{"text_format":"1","workbook":"xlsx","n_sheets":8,"sheets":["MainDisplay","Sheet2","Sheet1","Sheet3","Sheet4","Sheet5","Sheet6","Release Information"],"not_rendered":{"charts":6,"images":3,"macros":1,"external_links":0,"defined_names":351,"comments":0,"pivot_tables":0},"unopened":[],"bounds":{"document_bytes":16777216,"sheet_cells":100000,"rows_first":2000,"rows_last":500,"rows_between":2000,"halvings":0,"cell_chars":16384,"cell_head_chars":4096},"cells_cut":0,"cells_raw":0,"read":"whole","date_system":"1900"}

{"sheet":"MainDisplay","index":0,"n_rows":48,"n_cols":31,"rows_kept":48,"cut":false,"hidden":false,"merged":[[46,20,46,21],[35,20,35,21],[32,13,32,14],[33,13,33,14],[34,13,34,14],[35,13,35,14],[36,13,36,14],[42,13,42,14],[43,13,43,14],[44,13,44,14],[45,20,45,21],[36,20,36,21],[37,20,37,21],[38,20,38,21],[39,20,39,21],[40,20,40,21],[41,20,41,21],[42,20,42,21],[43,20,43,21],[44,20,44,21],[27,17,28,17],[27,18,28,18],[27,19,28,19],[27,15,28,15],[26,15,26,19],[26,13,26,14],[47,2,47,3],[47,5,47,7],[45,13,45,14],[46,13,46,14],[37,13,37,14],[38,13,38,14],[39,13,39,14],[40,13,40,14],[41,13,41,14],[26,3,26,5],[26,6,26,7],[29,13,29,14],[30,13,30,14],[31,13,31,14],[28,13,28,14],[27,13,27,14],[26,8,26,9],[27,16,28,16],[4,1,4,10],[4,11,4,20],[4,21,4,30],[46,1,46,2],[35,1,35,2],[36,1,36,2],[37,1,37,2],[38,1,38,2],[39,1,39,2],[40,1,40,2],[41,1,41,2],[42,1,42,2],[43,1,43,2],[44,1,44,2],[45,1,45,2],[34,1,34,2],[5,30,6,30],[7,21,8,22],[7,23,8,24],[7,25,8,26],[7,27,8,28],[7,29,7,30],[8,29,8,30],[26,1,26,2],[1,1,2,4],[1,27,2,30],[1,5,2,26],[27,1,28,2],[29,1,29,2],[30,1,30,2],[31,1,31,2],[32,1,32,2],[33,1,33,2],[27,10,27,11],[28,10,28,11],[28,4,28,5],[27,4,27,5],[27,8,27,9],[28,8,28,9],[5,12,6,15],[5,17,6,18],[5,20,6,20],[7,11,8,12],[7,13,8,14],[7,15,8,16],[7,17,8,18],[7,19,7,20],[8,19,8,20],[5,21,6,21],[5,22,6,25],[5,27,6,28],[5,1,6,1],[5,7,6,8],[5,10,6,10],[7,1,8,2],[7,3,8,4],[7,5,8,6],[7,7,8,8],[7,9,7,10],[8,9,8,10],[5,2,6,5],[5,11,6,11],[26,20,26,21],[30,20,30,21],[31,20,31,21],[32,20,32,21],[33,20,33,21],[34,20,34,21],[27,30,28,30],[29,20,29,21],[27,23,27,24],[28,23,28,24],[27,20,28,21],[27,26,28,26],[27,27,28,27],[27,28,28,28],[27,29,28,29],[26,26,26,30],[9,24,9,25],[9,26,9,27],[9,28,9,29],[9,2,9,3],[9,4,9,5],[9,6,9,7],[9,8,9,9],[9,12,9,13],[9,14,9,15],[9,16,9,17],[9,18,9,19],[9,22,9,23]]}
[null,null,{"$f":"ISNUMBER(AB2)","v":true}]
[null,{"$f":"RTD(\"cqg.rtd\", ,\"SystemInfo\", \"Linetime\")","v":43290.359791666669},null,null,null,"CQG Globex Grains and USDA Agriculture Reports",null,null,null,null,null,null,null,null,null,null,null,null,null,null,null,null,null,null,null,null,null,{"$f":"IF(RTD(\"cqg.rtd\", ,\"SystemInfo\", \"Linetime\")=0,NA(),RTD(\"cqg.rtd\", ,\"SystemInfo\", \"Linetime\"))","v":43290.359791666669}]
[]
[]
[null,"Soybeans",null,null,null,null,null,null,null,null,null,"Corn",null,null,null,null,null,null,null,null,null,"Wheat"]
[null,"ZSE",{"$f":"\" \"&RTD(\"cqg.rtd\", ,\"ContractData\",B6, \"LongDescription\",, \"T\")&\" \"","v":" Soybeans (Globex), Nov 18 "},null,null,null,"Last",{"$f":"RTD(\"cqg.rtd\", ,\"ContractData\",B6, \"LastTradeToday\",, \"T\")","v":877.75},null,"Net",{"$f":"IF(RTD(\"cqg.rtd\", ,\"ContractData\",B6, \"NetLastTradeToday\",, \"T\")=\"\",\"\",IF(RTD(\"cqg.rtd\", ,\"ContractData\",B6, \"NetLastTradeToday\",, \"T\")>0,\"+\"&TEXT(RTD(\"cqg.rtd\", ,\"ContractData\",B6, \"NetLastTradeToday\",, \"T\"),\"#.00\"),RTD(\"cqg.rtd\", ,\"ContractData\",B6, \"NetLastTradeToday\",, \"T\")))","v":-16.75},"ZCE",{"$f":"\" \"&RTD(\"cqg.rtd\", ,\"ContractData\",L6, \"LongDescription\",, \"T\")&\" \"","v":" Corn (Globex), Dec 18 "},null,null,null,"Last",{"$f":"RTD(\"cqg.rtd\", ,\"ContractData\",L6, \"LastTradeToday\",, \"T\")","v":366.5},null,"Net",{"$f":"IF(RTD(\"cqg.rtd\", ,\"ContractData\",L6, \"NetLastTradeToday\",, \"T\")=\"\",\"\",IF(RTD(\"cqg.rtd\", ,\"ContractData\",L6, \"NetLastTradeToday\",, \"T\")>0,\"+\"&TEXT(RTD(\"cqg.rtd\", ,\"ContractData\",L6, \"NetLastTradeToday\",, \"T\"),\"#.00\"),RTD(\"cqg.rtd\", ,\"ContractData\",L6, \"NetLastTradeToday\",, \"T\")))","v":-6.5},"ZWA",{"$f":"\" \"&RTD(\"cqg.rtd\", ,\"ContractData\",V6, \"LongDescription\",, \"T\")&\" \"","v":" Wheat (Globex), Sep 18 "},null,null,null,"Last",{"$f":"RTD(\"cqg.rtd\", ,\"ContractData\",V6, \"LastTradeToday\",, \"T\")","v":507.25},null,"Net",{"$f":"IF(RTD(\"cqg.rtd\", ,\"ContractData\",V6, \"NetLastTradeToday\",, \"T\")=\"\",\"\",IF(RTD(\"cqg.rtd\", ,\"ContractData\",V6, \"NetLastTradeToday\",, \"T\")>0,\"+\"&TEXT(RTD(\"cqg.rtd\", ,\"ContractData\",V6, \"NetLastTradeToday\",, \"T\"),\"#.00\"),RTD(\"cqg.rtd\", ,\"ContractData\",V6, \"NetLastTradeToday\",, \"T\")))","v":-8}]
{"$rows_left_out":43}
{"sheet":"Sheet2","index":1,"n_rows":963,"n_cols":5,"rows_kept":963,"cut":false,"hidden":true,"merged":[]}
[]
["Crop Progress"]
[]
["ISSN: 1948-3007"]
[]
["Released July 2, 2018, by the National Agricultural Statistics Service "]
{"$rows_left_out":958}
{"sheet":"Sheet1","index":2,"n_rows":10,"n_cols":7,"rows_kept":10,"cut":false,"hidden":true,"merged":[]}
[{"$f":"C9&\"s/\"&C10&\"/CropProg-\"&A9&A10&\"-\"&B9&B10&\"-\"&C10&\".txt\"","v":"2010s/2018/CropProg-07-02-2018.txt"},null,null,null,{"$f":"G9&\"s/\"&G10&\"/CropProg-\"&E9&E10&\"-\"&F9&F10&\"-\"&G10&\".txt\"","v":"2010s/2010/CropProg-07-12-2010.txt"}]
[]
[]
[]
[]
[]
{"$rows_left_out":5}
{"sheet":"Sheet3","index":3,"n_rows":88,"n_cols":22,"rows_kept":88,"cut":false,"hidden":true,"merged":[[33,3,33,6]]}
[{"$f":"IFERROR(INDIRECT(O3),\"\")","v":"Soybeans Blooming - Selected States"},{"$f":"P1","v":"$A$11"},{"$f":"INDIRECT(B1)","v":"Arkansas .......:     68            57            69            46      "},{"$f":"TRIM(RIGHT(INDIRECT(B1),LEN(INDIRECT(B1))-FIND(\":\",INDIRECT(B1))))","v":"68 57 69 46"},{"$f":"IF($M$14=1,VLOOKUP(LEFT(C1,2),$U$1:$V$50,2,FALSE),IFERROR(LEFT(INDIRECT(B1),FIND(\".\",INDIRECT(B1))-2),\"\"))","v":"Arkansas"},{"$f":"IFERROR(LEFT(D1,FIND(\" \",D1)),\"\")","v":"68 "},{"$f":"IFERROR(RIGHT(LEFT(D1,FIND(\"~\",SUBSTITUTE(D1,\" \",\"~\",2))),FIND(\"~\",SUBSTITUTE(D1,\" \",\"~\",2))-FIND(\"~\",SUBSTITUTE(D1,\" \",\"~\",1))),\"\")","v":"57 "},{"$f":"IFERROR(RIGHT(LEFT(D1,FIND(\"~\",SUBSTITUTE(D1,\" \",\"~\",3))),FIND(\"~\",SUBSTITUTE(D1,\" \",\"~\",3))-FIND(\"~\",SUBSTITUTE(D1,\" \",\"~\",2))),\"\")","v":"69 "},{"$f":"IFERROR(RIGHT(D1,LEN(D1)-FIND(\"~\",SUBSTITUTE(D1,\" \",\"~\",3))),\"\")","v":"46"},"Corn",{"$f":"IF(MainDisplay!B27=\"Corn\",\"Corn Planted\",IF(MainDisplay!B27=\"Soybeans\",\"Soybeans Planted\",IF(MainDisplay!B27=\"Spring Wheat\",\"Spring Wheat Planted\",\"Winter Wheat Planted\")))","v":"Soybeans Planted"},null,{"$f":"IF($J$8=\"Corn\",\"        Corn:  Percent Planted,\",IF($J$8=\"Soybeans\",\"      Soybeans:  Percent Planted,\",IF($J$8=\"Spring Wheat\",\"    Spring Wheat:  Percent Planted,\",IF($J$8=\"Winter Wheat\",\"    Winter Wheat:  Percent Planted,\"))))","v":"      Soybeans:  Percent Planted,"},null,{"$f":"IF($M$14=1,IF(LEFT(TRIM(O2),3)=\"Cor\",\"CO\",IF(LEFT(TRIM(O2),3)=\"Soy\",\"AR\",IF(LEFT(TRIM(O2),3)=\"Win\",\"AR\",IF(LEFT(TRIM(O2),3)=\"Spr\",\"ID\")))),IF(LEFT(TRIM(O2),3)=\"Cor\",\"Colorado\",IF(LEFT(TRIM(O2),3)=\"Soy\",\"Arkansa\",IF(LEFT(TRIM(O2),3)=\"Win\",\"Arkansa\",IF(LEFT(TRIM(O2),3)=\"Spr\",\"Idaho\")))))","v":"Arkansa"},{"$f":"CELL(\"address\",INDEX(A1:A38,MATCH(O1&\"*\",A1:A38,0),1))","v":"$A$11"},null,null,null,null,"AL","Alabama"]
[{"$f":"IFERROR(INDIRECT(O4),\"\")","v":"[These 18 States planted 96% of the 2017 soybean acreage]"},{"$f":"(IF(TRIM(A2)=\":\",\"\",IF(LEN(B1)=4,LEFT(B1,3)&RIGHT(B1,1)+1,LEFT(B1,3)&RIGHT(B1,3)+1)))","v":"$A$12"},{"$f":"INDIRECT(B2)","v":"Illinois .......:     14            23            44            11      "},{"$f":"TRIM(RIGHT(INDIRECT(B2),LEN(INDIRECT(B2))-FIND(\":\",INDIRECT(B2))))","v":"14 23 44 11"},{"$f":"IF($M$14=1,VLOOKUP(LEFT(C2,2),$U$1:$V$50,2,FALSE),IFERROR(LEFT(INDIRECT(B2),FIND(\".\",INDIRECT(B2))-2),\"\"))","v":"Illinois"},{"$f":"IFERROR(LEFT(D2,FIND(\" \",D2)),\"\")","v":"14 "},{"$f":"IFERROR(RIGHT(LEFT(D2,FIND(\"~\",SUBSTITUTE(D2,\" \",\"~\",2))),FIND(\"~\",SUBSTITUTE(D2,\" \",\"~\",2))-FIND(\"~\",SUBSTITUTE(D2,\" \",\"~\",1))),\"\")","v":"23 "},{"$f":"IFERROR(RIGHT(LEFT(D2,FIND(\"~\",SUBSTITUTE(D2,\" \",\"~\",3))),FIND(\"~\",SUBSTITUTE(D2,\" \",\"~\",3))-FIND(\"~\",SUBSTITUTE(D2,\" \",\"~\",2))),\"\")","v":"44 "},{"$f":"IFERROR(RIGHT(D2,LEN(D2)-FIND(\"~\",SUBSTITUTE(D2,\" \",\"~\",3))),\"\")","v":"11"},"Soybeans",{"$f":"IF(MainDisplay!B27=\"Corn\",\"Corn Emerged\",IF(MainDisplay!B27=\"Soybeans\",\"Soybeans Emerged\",IF(MainDisplay!B27=\"Spring Wheat\",\"Spring Wheat Emerged\",\"Winter Wheat Emerged\")))","v":"Soybeans Emerged"},null,{"$f":"IF($J$8=\"Corn\",\"        Corn:  Percent Emerged,\",IF($J$8=\"Soybeans\",\"      Soybeans:  Percent Emerged,\",IF($J$8=\"Spring Wheat\",\"    Spring Wheat:  Percent Emerged,\",IF($J$8=\"Winter Wheat\",\"    Winter Wheat:  Percent Emerged,\"))))","v":"      Soybeans:  Percent Emerged,"},null,{"$f":"IF(M14=0,MainDisplay!D27,Sheet3!M16)","v":"Soybeans Blooming"},null,null,null,null,null,"AK","Alaska"]
["------------------------------------------------------------------------",{"$f":"(IF(TRIM(A3)=\":\",\"\",IF(LEN(B2)=4,LEFT(B2,3)&RIGHT(B2,1)+1,LEFT(B2,3)&RIGHT(B2,3)+1)))","v":"$A$13"},"Indiana ........:     12             8            33            11      ","12 8 33 11","Indiana","12 ","8 ","33 ","11","Spring Wheat",{"$f":"IF(MainDisplay!B27=\"Corn\",\"Corn Silking\",IF(MainDisplay!B27=\"Soybeans\",\"Soybeans Blooming\",IF(MainDisplay!B27=\"Spring Wheat\",\"Spring Wheat Headed\",\"Winter Wheat Headed\")))","v":"Soybeans Blooming"},null,{"$f":"IF($J$8=\"Corn\",\"        Corn:  Percent Silking,\",IF($J$8=\"Soybeans\",\"     Soybeans:  Percent Blooming,\",IF($J$8=\"Spring Wheat\",\"     Spring Wheat:  Percent Headed,\",IF($J$8=\"Winter Wheat\",\"    Winter Wheat:  Percent Headed,\"))))","v":"     Soybeans:  Percent Blooming,"},null,{"$f":"CELL(\"address\",INDEX(Sheet2!A1:A1000,MATCH(O2&\"*\",Sheet2!A1:A1000,0),1))","v":"[CQGGlobexGrainsUSDAV3.xlsm]Sheet2!$A$76"},{"$f":"RIGHT(O3,$Q$3-$R$3)","v":"$A$76"},{"$f":"LEN(O3)","v":40},{"$f":"FIND(\"!\",O3)","v":35},null,null,"AZ","Arizona"]
["                :               Week ending               :             ",{"$f":"(IF(TRIM(B3)=\":\",\"\",LEFT(B3,3)&RIGHT(B3,3)+1))","v":"$A$14"},"Iowa ...........:     11             4            21            10      ","11 4 21 10","Iowa","11 ","4 ","21 ","10","Winter Wheat",{"$f":"IF(MainDisplay!B27=\"Corn\",\"Corn Dough\",IF(MainDisplay!B27=\"Soybeans\",\"Soybeans Setting Pods\",IF(MainDisplay!B27=\"Spring Wheat\",\"Spring Wheat Harvested\",\"Winter Wheat Harvested\")))","v":"Soybeans Setting Pods"},null,{"$f":"IF($J$8=\"Corn\",\"         Corn:  Percent Dough,\",IF($J$8=\"Soybeans\",\"   Soybeans:  Percent Setting Pods,\",IF($J$8=\"Spring Wheat\",\"   Spring Wheat:  Percent Harvested,\",IF($J$8=\"Winter Wheat\",\"   Winter Wheat:  Percent Harvested,\"))))","v":"   Soybeans:  Percent Setting Pods,"},null,{"$f":"LEFT($O$3,$R$3)&P4","v":"[CQGGlobexGrainsUSDAV3.xlsm]Sheet2!$A$77"},{"$f":"LEFT(P3,FIND(\"~\",SUBSTITUTE(P3,\"$\",\"~\",2)))&RIGHT(P3,3)+1","v":"$A$77"},null,null,null,null,"AR","Arkansas"]
[{"$f":"IFERROR(INDIRECT(O7),\"\")","v":"                :-----------------------------------------:             "},"$A$15","Kansas .........:     11             7            20             6      ","11 7 20 6","Kansas","11 ","7 ","20 ","6",null,{"$f":"IF(MainDisplay!B27=\"Corn\",\"Corn Dented\",IF(MainDisplay!B27=\"Soybeans\",\"Soybeans Dropping Leaves\",IF(MainDisplay!B27=\"Spring Wheat\",\"\",\"\")))","v":"Soybeans Dropping Leaves"},null,{"$f":"IF($J$8=\"Corn\",\"        Corn:  Percent Dented,\",IF($J$8=\"Soybeans\",\"  Soybeans:  Percent Dropping Leaves, \",IF($J$8=\"Spring Wheat\",\"\",IF($J$8=\"Winter Wheat\",\"\"))))","v":"  Soybeans:  Percent Dropping Leaves, "},null,{"$f":"LEFT($O$3,$R$3)&P5","v":"[CQGGlobexGrainsUSDAV3.xlsm]Sheet2!$A$78"},{"$f":"LEFT(P4,FIND(\"~\",SUBSTITUTE(P4,\"$\",\"~\",2)))&RIGHT(P4,3)+1","v":"$A$78"},null,null,null,null,"CA","California"]
["      State     :   July 1,   :  June 24,   :   July 1,   :  2013-2017  ","$A$16","Kentucky .......:     11             3            12             6      ","11 3 12 6","Kentucky","11 ","3 ","12 ","6",null,{"$f":"IF(MainDisplay!B27=\"Corn\",\"Corn Mature\",IF(MainDisplay!B27=\"Soybeans\",\"Soybeans Harvested\",IF(MainDisplay!B27=\"Spring Wheat\",\"\",\"\")))","v":"Soybeans Harvested"},null,{"$f":"IF($J$8=\"Corn\",\"        Corn:  Percent Mature,\",IF($J$8=\"Soybeans\",\"     Soybeans:  Percent Harvested,\",IF($J$8=\"Spring Wheat\",\"\",IF($J$8=\"Winter Wheat\",\"\"))))","v":"     Soybeans:  Percent Harvested,"},null,"[CQGGlobexGrainsUSDAV3.xlsm]Sheet2!$A$79","$A$79",null,null,null,null,"CO","Colorado"]
{"$rows_left_out":83}
{"sheet":"Sheet4","index":4,"n_rows":36,"n_cols":17,"rows_kept":36,"cut":false,"hidden":true,"merged":[]}
[]
[null,"ZSE",null,null,null,{"$f":"IF(RTD(\"cqg.rtd\", ,\"ContractData\",\"ZSE\", \"LastTradeToday\",, \"T\")=\"\",-1,0)","v":0}]
[null,1,{"$f":"$B$2&\"?\"&B3","v":"ZSE?1"},{"$f":"RTD(\"cqg.rtd\",,\"StudyData\",C3,\"Bar\",,\"Close\",\"D\",$F$2,,,,,\"T\")","v":861.5},{"$f":"RTD(\"cqg.rtd\", ,\"ContractData\",C3, \"contractMonth\",, \"T\")","v":"JUL"},{"$f":"IF(RTD(\"cqg.rtd\", ,\"ContractData\",C3, \"NetLastTradeToday\",, \"T\")=\"\",RTD(\"cqg.rtd\",,\"StudyData\",C3,\"Bar\",,\"Close\",\"D\",\"-1\",,,,,\"T\")-RTD(\"cqg.rtd\",,\"StudyData\",C3,\"Bar\",,\"Close\",\"D\",\"-2\",,,,,\"T\"),RTD(\"cqg.rtd\", ,\"ContractData\",C3, \"NetLastTradeToday\",, \"T\"))","v":-12.5},null,{"$f":"RTD(\"cqg.rtd\", ,\"ContractData\",C3, \"Bid\",, \"T\")","v":856.5},{"$f":"RTD(\"cqg.rtd\", ,\"ContractData\",C3, \"Ask\",, \"T\")","v":857.25},null,{"$f":"IFERROR(IF(OR(D3>I3,D3<H3),MEDIAN(I3,H3),D3),NA())","v":856.875},null,{"$f":"IF(RTD(\"cqg.rtd\", ,\"ContractData\",C3, \"NetLastTradeToday\",, \"T\")=\"\",RTD(\"cqg.rtd\",,\"StudyData\",C3,\"Bar\",,\"Close\",\"D\",\"-1\",,,,,\"T\")-RTD(\"cqg.rtd\",,\"StudyData\",C3,\"Bar\",,\"Close\",\"D\",\"-2\",,,,,\"T\"),RTD(\"cqg.rtd\", ,\"ContractData\",C3, \"NetLastTradeToday\",, \"T\"))","v":-12.5},null,{"$f":"IFERROR(IF(RTD(\"cqg.rtd\", ,\"ContractData\",C3, \"NetLastTradeToday\",, \"T\")=\"\",K3-RTD(\"cqg.rtd\",,\"ContractData\",C3,\"Y_Settlement\",,\"T\"),IF(OR(D3>I3,D3<H3),MEDIAN(I3,H3),D3)-RTD(\"cqg.rtd\",,\"ContractData\",C3,\"Y_Settlement\",,\"T\")),NA())","v":-17.125},null,{"$f":"RTD(\"cqg.rtd\",,\"ContractData\",C3,\"Y_Settlement\",,\"T\")","v":874}]
[null,2,"ZSE?2",{"$f":"RTD(\"cqg.rtd\",,\"StudyData\",C4,\"Bar\",,\"Close\",\"D\",$F$2,,,,,\"T\")","v":861},{"$f":"RTD(\"cqg.rtd\", ,\"ContractData\",C4, \"contractMonth\",, \"T\")","v":"AUG"},{"$f":"IF(RTD(\"cqg.rtd\", ,\"ContractData\",C4, \"NetLastTradeToday\",, \"T\")=\"\",RTD(\"cqg.rtd\",,\"StudyData\",C4,\"Bar\",,\"Close\",\"D\",\"-1\",,,,,\"T\")-RTD(\"cqg.rtd\",,\"StudyData\",C4,\"Bar\",,\"Close\",\"D\",\"-2\",,,,,\"T\"),RTD(\"cqg.rtd\", ,\"ContractData\",C4, \"NetLastTradeToday\",, \"T\"))","v":-16.5},null,{"$f":"RTD(\"cqg.rtd\", ,\"ContractData\",C4, \"Bid\",, \"T\")","v":860.75},{"$f":"RTD(\"cqg.rtd\", ,\"ContractData\",C4, \"Ask\",, \"T\")","v":861},null,{"$f":"IFERROR(IF(OR(D4>I4,D4<H4),MEDIAN(I4,H4),D4),NA())","v":861},null,{"$f":"IF(RTD(\"cqg.rtd\", ,\"ContractData\",C4, \"NetLastTradeToday\",, \"T\")=\"\",RTD(\"cqg.rtd\",,\"StudyData\",C4,\"Bar\",,\"Close\",\"D\",\"-1\",,,,,\"T\")-RTD(\"cqg.rtd\",,\"StudyData\",C4,\"Bar\",,\"Close\",\"D\",\"-2\",,,,,\"T\"),RTD(\"cqg.rtd\", ,\"ContractData\",C4, \"NetLastTradeToday\",, \"T\"))","v":-16.5}]
[null,3,"ZSE?3",{"$f":"RTD(\"cqg.rtd\",,\"StudyData\",C5,\"Bar\",,\"Close\",\"D\",$F$2,,,,,\"T\")","v":866.5},{"$f":"RTD(\"cqg.rtd\", ,\"ContractData\",C5, \"contractMonth\",, \"T\")","v":"SEP"},{"$f":"IF(RTD(\"cqg.rtd\", ,\"ContractData\",C5, \"NetLastTradeToday\",, \"T\")=\"\",RTD(\"cqg.rtd\",,\"StudyData\",C5,\"Bar\",,\"Close\",\"D\",\"-1\",,,,,\"T\")-RTD(\"cqg.rtd\",,\"StudyData\",C5,\"Bar\",,\"Close\",\"D\",\"-2\",,,,,\"T\"),RTD(\"cqg.rtd\", ,\"ContractData\",C5, \"NetLastTradeToday\",, \"T\"))","v":-16.75},null,{"$f":"RTD(\"cqg.rtd\", ,\"ContractData\",C5, \"Bid\",, \"T\")","v":866.25},{"$f":"RTD(\"cqg.rtd\", ,\"ContractData\",C5, \"Ask\",, \"T\")","v":866.5},null,866.5,null,{"$f":"IF(RTD(\"cqg.rtd\", ,\"ContractData\",C5, \"NetLastTradeToday\",, \"T\")=\"\",RTD(\"cqg.rtd\",,\"StudyData\",C5,\"Bar\",,\"Close\",\"D\",\"-1\",,,,,\"T\")-RTD(\"cqg.rtd\",,\"StudyData\",C5,\"Bar\",,\"Close\",\"D\",\"-2\",,,,,\"T\"),RTD(\"cqg.rtd\", ,\"ContractData\",C5, \"NetLastTradeToday\",, \"T\"))","v":-16.75}]
[null,4,"ZSE?4",{"$f":"RTD(\"cqg.rtd\",,\"StudyData\",C6,\"Bar\",,\"Close\",\"D\",$F$2,,,,,\"T\")","v":877.75},{"$f":"RTD(\"cqg.rtd\", ,\"ContractData\",C6, \"contractMonth\",, \"T\")","v":"NOV"},{"$f":"IF(RTD(\"cqg.rtd\", ,\"ContractData\",C6, \"NetLastTradeToday\",, \"T\")=\"\",RTD(\"cqg.rtd\",,\"StudyData\",C6,\"Bar\",,\"Close\",\"D\",\"-1\",,,,,\"T\")-RTD(\"cqg.rtd\",,\"StudyData\",C6,\"Bar\",,\"Close\",\"D\",\"-2\",,,,,\"T\"),RTD(\"cqg.rtd\", ,\"ContractData\",C6, \"NetLastTradeToday\",, \"T\"))","v":-16.75},null,{"$f":"RTD(\"cqg.rtd\", ,\"ContractData\",C6, \"Bid\",, \"T\")","v":877.5},{"$f":"RTD(\"cqg.rtd\", ,\"ContractData\",C6, \"Ask\",, \"T\")","v":877.75},null,877.75,null,{"$f":"IF(RTD(\"cqg.rtd\", ,\"ContractData\",C6, \"NetLastTradeToday\",, \"T\")=\"\",RTD(\"cqg.rtd\",,\"StudyData\",C6,\"Bar\",,\"Close\",\"D\",\"-1\",,,,,\"T\")-RTD(\"cqg.rtd\",,\"StudyData\",C6,\"Bar\",,\"Close\",\"D\",\"-2\",,,,,\"T\"),RTD(\"cqg.rtd\", ,\"ContractData\",C6, \"NetLastTradeToday\",, \"T\"))","v":-16.75}]
{"$rows_left_out":31}
{"sheet":"Sheet5","index":5,"n_rows":809,"n_cols":2,"rows_kept":809,"cut":false,"hidden":true,"merged":[]}
[]
["Crop Progress"]
[]
["ISSN: 1948-3007"]
[]
["Released July 12, 2010, by the National Agricultural Statistics Service "]
{"$rows_left_out":804}
{"sheet":"Sheet6","index":6,"n_rows":108,"n_cols":22,"rows_kept":108,"cut":false,"hidden":true,"merged":[[33,3,33,6]]}
[{"$f":"IFERROR(INDIRECT(O3),\"\")","v":"Soybeans Blooming - Selected States"},{"$f":"P1","v":"$A$11"},{"$f":"INDIRECT(B1)","v":"Arkansas ........:    35          46          55          42     "},{"$f":"TRIM(RIGHT(INDIRECT(B1),LEN(INDIRECT(B1))-FIND(\":\",INDIRECT(B1))))","v":"35 46 55 42"},{"$f":"IF($M$14=1,VLOOKUP(LEFT(C1,2),$U$1:$V$50,2,FALSE),IFERROR(LEFT(INDIRECT(B1),FIND(\".\",INDIRECT(B1))-2),\"\"))","v":"Arkansas"},{"$f":"IFERROR(LEFT(D1,FIND(\" \",D1)),\"\")","v":"35 "},{"$f":"IFERROR(RIGHT(LEFT(D1,FIND(\"~\",SUBSTITUTE(D1,\" \",\"~\",2))),FIND(\"~\",SUBSTITUTE(D1,\" \",\"~\",2))-FIND(\"~\",SUBSTITUTE(D1,\" \",\"~\",1))),\"\")","v":"46 "},{"$f":"IFERROR(RIGHT(LEFT(D1,FIND(\"~\",SUBSTITUTE(D1,\" \",\"~\",3))),FIND(\"~\",SUBSTITUTE(D1,\" \",\"~\",3))-FIND(\"~\",SUBSTITUTE(D1,\" \",\"~\",2))),\"\")","v":"55 "},{"$f":"IFERROR(RIGHT(D1,LEN(D1)-FIND(\"~\",SUBSTITUTE(D1,\" \",\"~\",3))),\"\")","v":"42"},"Corn",{"$f":"IF(MainDisplay!B27=\"Corn\",\"Corn Planted\",IF(MainDisplay!B27=\"Soybeans\",\"Soybeans Planted\",IF(MainDisplay!B27=\"Spring Wheat\",\"Spring Wheat Planted\",\"Winter Wheat Planted\")))","v":"Soybeans Planted"},null,{"$f":"IF($J$8=\"Corn\",\"        Corn:  Percent Planted,\",IF($J$8=\"Soybeans\",\"      Soybeans:  Percent Planted,\",IF($J$8=\"Spring Wheat\",\"    Spring Wheat:  Percent Planted,\",IF($J$8=\"Winter Wheat\",\"    Winter Wheat:  Percent Planted,\"))))","v":"      Soybeans:  Percent Planted,"},null,{"$f":"IF($M$14=1,IF(LEFT(TRIM(O2),3)=\"Cor\",\"CO\",IF(LEFT(TRIM(O2),3)=\"Soy\",\"AR\",IF(LEFT(TRIM(O2),3)=\"Win\",\"AR\",IF(LEFT(TRIM(O2),3)=\"Spr\",\"ID\")))),IF(LEFT(TRIM(O2),3)=\"Cor\",\"Colorado\",IF(LEFT(TRIM(O2),3)=\"Soy\",\"Arkansa\",IF(LEFT(TRIM(O2),3)=\"Win\",\"Arkansa\",IF(LEFT(TRIM(O2),3)=\"Spr\",\"Idaho\")))))","v":"Arkansa"},{"$f":"CELL(\"address\",INDEX(A1:A38,MATCH(O1&\"*\",A1:A38,0),1))","v":"$A$11"},null,null,null,null,"AL","Alabama"]
[{"$f":"IFERROR(INDIRECT(O4),\"\")","v":"[These 18 States planted 95% of the 2009 soybean acreage]"},{"$f":"(IF(TRIM(A2)=\":\",\"\",IF(LEN(B1)=4,LEFT(B1,3)&RIGHT(B1,1)+1,LEFT(B1,3)&RIGHT(B1,3)+1)))","v":"$A$12"},{"$f":"INDIRECT(B2)","v":"Illinois ........:    10          20          43          38     "},{"$f":"TRIM(RIGHT(INDIRECT(B2),LEN(INDIRECT(B2))-FIND(\":\",INDIRECT(B2))))","v":"10 20 43 38"},{"$f":"IF($M$14=1,VLOOKUP(LEFT(C2,2),$U$1:$V$50,2,FALSE),IFERROR(LEFT(INDIRECT(B2),FIND(\".\",INDIRECT(B2))-2),\"\"))","v":"Illinois"},{"$f":"IFERROR(LEFT(D2,FIND(\" \",D2)),\"\")","v":"10 "},{"$f":"IFERROR(RIGHT(LEFT(D2,FIND(\"~\",SUBSTITUTE(D2,\" \",\"~\",2))),FIND(\"~\",SUBSTITUTE(D2,\" \",\"~\",2))-FIND(\"~\",SUBSTITUTE(D2,\" \",\"~\",1))),\"\")","v":"20 "},{"$f":"IFERROR(RIGHT(LEFT(D2,FIND(\"~\",SUBSTITUTE(D2,\" \",\"~\",3))),FIND(\"~\",SUBSTITUTE(D2,\" \",\"~\",3))-FIND(\"~\",SUBSTITUTE(D2,\" \",\"~\",2))),\"\")","v":"43 "},{"$f":"IFERROR(RIGHT(D2,LEN(D2)-FIND(\"~\",SUBSTITUTE(D2,\" \",\"~\",3))),\"\")","v":"38"},"Soybeans",{"$f":"IF(MainDisplay!B27=\"Corn\",\"Corn Emerged\",IF(MainDisplay!B27=\"Soybeans\",\"Soybeans Emerged\",IF(MainDisplay!B27=\"Spring Wheat\",\"Spring Wheat Emerged\",\"Winter Wheat Emerged\")))","v":"Soybeans Emerged"},null,{"$f":"IF($J$8=\"Corn\",\"        Corn:  Percent Emerged,\",IF($J$8=\"Soybeans\",\"      Soybeans:  Percent Emerged,\",IF($J$8=\"Spring Wheat\",\"    Spring Wheat:  Percent Emerged,\",IF($J$8=\"Winter Wheat\",\"    Winter Wheat:  Percent Emerged,\"))))","v":"      Soybeans:  Percent Emerged,"},null,{"$f":"IF(M14=1,M16,Sheet3!O2)","v":"Soybeans Blooming"},null,null,null,null,null,"AK","Alaska"]
["-----------------------------------------------------------------",{"$f":"(IF(TRIM(A3)=\":\",\"\",IF(LEN(B2)=4,LEFT(B2,3)&RIGHT(B2,1)+1,LEFT(B2,3)&RIGHT(B2,3)+1)))","v":"$A$13"},"Indiana .........:    11          23          48          27     ","11 23 48 27","Indiana","11 ","23 ","48 ","27","Spring Wheat",{"$f":"IF(MainDisplay!B27=\"Corn\",\"Corn Silking\",IF(MainDisplay!B27=\"Soybeans\",\"Soybeans Blooming\",IF(MainDisplay!B27=\"Spring Wheat\",\"Spring Wheat Headed\",\"Winter Wheat Headed\")))","v":"Soybeans Blooming"},null,{"$f":"IF($J$8=\"Corn\",\"        Corn:  Percent Silking,\",IF($J$8=\"Soybeans\",\"     Soybeans:  Percent Blooming,\",IF($J$8=\"Spring Wheat\",\"    Spring Wheat:  Percent Headed,\",IF($J$8=\"Winter Wheat\",\"    Winter Wheat:  Percent Headed,\"))))","v":"     Soybeans:  Percent Blooming,"},null,{"$f":"CELL(\"address\",INDEX(Sheet5!A1:A1000,MATCH(\"*\"&O2&\"*\",Sheet5!A1:A1000,0),1))","v":"[CQGGlobexGrainsUSDAV3.xlsm]Sheet5!$A$167"},{"$f":"RIGHT(O3,$Q$3-$R$3)","v":"$A$167"},{"$f":"LEN(O3)","v":41},{"$f":"FIND(\"!\",O3)","v":35},null,null,"AZ","Arizona"]
["                 :            Week ending            :           ",{"$f":"(IF(TRIM(B3)=\":\",\"\",LEFT(B3,3)&RIGHT(B3,3)+1))","v":"$A$14"},"Iowa ............:    37          27          46          47     ","37 27 46 47","Iowa","37 ","27 ","46 ","47","Winter Wheat",{"$f":"IF(MainDisplay!B27=\"Corn\",\"Corn Dough\",IF(MainDisplay!B27=\"Soybeans\",\"Soybeans Setting Pods\",IF(MainDisplay!B27=\"Spring Wheat\",\"Spring Wheat Harvested\",\"Winter Wheat Harvested\")))","v":"Soybeans Setting Pods"},null,{"$f":"IF($J$8=\"Corn\",\"         Corn:  Percent Dough,\",IF($J$8=\"Soybeans\",\"   Soybeans:  Percent Setting Pods,\",IF($J$8=\"Spring Wheat\",\"   Spring Wheat:  Percent Harvested,\",IF($J$8=\"Winter Wheat\",\"   Winter Wheat:  Percent Harvested,\"))))","v":"   Soybeans:  Percent Setting Pods,"},null,{"$f":"LEFT($O$3,$R$3)&P4","v":"[CQGGlobexGrainsUSDAV3.xlsm]Sheet5!$A$168"},{"$f":"LEFT(P3,FIND(\"~\",SUBSTITUTE(P3,\"$\",\"~\",2)))&RIGHT(P3,3)+1","v":"$A$168"},null,null,null,null,"AR","Arkansas"]
[{"$f":"IFERROR(INDIRECT(O7),\"\")","v":"                 :-----------------------------------:           "},"$A$15","Kansas ..........:    24          10          19          30     ","24 10 19 30","Kansas","24 ","10 ","19 ","30",null,{"$f":"IF(MainDisplay!B27=\"Corn\",\"Corn Dented\",IF(MainDisplay!B27=\"Soybeans\",\"Soybeans Dropping Leaves\",IF(MainDisplay!B27=\"Spring Wheat\",\"\",\"\")))","v":"Soybeans Dropping Leaves"},null,{"$f":"IF($J$8=\"Corn\",\"        Corn:  Percent Dented,\",IF($J$8=\"Soybeans\",\"  Soybeans:  Percent Dropping Leaves, \",IF($J$8=\"Spring Wheat\",\"\",IF($J$8=\"Winter Wheat\",\"\"))))","v":"  Soybeans:  Percent Dropping Leaves, "},null,{"$f":"LEFT($O$3,$R$3)&P5","v":"[CQGGlobexGrainsUSDAV3.xlsm]Sheet5!$A$169"},{"$f":"LEFT(P4,FIND(\"~\",SUBSTITUTE(P4,\"$\",\"~\",2)))&RIGHT(P4,3)+1","v":"$A$169"},null,null,null,null,"CA","California"]
["      State      : July 11,  :  July 4,  : July 11,  : 2005-2009 ","$A$16","Kentucky ........:    16          35          49          28     ","16 35 49 28","Kentucky","16 ","35 ","49 ","28",null,{"$f":"IF(MainDisplay!B27=\"Corn\",\"Corn Mature\",IF(MainDisplay!B27=\"Soybeans\",\"Soybeans Harvested\",IF(MainDisplay!B27=\"Spring Wheat\",\"\",\"\")))","v":"Soybeans Harvested"},null,{"$f":"IF($J$8=\"Corn\",\"        Corn:  Percent Mature,\",IF($J$8=\"Soybeans\",\"     Soybeans:  Percent Harvested,\",IF($J$8=\"Spring Wheat\",\"\",IF($J$8=\"Winter Wheat\",\"\"))))","v":"     Soybeans:  Percent Harvested,"},null,"[CQGGlobexGrainsUSDAV3.xlsm]Sheet5!$A$170","$A$170",null,null,null,null,"CO","Colorado"]
{"$rows_left_out":103}
{"sheet":"Release Information","index":7,"n_rows":39,"n_cols":5,"rows_kept":39,"cut":false,"hidden":false,"merged":[[38,1,38,2]]}
[null,"Corn","Soybeans","Spring Wheat ","Winter Wheat "]
["April 1st Report",null,null,null,"Winter Wheat Condition"]
["April 2nd Report","Corn: Planted",null,"Spring Wheat: Planted","Winter Wheat: Headed, Condition "]
["April 3rd Report","Corn: Planted",null,"Spring Wheat: Planted","Winter Wheat: Headed, Condition "]
["April 4th Report","Corn: Planted, Emerged","Soybeans: Planted","Spring Wheat: Planted, Emerged","Winter Wheat: Headed, Condition "]
["May 1st Report","Corn: Planted, Emerged","Soybeans: Planted","Spring Wheat: Planted, Emerged","Winter Wheat: Headed, Condition"]
{"$rows_left_out":33}