{"text_format":"1","workbook":"xlsx","n_sheets":8,"sheets":["MainDisplay","Sheet2","Sheet1","Sheet3","Sheet4","Sheet5","Sheet6","Release Information"],"not_rendered":{"charts":6,"images":3,"macros":1,"external_links":0,"defined_names":351,"comments":0,"pivot_tables":0},"unopened":[],"bounds":{"document_bytes":16777216,"sheet_cells":100000,"rows_first":2000,"rows_last":500,"rows_between":2000,"halvings":0,"cell_chars":16384,"cell_head_chars":4096},"cells_cut":0,"cells_raw":0,"read":"whole","date_system":"1900"}

{"sheet":"MainDisplay","index":0,"n_rows":48,"n_cols":31,"rows_kept":48,"cut":false,"hidden":false,"merged":[[46,20,46,21],[35,20,35,21],[32,13,32,14],[33,13,33,14],[34,13,34,14],[35,13,35,14],[36,13,36,14],[42,13,42,14],[43,13,43,14],[44,13,44,14],[45,20,45,21],[36,20,36,21],[37,20,37,21],[38,20,38,21],[39,20,39,21],[40,20,40,21],[41,20,41,21],[42,20,42,21],[43,20,43,21],[44,20,44,21],[27,17,28,17],[27,18,28,18],[27,19,28,19],[27,15,28,15],[26,15,26,19],[26,13,26,14],[47,2,47,3],[47,5,47,7],[45,13,45,14],[46,13,46,14],[37,13,37,14],[38,13,38,14],[39,13,39,14],[40,13,40,14],[41,13,41,14],[26,3,26,5],[26,6,26,7],[29,13,29,14],[30,13,30,14],[31,13,31,14],[28,13,28,14],[27,13,27,14],[26,8,26,9],[27,16,28,16],[4,1,4,10],[4,11,4,20],[4,21,4,30],[46,1,46,2],[35,1,35,2],[36,1,36,2],[37,1,37,2],[38,1,38,2],[39,1,39,2],[40,1,40,2],[41,1,41,2],[42,1,42,2],[43,1,43,2],[44,1,44,2],[45,1,45,2],[34,1,34,2],[5,30,6,30],[7,21,8,22],[7,23,8,24],[7,25,8,26],[7,27,8,28],[7,29,7,30],[8,29,8,30],[26,1,26,2],[1,1,2,4],[1,27,2,30],[1,5,2,26],[27,1,28,2],[29,1,29,2],[30,1,30,2],[31,1,31,2],[32,1,32,2],[33,1,33,2],[27,10,27,11],[28,10,28,11],[28,4,28,5],[27,4,27,5],[27,8,27,9],[28,8,28,9],[5,12,6,15],[5,17,6,18],[5,20,6,20],[7,11,8,12],[7,13,8,14],[7,15,8,16],[7,17,8,18],[7,19,7,20],[8,19,8,20],[5,21,6,21],[5,22,6,25],[5,27,6,28],[5,1,6,1],[5,7,6,8],[5,10,6,10],[7,1,8,2],[7,3,8,4],[7,5,8,6],[7,7,8,8],[7,9,7,10],[8,9,8,10],[5,2,6,5],[5,11,6,11],[26,20,26,21],[30,20,30,21],[31,20,31,21],[32,20,32,21],[33,20,33,21],[34,20,34,21],[27,30,28,30],[29,20,29,21],[27,23,27,24],[28,23,28,24],[27,20,28,21],[27,26,28,26],[27,27,28,27],[27,28,28,28],[27,29,28,29],[26,26,26,30],[9,24,9,25],[9,26,9,27],[9,28,9,29],[9,2,9,3],[9,4,9,5],[9,6,9,7],[9,8,9,9],[9,12,9,13],[9,14,9,15],[9,16,9,17],[9,18,9,19],[9,22,9,23]]}
[null,null,{"$f":"ISNUMBER(AB2)","v":true}]
[null,{"$f":"RTD(\"cqg.rtd\", ,\"SystemInfo\", \"Linetime\")","v":43290.359791666669},null,null,null,"CQG Globex Grains and USDA Agriculture Reports",null,null,null,null,null,null,null,null,null,null,null,null,null,null,null,null,null,null,null,null,null,{"$f":"IF(RTD(\"cqg.rtd\", ,\"SystemInfo\", \"Linetime\")=0,NA(),RTD(\"cqg.rtd\", ,\"SystemInfo\", \"Linetime\"))","v":43290.359791666669}]
[]
[]
[null,"Soybeans",null,null,null,null,null,null,null,null,null,"Corn",null,null,null,null,null,null,null,null,null,"Wheat"]
[null,"ZSE",{"$f":"\" \"&RTD(\"cqg.rtd\", ,\"ContractData\",B6, \"LongDescription\",, \"T\")&\" \"","v":" Soybeans (Globex), Nov 18 "},null,null,null,"Last",{"$f":"RTD(\"cqg.rtd\", ,\"ContractData\",B6, \"LastTradeToday\",, \"T\")","v":877.75},null,"Net",{"$f":"IF(RTD(\"cqg.rtd\", ,\"ContractData\",B6, \"NetLastTradeToday\",, \"T\")=\"\",\"\",IF(RTD(\"cqg.rtd\", ,\"ContractData\",B6, \"NetLastTradeToday\",, \"T\")>0,\"+\"&TEXT(RTD(\"cqg.rtd\", ,\"ContractData\",B6, \"NetLastTradeToday\",, \"T\"),\"#.00\"),RTD(\"cqg.rtd\", ,\"ContractData\",B6, \"NetLastTradeToday\",, \"T\")))","v":-16.75},"ZCE",{"$f":"\" \"&RTD(\"cqg.rtd\", ,\"ContractData\",L6, \"LongDescription\",, \"T\")&\" \"","v":" Corn (Globex), Dec 18 "},null,null,null,"Last",{"$f":"RTD(\"cqg.rtd\", ,\"ContractData\",L6, \"LastTradeToday\",, \"T\")","v":366.5},null,"Net",{"$f":"IF(RTD(\"cqg.rtd\", ,\"ContractData\",L6, \"NetLastTradeToday\",, \"T\")=\"\",\"\",IF(RTD(\"cqg.rtd\", ,\"ContractData\",L6, \"NetLastTradeToday\",, \"T\")>0,\"+\"&TEXT(RTD(\"cqg.rtd\", ,\"ContractData\",L6, \"NetLastTradeToday\",, \"T\"),\"#.00\"),RTD(\"cqg.rtd\", ,\"ContractData\",L6, \"NetLastTradeToday\",, \"T\")))","v":-6.5},"ZWA",{"$f":"\" \"&RTD(\"cqg.rtd\", ,\"ContractData\",V6, \"LongDescription\",, \"T\")&\" \"","v":" Wheat (Globex), Sep 18 "},null,null,null,"Last",{"$f":"RTD(\"cqg.rtd\", ,\"ContractData\",V6, \"LastTradeToday\",, \"T\")","v":507.25},null,"Net",{"$f":"IF(RTD(\"cqg.rtd\", ,\"ContractData\",V6, \"NetLastTradeToday\",, \"T\")=\"\",\"\",IF(RTD(\"cqg.rtd\", ,\"ContractData\",V6, \"NetLastTradeToday\",, \"T\")>0,\"+\"&TEXT(RTD(\"cqg.rtd\", ,\"ContractData\",V6, \"NetLastTradeToday\",, \"T\"),\"#.00\"),RTD(\"cqg.rtd\", ,\"ContractData\",V6, \"NetLastTradeToday\",, \"T\")))","v":-8}]
[null,null,null,null,null,null,"Trade",null,null,"Change",null,null,null,null,null,null,"Trade",null,null,"Change",null,null,null,null,null,null,"Trade",null,null,"Change"]
[null,{"$f":"RTD(\"cqg.rtd\", ,\"ContractData\",B6, \"MT_LastBidVolume\",, \"T\")","v":8},null,{"$f":"RTD(\"cqg.rtd\", ,\"ContractData\",B6, \"Bid\",, \"T\")","v":877.5},null,{"$f":"RTD(\"cqg.rtd\", ,\"ContractData\",B6, \"Ask\",, \"T\")","v":877.75},null,{"$f":"RTD(\"cqg.rtd\", ,\"ContractData\",B6, \"MT_LastAskVolume\",, \"T\")","v":19},null,"Contract Volume",null,{"$f":"RTD(\"cqg.rtd\", ,\"ContractData\",L6, \"MT_LastBidVolume\",, \"T\")","v":54},null,{"$f":"RTD(\"cqg.rtd\", ,\"ContractData\",L6, \"Bid\",, \"T\")","v":366.25},null,{"$f":"RTD(\"cqg.rtd\", ,\"ContractData\",L6, \"Ask\",, \"T\")","v":366.5},null,{"$f":"RTD(\"cqg.rtd\", ,\"ContractData\",L6, \"MT_LastAskVolume\",, \"T\")","v":631},null,"Contract Volume",null,{"$f":"RTD(\"cqg.rtd\", ,\"ContractData\",V6, \"MT_LastBidVolume\",, \"T\")","v":7},null,{"$f":"RTD(\"cqg.rtd\", ,\"ContractData\",V6, \"Bid\",, \"T\")","v":507.25},null,{"$f":"RTD(\"cqg.rtd\", ,\"ContractData\",V6, \"Ask\",, \"T\")","v":507.5},null,{"$f":"RTD(\"cqg.rtd\", ,\"ContractData\",V6, \"MT_LastAskVolume\",, \"T\")","v":13},null,"Contract Volume"]
[null,null,null,null,null,null,null,null,null,{"$f":"RTD(\"cqg.rtd\", ,\"ContractData\",B6, \"T_CVol\",, \"T\")","v":37546},null,null,null,null,null,null,null,null,null,{"$f":"RTD(\"cqg.rtd\", ,\"ContractData\",L6, \"T_CVol\",, \"T\")","v":36506},null,null,null,null,null,null,null,null,null,{"$f":"RTD(\"cqg.rtd\", ,\"ContractData\",V6, \"T_CVol\",, \"T\")","v":14152}]
[null,null,"Total Volume Today: ",null,{"$f":"RTD(\"cqg.rtd\", ,\"ContractData\", \"ZSE\", \"T_TVol\",, \"T\")","v":58324},null,"Total Volume Y'day: ",null,{"$f":"RTD(\"cqg.rtd\", ,\"ContractData\", \"ZSE\", \"Y_tVol\",, \"T\")","v":234218},null,null,null,"Total Volume Today: ",null,{"$f":"RTD(\"cqg.rtd\", ,\"ContractData\", \"ZCE\", \"T_TVol\",, \"T\")","v":62320},null,"Total Volume Y'day: ",null,{"$f":"RTD(\"cqg.rtd\", ,\"ContractData\", \"ZCE\", \"Y_tVol\",, \"T\")","v":282345},null,null,null,"Total Volume Today: ",null,{"$f":"RTD(\"cqg.rtd\", ,\"ContractData\", \"ZWA\", \"T_TVol\",, \"T\")","v":23432},null,"Total Volume Y'day: ",null,{"$f":"RTD(\"cqg.rtd\", ,\"ContractData\", \"ZWA\", \"Y_tVol\",, \"T\")","v":113565}]
[null,{"$f":"RTD(\"cqg.rtd\", ,\"ContractData\",\"ZSE?\"&$A$12, \"contractMonth\",, \"T\")&RIGHT(RTD(\"cqg.rtd\",,\"ContractData\",\"ZSE?\"&$A$12,\"Symbol\",,\"T\"),1)","v":"JUL8"},{"$f":"RTD(\"cqg.rtd\", ,\"ContractData\",\"ZSE?\"&$A$13, \"contractMonth\",, \"T\")&RIGHT(RTD(\"cqg.rtd\",,\"ContractData\",\"ZSE?\"&$A$13,\"Symbol\",,\"T\"),1)","v":"AUG8"},{"$f":"RTD(\"cqg.rtd\", ,\"ContractData\",\"ZSE?\"&$A$14, \"contractMonth\",, \"T\")&RIGHT(RTD(\"cqg.rtd\",,\"ContractData\",\"ZSE?\"&$A$14,\"Symbol\",,\"T\"),1)","v":"SEP8"},{"$f":"RTD(\"cqg.rtd\", ,\"ContractData\",\"ZSE?\"&$A$15, \"contractMonth\",, \"T\")&RIGHT(RTD(\"cqg.rtd\",,\"ContractData\",\"ZSE?\"&$A$15,\"Symbol\",,\"T\"),1)","v":"NOV8"},{"$f":"RTD(\"cqg.rtd\", ,\"ContractData\",\"ZSE?\"&$A$16, \"contractMonth\",, \"T\")&RIGHT(RTD(\"cqg.rtd\",,\"ContractData\",\"ZSE?\"&$A$16,\"Symbol\",,\"T\"),1)","v":"JAN9"},{"$f":"RTD(\"cqg.rtd\", ,\"ContractData\",\"ZSE?\"&$A$17, \"contractMonth\",, \"T\")&RIGHT(RTD(\"cqg.rtd\",,\"ContractData\",\"ZSE?\"&$A$17,\"Symbol\",,\"T\"),1)","v":"MAR9"},{"$f":"RTD(\"cqg.rtd\", ,\"ContractData\",\"ZSE?\"&$A$18, \"contractMonth\",, \"T\")&RIGHT(RTD(\"cqg.rtd\",,\"ContractData\",\"ZSE?\"&$A$18,\"Symbol\",,\"T\"),1)","v":"MAY9"},{"$f":"RTD(\"cqg.rtd\", ,\"ContractData\",\"ZSE?\"&$A$19, \"contractMonth\",, \"T\")&RIGHT(RTD(\"cqg.rtd\",,\"ContractData\",\"ZSE?\"&$A$19,\"Symbol\",,\"T\"),1)","v":"JUL9"},{"$f":"RTD(\"cqg.rtd\", ,\"ContractData\",\"ZSE?\"&$A$20, \"contractMonth\",, \"T\")&RIGHT(RTD(\"cqg.rtd\",,\"ContractData\",\"ZSE?\"&$A$20,\"Symbol\",,\"T\"),1)","v":"AUG9"},{"$f":"RTD(\"cqg.rtd\", ,\"ContractData\",\"ZSE?\"&$A$21, \"contractMonth\",, \"T\")&RIGHT(RTD(\"cqg.rtd\",,\"ContractData\",\"ZSE?\"&$A$21,\"Symbol\",,\"T\"),1)","v":"SEP9"},{"$f":"RTD(\"cqg.rtd\",,\"ContractData\",\"ZCE?\"&$A$12,\"contractMonth\",,\"T\")&RIGHT(RTD(\"cqg.rtd\",,\"ContractData\",\"ZCE?\"&$A$12,\"Symbol\",,\"T\"),1)","v":"JUL8"},{"$f":"RTD(\"cqg.rtd\", ,\"ContractData\",\"ZCE?\"&$A$13, \"contractMonth\",, \"T\")&RIGHT(RTD(\"cqg.rtd\",,\"ContractData\",\"ZCE?\"&$A$13,\"Symbol\",,\"T\"),1)","v":"SEP8"},{"$f":"RTD(\"cqg.rtd\", ,\"ContractData\",\"ZCE?\"&$A$14, \"contractMonth\",, \"T\")&RIGHT(RTD(\"cqg.rtd\",,\"ContractData\",\"ZCE?\"&$A$14,\"Symbol\",,\"T\"),1)","v":"DEC8"},{"$f":"RTD(\"cqg.rtd\", ,\"ContractData\",\"ZCE?\"&$A$15, \"contractMonth\",, \"T\")&RIGHT(RTD(\"cqg.rtd\",,\"ContractData\",\"ZCE?\"&$A$15,\"Symbol\",,\"T\"),1)","v":"MAR9"},{"$f":"RTD(\"cqg.rtd\", ,\"ContractData\",\"ZCE?\"&$A$16, \"contractMonth\",, \"T\")&RIGHT(RTD(\"cqg.rtd\",,\"ContractData\",\"ZCE?\"&$A$16,\"Symbol\",,\"T\"),1)","v":"MAY9"},{"$f":"RTD(\"cqg.rtd\", ,\"ContractData\",\"ZCE?\"&$A$17, \"contractMonth\",, \"T\")&RIGHT(RTD(\"cqg.rtd\",,\"ContractData\",\"ZCE?\"&$A$17,\"Symbol\",,\"T\"),1)","v":"JUL9"},{"$f":"RTD(\"cqg.rtd\", ,\"ContractData\",\"ZCE?\"&$A$18, \"contractMonth\",, \"T\")&RIGHT(RTD(\"cqg.rtd\",,\"ContractData\",\"ZCE?\"&$A$18,\"Symbol\",,\"T\"),1)","v":"SEP9"},{"$f":"RTD(\"cqg.rtd\", ,\"ContractData\",\"ZCE?\"&$A$19, \"contractMonth\",, \"T\")&RIGHT(RTD(\"cqg.rtd\",,\"ContractData\",\"ZCE?\"&$A$19,\"Symbol\",,\"T\"),1)","v":"DEC9"},{"$f":"RTD(\"cqg.rtd\", ,\"ContractData\",\"ZCE?\"&$A$20, \"contractMonth\",, \"T\")&RIGHT(RTD(\"cqg.rtd\",,\"ContractData\",\"ZCE?\"&$A$20,\"Symbol\",,\"T\"),1)","v":"MAR0"},{"$f":"RTD(\"cqg.rtd\", ,\"ContractData\",\"ZCE?\"&$A$21, \"contractMonth\",, \"T\")&RIGHT(RTD(\"cqg.rtd\",,\"ContractData\",\"ZCE?\"&$A$21,\"Symbol\",,\"T\"),1)","v":"MAY0"},{"$f":"RTD(\"cqg.rtd\", ,\"ContractData\",\"ZWA?\"&$A$12, \"contractMonth\",, \"T\")","v":"JUL"},{"$f":"RTD(\"cqg.rtd\", ,\"ContractData\",\"ZWA?\"&$A$13, \"contractMonth\",, \"T\")","v":"SEP"},{"$f":"RTD(\"cqg.rtd\", ,\"ContractData\",\"ZWA?\"&$A$14, \"contractMonth\",, \"T\")","v":"DEC"},{"$f":"RTD(\"cqg.rtd\", ,\"ContractData\",\"ZWA?\"&$A$15, \"contractMonth\",, \"T\")","v":"MAR"},{"$f":"RTD(\"cqg.rtd\", ,\"ContractData\",\"ZWA?\"&$A$16, \"contractMonth\",, \"T\")","v":"MAY"},{"$f":"RTD(\"cqg.rtd\", ,\"ContractData\",\"ZWA?\"&$A$17, \"contractMonth\",, \"T\")","v":"JUL"},{"$f":"RTD(\"cqg.rtd\", ,\"ContractData\",\"ZWA?\"&$A$18, \"contractMonth\",, \"T\")","v":"SEP"},{"$f":"RTD(\"cqg.rtd\", ,\"ContractData\",\"ZWA?\"&$A$19, \"contractMonth\",, \"T\")","v":"DEC"},{"$f":"RTD(\"cqg.rtd\", ,\"ContractData\",\"ZWA?\"&$A$20, \"contractMonth\",, \"T\")","v":"MAR"},{"$f":"RTD(\"cqg.rtd\", ,\"ContractData\",\"ZWA?\"&$A$21, \"contractMonth\",, \"T\")","v":"MAY"}]
[1,{"$f":"\"A \"&TEXT(RTD(\"cqg.rtd\",,\"ContractData\",\"ZSE?\"&$A$12,\"Ask\",,\"T\"),\"#.00\")","v":"A 857.25"},{"$f":"\"A \"&TEXT(RTD(\"cqg.rtd\", ,\"ContractData\",\"ZSE?\"&$A$13, \"Ask\",, \"T\"),\"#.00\")","v":"A 861.00"},{"$f":"\"A \"&TEXT(RTD(\"cqg.rtd\", ,\"ContractData\",\"ZSE?\"&$A$14, \"Ask\",, \"T\"),\"#.00\")","v":"A 866.50"},{"$f":"\"A \"&TEXT(RTD(\"cqg.rtd\", ,\"ContractData\",\"ZSE?\"&$A$15, \"Ask\",, \"T\"),\"#.00\")","v":"A 877.75"},{"$f":"\"A \"&TEXT(RTD(\"cqg.rtd\", ,\"ContractData\",\"ZSE?\"&$A$16, \"Ask\",, \"T\"),\"#.00\")","v":"A 887.75"},{"$f":"\"A \"&TEXT(RTD(\"cqg.rtd\", ,\"ContractData\",\"ZSE?\"&$A$17, \"Ask\",, \"T\"),\"#.00\")","v":"A 895.25"},{"$f":"\"A \"&TEXT(RTD(\"cqg.rtd\", ,\"ContractData\",\"ZSE?\"&$A$18, \"Ask\",, \"T\"),\"#.00\")","v":"A 904.25"},{"$f":"\"A \"&TEXT(RTD(\"cqg.rtd\", ,\"ContractData\",\"ZSE?\"&$A$19, \"Ask\",, \"T\"),\"#.00\")","v":"A 913.00"},{"$f":"\"A \"&TEXT(RTD(\"cqg.rtd\", ,\"ContractData\",\"ZSE?\"&$A$20, \"Ask\",, \"T\"),\"#.00\")","v":"A 913.00"},{"$f":"\"A \"&TEXT(RTD(\"cqg.rtd\", ,\"ContractData\",\"ZSE?\"&$A$21, \"Ask\",, \"T\"),\"#.00\")","v":"A 907.25"},{"$f":"\"A \"&TEXT(RTD(\"cqg.rtd\", ,\"ContractData\",\"ZCE?\"&$A$12, \"Ask\",, \"T\"),\"#.00\")","v":"A 345.00"},{"$f":"\"A \"&TEXT(RTD(\"cqg.rtd\", ,\"ContractData\",\"ZCE?\"&$A$13, \"Ask\",, \"T\"),\"#.00\")","v":"A 353.50"},{"$f":"\"A \"&TEXT(RTD(\"cqg.rtd\", ,\"ContractData\",\"ZCE?\"&$A$14, \"Ask\",, \"T\"),\"#.00\")","v":"A 366.50"},{"$f":"\"A \"&TEXT(RTD(\"cqg.rtd\", ,\"ContractData\",\"ZCE?\"&$A$15, \"Ask\",, \"T\"),\"#.00\")","v":"A 377.00"},{"$f":"\"A \"&TEXT(RTD(\"cqg.rtd\", ,\"ContractData\",\"ZCE?\"&$A$16, \"Ask\",, \"T\"),\"#.00\")","v":"A 383.75"},{"$f":"\"A \"&TEXT(RTD(\"cqg.rtd\", ,\"ContractData\",\"ZCE?\"&$A$17, \"Ask\",, \"T\"),\"#.00\")","v":"A 390.25"},{"$f":"\"A \"&TEXT(RTD(\"cqg.rtd\", ,\"ContractData\",\"ZCE?\"&$A$18, \"Ask\",, \"T\"),\"#.00\")","v":"A 388.75"},{"$f":"\"A \"&TEXT(RTD(\"cqg.rtd\", ,\"ContractData\",\"ZCE?\"&$A$19, \"Ask\",, \"T\"),\"#.00\")","v":"A 394.00"},{"$f":"\"A \"&TEXT(RTD(\"cqg.rtd\", ,\"ContractData\",\"ZCE?\"&$A$20, \"Ask\",, \"T\"),\"#.00\")","v":"A 403.75"},{"$f":"\"A \"&TEXT(RTD(\"cqg.rtd\", ,\"ContractData\",\"ZCE?\"&$A$21, \"Ask\",, \"T\"),\"#.00\")","v":"A 410.25"},{"$f":"\"A \"&TEXT(RTD(\"cqg.rtd\", ,\"ContractData\",\"ZWA?\"&$A$12, \"Ask\",, \"T\"),\"#.00\")","v":"A 507.25"},{"$f":"\"A \"&TEXT(RTD(\"cqg.rtd\", ,\"ContractData\",\"ZWA?\"&$A$13, \"Ask\",, \"T\"),\"#.00\")","v":"A 507.50"},{"$f":"\"A \"&TEXT(RTD(\"cqg.rtd\", ,\"ContractData\",\"ZWA?\"&$A$14, \"Ask\",, \"T\"),\"#.00\")","v":"A 523.75"},{"$f":"\"A \"&TEXT(RTD(\"cqg.rtd\", ,\"ContractData\",\"ZWA?\"&$A$15, \"Ask\",, \"T\"),\"#.00\")","v":"A 538.50"},{"$f":"\"A \"&TEXT(RTD(\"cqg.rtd\", ,\"ContractData\",\"ZWA?\"&$A$16, \"Ask\",, \"T\"),\"#.00\")","v":"A 548.00"},{"$f":"\"A \"&TEXT(RTD(\"cqg.rtd\", ,\"ContractData\",\"ZWA?\"&$A$17, \"Ask\",, \"T\"),\"#.00\")","v":"A 552.00"},{"$f":"\"A \"&TEXT(RTD(\"cqg.rtd\", ,\"ContractData\",\"ZWA?\"&$A$18, \"Ask\",, \"T\"),\"#.00\")","v":"A 560.75"},{"$f":"\"A \"&TEXT(RTD(\"cqg.rtd\", ,\"ContractData\",\"ZWA?\"&$A$19, \"Ask\",, \"T\"),\"#.00\")","v":"A 573.25"},{"$f":"\"A \"&TEXT(RTD(\"cqg.rtd\", ,\"ContractData\",\"ZWA?\"&$A$20, \"Ask\",, \"T\"),\"#.00\")","v":"A 582.50"},{"$f":"\"A \"&TEXT(RTD(\"cqg.rtd\", ,\"ContractData\",\"ZWA?\"&$A$21, \"Ask\",, \"T\"),\"#.00\")","v":"A 588.75"}]
[2,{"$f":"\"B \"&TEXT(RTD(\"cqg.rtd\", ,\"ContractData\",\"ZSE?\"&$A$12, \"Bid\",, \"T\"),\"#.00\")","v":"B 856.50"},{"$f":"\"B \"&TEXT(RTD(\"cqg.rtd\", ,\"ContractData\",\"ZSE?\"&$A$13, \"Bid\",, \"T\"),\"#.00\")","v":"B 860.75"},{"$f":"\"B \"&TEXT(RTD(\"cqg.rtd\", ,\"ContractData\",\"ZSE?\"&$A$14, \"Bid\",, \"T\"),\"#.00\")","v":"B 866.25"},{"$f":"\"B \"&TEXT(RTD(\"cqg.rtd\", ,\"ContractData\",\"ZSE?\"&$A$15, \"Bid\",, \"T\"),\"#.00\")","v":"B 877.50"},{"$f":"\"B \"&TEXT(RTD(\"cqg.rtd\", ,\"ContractData\",\"ZSE?\"&$A$16, \"Bid\",, \"T\"),\"#.00\")","v":"B 887.50"},{"$f":"\"B \"&TEXT(RTD(\"cqg.rtd\", ,\"ContractData\",\"ZSE?\"&$A$17, \"Bid\",, \"T\"),\"#.00\")","v":"B 895.00"},{"$f":"\"B \"&TEXT(RTD(\"cqg.rtd\", ,\"ContractData\",\"ZSE?\"&$A$18, \"Bid\",, \"T\"),\"#.00\")","v":"B 904.00"},{"$f":"\"B \"&TEXT(RTD(\"cqg.rtd\", ,\"ContractData\",\"ZSE?\"&$A$19, \"Bid\",, \"T\"),\"#.00\")","v":"B 912.75"},{"$f":"\"B \"&TEXT(RTD(\"cqg.rtd\", ,\"ContractData\",\"ZSE?\"&$A$20, \"Bid\",, \"T\"),\"#.00\")","v":"B 912.25"},{"$f":"\"B \"&TEXT(RTD(\"cqg.rtd\", ,\"ContractData\",\"ZSE?\"&$A$21, \"Bid\",, \"T\"),\"#.00\")","v":"B 903.25"},{"$f":"\"B \"&TEXT(RTD(\"cqg.rtd\", ,\"ContractData\",\"ZCE?\"&$A$12, \"Bid\",, \"T\"),\"#.00\")","v":"B 344.50"},{"$f":"\"B \"&TEXT(RTD(\"cqg.rtd\", ,\"ContractData\",\"ZCE?\"&$A$13, \"Bid\",, \"T\"),\"#.00\")","v":"B 353.25"},{"$f":"\"B \"&TEXT(RTD(\"cqg.rtd\", ,\"ContractData\",\"ZCE?\"&$A$14, \"Bid\",, \"T\"),\"#.00\")","v":"B 366.25"},{"$f":"\"B \"&TEXT(RTD(\"cqg.rtd\", ,\"ContractData\",\"ZCE?\"&$A$15, \"Bid\",, \"T\"),\"#.00\")","v":"B 376.75"},{"$f":"\"B \"&TEXT(RTD(\"cqg.rtd\", ,\"ContractData\",\"ZCE?\"&$A$16, \"Bid\",, \"T\"),\"#.00\")","v":"B 383.50"},{"$f":"\"B \"&TEXT(RTD(\"cqg.rtd\", ,\"ContractData\",\"ZCE?\"&$A$17, \"Bid\",, \"T\"),\"#.00\")","v":"B 389.75"},{"$f":"\"B \"&TEXT(RTD(\"cqg.rtd\", ,\"ContractData\",\"ZCE?\"&$A$18, \"Bid\",, \"T\"),\"#.00\")","v":"B 388.50"},{"$f":"\"B \"&TEXT(RTD(\"cqg.rtd\", ,\"ContractData\",\"ZCE?\"&$A$19, \"Bid\",, \"T\"),\"#.00\")","v":"B 393.75"},{"$f":"\"B \"&TEXT(RTD(\"cqg.rtd\", ,\"ContractData\",\"ZCE?\"&$A$20, \"Bid\",, \"T\"),\"#.00\")","v":"B 403.25"},{"$f":"\"B \"&TEXT(RTD(\"cqg.rtd\", ,\"ContractData\",\"ZCE?\"&$A$21, \"Bid\",, \"T\"),\"#.00\")","v":"B 409.25"},{"$f":"\"B \"&TEXT(RTD(\"cqg.rtd\", ,\"ContractData\",\"ZWA?\"&$A$12, \"Bid\",, \"T\"),\"#.00\")","v":"B 503.00"},{"$f":"\"B \"&TEXT(RTD(\"cqg.rtd\", ,\"ContractData\",\"ZWA?\"&$A$13, \"Bid\",, \"T\"),\"#.00\")","v":"B 507.25"},{"$f":"\"B \"&TEXT(RTD(\"cqg.rtd\", ,\"ContractData\",\"ZWA?\"&$A$14, \"Bid\",, \"T\"),\"#.00\")","v":"B 523.25"},{"$f":"\"B \"&TEXT(RTD(\"cqg.rtd\", ,\"ContractData\",\"ZWA?\"&$A$15, \"Bid\",, \"T\"),\"#.00\")","v":"B 538.00"},{"$f":"\"B \"&TEXT(RTD(\"cqg.rtd\", ,\"ContractData\",\"ZWA?\"&$A$16, \"Bid\",, \"T\"),\"#.00\")","v":"B 547.50"},{"$f":"\"B \"&TEXT(RTD(\"cqg.rtd\", ,\"ContractData\",\"ZWA?\"&$A$17, \"Bid\",, \"T\"),\"#.00\")","v":"B 551.50"},{"$f":"\"B \"&TEXT(RTD(\"cqg.rtd\", ,\"ContractData\",\"ZWA?\"&$A$18, \"Bid\",, \"T\"),\"#.00\")","v":"B 560.00"},{"$f":"\"B \"&TEXT(RTD(\"cqg.rtd\", ,\"ContractData\",\"ZWA?\"&$A$19, \"Bid\",, \"T\"),\"#.00\")","v":"B 572.50"},{"$f":"\"B \"&TEXT(RTD(\"cqg.rtd\", ,\"ContractData\",\"ZWA?\"&$A$20, \"Bid\",, \"T\"),\"#.00\")","v":"B 580.75"},{"$f":"\"B \"&TEXT(RTD(\"cqg.rtd\", ,\"ContractData\",\"ZWA?\"&$A$21, \"Bid\",, \"T\"),\"#.00\")","v":"B 581.75"}]
[3,{"$f":"IF(RTD(\"cqg.rtd\",,\"ContractData\",\"ZSE?\"&$A$12,\"LastTradeToday\",,\"T\")=\"\",\"S \"&RTD(\"cqg.rtd\",,\"ContractData\",\"ZSE?\"&$A$12,\"Settlement\",,\"T\"),TEXT(RTD(\"cqg.rtd\",,\"ContractData\",\"ZSE?\"&$A$12,\"LastTradeToday\",,\"T\"),\"#.00\"))","v":"861.50"},{"$f":"IF(RTD(\"cqg.rtd\",,\"ContractData\",\"ZSE?\"&$A$13,\"LastTradeToday\",,\"T\")=\"\",\"S \"&RTD(\"cqg.rtd\",,\"ContractData\",\"ZSE?\"&$A$13,\"Settlement\",,\"T\"),TEXT(RTD(\"cqg.rtd\",,\"ContractData\",\"ZSE?\"&$A$13,\"LastTradeToday\",,\"T\"),\"#.00\"))","v":"861.00"},{"$f":"IF(RTD(\"cqg.rtd\",,\"ContractData\",\"ZSE?\"&$A$14,\"LastTradeToday\",,\"T\")=\"\",\"S \"&RTD(\"cqg.rtd\",,\"ContractData\",\"ZSE?\"&$A$14,\"Settlement\",,\"T\"),TEXT(RTD(\"cqg.rtd\",,\"ContractData\",\"ZSE?\"&$A$14,\"LastTradeToday\",,\"T\"),\"#.00\"))","v":"866.50"},{"$f":"IF(RTD(\"cqg.rtd\",,\"ContractData\",\"ZSE?\"&$A$15,\"LastTradeToday\",,\"T\")=\"\",\"S \"&RTD(\"cqg.rtd\",,\"ContractData\",\"ZSE?\"&$A$15,\"Settlement\",,\"T\"),TEXT(RTD(\"cqg.rtd\",,\"ContractData\",\"ZSE?\"&$A$15,\"LastTradeToday\",,\"T\"),\"#.00\"))","v":"877.75"},{"$f":"IF(RTD(\"cqg.rtd\",,\"ContractData\",\"ZSE?\"&$A$16,\"LastTradeToday\",,\"T\")=\"\",\"S \"&RTD(\"cqg.rtd\",,\"ContractData\",\"ZSE?\"&$A$16,\"Settlement\",,\"T\"),TEXT(RTD(\"cqg.rtd\",,\"ContractData\",\"ZSE?\"&$A$16,\"LastTradeToday\",,\"T\"),\"#.00\"))","v":"887.75"},{"$f":"IF(RTD(\"cqg.rtd\",,\"ContractData\",\"ZSE?\"&$A$17,\"LastTradeToday\",,\"T\")=\"\",\"S \"&RTD(\"cqg.rtd\",,\"ContractData\",\"ZSE?\"&$A$17,\"Settlement\",,\"T\"),TEXT(RTD(\"cqg.rtd\",,\"ContractData\",\"ZSE?\"&$A$17,\"LastTradeToday\",,\"T\"),\"#.00\"))","v":"895.00"},{"$f":"IF(RTD(\"cqg.rtd\",,\"ContractData\",\"ZSE?\"&$A$18,\"LastTradeToday\",,\"T\")=\"\",\"S \"&RTD(\"cqg.rtd\",,\"ContractData\",\"ZSE?\"&$A$18,\"Settlement\",,\"T\"),TEXT(RTD(\"cqg.rtd\",,\"ContractData\",\"ZSE?\"&$A$18,\"LastTradeToday\",,\"T\"),\"#.00\"))","v":"904.00"},{"$f":"IF(RTD(\"cqg.rtd\",,\"ContractData\",\"ZSE?\"&$A$19,\"LastTradeToday\",,\"T\")=\"\",\"S \"&RTD(\"cqg.rtd\",,\"ContractData\",\"ZSE?\"&$A$19,\"Settlement\",,\"T\"),TEXT(RTD(\"cqg.rtd\",,\"ContractData\",\"ZSE?\"&$A$19,\"LastTradeToday\",,\"T\"),\"#.00\"))","v":"912.75"},{"$f":"IF(RTD(\"cqg.rtd\",,\"ContractData\",\"ZSE?\"&$A$20,\"LastTradeToday\",,\"T\")=\"\",\"S \"&RTD(\"cqg.rtd\",,\"ContractData\",\"ZSE?\"&$A$20,\"Settlement\",,\"T\"),TEXT(RTD(\"cqg.rtd\",,\"ContractData\",\"ZSE?\"&$A$20,\"LastTradeToday\",,\"T\"),\"#.00\"))","v":"S 928"},{"$f":"IF(RTD(\"cqg.rtd\",,\"ContractData\",\"ZSE?\"&$A$21,\"LastTradeToday\",,\"T\")=\"\",\"S \"&RTD(\"cqg.rtd\",,\"ContractData\",\"ZSE?\"&$A$21,\"Settlement\",,\"T\"),TEXT(RTD(\"cqg.rtd\",,\"ContractData\",\"ZSE?\"&$A$21,\"LastTradeToday\",,\"T\"),\"#.00\"))","v":"S 920"},{"$f":"IF(RTD(\"cqg.rtd\",,\"ContractData\",\"ZCE?\"&$A$12,\"LastTradeToday\",,\"T\")=\"\",\"S \"&RTD(\"cqg.rtd\",,\"ContractData\",\"ZCE?\"&$A$12,\"Settlement\",,\"T\"),TEXT(RTD(\"cqg.rtd\",,\"ContractData\",\"ZCE?\"&$A$12,\"LastTradeToday\",,\"T\"),\"#.00\"))","v":"345.00"},{"$f":"IF(RTD(\"cqg.rtd\",,\"ContractData\",\"ZCE?\"&$A$13,\"LastTradeToday\",,\"T\")=\"\",\"S \"&RTD(\"cqg.rtd\",,\"ContractData\",\"ZCE?\"&$A$13,\"Settlement\",,\"T\"),TEXT(RTD(\"cqg.rtd\",,\"ContractData\",\"ZCE?\"&$A$13,\"LastTradeToday\",,\"T\"),\"#.00\"))","v":"353.50"},{"$f":"IF(RTD(\"cqg.rtd\",,\"ContractData\",\"ZCE?\"&$A$14,\"LastTradeToday\",,\"T\")=\"\",\"S \"&RTD(\"cqg.rtd\",,\"ContractData\",\"ZCE?\"&$A$14,\"Settlement\",,\"T\"),TEXT(RTD(\"cqg.rtd\",,\"ContractData\",\"ZCE?\"&$A$14,\"LastTradeToday\",,\"T\"),\"#.00\"))","v":"366.50"},{"$f":"IF(RTD(\"cqg.rtd\",,\"ContractData\",\"ZCE?\"&$A$15,\"LastTradeToday\",,\"T\")=\"\",\"S \"&RTD(\"cqg.rtd\",,\"ContractData\",\"ZCE?\"&$A$15,\"Settlement\",,\"T\"),TEXT(RTD(\"cqg.rtd\",,\"ContractData\",\"ZCE?\"&$A$15,\"LastTradeToday\",,\"T\"),\"#.00\"))","v":"376.75"},{"$f":"IF(RTD(\"cqg.rtd\",,\"ContractData\",\"ZCE?\"&$A$16,\"LastTradeToday\",,\"T\")=\"\",\"S \"&RTD(\"cqg.rtd\",,\"ContractData\",\"ZCE?\"&$A$16,\"Settlement\",,\"T\"),TEXT(RTD(\"cqg.rtd\",,\"ContractData\",\"ZCE?\"&$A$16,\"LastTradeToday\",,\"T\"),\"#.00\"))","v":"384.00"},{"$f":"IF(RTD(\"cqg.rtd\",,\"ContractData\",\"ZCE?\"&$A$17,\"LastTradeToday\",,\"T\")=\"\",\"S \"&RTD(\"cqg.rtd\",,\"ContractData\",\"ZCE?\"&$A$17,\"Settlement\",,\"T\"),TEXT(RTD(\"cqg.rtd\",,\"ContractData\",\"ZCE?\"&$A$17,\"LastTradeToday\",,\"T\"),\"#.00\"))","v":"390.00"},{"$f":"IF(RTD(\"cqg.rtd\",,\"ContractData\",\"ZCE?\"&$A$18,\"LastTradeToday\",,\"T\")=\"\",\"S \"&RTD(\"cqg.rtd\",,\"ContractData\",\"ZCE?\"&$A$18,\"Settlement\",,\"T\"),TEXT(RTD(\"cqg.rtd\",,\"ContractData\",\"ZCE?\"&$A$18,\"LastTradeToday\",,\"T\"),\"#.00\"))","v":"389.00"},{"$f":"IF(RTD(\"cqg.rtd\",,\"ContractData\",\"ZCE?\"&$A$19,\"LastTradeToday\",,\"T\")=\"\",\"S \"&RTD(\"cqg.rtd\",,\"ContractData\",\"ZCE?\"&$A$19,\"Settlement\",,\"T\"),TEXT(RTD(\"cqg.rtd\",,\"ContractData\",\"ZCE?\"&$A$19,\"LastTradeToday\",,\"T\"),\"#.00\"))","v":"394.00"},{"$f":"IF(RTD(\"cqg.rtd\",,\"ContractData\",\"ZCE?\"&$A$20,\"LastTradeToday\",,\"T\")=\"\",\"S \"&RTD(\"cqg.rtd\",,\"ContractData\",\"ZCE?\"&$A$20,\"Settlement\",,\"T\"),TEXT(RTD(\"cqg.rtd\",,\"ContractData\",\"ZCE?\"&$A$20,\"LastTradeToday\",,\"T\"),\"#.00\"))","v":"405.50"},{"$f":"IF(RTD(\"cqg.rtd\",,\"ContractData\",\"ZCE?\"&$A$21,\"LastTradeToday\",,\"T\")=\"\",\"S \"&RTD(\"cqg.rtd\",,\"ContractData\",\"ZCE?\"&$A$21,\"Settlement\",,\"T\"),TEXT(RTD(\"cqg.rtd\",,\"ContractData\",\"ZCE?\"&$A$21,\"LastTradeToday\",,\"T\"),\"#.00\"))","v":"S 414.75"},{"$f":"IF(RTD(\"cqg.rtd\",,\"ContractData\",\"ZWA?\"&$A$12,\"LastTradeToday\",,\"T\")=\"\",\"S \"&RTD(\"cqg.rtd\",,\"ContractData\",\"ZWA?\"&$A$12,\"Settlement\",,\"T\"),TEXT(RTD(\"cqg.rtd\",,\"ContractData\",\"ZWA?\"&$A$12,\"LastTradeToday\",,\"T\"),\"#.00\"))","v":"509.50"},{"$f":"IF(RTD(\"cqg.rtd\",,\"ContractData\",\"ZWA?\"&$A$13,\"LastTradeToday\",,\"T\")=\"\",\"S \"&RTD(\"cqg.rtd\",,\"ContractData\",\"ZWA?\"&$A$13,\"Settlement\",,\"T\"),TEXT(RTD(\"cqg.rtd\",,\"ContractData\",\"ZWA?\"&$A$13,\"LastTradeToday\",,\"T\"),\"#.00\"))","v":"507.25"},{"$f":"IF(RTD(\"cqg.rtd\",,\"ContractData\",\"ZWA?\"&$A$14,\"LastTradeToday\",,\"T\")=\"\",\"S \"&RTD(\"cqg.rtd\",,\"ContractData\",\"ZWA?\"&$A$14,\"Settlement\",,\"T\"),TEXT(RTD(\"cqg.rtd\",,\"ContractData\",\"ZWA?\"&$A$14,\"LastTradeToday\",,\"T\"),\"#.00\"))","v":"523.50"},{"$f":"IF(RTD(\"cqg.rtd\",,\"ContractData\",\"ZWA?\"&$A$15,\"LastTradeToday\",,\"T\")=\"\",\"S \"&RTD(\"cqg.rtd\",,\"ContractData\",\"ZWA?\"&$A$15,\"Settlement\",,\"T\"),TEXT(RTD(\"cqg.rtd\",,\"ContractData\",\"ZWA?\"&$A$15,\"LastTradeToday\",,\"T\"),\"#.00\"))","v":"538.25"},{"$f":"IF(RTD(\"cqg.rtd\",,\"ContractData\",\"ZWA?\"&$A$16,\"LastTradeToday\",,\"T\")=\"\",\"S \"&RTD(\"cqg.rtd\",,\"ContractData\",\"ZWA?\"&$A$16,\"Settlement\",,\"T\"),TEXT(RTD(\"cqg.rtd\",,\"ContractData\",\"ZWA?\"&$A$16,\"LastTradeToday\",,\"T\"),\"#.00\"))","v":"547.75"},{"$f":"IF(RTD(\"cqg.rtd\",,\"ContractData\",\"ZWA?\"&$A$17,\"LastTradeToday\",,\"T\")=\"\",\"S \"&RTD(\"cqg.rtd\",,\"ContractData\",\"ZWA?\"&$A$17,\"Settlement\",,\"T\"),TEXT(RTD(\"cqg.rtd\",,\"ContractData\",\"ZWA?\"&$A$17,\"LastTradeToday\",,\"T\"),\"#.00\"))","v":"552.50"},{"$f":"IF(RTD(\"cqg.rtd\",,\"ContractData\",\"ZWA?\"&$A$18,\"LastTradeToday\",,\"T\")=\"\",\"S \"&RTD(\"cqg.rtd\",,\"ContractData\",\"ZWA?\"&$A$18,\"Settlement\",,\"T\"),TEXT(RTD(\"cqg.rtd\",,\"ContractData\",\"ZWA?\"&$A$18,\"LastTradeToday\",,\"T\"),\"#.00\"))","v":"560.25"},{"$f":"IF(RTD(\"cqg.rtd\",,\"ContractData\",\"ZWA?\"&$A$19,\"LastTradeToday\",,\"T\")=\"\",\"S \"&RTD(\"cqg.rtd\",,\"ContractData\",\"ZWA?\"&$A$19,\"Settlement\",,\"T\"),TEXT(RTD(\"cqg.rtd\",,\"ContractData\",\"ZWA?\"&$A$19,\"LastTradeToday\",,\"T\"),\"#.00\"))","v":"573.50"},{"$f":"IF(RTD(\"cqg.rtd\",,\"ContractData\",\"ZWA?\"&$A$20,\"LastTradeToday\",,\"T\")=\"\",\"S \"&RTD(\"cqg.rtd\",,\"ContractData\",\"ZWA?\"&$A$20,\"Settlement\",,\"T\"),TEXT(RTD(\"cqg.rtd\",,\"ContractData\",\"ZWA?\"&$A$20,\"LastTradeToday\",,\"T\"),\"#.00\"))","v":"S 587.75"},{"$f":"IF(RTD(\"cqg.rtd\",,\"ContractData\",\"ZWA?\"&$A$21,\"LastTradeToday\",,\"T\")=\"\",\"S \"&RTD(\"cqg.rtd\",,\"ContractData\",\"ZWA?\"&$A$21,\"Settlement\",,\"T\"),TEXT(RTD(\"cqg.rtd\",,\"ContractData\",\"ZWA?\"&$A$21,\"LastTradeToday\",,\"T\"),\"#.00\"))","v":"S 592"}]
[4,{"$f":"IF(RTD(\"cqg.rtd\", ,\"ContractData\",\"ZSE?\"&$A$12, \"NetLastQuoteToday\",, \"T\")=\"\",\"NC \"&TEXT(RTD(\"cqg.rtd\",,\"StudyData\",\"ZSE?\"&$A$12,\"Bar\",,\"Close\",\"D\",\"-1\",,,,,\"T\")-RTD(\"cqg.rtd\",,\"StudyData\",\"ZSE?\"&$A$12,\"Bar\",,\"Close\",\"D\",\"-2\",,,,,\"T\"),\"#.00\"),\"NC \"&TEXT(RTD(\"cqg.rtd\", ,\"ContractData\",\"ZSE?\"&$A$12, \"NetLastQuoteToday\",, \"T\"),\"#.00\"))","v":"NC -16.75"},{"$f":"IF(RTD(\"cqg.rtd\", ,\"ContractData\",\"ZSE?\"&$A$13, \"NetLastQuoteToday\",, \"T\")=\"\",\"NC \"&TEXT(RTD(\"cqg.rtd\",,\"StudyData\",\"ZSE?\"&$A$13,\"Bar\",,\"Close\",\"D\",\"-1\",,,,,\"T\")-RTD(\"cqg.rtd\",,\"StudyData\",\"ZSE?\"&$A$13,\"Bar\",,\"Close\",\"D\",\"-2\",,,,,\"T\"),\"#.00\"),\"NC \"&TEXT(RTD(\"cqg.rtd\", ,\"ContractData\",\"ZSE?\"&$A$13, \"NetLastQuoteToday\",, \"T\"),\"#.00\"))","v":"NC -16.50"},{"$f":"IF(RTD(\"cqg.rtd\", ,\"ContractData\",\"ZSE?\"&$A$14, \"NetLastQuoteToday\",, \"T\")=\"\",\"NC \"&TEXT(RTD(\"cqg.rtd\",,\"StudyData\",\"ZSE?\"&$A$14,\"Bar\",,\"Close\",\"D\",\"-1\",,,,,\"T\")-RTD(\"cqg.rtd\",,\"StudyData\",\"ZSE?\"&$A$14,\"Bar\",,\"Close\",\"D\",\"-2\",,,,,\"T\"),\"#.00\"),\"NC \"&TEXT(RTD(\"cqg.rtd\", ,\"ContractData\",\"ZSE?\"&$A$14, \"NetLastQuoteToday\",, \"T\"),\"#.00\"))","v":"NC -16.75"},{"$f":"IF(RTD(\"cqg.rtd\", ,\"ContractData\",\"ZSE?\"&$A$15, \"NetLastQuoteToday\",, \"T\")=\"\",\"NC \"&TEXT(RTD(\"cqg.rtd\",,\"StudyData\",\"ZSE?\"&$A$15,\"Bar\",,\"Close\",\"D\",\"-1\",,,,,\"T\")-RTD(\"cqg.rtd\",,\"StudyData\",\"ZSE?\"&$A$15,\"Bar\",,\"Close\",\"D\",\"-2\",,,,,\"T\"),\"#.00\"),\"NC \"&TEXT(RTD(\"cqg.rtd\", ,\"ContractData\",\"ZSE?\"&$A$15, \"NetLastQuoteToday\",, \"T\"),\"#.00\"))","v":"NC -17.00"},{"$f":"IF(RTD(\"cqg.rtd\", ,\"ContractData\",\"ZSE?\"&$A$16, \"NetLastQuoteToday\",, \"T\")=\"\",\"NC \"&TEXT(RTD(\"cqg.rtd\",,\"StudyData\",\"ZSE?\"&$A$16,\"Bar\",,\"Close\",\"D\",\"-1\",,,,,\"T\")-RTD(\"cqg.rtd\",,\"StudyData\",\"ZSE?\"&$A$16,\"Bar\",,\"Close\",\"D\",\"-2\",,,,,\"T\"),\"#.00\"),\"NC \"&TEXT(RTD(\"cqg.rtd\", ,\"ContractData\",\"ZSE?\"&$A$16, \"NetLastQuoteToday\",, \"T\"),\"#.00\"))","v":"NC -16.25"},{"$f":"IF(RTD(\"cqg.rtd\", ,\"ContractData\",\"ZSE?\"&$A$17, \"NetLastQuoteToday\",, \"T\")=\"\",\"NC \"&TEXT(RTD(\"cqg.rtd\",,\"StudyData\",\"ZSE?\"&$A$17,\"Bar\",,\"Close\",\"D\",\"-1\",,,,,\"T\")-RTD(\"cqg.rtd\",,\"StudyData\",\"ZSE?\"&$A$17,\"Bar\",,\"Close\",\"D\",\"-2\",,,,,\"T\"),\"#.00\"),\"NC \"&TEXT(RTD(\"cqg.rtd\", ,\"ContractData\",\"ZSE?\"&$A$17, \"NetLastQuoteToday\",, \"T\"),\"#.00\"))","v":"NC -15.75"},{"$f":"IF(RTD(\"cqg.rtd\", ,\"ContractData\",\"ZSE?\"&$A$18, \"NetLastQuoteToday\",, \"T\")=\"\",\"NC \"&TEXT(RTD(\"cqg.rtd\",,\"StudyData\",\"ZSE?\"&$A$18,\"Bar\",,\"Close\",\"D\",\"-1\",,,,,\"T\")-RTD(\"cqg.rtd\",,\"StudyData\",\"ZSE?\"&$A$18,\"Bar\",,\"Close\",\"D\",\"-2\",,,,,\"T\"),\"#.00\"),\"NC \"&TEXT(RTD(\"cqg.rtd\", ,\"ContractData\",\"ZSE?\"&$A$18, \"NetLastQuoteToday\",, \"T\"),\"#.00\"))","v":"NC -15.50"},{"$f":"IF(RTD(\"cqg.rtd\", ,\"ContractData\",\"ZSE?\"&$A$19, \"NetLastQuoteToday\",, \"T\")=\"\",\"NC \"&TEXT(RTD(\"cqg.rtd\",,\"StudyData\",\"ZSE?\"&$A$19,\"Bar\",,\"Close\",\"D\",\"-1\",,,,,\"T\")-RTD(\"cqg.rtd\",,\"StudyData\",\"ZSE?\"&$A$19,\"Bar\",,\"Close\",\"D\",\"-2\",,,,,\"T\"),\"#.00\"),\"NC \"&TEXT(RTD(\"cqg.rtd\", ,\"ContractData\",\"ZSE?\"&$A$19, \"NetLastQuoteToday\",, \"T\"),\"#.00\"))","v":"NC -15.50"},{"$f":"IF(RTD(\"cqg.rtd\", ,\"ContractData\",\"ZSE?\"&$A$20, \"NetLastQuoteToday\",, \"T\")=\"\",\"NC \"&TEXT(RTD(\"cqg.rtd\",,\"StudyData\",\"ZSE?\"&$A$20,\"Bar\",,\"Close\",\"D\",\"-1\",,,,,\"T\")-RTD(\"cqg.rtd\",,\"StudyData\",\"ZSE?\"&$A$20,\"Bar\",,\"Close\",\"D\",\"-2\",,,,,\"T\"),\"#.00\"),\"NC \"&TEXT(RTD(\"cqg.rtd\", ,\"ContractData\",\"ZSE?\"&$A$20, \"NetLastQuoteToday\",, \"T\"),\"#.00\"))","v":"NC -15.00"},{"$f":"IF(RTD(\"cqg.rtd\", ,\"ContractData\",\"ZSE?\"&$A$21, \"NetLastQuoteToday\",, \"T\")=\"\",\"NC \"&TEXT(RTD(\"cqg.rtd\",,\"StudyData\",\"ZSE?\"&$A$21,\"Bar\",,\"Close\",\"D\",\"-1\",,,,,\"T\")-RTD(\"cqg.rtd\",,\"StudyData\",\"ZSE?\"&$A$21,\"Bar\",,\"Close\",\"D\",\"-2\",,,,,\"T\"),\"#.00\"),\"NC \"&TEXT(RTD(\"cqg.rtd\", ,\"ContractData\",\"ZSE?\"&$A$21, \"NetLastQuoteToday\",, \"T\"),\"#.00\"))","v":"NC -12.75"},{"$f":"IF(RTD(\"cqg.rtd\", ,\"ContractData\",\"ZCE?\"&$A$12, \"NetLastQuoteToday\",, \"T\")=\"\",\"NC \"&TEXT(RTD(\"cqg.rtd\",,\"StudyData\",\"ZCE?\"&$A$12,\"Bar\",,\"Close\",\"D\",\"-1\",,,,,\"T\")-RTD(\"cqg.rtd\",,\"StudyData\",\"ZCE?\"&$A$12,\"Bar\",,\"Close\",\"D\",\"-2\",,,,,\"T\"),\"#.00\"),\"NC \"&TEXT(RTD(\"cqg.rtd\", ,\"ContractData\",\"ZCE?\"&$A$12, \"NetLastQuoteToday\",, \"T\"),\"#.00\"))","v":"NC -6.75"},{"$f":"IF(RTD(\"cqg.rtd\", ,\"ContractData\",\"ZCE?\"&$A$13, \"NetLastQuoteToday\",, \"T\")=\"\",\"NC \"&TEXT(RTD(\"cqg.rtd\",,\"StudyData\",\"ZCE?\"&$A$13,\"Bar\",,\"Close\",\"D\",\"-1\",,,,,\"T\")-RTD(\"cqg.rtd\",,\"StudyData\",\"ZCE?\"&$A$13,\"Bar\",,\"Close\",\"D\",\"-2\",,,,,\"T\"),\"#.00\"),\"NC \"&TEXT(RTD(\"cqg.rtd\", ,\"ContractData\",\"ZCE?\"&$A$13, \"NetLastQuoteToday\",, \"T\"),\"#.00\"))","v":"NC -6.75"},{"$f":"IF(RTD(\"cqg.rtd\", ,\"ContractData\",\"ZCE?\"&$A$14, \"NetLastQuoteToday\",, \"T\")=\"\",\"NC \"&TEXT(RTD(\"cqg.rtd\",,\"StudyData\",\"ZCE?\"&$A$14,\"Bar\",,\"Close\",\"D\",\"-1\",,,,,\"T\")-RTD(\"cqg.rtd\",,\"StudyData\",\"ZCE?\"&$A$14,\"Bar\",,\"Close\",\"D\",\"-2\",,,,,\"T\"),\"#.00\"),\"NC \"&TEXT(RTD(\"cqg.rtd\", ,\"ContractData\",\"ZCE?\"&$A$14, \"NetLastQuoteToday\",, \"T\"),\"#.00\"))","v":"NC -6.75"},{"$f":"IF(RTD(\"cqg.rtd\", ,\"ContractData\",\"ZCE?\"&$A$15, \"NetLastQuoteToday\",, \"T\")=\"\",\"NC \"&TEXT(RTD(\"cqg.rtd\",,\"StudyData\",\"ZCE?\"&$A$15,\"Bar\",,\"Close\",\"D\",\"-1\",,,,,\"T\")-RTD(\"cqg.rtd\",,\"StudyData\",\"ZCE?\"&$A$15,\"Bar\",,\"Close\",\"D\",\"-2\",,,,,\"T\"),\"#.00\"),\"NC \"&TEXT(RTD(\"cqg.rtd\", ,\"ContractData\",\"ZCE?\"&$A$15, \"NetLastQuoteToday\",, \"T\"),\"#.00\"))","v":"NC -6.50"},{"$f":"IF(RTD(\"cqg.rtd\", ,\"ContractData\",\"ZCE?\"&$A$16, \"NetLastQuoteToday\",, \"T\")=\"\",\"NC \"&TEXT(RTD(\"cqg.rtd\",,\"StudyData\",\"ZCE?\"&$A$16,\"Bar\",,\"Close\",\"D\",\"-1\",,,,,\"T\")-RTD(\"cqg.rtd\",,\"StudyData\",\"ZCE?\"&$A$16,\"Bar\",,\"Close\",\"D\",\"-2\",,,,,\"T\"),\"#.00\"),\"NC \"&TEXT(RTD(\"cqg.rtd\", ,\"ContractData\",\"ZCE?\"&$A$16, \"NetLastQuoteToday\",, \"T\"),\"#.00\"))","v":"NC -6.25"},{"$f":"IF(RTD(\"cqg.rtd\", ,\"ContractData\",\"ZCE?\"&$A$17, \"NetLastQuoteToday\",, \"T\")=\"\",\"NC \"&TEXT(RTD(\"cqg.rtd\",,\"StudyData\",\"ZCE?\"&$A$17,\"Bar\",,\"Close\",\"D\",\"-1\",,,,,\"T\")-RTD(\"cqg.rtd\",,\"StudyData\",\"ZCE?\"&$A$17,\"Bar\",,\"Close\",\"D\",\"-2\",,,,,\"T\"),\"#.00\"),\"NC \"&TEXT(RTD(\"cqg.rtd\", ,\"ContractData\",\"ZCE?\"&$A$17, \"NetLastQuoteToday\",, \"T\"),\"#.00\"))","v":"NC -6.25"},{"$f":"IF(RTD(\"cqg.rtd\", ,\"ContractData\",\"ZCE?\"&$A$18, \"NetLastQuoteToday\",, \"T\")=\"\",\"NC \"&TEXT(RTD(\"cqg.rtd\",,\"StudyData\",\"ZCE?\"&$A$18,\"Bar\",,\"Close\",\"D\",\"-1\",,,,,\"T\")-RTD(\"cqg.rtd\",,\"StudyData\",\"ZCE?\"&$A$18,\"Bar\",,\"Close\",\"D\",\"-2\",,,,,\"T\"),\"#.00\"),\"NC \"&TEXT(RTD(\"cqg.rtd\", ,\"ContractData\",\"ZCE?\"&$A$18, \"NetLastQuoteToday\",, \"T\"),\"#.00\"))","v":"NC -5.75"},{"$f":"IF(RTD(\"cqg.rtd\", ,\"ContractData\",\"ZCE?\"&$A$19, \"NetLastQuoteToday\",, \"T\")=\"\",\"NC \"&TEXT(RTD(\"cqg.rtd\",,\"StudyData\",\"ZCE?\"&$A$19,\"Bar\",,\"Close\",\"D\",\"-1\",,,,,\"T\")-RTD(\"cqg.rtd\",,\"StudyData\",\"ZCE?\"&$A$19,\"Bar\",,\"Close\",\"D\",\"-2\",,,,,\"T\"),\"#.00\"),\"NC \"&TEXT(RTD(\"cqg.rtd\", ,\"ContractData\",\"ZCE?\"&$A$19, \"NetLastQuoteToday\",, \"T\"),\"#.00\"))","v":"NC -5.00"},{"$f":"IF(RTD(\"cqg.rtd\", ,\"ContractData\",\"ZCE?\"&$A$20, \"NetLastQuoteToday\",, \"T\")=\"\",\"NC \"&TEXT(RTD(\"cqg.rtd\",,\"StudyData\",\"ZCE?\"&$A$20,\"Bar\",,\"Close\",\"D\",\"-1\",,,,,\"T\")-RTD(\"cqg.rtd\",,\"StudyData\",\"ZCE?\"&$A$20,\"Bar\",,\"Close\",\"D\",\"-2\",,,,,\"T\"),\"#.00\"),\"NC \"&TEXT(RTD(\"cqg.rtd\", ,\"ContractData\",\"ZCE?\"&$A$20, \"NetLastQuoteToday\",, \"T\"),\"#.00\"))","v":"NC -5.00"},{"$f":"IF(RTD(\"cqg.rtd\", ,\"ContractData\",\"ZCE?\"&$A$21, \"NetLastQuoteToday\",, \"T\")=\"\",\"NC \"&TEXT(RTD(\"cqg.rtd\",,\"StudyData\",\"ZCE?\"&$A$21,\"Bar\",,\"Close\",\"D\",\"-1\",,,,,\"T\")-RTD(\"cqg.rtd\",,\"StudyData\",\"ZCE?\"&$A$21,\"Bar\",,\"Close\",\"D\",\"-2\",,,,,\"T\"),\"#.00\"),\"NC \"&TEXT(RTD(\"cqg.rtd\", ,\"ContractData\",\"ZCE?\"&$A$21, \"NetLastQuoteToday\",, \"T\"),\"#.00\"))","v":"NC -4.50"},{"$f":"IF(RTD(\"cqg.rtd\", ,\"ContractData\",\"ZWA?\"&$A$12, \"NetLastQuoteToday\",, \"T\")=\"\",\"NC \"&TEXT(RTD(\"cqg.rtd\",,\"StudyData\",\"ZWA?\"&$A$12,\"Bar\",,\"Close\",\"D\",\"-1\",,,,,\"T\")-RTD(\"cqg.rtd\",,\"StudyData\",\"ZWA?\"&$A$12,\"Bar\",,\"Close\",\"D\",\"-2\",,,,,\"T\"),\"#.00\"),\"NC \"&TEXT(RTD(\"cqg.rtd\", ,\"ContractData\",\"ZWA?\"&$A$12, \"NetLastQuoteToday\",, \"T\"),\"#.00\"))","v":"NC -5.50"},{"$f":"IF(RTD(\"cqg.rtd\", ,\"ContractData\",\"ZWA?\"&$A$13, \"NetLastQuoteToday\",, \"T\")=\"\",\"NC \"&TEXT(RTD(\"cqg.rtd\",,\"StudyData\",\"ZWA?\"&$A$13,\"Bar\",,\"Close\",\"D\",\"-1\",,,,,\"T\")-RTD(\"cqg.rtd\",,\"StudyData\",\"ZWA?\"&$A$13,\"Bar\",,\"Close\",\"D\",\"-2\",,,,,\"T\"),\"#.00\"),\"NC \"&TEXT(RTD(\"cqg.rtd\", ,\"ContractData\",\"ZWA?\"&$A$13, \"NetLastQuoteToday\",, \"T\"),\"#.00\"))","v":"NC -7.75"},{"$f":"IF(RTD(\"cqg.rtd\", ,\"ContractData\",\"ZWA?\"&$A$14, \"NetLastQuoteToday\",, \"T\")=\"\",\"NC \"&TEXT(RTD(\"cqg.rtd\",,\"StudyData\",\"ZWA?\"&$A$14,\"Bar\",,\"Close\",\"D\",\"-1\",,,,,\"T\")-RTD(\"cqg.rtd\",,\"StudyData\",\"ZWA?\"&$A$14,\"Bar\",,\"Close\",\"D\",\"-2\",,,,,\"T\"),\"#.00\"),\"NC \"&TEXT(RTD(\"cqg.rtd\", ,\"ContractData\",\"ZWA?\"&$A$14, \"NetLastQuoteToday\",, \"T\"),\"#.00\"))","v":"NC -6.75"},{"$f":"IF(RTD(\"cqg.rtd\", ,\"ContractData\",\"ZWA?\"&$A$15, \"NetLastQuoteToday\",, \"T\")=\"\",\"NC \"&TEXT(RTD(\"cqg.rtd\",,\"StudyData\",\"ZWA?\"&$A$15,\"Bar\",,\"Close\",\"D\",\"-1\",,,,,\"T\")-RTD(\"cqg.rtd\",,\"StudyData\",\"ZWA?\"&$A$15,\"Bar\",,\"Close\",\"D\",\"-2\",,,,,\"T\"),\"#.00\"),\"NC \"&TEXT(RTD(\"cqg.rtd\", ,\"ContractData\",\"ZWA?\"&$A$15, \"NetLastQuoteToday\",, \"T\"),\"#.00\"))","v":"NC -5.25"},{"$f":"IF(RTD(\"cqg.rtd\", ,\"ContractData\",\"ZWA?\"&$A$16, \"NetLastQuoteToday\",, \"T\")=\"\",\"NC \"&TEXT(RTD(\"cqg.rtd\",,\"StudyData\",\"ZWA?\"&$A$16,\"Bar\",,\"Close\",\"D\",\"-1\",,,,,\"T\")-RTD(\"cqg.rtd\",,\"StudyData\",\"ZWA?\"&$A$16,\"Bar\",,\"Close\",\"D\",\"-2\",,,,,\"T\"),\"#.00\"),\"NC \"&TEXT(RTD(\"cqg.rtd\", ,\"ContractData\",\"ZWA?\"&$A$16, \"NetLastQuoteToday\",, \"T\"),\"#.00\"))","v":"NC -5.50"},{"$f":"IF(RTD(\"cqg.rtd\", ,\"ContractData\",\"ZWA?\"&$A$17, \"NetLastQuoteToday\",, \"T\")=\"\",\"NC \"&TEXT(RTD(\"cqg.rtd\",,\"StudyData\",\"ZWA?\"&$A$17,\"Bar\",,\"Close\",\"D\",\"-1\",,,,,\"T\")-RTD(\"cqg.rtd\",,\"StudyData\",\"ZWA?\"&$A$17,\"Bar\",,\"Close\",\"D\",\"-2\",,,,,\"T\"),\"#.00\"),\"NC \"&TEXT(RTD(\"cqg.rtd\", ,\"ContractData\",\"ZWA?\"&$A$17, \"NetLastQuoteToday\",, \"T\"),\"#.00\"))","v":"NC -6.00"},{"$f":"IF(RTD(\"cqg.rtd\", ,\"ContractData\",\"ZWA?\"&$A$18, \"NetLastQuoteToday\",, \"T\")=\"\",\"NC \"&TEXT(RTD(\"cqg.rtd\",,\"StudyData\",\"ZWA?\"&$A$18,\"Bar\",,\"Close\",\"D\",\"-1\",,,,,\"T\")-RTD(\"cqg.rtd\",,\"StudyData\",\"ZWA?\"&$A$18,\"Bar\",,\"Close\",\"D\",\"-2\",,,,,\"T\"),\"#.00\"),\"NC \"&TEXT(RTD(\"cqg.rtd\", ,\"ContractData\",\"ZWA?\"&$A$18, \"NetLastQuoteToday\",, \"T\"),\"#.00\"))","v":"NC -6.00"},{"$f":"IF(RTD(\"cqg.rtd\", ,\"ContractData\",\"ZWA?\"&$A$19, \"NetLastQuoteToday\",, \"T\")=\"\",\"NC \"&TEXT(RTD(\"cqg.rtd\",,\"StudyData\",\"ZWA?\"&$A$19,\"Bar\",,\"Close\",\"D\",\"-1\",,,,,\"T\")-RTD(\"cqg.rtd\",,\"StudyData\",\"ZWA?\"&$A$19,\"Bar\",,\"Close\",\"D\",\"-2\",,,,,\"T\"),\"#.00\"),\"NC \"&TEXT(RTD(\"cqg.rtd\", ,\"ContractData\",\"ZWA?\"&$A$19, \"NetLastQuoteToday\",, \"T\"),\"#.00\"))","v":"NC -5.75"},{"$f":"IF(RTD(\"cqg.rtd\", ,\"ContractData\",\"ZWA?\"&$A$20, \"NetLastQuoteToday\",, \"T\")=\"\",\"NC \"&TEXT(RTD(\"cqg.rtd\",,\"StudyData\",\"ZWA?\"&$A$20,\"Bar\",,\"Close\",\"D\",\"-1\",,,,,\"T\")-RTD(\"cqg.rtd\",,\"StudyData\",\"ZWA?\"&$A$20,\"Bar\",,\"Close\",\"D\",\"-2\",,,,,\"T\"),\"#.00\"),\"NC \"&TEXT(RTD(\"cqg.rtd\", ,\"ContractData\",\"ZWA?\"&$A$20, \"NetLastQuoteToday\",, \"T\"),\"#.00\"))","v":"NC -7.00"},{"$f":"IF(RTD(\"cqg.rtd\", ,\"ContractData\",\"ZWA?\"&$A$21, \"NetLastQuoteToday\",, \"T\")=\"\",\"NC \"&TEXT(RTD(\"cqg.rtd\",,\"StudyData\",\"ZWA?\"&$A$21,\"Bar\",,\"Close\",\"D\",\"-1\",,,,,\"T\")-RTD(\"cqg.rtd\",,\"StudyData\",\"ZWA?\"&$A$21,\"Bar\",,\"Close\",\"D\",\"-2\",,,,,\"T\"),\"#.00\"),\"NC \"&TEXT(RTD(\"cqg.rtd\", ,\"ContractData\",\"ZWA?\"&$A$21, \"NetLastQuoteToday\",, \"T\"),\"#.00\"))","v":"NC -10.25"}]
[5]
[6]
[7]
[8]
[9]
[10]
[]
[]
[]
[]
[]
[null,"Soybeans",null,"Soybeans Blooming",null,null,{"$f":"IF(LEFT(B27,2)=LEFT(D27,2),\"\",\"Mismatch\")","v":""},null,"Get Data",null,7,2,2018,{"$f":"\"  \"&IF(WEEKDAY(DATE(M27,K27,L27))=1,\"Sunday\",IF(WEEKDAY(DATE(M27,K27,L27))=2,\"Monday\",IF(WEEKDAY(DATE(M27,K27,L27))=3,\"Tuesday\",IF(WEEKDAY(DATE(M27,K27,L27))=4,\"Wednesday\",IF(WEEKDAY(DATE(M27,K27,L27))=5,\"Thursday\",IF(WEEKDAY(DATE(M27,K27,L27))=6,\"Friday\",IF(WEEKDAY(DATE(M27,K27,L27))=7,\"Saturday\")))))))","v":"  Monday"},null,{"$f":"\"Date: \"&D28&\" \"&D29","v":"Date:  July 1 2018"},null,null,null,null,"Get Data",null,7,12,2010,{"$f":"IF(WEEKDAY(DATE(Y27,W27,X27))=1,\"Sun\",IF(WEEKDAY(DATE(Y27,W27,X27))=2,\"Mon\",IF(WEEKDAY(DATE(Y27,W27,X27))=3,\"Tue\",IF(WEEKDAY(DATE(Y27,W27,X27))=4,\"Wed\",IF(WEEKDAY(DATE(Y27,W27,X27))=5,\"Thu\",IF(WEEKDAY(DATE(Y27,W27,X27))=6,\"Fri\",IF(WEEKDAY(DATE(Y27,W27,X27))=7,\"Sat\")))))))","v":"Mon"},{"$f":"IF(N28=\"Not\",\"\",N28&\" Condition Difference\")","v":"Soybeans Condition Difference"}]
[null,{"$f":"IF(D28=\"\",\"Not Available\",D27)","v":"Soybeans Blooming"},null,{"$f":"IF(Sheet3!$M$14=1,IFERROR(Sheet3!F35,\"\"),IFERROR(Sheet3!H35,\"\"))","v":" July 1"},{"$f":"IF(D28=\"\",\"\",\"Difference\")","v":"Difference"},null,{"$f":"IFERROR(Sheet3!G35,\"\")","v":"June 24"},{"$f":"IF(Sheet3!$M$14=1,IFERROR(Sheet3!H35,\"\"),IFERROR(Sheet3!F35,\"\"))","v":" July 1"},{"$f":"IF(D28=\"\",\"\",\"Difference \"&D28&\" -\")","v":"Difference  July 1 -"},null,{"$f":"IFERROR(Sheet3!I35,\"\")","v":"2013 - 2017"},null,{"$f":"IF(D28=\"\",\"\",\"Difference\")","v":"Difference"},{"$f":"IF(N30=\"\",\"Not\",B27)","v":"Soybeans"},null,"Very Poor","Poor","Fair","Good","Excellent",{"$f":"IF(W28=\"\",\"Not Available\",B28)","v":"Soybeans Blooming"},null,{"$f":"IF(Sheet6!$M$14=1,IFERROR(Sheet6!F35,\"\"),IFERROR(Sheet6!H35,\"\"))","v":" July 11"},{"$f":"IF(W28=\"\",\"\",\"Difference\")","v":"Difference"},null,{"$f":"D28","v":" July 1"},"Very Poor","Poor","Fair","Good","Excellent"]
[null,null,null,{"$f":"IF(Sheet3!$M$14=1,IFERROR(Sheet3!F36,\"\"),IFERROR(Sheet3!H36,\"\"))","v":"2018"},{"$f":"IF(D28=\"\",\"\",IFERROR(D28&\" -\"&G28,\"\"))","v":" July 1 -June 24"},null,{"$f":"IFERROR(Sheet3!G36,\"\")","v":"2018"},{"$f":"IF(Sheet3!$M$14=1,IFERROR(Sheet3!H36,\"\"),IFERROR(Sheet3!F36,\"\"))","v":"2017"},{"$f":"IF(D28=\"\",\"\",IFERROR(H28&\", \"&H29,\"\"))","v":" July 1, 2017"},null,{"$f":"IF(D28=\"\",\"\",\"Average\")","v":"Average"},null,{"$f":"IF(D28=\"\",\"\",\"to Current\")","v":"to Current"},{"$f":"IF(N30=\"\",\"Available\",\"Condition\")","v":"Condition"},null,null,null,null,null,null,null,null,{"$f":"IF(Sheet6!$M$14=1,IFERROR(Sheet6!F36,\"\"),IFERROR(Sheet6!H36,\"\"))","v":"2010"},{"$f":"IF(X28=\"\",\"\",Z28&\" - \"&W28)","v":" July 1 -  July 11"},null,{"$f":"D29","v":"2018"}]
[null,{"$f":"IFERROR(Sheet3!E1,\"\")","v":"Arkansas"},null,{"$f":"IF(Sheet3!$M$14=1,IFERROR(Sheet3!F1,\"\"),IFERROR(Sheet3!H1,\"\"))","v":"69 "},{"$f":"IFERROR(D30-G30,\"\")","v":12},{"$f":"IFERROR(D30-G30,\"\")","v":12},{"$f":"Sheet3!G1","v":"57 "},{"$f":"IF(Sheet3!$M$14=1,IFERROR(Sheet3!H1,\"\"),IFERROR(Sheet3!F1,\"\"))","v":"68 "},{"$f":"IFERROR(D30-H30,\"\")","v":1},{"$f":"IFERROR(D30-H30,\"\")","v":1},{"$f":"Sheet3!I1","v":"46"},{"$f":"IFERROR(D30-K30,\"\")","v":23},{"$f":"IFERROR(D30-K30,\"\")","v":23},{"$f":"IFERROR(Sheet3!E39,\"\")","v":"Arkansas"},null,{"$f":"IF($N30=\"\",\"\",IFERROR(Sheet3!F71,\"\"))","v":2},{"$f":"IF($N30=\"\",\"\",IFERROR(Sheet3!G71,\"\"))","v":8},{"$f":"IF($N30=\"\",\"\",IFERROR(Sheet3!H71,\"\"))","v":27},{"$f":"IF($N30=\"\",\"\",IFERROR(Sheet3!I71,\"\"))","v":46},{"$f":"IF($N30=\"\",\"\",IFERROR(Sheet3!J71,\"\"))","v":17},{"$f":"IFERROR(Sheet6!E1,\"\")","v":"Arkansas"},null,{"$f":"IF(Sheet6!$M$14=1,IFERROR(Sheet6!F1,\"\"),IFERROR(Sheet6!H1,\"\"))","v":"55 "},{"$f":"IFERROR(Z30-W30,\"\")","v":14},{"$f":"IFERROR(Z30-W30,\"\")","v":14},{"$f":"D30","v":"69 "},{"$f":"Sheet6!F91","v":-2},{"$f":"Sheet6!G91","v":-7},{"$f":"Sheet6!H91","v":-9},{"$f":"Sheet6!I91","v":10},{"$f":"Sheet6!J91","v":8}]
[null,{"$f":"IFERROR(Sheet3!E2,\"\")","v":"Illinois"},null,{"$f":"IF(Sheet3!$M$14=1,IFERROR(Sheet3!F2,\"\"),IFERROR(Sheet3!H2,\"\"))","v":"44 "},21,{"$f":"IFERROR(D31-G31,\"\")","v":21},{"$f":"Sheet3!G2","v":"23 "},{"$f":"IF(Sheet3!$M$14=1,IFERROR(Sheet3!H2,\"\"),IFERROR(Sheet3!F2,\"\"))","v":"14 "},30,{"$f":"IFERROR(D31-H31,\"\")","v":30},{"$f":"Sheet3!I2","v":"11"},{"$f":"IFERROR(D31-K31,\"\")","v":33},{"$f":"IFERROR(D31-K31,\"\")","v":33},{"$f":"IF(N30=\"\",\"\",IFERROR(Sheet3!E40,\"\"))","v":"Illinois"},null,{"$f":"IF($N31=\"\",\"\",IFERROR(Sheet3!F72,\"\"))","v":2},{"$f":"IF($N31=\"\",\"\",IFERROR(Sheet3!G72,\"\"))","v":3},{"$f":"IF($N31=\"\",\"\",IFERROR(Sheet3!H72,\"\"))","v":17},{"$f":"IF($N31=\"\",\"\",IFERROR(Sheet3!I72,\"\"))","v":53},{"$f":"IF($N31=\"\",\"\",IFERROR(Sheet3!J72,\"\"))","v":25},{"$f":"IFERROR(Sheet6!E2,\"\")","v":"Illinois"},null,{"$f":"IF(Sheet6!$M$14=1,IFERROR(Sheet6!F2,\"\"),IFERROR(Sheet6!H2,\"\"))","v":"43 "},{"$f":"IFERROR(Z31-W31,\"\")","v":1},{"$f":"IFERROR(Z31-W31,\"\")","v":1},{"$f":"D31","v":"44 "},{"$f":"Sheet6!F92","v":-1},{"$f":"Sheet6!G92","v":-6},{"$f":"Sheet6!H92","v":-9},{"$f":"Sheet6!I92","v":5},{"$f":"Sheet6!J92","v":11}]
[null,{"$f":"IFERROR(Sheet3!E3,\"\")","v":"Indiana"},null,{"$f":"IF(Sheet3!$M$14=1,IFERROR(Sheet3!F3,\"\"),IFERROR(Sheet3!H3,\"\"))","v":"33 "},25,25,{"$f":"Sheet3!G3","v":"8 "},{"$f":"IF(Sheet3!$M$14=1,IFERROR(Sheet3!H3,\"\"),IFERROR(Sheet3!F3,\"\"))","v":"12 "},21,21,{"$f":"Sheet3!I3","v":"11"},22,22,{"$f":"IF(N31=\"\",\"\",IFERROR(Sheet3!E41,\"\"))","v":"Indiana"},null,{"$f":"IF($N32=\"\",\"\",IFERROR(Sheet3!F73,\"\"))","v":2},{"$f":"IF($N32=\"\",\"\",IFERROR(Sheet3!G73,\"\"))","v":5},{"$f":"IF($N32=\"\",\"\",IFERROR(Sheet3!H73,\"\"))","v":21},{"$f":"IF($N32=\"\",\"\",IFERROR(Sheet3!I73,\"\"))","v":55},{"$f":"IF($N32=\"\",\"\",IFERROR(Sheet3!J73,\"\"))","v":17},{"$f":"IFERROR(Sheet6!E3,\"\")","v":"Indiana"},null,{"$f":"IF(Sheet6!$M$14=1,IFERROR(Sheet6!F3,\"\"),IFERROR(Sheet6!H3,\"\"))","v":"48 "},-15,-15,"33 ",{"$f":"Sheet6!F93","v":-1},{"$f":"Sheet6!G93","v":-3},{"$f":"Sheet6!H93","v":-6},{"$f":"Sheet6!I93","v":7},{"$f":"Sheet6!J93","v":3}]
[null,{"$f":"IFERROR(Sheet3!E4,\"\")","v":"Iowa"},null,{"$f":"IF(Sheet3!$M$14=1,IFERROR(Sheet3!F4,\"\"),IFERROR(Sheet3!H4,\"\"))","v":"21 "},17,17,{"$f":"Sheet3!G4","v":"4 "},{"$f":"IF(Sheet3!$M$14=1,IFERROR(Sheet3!H4,\"\"),IFERROR(Sheet3!F4,\"\"))","v":"11 "},10,10,{"$f":"Sheet3!I4","v":"10"},11,11,{"$f":"IF(N32=\"\",\"\",IFERROR(Sheet3!E42,\"\"))","v":"Iowa"},null,{"$f":"IF($N33=\"\",\"\",IFERROR(Sheet3!F74,\"\"))","v":2},{"$f":"IF($N33=\"\",\"\",IFERROR(Sheet3!G74,\"\"))","v":4},{"$f":"IF($N33=\"\",\"\",IFERROR(Sheet3!H74,\"\"))","v":18},{"$f":"IF($N33=\"\",\"\",IFERROR(Sheet3!I74,\"\"))","v":55},{"$f":"IF($N33=\"\",\"\",IFERROR(Sheet3!J74,\"\"))","v":21},{"$f":"IFERROR(Sheet6!E4,\"\")","v":"Iowa"},null,{"$f":"IF(Sheet6!$M$14=1,IFERROR(Sheet6!F4,\"\"),IFERROR(Sheet6!H4,\"\"))","v":"46 "},-25,-25,"21 ",{"$f":"Sheet6!F94","v":-1},{"$f":"Sheet6!G94","v":-3},{"$f":"Sheet6!H94","v":-3},{"$f":"Sheet6!I94","v":3},{"$f":"Sheet6!J94","v":4}]
[null,{"$f":"IFERROR(Sheet3!E5,\"\")","v":"Kansas"},null,{"$f":"IF(Sheet3!$M$14=1,IFERROR(Sheet3!F5,\"\"),IFERROR(Sheet3!H5,\"\"))","v":"20 "},13,13,{"$f":"Sheet3!G5","v":"7 "},{"$f":"IF(Sheet3!$M$14=1,IFERROR(Sheet3!H5,\"\"),IFERROR(Sheet3!F5,\"\"))","v":"11 "},9,9,{"$f":"Sheet3!I5","v":"6"},14,14,{"$f":"IF(N33=\"\",\"\",IFERROR(Sheet3!E43,\"\"))","v":"Kansas"},null,{"$f":"IF($N34=\"\",\"\",IFERROR(Sheet3!F75,\"\"))","v":1},{"$f":"IF($N34=\"\",\"\",IFERROR(Sheet3!G75,\"\"))","v":8},{"$f":"IF($N34=\"\",\"\",IFERROR(Sheet3!H75,\"\"))","v":37},{"$f":"IF($N34=\"\",\"\",IFERROR(Sheet3!I75,\"\"))","v":49},{"$f":"IF($N34=\"\",\"\",IFERROR(Sheet3!J75,\"\"))","v":5},{"$f":"IFERROR(Sheet6!E5,\"\")","v":"Kansas"},null,{"$f":"IF(Sheet6!$M$14=1,IFERROR(Sheet6!F5,\"\"),IFERROR(Sheet6!H5,\"\"))","v":"19 "},1,1,"20 ",{"$f":"Sheet6!F95","v":0},{"$f":"Sheet6!G95","v":4},{"$f":"Sheet6!H95","v":12},{"$f":"Sheet6!I95","v":-8},{"$f":"Sheet6!J95","v":-8}]
[null,{"$f":"IFERROR(Sheet3!E6,\"\")","v":"Kentucky"},null,{"$f":"IF(Sheet3!$M$14=1,IFERROR(Sheet3!F6,\"\"),IFERROR(Sheet3!H6,\"\"))","v":"12 "},9,9,{"$f":"Sheet3!G6","v":"3 "},{"$f":"IF(Sheet3!$M$14=1,IFERROR(Sheet3!H6,\"\"),IFERROR(Sheet3!F6,\"\"))","v":"11 "},1,1,{"$f":"Sheet3!I6","v":"6"},6,6,{"$f":"IF(N34=\"\",\"\",IFERROR(Sheet3!E44,\"\"))","v":"Kentucky"},null,{"$f":"IF($N35=\"\",\"\",IFERROR(Sheet3!F76,\"\"))","v":0},{"$f":"IF($N35=\"\",\"\",IFERROR(Sheet3!G76,\"\"))","v":2},{"$f":"IF($N35=\"\",\"\",IFERROR(Sheet3!H76,\"\"))","v":12},{"$f":"IF($N35=\"\",\"\",IFERROR(Sheet3!I76,\"\"))","v":69},{"$f":"IF($N35=\"\",\"\",IFERROR(Sheet3!J76,\"\"))","v":17},{"$f":"IFERROR(Sheet6!E6,\"\")","v":"Kentucky"},null,{"$f":"IF(Sheet6!$M$14=1,IFERROR(Sheet6!F6,\"\"),IFERROR(Sheet6!H6,\"\"))","v":"49 "},-37,-37,"12 ",{"$f":"Sheet6!F96","v":""},{"$f":"Sheet6!G96","v":-2},{"$f":"Sheet6!H96","v":-15},{"$f":"Sheet6!I96","v":25},{"$f":"Sheet6!J96","v":-7}]
[null,{"$f":"IFERROR(Sheet3!E7,\"\")","v":"Louisiana"},null,{"$f":"IF(Sheet3!$M$14=1,IFERROR(Sheet3!F7,\"\"),IFERROR(Sheet3!H7,\"\"))","v":"82 "},9,9,{"$f":"Sheet3!G7","v":"73 "},{"$f":"IF(Sheet3!$M$14=1,IFERROR(Sheet3!H7,\"\"),IFERROR(Sheet3!F7,\"\"))","v":"82 "},0,0,{"$f":"Sheet3!I7","v":"67"},15,15,{"$f":"IF(N35=\"\",\"\",IFERROR(Sheet3!E45,\"\"))","v":"Louisiana"},null,{"$f":"IF($N36=\"\",\"\",IFERROR(Sheet3!F77,\"\"))","v":5},{"$f":"IF($N36=\"\",\"\",IFERROR(Sheet3!G77,\"\"))","v":11},{"$f":"IF($N36=\"\",\"\",IFERROR(Sheet3!H77,\"\"))","v":36},{"$f":"IF($N36=\"\",\"\",IFERROR(Sheet3!I77,\"\"))","v":37},{"$f":"IF($N36=\"\",\"\",IFERROR(Sheet3!J77,\"\"))","v":11},{"$f":"IFERROR(Sheet6!E7,\"\")","v":"Louisiana"},null,{"$f":"IF(Sheet6!$M$14=1,IFERROR(Sheet6!F7,\"\"),IFERROR(Sheet6!H7,\"\"))","v":"79 "},3,3,"82 ",{"$f":"Sheet6!F97","v":4},{"$f":"Sheet6!G97","v":-1},{"$f":"Sheet6!H97","v":4},{"$f":"Sheet6!I97","v":-13},{"$f":"Sheet6!J97","v":6}]
[null,{"$f":"IFERROR(Sheet3!E8,\"\")","v":"Michigan"},null,{"$f":"IF(Sheet3!$M$14=1,IFERROR(Sheet3!F8,\"\"),IFERROR(Sheet3!H8,\"\"))","v":"11 "},10,10,{"$f":"Sheet3!G8","v":"1 "},{"$f":"IF(Sheet3!$M$14=1,IFERROR(Sheet3!H8,\"\"),IFERROR(Sheet3!F8,\"\"))","v":"11 "},0,0,{"$f":"Sheet3!I8","v":"7"},4,4,{"$f":"IF(N36=\"\",\"\",IFERROR(Sheet3!E46,\"\"))","v":"Michigan"},null,{"$f":"IF($N37=\"\",\"\",IFERROR(Sheet3!F78,\"\"))","v":2},{"$f":"IF($N37=\"\",\"\",IFERROR(Sheet3!G78,\"\"))","v":4},{"$f":"IF($N37=\"\",\"\",IFERROR(Sheet3!H78,\"\"))","v":22},{"$f":"IF($N37=\"\",\"\",IFERROR(Sheet3!I78,\"\"))","v":59},{"$f":"IF($N37=\"\",\"\",IFERROR(Sheet3!J78,\"\"))","v":13},{"$f":"IFERROR(Sheet6!E8,\"\")","v":"Michigan"},null,{"$f":"IF(Sheet6!$M$14=1,IFERROR(Sheet6!F8,\"\"),IFERROR(Sheet6!H8,\"\"))","v":"40 "},-29,-29,"11 ",{"$f":"Sheet6!F98","v":1},{"$f":"Sheet6!G98","v":-1},{"$f":"Sheet6!H98","v":0},{"$f":"Sheet6!I98","v":10},{"$f":"Sheet6!J98","v":-10}]
[null,{"$f":"IFERROR(Sheet3!E9,\"\")","v":"Minnesota"},null,{"$f":"IF(Sheet3!$M$14=1,IFERROR(Sheet3!F9,\"\"),IFERROR(Sheet3!H9,\"\"))","v":"13 "},11,11,{"$f":"Sheet3!G9","v":"2 "},{"$f":"IF(Sheet3!$M$14=1,IFERROR(Sheet3!H9,\"\"),IFERROR(Sheet3!F9,\"\"))","v":"8 "},5,5,{"$f":"Sheet3!I9","v":"9"},4,4,{"$f":"IF(N37=\"\",\"\",IFERROR(Sheet3!E47,\"\"))","v":"Minnesota"},null,{"$f":"IF($N38=\"\",\"\",IFERROR(Sheet3!F79,\"\"))","v":0},{"$f":"IF($N38=\"\",\"\",IFERROR(Sheet3!G79,\"\"))","v":3},{"$f":"IF($N38=\"\",\"\",IFERROR(Sheet3!H79,\"\"))","v":20},{"$f":"IF($N38=\"\",\"\",IFERROR(Sheet3!I79,\"\"))","v":57},{"$f":"IF($N38=\"\",\"\",IFERROR(Sheet3!J79,\"\"))","v":20},{"$f":"IFERROR(Sheet6!E9,\"\")","v":"Minnesota"},null,{"$f":"IF(Sheet6!$M$14=1,IFERROR(Sheet6!F9,\"\"),IFERROR(Sheet6!H9,\"\"))","v":"35 "},-22,-22,"13 ",{"$f":"Sheet6!F99","v":""},{"$f":"Sheet6!G99","v":0},{"$f":"Sheet6!H99","v":7},{"$f":"Sheet6!I99","v":-5},{"$f":"Sheet6!J99","v":-1}]
[null,{"$f":"IFERROR(Sheet3!E10,\"\")","v":"Mississippi"},null,{"$f":"IF(Sheet3!$M$14=1,IFERROR(Sheet3!F10,\"\"),IFERROR(Sheet3!H10,\"\"))","v":"69 "},15,15,{"$f":"Sheet3!G10","v":"54 "},{"$f":"IF(Sheet3!$M$14=1,IFERROR(Sheet3!H10,\"\"),IFERROR(Sheet3!F10,\"\"))","v":"71 "},-2,-2,{"$f":"Sheet3!I10","v":"48"},21,21,{"$f":"IF(N38=\"\",\"\",IFERROR(Sheet3!E48,\"\"))","v":"Mississippi"},null,{"$f":"IF($N39=\"\",\"\",IFERROR(Sheet3!F80,\"\"))","v":0},{"$f":"IF($N39=\"\",\"\",IFERROR(Sheet3!G80,\"\"))","v":2},{"$f":"IF($N39=\"\",\"\",IFERROR(Sheet3!H80,\"\"))","v":30},{"$f":"IF($N39=\"\",\"\",IFERROR(Sheet3!I80,\"\"))","v":54},{"$f":"IF($N39=\"\",\"\",IFERROR(Sheet3!J80,\"\"))","v":14},{"$f":"IFERROR(Sheet6!E10,\"\")","v":"Mississippi"},null,{"$f":"IF(Sheet6!$M$14=1,IFERROR(Sheet6!F10,\"\"),IFERROR(Sheet6!H10,\"\"))","v":"87 "},-18,-18,"69 ",{"$f":"Sheet6!F100","v":""},{"$f":"Sheet6!G100","v":-12},{"$f":"Sheet6!H100","v":2},{"$f":"Sheet6!I100","v":17},{"$f":"Sheet6!J100","v":-3}]
[null,{"$f":"IFERROR(Sheet3!E11,\"\")","v":"Missouri"},null,{"$f":"IF(Sheet3!$M$14=1,IFERROR(Sheet3!F11,\"\"),IFERROR(Sheet3!H11,\"\"))","v":"27 "},23,23,{"$f":"Sheet3!G11","v":"4 "},{"$f":"IF(Sheet3!$M$14=1,IFERROR(Sheet3!H11,\"\"),IFERROR(Sheet3!F11,\"\"))","v":"11 "},16,16,{"$f":"Sheet3!I11","v":"7"},20,20,{"$f":"IF(N39=\"\",\"\",IFERROR(Sheet3!E49,\"\"))","v":"Missouri"},null,{"$f":"IF($N40=\"\",\"\",IFERROR(Sheet3!F81,\"\"))","v":3},{"$f":"IF($N40=\"\",\"\",IFERROR(Sheet3!G81,\"\"))","v":12},{"$f":"IF($N40=\"\",\"\",IFERROR(Sheet3!H81,\"\"))","v":37},{"$f":"IF($N40=\"\",\"\",IFERROR(Sheet3!I81,\"\"))","v":43},{"$f":"IF($N40=\"\",\"\",IFERROR(Sheet3!J81,\"\"))","v":5},{"$f":"IFERROR(Sheet6!E11,\"\")","v":"Missouri"},null,{"$f":"IF(Sheet6!$M$14=1,IFERROR(Sheet6!F11,\"\"),IFERROR(Sheet6!H11,\"\"))","v":"21 "},6,6,"27 ",{"$f":"Sheet6!F101","v":-3},{"$f":"Sheet6!G101","v":-3},{"$f":"Sheet6!H101","v":2},{"$f":"Sheet6!I101","v":7},{"$f":"Sheet6!J101","v":-3}]
[null,{"$f":"IFERROR(Sheet3!E12,\"\")","v":"Nebraska"},null,{"$f":"IF(Sheet3!$M$14=1,IFERROR(Sheet3!F12,\"\"),IFERROR(Sheet3!H12,\"\"))","v":"35 "},21,21,{"$f":"Sheet3!G12","v":"14 "},{"$f":"IF(Sheet3!$M$14=1,IFERROR(Sheet3!H12,\"\"),IFERROR(Sheet3!F12,\"\"))","v":"25 "},10,10,{"$f":"Sheet3!I12","v":"17"},18,18,{"$f":"IF(N40=\"\",\"\",IFERROR(Sheet3!E50,\"\"))","v":"Nebraska"},null,{"$f":"IF($N41=\"\",\"\",IFERROR(Sheet3!F82,\"\"))","v":1},{"$f":"IF($N41=\"\",\"\",IFERROR(Sheet3!G82,\"\"))","v":2},{"$f":"IF($N41=\"\",\"\",IFERROR(Sheet3!H82,\"\"))","v":11},{"$f":"IF($N41=\"\",\"\",IFERROR(Sheet3!I82,\"\"))","v":70},{"$f":"IF($N41=\"\",\"\",IFERROR(Sheet3!J82,\"\"))","v":16},{"$f":"IFERROR(Sheet6!E12,\"\")","v":"Nebraska"},null,{"$f":"IF(Sheet6!$M$14=1,IFERROR(Sheet6!F12,\"\"),IFERROR(Sheet6!H12,\"\"))","v":"38 "},-3,-3,"35 ",{"$f":"Sheet6!F102","v":-1},{"$f":"Sheet6!G102","v":-1},{"$f":"Sheet6!H102","v":-4},{"$f":"Sheet6!I102","v":7},{"$f":"Sheet6!J102","v":-1}]
[null,{"$f":"IFERROR(Sheet3!E13,\"\")","v":"North Carolina"},null,{"$f":"IF(Sheet3!$M$14=1,IFERROR(Sheet3!F13,\"\"),IFERROR(Sheet3!H13,\"\"))","v":"14 "},9,9,{"$f":"Sheet3!G13","v":"5 "},{"$f":"IF(Sheet3!$M$14=1,IFERROR(Sheet3!H13,\"\"),IFERROR(Sheet3!F13,\"\"))","v":"11 "},3,3,{"$f":"Sheet3!I13","v":"8"},6,6,{"$f":"IF(N41=\"\",\"\",IFERROR(Sheet3!E51,\"\"))","v":"North Carolina"},null,{"$f":"IF($N42=\"\",\"\",IFERROR(Sheet3!F83,\"\"))","v":0},{"$f":"IF($N42=\"\",\"\",IFERROR(Sheet3!G83,\"\"))","v":7},{"$f":"IF($N42=\"\",\"\",IFERROR(Sheet3!H83,\"\"))","v":38},{"$f":"IF($N42=\"\",\"\",IFERROR(Sheet3!I83,\"\"))","v":50},{"$f":"IF($N42=\"\",\"\",IFERROR(Sheet3!J83,\"\"))","v":5},{"$f":"IFERROR(Sheet6!E13,\"\")","v":"North Carolina"},null,{"$f":"IF(Sheet6!$M$14=1,IFERROR(Sheet6!F13,\"\"),IFERROR(Sheet6!H13,\"\"))","v":"16 "},-2,-2,"14 ",{"$f":"Sheet6!F103","v":""},{"$f":"Sheet6!G103","v":-9},{"$f":"Sheet6!H103","v":3},{"$f":"Sheet6!I103","v":9},{"$f":"Sheet6!J103","v":2}]
[null,{"$f":"IFERROR(Sheet3!E14,\"\")","v":"North Dakota"},null,{"$f":"IF(Sheet3!$M$14=1,IFERROR(Sheet3!F14,\"\"),IFERROR(Sheet3!H14,\"\"))","v":"11 "},10,10,{"$f":"Sheet3!G14","v":"1 "},{"$f":"IF(Sheet3!$M$14=1,IFERROR(Sheet3!H14,\"\"),IFERROR(Sheet3!F14,\"\"))","v":"7 "},4,4,{"$f":"Sheet3!I14","v":"12"},-1,-1,{"$f":"IF(N42=\"\",\"\",IFERROR(Sheet3!E52,\"\"))","v":"North Dakota"},null,{"$f":"IF($N43=\"\",\"\",IFERROR(Sheet3!F84,\"\"))","v":0},{"$f":"IF($N43=\"\",\"\",IFERROR(Sheet3!G84,\"\"))","v":3},{"$f":"IF($N43=\"\",\"\",IFERROR(Sheet3!H84,\"\"))","v":20},{"$f":"IF($N43=\"\",\"\",IFERROR(Sheet3!I84,\"\"))","v":68},{"$f":"IF($N43=\"\",\"\",IFERROR(Sheet3!J84,\"\"))","v":9},{"$f":"IFERROR(Sheet6!E14,\"\")","v":"North Dakota"},null,{"$f":"IF(Sheet6!$M$14=1,IFERROR(Sheet6!F14,\"\"),IFERROR(Sheet6!H14,\"\"))","v":"40 "},-29,-29,"11 ",{"$f":"Sheet6!F104","v":""},{"$f":"Sheet6!G104","v":1},{"$f":"Sheet6!H104","v":10},{"$f":"Sheet6!I104","v":-4},{"$f":"Sheet6!J104","v":-6}]
[null,{"$f":"IFERROR(Sheet3!E15,\"\")","v":"Ohio"},null,{"$f":"IF(Sheet3!$M$14=1,IFERROR(Sheet3!F15,\"\"),IFERROR(Sheet3!H15,\"\"))","v":"22 "},16,16,{"$f":"Sheet3!G15","v":"6 "},{"$f":"IF(Sheet3!$M$14=1,IFERROR(Sheet3!H15,\"\"),IFERROR(Sheet3!F15,\"\"))","v":"8 "},14,14,{"$f":"Sheet3!I15","v":"6"},16,16,{"$f":"IF(N43=\"\",\"\",IFERROR(Sheet3!E53,\"\"))","v":"Ohio"},null,{"$f":"IF($N44=\"\",\"\",IFERROR(Sheet3!F85,\"\"))","v":0},{"$f":"IF($N44=\"\",\"\",IFERROR(Sheet3!G85,\"\"))","v":4},{"$f":"IF($N44=\"\",\"\",IFERROR(Sheet3!H85,\"\"))","v":20},{"$f":"IF($N44=\"\",\"\",IFERROR(Sheet3!I85,\"\"))","v":57},{"$f":"IF($N44=\"\",\"\",IFERROR(Sheet3!J85,\"\"))","v":19},{"$f":"IFERROR(Sheet6!E15,\"\")","v":"Ohio"},null,{"$f":"IF(Sheet6!$M$14=1,IFERROR(Sheet6!F15,\"\"),IFERROR(Sheet6!H15,\"\"))","v":"43 "},-21,-21,"22 ",{"$f":"Sheet6!F105","v":""},{"$f":"Sheet6!G105","v":-5},{"$f":"Sheet6!H105","v":-10},{"$f":"Sheet6!I105","v":11},{"$f":"Sheet6!J105","v":7}]
[null,{"$f":"IFERROR(Sheet3!E16,\"\")","v":"South Dakota"},null,{"$f":"IF(Sheet3!$M$14=1,IFERROR(Sheet3!F16,\"\"),IFERROR(Sheet3!H16,\"\"))","v":"7 "},5,5,{"$f":"Sheet3!G16","v":"2 "},{"$f":"IF(Sheet3!$M$14=1,IFERROR(Sheet3!H16,\"\"),IFERROR(Sheet3!F16,\"\"))","v":"14 "},-7,-7,{"$f":"Sheet3!I16","v":"13"},-6,-6,{"$f":"IF(N44=\"\",\"\",IFERROR(Sheet3!E54,\"\"))","v":"South Dakota"},null,{"$f":"IF($N45=\"\",\"\",IFERROR(Sheet3!F86,\"\"))","v":3},{"$f":"IF($N45=\"\",\"\",IFERROR(Sheet3!G86,\"\"))","v":6},{"$f":"IF($N45=\"\",\"\",IFERROR(Sheet3!H86,\"\"))","v":32},{"$f":"IF($N45=\"\",\"\",IFERROR(Sheet3!I86,\"\"))","v":51},{"$f":"IF($N45=\"\",\"\",IFERROR(Sheet3!J86,\"\"))","v":8},{"$f":"IFERROR(Sheet6!E16,\"\")","v":"South Dakota"},null,{"$f":"IF(Sheet6!$M$14=1,IFERROR(Sheet6!F16,\"\"),IFERROR(Sheet6!H16,\"\"))","v":"33 "},-26,-26,"7 ",{"$f":"Sheet6!F106","v":1},{"$f":"Sheet6!G106","v":-1},{"$f":"Sheet6!H106","v":10},{"$f":"Sheet6!I106","v":-2},{"$f":"Sheet6!J106","v":-8}]
[null,{"$f":"IFERROR(Sheet3!E17,\"\")","v":"Tennessee"},null,{"$f":"IF(Sheet3!$M$14=1,IFERROR(Sheet3!F17,\"\"),IFERROR(Sheet3!H17,\"\"))","v":"24 "},11,11,{"$f":"Sheet3!G17","v":"13 "},{"$f":"IF(Sheet3!$M$14=1,IFERROR(Sheet3!H17,\"\"),IFERROR(Sheet3!F17,\"\"))","v":"18 "},6,6,{"$f":"Sheet3!I17","v":"10"},14,14,{"$f":"IF(N45=\"\",\"\",IFERROR(Sheet3!E55,\"\"))","v":"Tennessee"},null,{"$f":"IF($N46=\"\",\"\",IFERROR(Sheet3!F87,\"\"))","v":0},{"$f":"IF($N46=\"\",\"\",IFERROR(Sheet3!G87,\"\"))","v":3},{"$f":"IF($N46=\"\",\"\",IFERROR(Sheet3!H87,\"\"))","v":19},{"$f":"IF($N46=\"\",\"\",IFERROR(Sheet3!I87,\"\"))","v":58},{"$f":"IF($N46=\"\",\"\",IFERROR(Sheet3!J87,\"\"))","v":20},{"$f":"IFERROR(Sheet6!E17,\"\")","v":"Tennessee"},null,{"$f":"IF(Sheet6!$M$14=1,IFERROR(Sheet6!F17,\"\"),IFERROR(Sheet6!H17,\"\"))","v":"49 "},-25,-25,"24 ",{"$f":"Sheet6!F107","v":""},{"$f":"Sheet6!G107","v":-4},{"$f":"Sheet6!H107","v":-9},{"$f":"Sheet6!I107","v":5},{"$f":"Sheet6!J107","v":11}]
[null,{"$f":"IFERROR(Sheet3!E18,\"\")","v":"Wisconsin"},null,{"$f":"IF(Sheet3!$M$14=1,IFERROR(Sheet3!F18,\"\"),IFERROR(Sheet3!H18,\"\"))","v":"13 "},"","",{"$f":"Sheet3!G18","v":"- "},{"$f":"IF(Sheet3!$M$14=1,IFERROR(Sheet3!H18,\"\"),IFERROR(Sheet3!F18,\"\"))","v":"9 "},4,4,{"$f":"Sheet3!I18","v":"7"},6,6,{"$f":"IF(N46=\"\",\"\",IFERROR(Sheet3!E56,\"\"))","v":"Wisconsin"},null,{"$f":"IF($N47=\"\",\"\",IFERROR(Sheet3!F88,\"\"))","v":1},{"$f":"IF($N47=\"\",\"\",IFERROR(Sheet3!G88,\"\"))","v":3},{"$f":"IF($N47=\"\",\"\",IFERROR(Sheet3!H88,\"\"))","v":13},{"$f":"IF($N47=\"\",\"\",IFERROR(Sheet3!I88,\"\"))","v":58},{"$f":"IF($N47=\"\",\"\",IFERROR(Sheet3!J88,\"\"))","v":25},{"$f":"IFERROR(Sheet6!E18,\"\")","v":"Wisconsin"},null,{"$f":"IF(Sheet6!$M$14=1,IFERROR(Sheet6!F18,\"\"),IFERROR(Sheet6!H18,\"\"))","v":"21 "},-8,-8,"13 ",{"$f":"Sheet6!F108","v":0},{"$f":"Sheet6!G108","v":1},{"$f":"Sheet6!H108","v":-2},{"$f":"Sheet6!I108","v":1},{"$f":"Sheet6!J108","v":0}]
[null,null,"  Copyright © 2018",null,null,"Designed by Thom Hartle"]

{"sheet":"Sheet2","index":1,"n_rows":963,"n_cols":5,"rows_kept":963,"cut":false,"hidden":true,"merged":[]}
[]
["Crop Progress"]
[]
["ISSN: 1948-3007"]
[]
["Released July 2, 2018, by the National Agricultural Statistics Service "]
["(NASS), Agricultural Statistics Board, United States Department of "]
["Agriculture (USDA)."]
[]
["Corn Silking - Selected States"]
["[These 18 States planted 92% of the 2017 corn acreage]"]
["-----------------------------------------------------------------"]
["                 :            Week ending            :           "]
["                 :-----------------------------------:           "]
["      State      :  July 1,  : June 24,  :  July 1,  : 2013-2017 "]
["                 :   2017    :   2018    :   2018    :  Average  "]
["-----------------------------------------------------------------"]
["                 :                    percent                    "]
["                 :                                               "]
["Colorado ........:     -           -           -           1     "]
["Illinois ........:    11           2          40          11     "]
["Indiana .........:     7           2          18           5     "]
["Iowa ............:     -           -           7           1     "]
["Kansas ..........:    17          13          30          19     "]
["Kentucky ........:    41          16          44          26     "]
["Michigan ........:     -           -           2           1     "]
["Minnesota .......:     -           -           1           -     "]
["Missouri ........:    22          11          48          24     "]
["Nebraska ........:     7           2           8           4     "]
["North Carolina ..:    75          47          68          74     "]
["North Dakota ....:     2           -           -           4     "]
["Ohio ............:     3           -           5           2     "]
["Pennsylvania ....:     2           -           1           2     "]
["South Dakota ....:     -           -           -           1     "]
["Tennessee .......:    58          33          60          43     "]
["Texas ...........:    62          57          59          60     "]
["Wisconsin .......:     -           -           1           -     "]
["                 :                                               "]
["18 States .......:     9           5          17           8     "]
["-----------------------------------------------------------------"]
[{"$f":"-  Represents zero.","v":{"$error":"#NAME?"}}]
[]
["Corn Condition - Selected States: Week Ending July 1, 2018"]
["[These 18 States planted 92% of the 2017 corn acreage]"]
["----------------------------------------------------------------------------"]
["      State     : Very poor :   Poor    :   Fair    :   Good    : Excellent "]
["----------------------------------------------------------------------------"]
["                :                          percent                          "]
["                :                                                           "]
["Colorado .......:     2           3          17          67          11     "]
["Illinois .......:     1           2          12          53          32     "]
["Indiana ........:     1           4          19          56          20     "]
["Iowa ...........:     2           4          16          53          25     "]
["Kansas .........:     4          11          32          46           7     "]
["Kentucky .......:     -           1          12          71          16     "]
["Michigan .......:     2           5          22          53          18     "]
["Minnesota ......:     -           3          14          57          26     "]
["Missouri .......:     2          12          34          45           7     "]
["Nebraska .......:     -           2          12          67          19     "]
["North Carolina .:     3          16          30          45           6     "]
["North Dakota ...:     -           2          16          71          11     "]
["Ohio ...........:     1           3          13          56          27     "]
["Pennsylvania ...:     1           7          26          56          10     "]
["South Dakota ...:     3           4          28          51          14     "]
["Tennessee ......:     1           2          17          55          25     "]
["Texas ..........:    11          17          42          30           -     "]
["Wisconsin ......:     1           3          12          51          33     "]
["                :                                                           "]
["18 States ......:     2           4          18          55          21     "]
["                :                                                           "]
["Previous week ..:     1           4          18          58          19     "]
["Previous year ..:     2           6          24          55          13     "]
["----------------------------------------------------------------------------"]
[{"$f":"-  Represents zero.","v":{"$error":"#NAME?"}}]
[]
["Soybeans Blooming - Selected States"]
["[These 18 States planted 96% of the 2017 soybean acreage]"]
["------------------------------------------------------------------------"]
["                :               Week ending               :             "]
["                :-----------------------------------------:             "]
["      State     :   July 1,   :  June 24,   :   July 1,   :  2013-2017  "]
["                :    2017     :    2018     :    2018     :   Average   "]
["------------------------------------------------------------------------"]
["                :                        percent                        "]
["                :                                                       "]
["Arkansas .......:     68            57            69            46      "]
["Illinois .......:     14            23            44            11      "]
["Indiana ........:     12             8            33            11      "]
["Iowa ...........:     11             4            21            10      "]
["Kansas .........:     11             7            20             6      "]
["Kentucky .......:     11             3            12             6      "]
["Louisiana ......:     82            73            82            67      "]
["Michigan .......:     11             1            11             7      "]
["Minnesota ......:      8             2            13             9      "]
["Mississippi ....:     71            54            69            48      "]
["Missouri .......:     11             4            27             7      "]
["Nebraska .......:     25            14            35            17      "]
["North Carolina .:     11             5            14             8      "]
["North Dakota ...:      7             1            11            12      "]
["Ohio ...........:      8             6            22             6      "]
["South Dakota ...:     14             2             7            13      "]
["Tennessee ......:     18            13            24            10      "]
["Wisconsin ......:      9             -            13             7      "]
["                :                                                       "]
["18 States ......:     17            12            27            13      "]
["------------------------------------------------------------------------"]
[{"$f":"-  Represents zero.","v":{"$error":"#NAME?"}}]
[]
["Soybean Condition - Selected States: Week Ending July 1, 2018"]
["[These 18 States planted 96% of the 2017 soybean acreage]"]
["----------------------------------------------------------------------------"]
["      State     : Very poor :   Poor    :   Fair    :   Good    : Excellent "]
["----------------------------------------------------------------------------"]
["                :                          percent                          "]
["                :                                                           "]
["Arkansas .......:     2           8          27          46          17     "]
["Illinois .......:     2           3          17          53          25     "]
["Indiana ........:     2           5          21          55          17     "]
["Iowa ...........:     2           4          18          55          21     "]
["Kansas .........:     1           8          37          49           5     "]
["Kentucky .......:     -           2          12          69          17     "]
["Louisiana ......:     5          11          36          37          11     "]
["Michigan .......:     2           4          22          59          13     "]
["Minnesota ......:     -           3          20          57          20     "]
["Mississippi ....:     -           2          30          54          14     "]
["Missouri .......:     3          12          37          43           5     "]
["Nebraska .......:     1           2          11          70          16     "]
["North Carolina .:     -           7          38          50           5     "]
["North Dakota ...:     -           3          20          68           9     "]
["Ohio ...........:     -           4          20          57          19     "]
["South Dakota ...:     3           6          32          51           8     "]
["Tennessee ......:     -           3          19          58          20     "]
["Wisconsin ......:     1           3          13          58          25     "]
["                :                                                           "]
["18 States ......:     1           5          23          55          16     "]
["                :                                                           "]
["Previous week ..:     1           4          22          58          15     "]
["Previous year ..:     2           7          27          54          10     "]
["----------------------------------------------------------------------------"]
[{"$f":"-  Represents zero.","v":{"$error":"#NAME?"}}]
[]
["Cotton Squaring - Selected States"]
["[These 15 States planted 99% of the 2017 cotton acreage]"]
["-----------------------------------------------------------------"]
["                 :            Week ending            :           "]
["                 :-----------------------------------:           "]
["      State      :  July 1,  : June 24,  :  July 1,  : 2013-2017 "]
["                 :   2017    :   2018    :   2018    :  Average  "]
["-----------------------------------------------------------------"]
["                 :                    percent                    "]
["                 :                                               "]
["Alabama .........:    53          31          45          61     "]
["Arizona .........:    73          45          70          73     "]
["Arkansas ........:    92          75          83          89     "]
["California ......:    43          35          45          69     "]
["Georgia .........:    55          42          58          56     "]
["Kansas ..........:     8          30          38          11     "]
["Louisiana .......:    83          83          89          75     "]
["Mississippi .....:    50          40          60          54     "]
["Missouri ........:    51          57          68          44     "]
["North Carolina ..:    51          38          58          48     "]
["Oklahoma ........:    37          18          25          25     "]
["South Carolina ..:    43          23          35          39     "]
["Tennessee .......:    51          54          72          45     "]
["Texas ...........:    34          23          31          28     "]
["Virginia ........:    56          42          58          51     "]
["                 :                                               "]
["15 States .......:    43          32          42          40     "]
["-----------------------------------------------------------------"]
[]
["Cotton Setting Bolls - Selected States"]
["[These 15 States planted 99% of the 2017 cotton acreage]"]
["------------------------------------------------------------------------"]
["                :               Week ending               :             "]
["                :-----------------------------------------:             "]
["      State     :   July 1,   :  June 24,   :   July 1,   :  2013-2017  "]
["                :    2017     :    2018     :    2018     :   Average   "]
["------------------------------------------------------------------------"]
["                :                        percent                        "]
["                :                                                       "]
["Alabama ........:      9             1            11             8      "]
["Arizona ........:     29            10            22            24      "]
["Arkansas .......:     25             7            35            11      "]
["California .....:      3             -             2             9      "]
["Georgia ........:      7             1             8             9      "]
["Kansas .........:      -             -             -             -      "]
["Louisiana ......:     29             7            36            19      "]
["Mississippi ....:      9             -            10             9      "]
["Missouri .......:      3             -             5             1      "]
["North Carolina .:      2             -             2             3      "]
["Oklahoma .......:      -             -             4             2      "]
["South Carolina .:      3             -             -             6      "]
["Tennessee ......:      8             1             8             4      "]
["Texas ..........:     14            10            13             9      "]
["Virginia .......:      2             -             -             -      "]
["                :                                                       "]
["15 States ......:     12             6            12             9      "]
["------------------------------------------------------------------------"]
[{"$f":"-  Represents zero.","v":{"$error":"#NAME?"}}]
[]
["Cotton Condition - Selected States: Week Ending July 1, 2018"]
["[These 15 States planted 99% of the 2017 cotton acreage]"]
["----------------------------------------------------------------------------"]
["      State     : Very poor :   Poor    :   Fair    :   Good    : Excellent "]
["----------------------------------------------------------------------------"]
["                :                          percent                          "]
["                :                                                           "]
["Alabama ........:     -           1          24          63          12     "]
["Arizona ........:     -           3          47          43           7     "]
["Arkansas .......:     -           1          10          43          46     "]
["California .....:     -           -          10          80          10     "]
["Georgia ........:     1           7          26          58           8     "]
["Kansas .........:     1           4          29          61           5     "]
["Louisiana ......:     -          12          45          38           5     "]
["Mississippi ....:     -           3          28          51          18     "]
["Missouri .......:     -           4          37          52           7     "]
["North Carolina .:     3           7          23          56          11     "]
["Oklahoma .......:     6          17          29          42           6     "]
["South Carolina .:     -           -          17          72          11     "]
["Tennessee ......:     2           4          14          63          17     "]
["Texas ..........:     9          27          39          23           2     "]
["Virginia .......:     1           2          26          68           3     "]
["                :                                                           "]
["15 States ......:     6          18          33          36           7     "]
["                :                                                           "]
["Previous week ..:     1          18          39          35           7     "]
["Previous year ..:     2          10          34          43          11     "]
["----------------------------------------------------------------------------"]
[{"$f":"-  Represents zero.","v":{"$error":"#NAME?"}}]
[]
["Sorghum Headed - Selected States"]
["[These 11 States planted 99% of the 2017 sorghum acreage]"]
["------------------------------------------------------------------------"]
["                :               Week ending               :             "]
["                :-----------------------------------------:             "]
["      State     :   July 1,   :  June 24,   :   July 1,   :  2013-2017  "]
["                :    2017     :    2018     :    2018     :   Average   "]
["------------------------------------------------------------------------"]
["                :                        percent                        "]
["                :                                                       "]
["Arkansas .......:     25             2            15            26      "]
["Colorado .......:      -             -             -             -      "]
["Illinois .......:      -             -             -             3      "]
["Kansas .........:      3             4             5             3      "]
["Louisiana ......:     72            49            69            73      "]
["Missouri .......:      3             7            12             5      "]
["Nebraska .......:      4             2             5             1      "]
["New Mexico .....:      -             -             -             -      "]
["Oklahoma .......:      9             5            11             7      "]
["South Dakota ...:      -             -             -             2      "]
["Texas ..........:     67            57            60            58      "]
["                :                                                       "]
["11 States ......:     24            20            22            24      "]
["------------------------------------------------------------------------"]
[{"$f":"-  Represents zero.","v":{"$error":"#NAME?"}}]
[]
["Sorghum Condition - Selected States: Week Ending July 1, 2018"]
["[These 11 States planted 99% of the 2017 sorghum acreage]"]
["----------------------------------------------------------------------------"]
["      State     : Very poor :   Poor    :   Fair    :   Good    : Excellent "]
["----------------------------------------------------------------------------"]
["                :                          percent                          "]
["                :                                                           "]
["Arkansas .......:     -           1          40          45          14     "]
["Colorado .......:     3           6          13          77           1     "]
["Illinois .......:     -           7          43          45           5     "]
["Kansas .........:     2           5          31          57           5     "]
["Louisiana ......:     -           3          81          16           -     "]
["Missouri .......:     -          10          41          45           4     "]
["Nebraska .......:     -           2          16          72          10     "]
["New Mexico .....:     -           1          45          48           6     "]
["Oklahoma .......:     -           4          32          61           3     "]
["South Dakota ...:     1           1          15          82           1     "]
["Texas ..........:     7          31          38          23           1     "]
["                :                                                           "]
["11 States ......:     3          12          32          49           4     "]
["                :                                                           "]
["Previous week ..:     3           9          32          51           5     "]
["Previous year ..:     -           3          35          57           5     "]
["----------------------------------------------------------------------------"]
[{"$f":"-  Represents zero.","v":{"$error":"#NAME?"}}]
[]
["Peanuts Pegging - Selected States"]
["[These 8 States planted 96% of the 2017 peanut acreage]"]
["-----------------------------------------------------------------"]
["                 :            Week ending            :           "]
["                 :-----------------------------------:           "]
["      State      :  July 1,  : June 24,  :  July 1,  : 2013-2017 "]
["                 :   2017    :   2018    :   2018    :  Average  "]
["-----------------------------------------------------------------"]
["                 :                    percent                    "]
["                 :                                               "]
["Alabama .........:    39          29          41          41     "]
["Florida .........:    48          17          34          44     "]
["Georgia .........:    54          38          61          37     "]
["North Carolina ..:    30          18          34          27     "]
["Oklahoma ........:    23          12          30          26     "]
["South Carolina ..:    42          22          46          50     "]
["Texas ...........:    14           5          10          15     "]
["Virginia ........:    17          10          22          13     "]
["                 :                                               "]
["8 States ........:    43          27          45          36     "]
["-----------------------------------------------------------------"]
[]
["Peanut Condition - Selected States: Week Ending July 1, 2018"]
["[These 8 States harvested 96% of the 2017 peanut acreage]"]
["----------------------------------------------------------------------------"]
["      State     : Very poor :   Poor    :   Fair    :   Good    : Excellent "]
["----------------------------------------------------------------------------"]
["                :                          percent                          "]
["                :                                                           "]
["Alabama ........:     -           2          20          73           5     "]
["Florida ........:     -           2          23          62          13     "]
["Georgia ........:     1           4          24          64           7     "]
["North Carolina .:     -           1          25          60          14     "]
["Oklahoma .......:     -           -          14          75          11     "]
["South Carolina .:     -           -          17          63          20     "]
["Texas ..........:     -           1          73          26           -     "]
["Virginia .......:     1           2          22          70           5     "]
["                :                                                           "]
["8 States .......:     -           3          30          59           8     "]
["                :                                                           "]
["Previous week ..:     1           3          31          58           7     "]
["Previous year ..:     -           4          21          61          14     "]
["----------------------------------------------------------------------------"]
[{"$f":"-  Represents zero.","v":{"$error":"#NAME?"}}]
[]
["Rice Headed - Selected States"]
["[These 6 States planted 100% of the 2017 rice acreage]"]
["------------------------------------------------------------------------"]
["                :               Week ending               :             "]
["                :-----------------------------------------:             "]
["      State     :   July 1,   :  June 24,   :   July 1,   :  2013-2017  "]
["                :    2017     :    2018     :    2018     :   Average   "]
["------------------------------------------------------------------------"]
["                :                        percent                        "]
["                :                                                       "]
["Arkansas .......:      4             -             6             5      "]
["California .....:      -             -             5             9      "]
["Louisiana ......:     45            31            43            46      "]
["Mississippi ....:     32             8            11            16      "]
["Missouri .......:      3             -            16             3      "]
["Texas ..........:     52            28            51            37      "]
["                :                                                       "]
["6 States .......:     13             7            15            14      "]
["------------------------------------------------------------------------"]
[{"$f":"-  Represents zero.","v":{"$error":"#NAME?"}}]
[]
["Rice Condition - Selected States: Week Ending July 1, 2018"]
["[These 6 States planted 100% of the 2017 rice acreage]"]
["----------------------------------------------------------------------------"]
["      State     : Very poor :   Poor    :   Fair    :   Good    : Excellent "]
["----------------------------------------------------------------------------"]
["                :                          percent                          "]
["                :                                                           "]
["Arkansas .......:     1           7          28          46          18     "]
["California .....:     -           -          10          85           5     "]
["Louisiana ......:     -           4          23          62          11     "]
["Mississippi ....:     -           -          21          62          17     "]
["Missouri .......:     -          10          21          43          26     "]
["Texas ..........:     -           1          42          47          10     "]
["                :                                                           "]
["6 States .......:     -           5          24          56          15     "]
["                :                                                           "]
["Previous week ..:     -           5          25          57          13     "]
["Previous year ..:     -           4          23          51          22     "]
["----------------------------------------------------------------------------"]
[{"$f":"-  Represents zero.","v":{"$error":"#NAME?"}}]
[]
["Sunflowers Planted - Selected States"]
["[These 4 States planted 87% of the 2017 sunflower acreage]"]
["-----------------------------------------------------------------"]
["                 :            Week ending            :           "]
["                 :-----------------------------------:           "]
["      State      :  July 1,  : June 24,  :  July 1,  : 2013-2017 "]
["                 :   2017    :   2018    :   2018    :  Average  "]
["-----------------------------------------------------------------"]
["                 :                    percent                    "]
["                 :                                               "]
["Colorado ........:     89         80           95         87     "]
["Kansas ..........:     92         82           88         88     "]
["North Dakota ....:    100         98          100         97     "]
["South Dakota ....:    100         87           91         94     "]
["                 :                                               "]
["4 States ........:    100         91           95         95     "]
["-----------------------------------------------------------------"]
[]
["Winter Wheat Harvested - Selected States"]
["[These 18 States harvested 90% of the 2017 winter wheat acreage]"]
["-----------------------------------------------------------------"]
["                 :            Week ending            :           "]
["                 :-----------------------------------:           "]
["      State      :  July 1,  : June 24,  :  July 1,  : 2013-2017 "]
["                 :   2017    :   2018    :   2018    :  Average  "]
["-----------------------------------------------------------------"]
["                 :                    percent                    "]
["                 :                                               "]
["Arkansas ........:    99          99          100         95     "]
["California ......:    52          50           60         79     "]
["Colorado ........:    11           6           21          9     "]
["Idaho ...........:     -           -            -          -     "]
["Illinois ........:    88          66           83         67     "]
["Indiana .........:    53          28           50         39     "]
["Kansas ..........:    69          52           71         63     "]
["Michigan ........:     -           -            -          -     "]
["Missouri ........:    89          66           85         70     "]
["Montana .........:     -           -            -          -     "]
["Nebraska ........:    15           1            7          9     "]
["North Carolina ..:    91          75           87         86     "]
["Ohio ............:    35           4           24         19     "]
["Oklahoma ........:    94          92           98         90     "]
["Oregon ..........:     1           -            2          1     "]
["South Dakota ....:     6           -            -          2     "]
["Texas ...........:    92          71           80         83     "]
["Washington ......:     3           -            -          1     "]
["                 :                                               "]
["18 States .......:    51          41           51         49     "]
["-----------------------------------------------------------------"]
[{"$f":"-  Represents zero.","v":{"$error":"#NAME?"}}]
[]
["Winter Wheat Condition - Selected States: Week Ending July 1, 2018"]
["[These 18 States planted 90% of the 2017 winter wheat acreage]"]
["----------------------------------------------------------------------------"]
["      State     : Very poor :   Poor    :   Fair    :   Good    : Excellent "]
["----------------------------------------------------------------------------"]
["                :                          percent                          "]
["                :                                                           "]
["Arkansas .......:     2           5          33          52           8     "]
["California .....:     -           -           5          70          25     "]
["Colorado .......:     5          18          29          41           7     "]
["Idaho ..........:     -           2          12          55          31     "]
["Illinois .......:     4           9          34          45           8     "]
["Indiana ........:     2           5          29          53          11     "]
["Kansas .........:    16          30          37          15           2     "]
["Michigan .......:     2           6          21          50          21     "]
["Missouri .......:     4          11          38          43           4     "]
["Montana ........:     4           8          19          24          45     "]
["Nebraska .......:     2           7          26          52          13     "]
["North Carolina .:     1           3          25          57          14     "]
["Ohio ...........:     1           3          17          60          19     "]
["Oklahoma .......:    36          26          28          10           -     "]
["Oregon .........:     3          14          24          40          19     "]
["South Dakota ...:     4           9          41          45           1     "]
["Texas ..........:    29          21          31          17           2     "]
["Washington .....:     -           2          16          59          23     "]
["                :                                                           "]
["18 States ......:    15          19          29          28           9     "]
["                :                                                           "]
["Previous week ..:    15          19          29          28           9     "]
["Previous year ..:     5          12          35          39           9     "]
["----------------------------------------------------------------------------"]
[{"$f":"-  Represents zero.","v":{"$error":"#NAME?"}}]
[]
["Spring Wheat Headed - Selected States"]
["[These 6 States planted 99% of the 2017 spring wheat acreage]"]
["-----------------------------------------------------------------"]
["                 :            Week ending            :           "]
["                 :-----------------------------------:           "]
["      State      :  July 1,  : June 24,  :  July 1,  : 2013-2017 "]
["                 :   2017    :   2018    :   2018    :  Average  "]
["-----------------------------------------------------------------"]
["                 :                    percent                    "]
["                 :                                               "]
["Idaho ...........:    56          34          55          64     "]
["Minnesota .......:    68          36          73          55     "]
["Montana .........:    32          23          32          33     "]
["North Dakota ....:    54          27          58          43     "]
["South Dakota ....:    91          67          81          74     "]
["Washington ......:    80          81          88          85     "]
["                 :                                               "]
["6 States ........:    56          34          58          48     "]
["-----------------------------------------------------------------"]
[]
["Spring Wheat Condition - Selected States: Week Ending July 1, 2018"]
["[These 6 States planted 99% of the 2017 spring wheat acreage]"]
["-----------------------------------------------------------------------------"]
["      State      : Very poor :   Poor    :   Fair    :   Good    : Excellent "]
["-----------------------------------------------------------------------------"]
["                 :                          percent                          "]
["                 :                                                           "]
["Idaho ...........:     6           2          12          63          17     "]
["Minnesota .......:     -           -          14          50          36     "]
["Montana .........:     3           5          17          66           9     "]
["North Dakota ....:     -           3          17          69          11     "]
["South Dakota ....:     4          10          35          47           4     "]
["Washington ......:     -           1          19          68          12     "]
["                 :                                                           "]
["6 States ........:     1           4          18          64          13     "]
["                 :                                                           "]
["Previous week ...:     2           3          18          63          14     "]
["Previous year ...:    13          20          30          30           7     "]
["-----------------------------------------------------------------------------"]
[{"$f":"-  Represents zero.","v":{"$error":"#NAME?"}}]
[]
["Barley Headed - Selected States"]
["[These 5 States planted 80% of the 2017 barley acreage]"]
["-----------------------------------------------------------------"]
["                 :            Week ending            :           "]
["                 :-----------------------------------:           "]
["      State      :  July 1,  : June 24,  :  July 1,  : 2013-2017 "]
["                 :   2017    :   2018    :   2018    :  Average  "]
["-----------------------------------------------------------------"]
["                 :                    percent                    "]
["                 :                                               "]
["Idaho ...........:    71          43          59          66     "]
["Minnesota .......:    66          27          70          54     "]
["Montana .........:    25          17          28          45     "]
["North Dakota ....:    53          22          63          44     "]
["Washington ......:    66          78          82          80     "]
["                 :                                               "]
["5 States ........:    48          28          50          51     "]
["-----------------------------------------------------------------"]
[]
["Barley Condition - Selected States: Week Ending July 1, 2018"]
["[These 5 States planted 80% of the 2017 barley acreage]"]
["-----------------------------------------------------------------------------"]
["      State      : Very poor :   Poor    :   Fair    :   Good    : Excellent "]
["-----------------------------------------------------------------------------"]
["                 :                          percent                          "]
["                 :                                                           "]
["Idaho ...........:     1           1           8          67          23     "]
["Minnesota .......:     -           1          14          55          30     "]
["Montana .........:     3           5          15          53          24     "]
["North Dakota ....:     -           1          13          81           5     "]
["Washington ......:     -           -          13          73          14     "]
["                 :                                                           "]
["5 States ........:     1           2          13          66          18     "]
["                 :                                                           "]
["Previous week ...:     1           3          13          65          18     "]
["Previous year ...:     5          12          31          41          11     "]
["-----------------------------------------------------------------------------"]
[{"$f":"-  Represents zero.","v":{"$error":"#NAME?"}}]
[]
["Oats Headed - Selected States"]
["[These 9 States planted 67% of the 2017 oat acreage]"]
["-----------------------------------------------------------------"]
["                 :            Week ending            :           "]
["                 :-----------------------------------:           "]
["      State      :  July 1,  : June 24,  :  July 1,  : 2013-2017 "]
["                 :   2017    :   2018    :   2018    :  Average  "]
["-----------------------------------------------------------------"]
["                 :                    percent                    "]
["                 :                                               "]
["Iowa ............:     93          84          93          91    "]
["Minnesota .......:     76          43          66          64    "]
["Nebraska ........:     98          91          97          92    "]
["North Dakota ....:     59          20          58          46    "]
["Ohio ............:     89          82          91          86    "]
["Pennsylvania ....:     73          46          72          79    "]
["South Dakota ....:     91          78          90          82    "]
["Texas ...........:    100         100         100         100    "]
["Wisconsin .......:     66          48          68          68    "]
["                 :                                               "]
["9 States ........:     83          67          82          80    "]
["-----------------------------------------------------------------"]
[]
["Oat Condition - Selected States: Week Ending July 1, 2018"]
["[These 9 States planted 67% of the 2017 oat acreage]"]
["-----------------------------------------------------------------------------"]
["      State      : Very poor :   Poor    :   Fair    :   Good    : Excellent "]
["-----------------------------------------------------------------------------"]
["                 :                          percent                          "]
["                 :                                                           "]
["Iowa ............:     -           2          18          65          15     "]
["Minnesota .......:     -           2          18          64          16     "]
["Nebraska ........:     1           3          26          58          12     "]
["North Dakota ....:     -           2          15          76           7     "]
["Ohio ............:     -           4          17          67          12     "]
["Pennsylvania ....:     -           7          16          69           8     "]
["South Dakota ....:     1           4          27          61           7     "]
["Texas ...........:    12           4          26          44          14     "]
["Wisconsin .......:     -           1          11          62          26     "]
["                 :                                                           "]
["9 States ........:     3           3          21          60          13     "]
["                 :                                                           "]
["Previous week ...:     3           3          22          59          13     "]
["Previous year ...:     7          13          27          45           8     "]
["-----------------------------------------------------------------------------"]
[{"$f":"-  Represents zero.","v":{"$error":"#NAME?"}}]
[]
["Pasture and Range Condition - Selected States: Week Ending July 1, 2018"]
["[National pasture and range conditions for selected States are weighted"]
["based on pasture acreage and/or livestock inventories]"]
["----------------------------------------------------------------------------"]
["      State     : Very poor :   Poor    :   Fair    :   Good    : Excellent "]
["----------------------------------------------------------------------------"]
["                :                          percent                          "]
["                :                                                           "]
["Alabama ........:     -           2          13          71          14     "]
["Arizona ........:    64          24           9           3           -     "]
["Arkansas .......:     4          22          51          19           4     "]
["California .....:    30          10          10          40          10     "]
["Colorado .......:    21          30          24          23           2     "]
["Connecticut ....:     5          10          30          55           -     "]
["Delaware .......:     3           6          33          49           9     "]
["Florida ........:     1           5          19          54          21     "]
["Georgia ........:     1           4          26          57          12     "]
["Idaho ..........:     -           3          15          58          24     "]
["Illinois .......:     1           7          23          49          20     "]
["Indiana ........:     1           6          32          51          10     "]
["Iowa ...........:     2           7          25          51          15     "]
["Kansas .........:     6          19          41          30           4     "]
["Kentucky .......:     1           3          22          62          12     "]
["Louisiana ......:     7          14          40          35           4     "]
["Maine ..........:     -           -          20          80           -     "]
["Maryland .......:     2           3          26          61           8     "]
["Massachusetts ..:     -          10          26          64           -     "]
["Michigan .......:     2           7          23          53          15     "]
["Minnesota ......:     -           3          19          60          18     "]
["Mississippi ....:     1          10          30          54           5     "]
["Missouri .......:     9          26          42          23           -     "]
["Montana ........:     1           5          17          44          33     "]
["Nebraska .......:     2           5          22          52          19     "]
["Nevada .........:    10          20          45          25           -     "]
["New Hampshire ..:     5          11          68          16           -     "]
["New Jersey .....:     1           6          29          58           6     "]
["New Mexico .....:    18          48          27           7           -     "]
["New York .......:     3           7          25          45          20     "]
["North Carolina .:     1           8          42          47           2     "]
["North Dakota ...:     2           9          33          51           5     "]
["Ohio ...........:     1           4          28          55          12     "]
["Oklahoma .......:     6           9          37          46           2     "]
["Oregon .........:     4          29          25          37           5     "]
["Pennsylvania ...:     -           4          24          42          30     "]
["Rhode Island ...:     -           5          20          75           -     "]
["South Carolina .:     -           -          34          62           4     "]
["South Dakota ...:     1           8          33          52           6     "]
["Tennessee ......:     1           9          28          49          13     "]
["Texas ..........:    13          27          36          19           5     "]
["Utah ...........:    12          18          39          31           -     "]
["Vermont ........:     -           -           4          93           3     "]
["Virginia .......:     1           6          28          50          15     "]
["Washington .....:     1           4          26          65           4     "]
["West Virginia ..:     -          11          29          53           7     "]
["Wisconsin ......:     -           3          12          55          30     "]
["Wyoming ........:     5           5          17          66           7     "]
["                :                                                           "]
["48 States ......:     6          14          29          41          10     "]
["                :                                                           "]
["Previous week ..:     6          14          31          41           8     "]
["Previous year ..:     5          10          28          47          10     "]
["----------------------------------------------------------------------------"]
[{"$f":"-  Represents zero.","v":{"$error":"#NAME?"}}]
[]
["Days Suitable for Fieldwork - Selected States"]
["[Days suitable for Fieldwork are weighted based on"]
["cropland acreage]"]
["-----------------------------------------------------------"]
["                 :               Week ending               "]
["                 :-----------------------------------------"]
["      State      :   July 1,   :  June 24,   :   July 1,   "]
["                 :    2017     :    2018     :    2018     "]
["-----------------------------------------------------------"]
["                 :                  Days                   "]
["                 :                                         "]
["Alabama .........:     3.3           5.3           4.7     "]
["Arizona .........:     7.0           7.0           7.0     "]
["Arkansas ........:     4.8           5.9           6.1     "]
["California ......:     7.0           6.9           7.0     "]
["Colorado ........:     6.7           5.6           6.2     "]
["Connecticut .....:     7.0           6.0           5.0     "]
["Delaware ........:     7.0           6.0           7.0     "]
["Florida .........:     6.2           6.2           5.8     "]
["Georgia .........:     4.9           6.2           5.2     "]
["Idaho ...........:     6.9           5.8           6.7     "]
["Illinois ........:     5.8           3.2           4.1     "]
["Indiana .........:     4.3           3.0           4.5     "]
["Iowa ............:     4.6           2.1           3.2     "]
["Kansas ..........:     5.4           4.4           4.9     "]
["Kentucky ........:     5.2           5.0           3.3     "]
["Louisiana .......:     3.5           5.3           6.7     "]
["Maine ...........:     4.2           5.2           4.5     "]
["Maryland ........:     7.0           4.5           7.0     "]
["Massachusetts ...:     6.0           5.7           5.0     "]
["Michigan ........:     4.2           4.8           5.7     "]
["Minnesota .......:     4.8           3.3           3.8     "]
["Mississippi .....:     3.9           4.5           5.8     "]
["Missouri ........:     4.1           4.9           4.8     "]
["Montana .........:     6.7           3.8           5.2     "]
["Nebraska ........:     5.8           3.6           4.0     "]
["Nevada ..........:     7.0           7.0           7.0     "]
["New Hampshire ...:     3.6           5.8           5.8     "]
["New Jersey ......:     6.5           6.5           7.0     "]
["New Mexico ......:     5.8           6.9           6.8     "]
["New York ........:     3.0           6.0           5.5     "]
["North Carolina ..:     5.8           5.6           6.0     "]
["North Dakota ....:     6.3           5.7           5.0     "]
["Ohio ............:     4.6           2.8           4.2     "]
["Oklahoma ........:     5.9           5.3           5.5     "]
["Oregon ..........:     6.7           6.6           7.0     "]
["Pennsylvania ....:     5.5           4.5           5.5     "]
["Rhode Island ....:     6.5           6.0           6.5     "]
["South Carolina ..:     5.4           6.3           5.9     "]
["South Dakota ....:     6.1           4.1           4.8     "]
["Tennessee .......:     5.0           4.8           3.8     "]
["Texas ...........:     5.4           5.6           6.3     "]
["Utah ............:     7.0           6.9           7.0     "]
["Vermont .........:     3.1           5.0           5.8     "]
["Virginia ........:     6.6           4.4           5.8     "]
["Washington ......:     7.0           6.2           6.6     "]
["West Virginia ...:     6.6           3.2           5.0     "]
["Wisconsin .......:     3.7           3.5           5.3     "]
["Wyoming .........:     6.7           4.9           6.0     "]
["-----------------------------------------------------------"]
[]
["Topsoil Moisture Condition - Selected States: Week Ending"]
["2018-07-01"]
["[National topsoil moisture conditions for selected States are"]
["weighted based on cropland acreage]"]
["----------------------------------------------------------------"]
["      State     :Very short :   Short   : Adequate  :  Surplus  "]
["----------------------------------------------------------------"]
["                :                    percent                    "]
["                :                                               "]
["Alabama ........:     -           7           78         15     "]
["Arizona ........:     5          13           80          2     "]
["Arkansas .......:    20          33           45          2     "]
["California .....:    40          40           20          -     "]
["Colorado .......:    18          22           56          4     "]
["Connecticut ....:     -           -          100          -     "]
["Delaware .......:     7          31           45         17     "]
["Florida ........:     -           2           82         16     "]
["Georgia ........:     1          12           71         16     "]
["Idaho ..........:     7          32           52          9     "]
["Illinois .......:     1           6           75         18     "]
["Indiana ........:     1           9           78         12     "]
["Iowa ...........:     1           5           68         26     "]
["Kansas .........:     7          21           68          4     "]
["Kentucky .......:     -           4           74         22     "]
["Louisiana ......:    17          37           45          1     "]
["Maine ..........:     -          20           80          -     "]
["Maryland .......:     6          17           71          6     "]
["Massachusetts ..:     1          36           63          -     "]
["Michigan .......:     7          21           64          8     "]
["Minnesota ......:     -           3           63         34     "]
["Mississippi ....:     4          34           57          5     "]
["Missouri .......:    20          32           46          2     "]
["Montana ........:     3          14           71         12     "]
["Nebraska .......:     1          10           77         12     "]
["Nevada .........:    15          35           50          -     "]
["New Hampshire ..:    18          14           68          -     "]
["New Jersey .....:     9          25           66          -     "]
["New Mexico .....:    51          34           15          -     "]
["New York .......:    28          29           37          6     "]
["North Carolina .:     5          32           60          3     "]
["North Dakota ...:     3          14           77          6     "]
["Ohio ...........:     -           3           69         28     "]
["Oklahoma .......:    18          21           56          5     "]
["Oregon .........:    30          44           25          1     "]
["Pennsylvania ...:     -           1           91          8     "]
["Rhode Island ...:     -          22           78          -     "]
["South Carolina .:     -          38           61          1     "]
["South Dakota ...:     3          14           72         11     "]
["Tennessee ......:     -          11           69         20     "]
["Texas ..........:    32          37           29          2     "]
["Utah ...........:    25          35           40          -     "]
["Vermont ........:     -          45           55          -     "]
["Virginia .......:     -          13           76         11     "]
["Washington .....:     2          23           72          3     "]
["West Virginia ..:     -          15           64         21     "]
["Wisconsin ......:     -           7           84          9     "]
["Wyoming ........:     9          17           73          1     "]
["                :                                               "]
["48 States ......:     9          18           62         11     "]
["                :                                               "]
["Previous week ..:     8          18           61         13     "]
["Previous year ..:    10          22           60          8     "]
["----------------------------------------------------------------"]
[{"$f":"-  Represents zero.","v":{"$error":"#NAME?"}}]
[]
["Subsoil Moisture Condition - Selected States: Week Ending"]
["2018-07-01"]
["[National subsoil moisture conditions for selected States are"]
["weighted based on cropland acreage]"]
["----------------------------------------------------------------"]
["      State     :Very short :   Short   : Adequate  :  Surplus  "]
["----------------------------------------------------------------"]
["                :                    percent                    "]
["                :                                               "]
["Alabama ........:     -           7           81         12     "]
["Arizona ........:     4          12           82          2     "]
["Arkansas .......:    11          44           43          2     "]
["California .....:    45          30           25          -     "]
["Colorado .......:    16          23           61          -     "]
["Connecticut ....:     -           -          100          -     "]
["Delaware .......:     1          26           49         24     "]
["Florida ........:     -           2           81         17     "]
["Georgia ........:     -          10           75         15     "]
["Idaho ..........:    16          23           53          8     "]
["Illinois .......:     2          11           75         12     "]
["Indiana ........:     1           8           81         10     "]
["Iowa ...........:     3           9           66         22     "]
["Kansas .........:    10          28           60          2     "]
["Kentucky .......:     -           5           78         17     "]
["Louisiana ......:     4          50           45          1     "]
["Maine ..........:     5          25           70          -     "]
["Maryland .......:     1          12           80          7     "]
["Massachusetts ..:     2          15           83          -     "]
["Michigan .......:     4          18           67         11     "]
["Minnesota ......:     -           3           66         31     "]
["Mississippi ....:     2          32           59          7     "]
["Missouri .......:    20          33           44          3     "]
["Montana ........:     6          18           70          6     "]
["Nebraska .......:     2          16           75          7     "]
["Nevada .........:    15          25           60          -     "]
["New Hampshire ..:    17          32           51          -     "]
["New Jersey .....:     2          15           80          3     "]
["New Mexico .....:    46          39           15          -     "]
["New York .......:    17          28           49          6     "]
["North Carolina .:     2          20           75          3     "]
["North Dakota ...:     5          27           64          4     "]
["Ohio ...........:     -           2           71         27     "]
["Oklahoma .......:    22          35           41          2     "]
["Oregon .........:    25          46           29          -     "]
["Pennsylvania ...:     -           -           91          9     "]
["Rhode Island ...:     -          15           85          -     "]
["South Carolina .:     -          30           69          1     "]
["South Dakota ...:     4          22           66          8     "]
["Tennessee ......:     1           9           76         14     "]
["Texas ..........:    34          37           27          2     "]
["Utah ...........:    23          39           38          -     "]
["Vermont ........:     -          23           77          -     "]
["Virginia .......:     -          13           74         13     "]
["Washington .....:     2          18           78          2     "]
["West Virginia ..:     -          17           64         19     "]
["Wisconsin ......:     -           5           86          9     "]
["Wyoming ........:     7          19           73          1     "]
["                :                                               "]
["48 States ......:     9          20           62          9     "]
["                :                                               "]
["Previous week ..:     9          20           62          9     "]
["Previous year ..:     7          20           66          7     "]
["----------------------------------------------------------------"]
[{"$f":"-  Represents zero.","v":{"$error":"#NAME?"}}]
[]
["Crop Progress and Condition Tables Expected Next Week"]
[]
["Barley: Headed, Condition","Sorghum: Headed, Coloring, "]
["Condition"]
["Corn: Silking, Condition",null,null,null,"Soybeans: Blooming, Setting "]
["Pods, Condition"]
["Cotton: Squaring, Setting Bolls, Condition",null,"Spring Wheat: Headed, "]
["Condition"]
["Oats: Headed, Harvested, Condition",null,null,"Winter Wheat: Harvested"]
["Pasture and Range: Condition",null,null,null,"Days Suitable for Fieldwork"]
["Peanuts: Pegging, Condition",null,null,null,"Topsoil Moisture Condition"]
["Rice: Headed, Condition",null,null,null,"Subsoil Moisture Condition"]
[]
[]
["Statistical Methodology"]
[]
["Survey Procedures: Crop progress and condition estimates are based on survey "]
["data collected each week from early April through the end of November. The "]
["non-probability crop progress and condition surveys include input from "]
["approximately 3,600 respondents whose occupations provide them opportunities "]
["to make visual observations and frequently bring them in contact with farmers "]
["in their counties. Based on standard definitions, these respondents "]
["subjectively estimate the progress of crops through various stages of "]
["development, as well as the progress of producer activities. They also "]
["provide subjective evaluations of crop conditions."]
[]
["Most respondents complete their questionnaires on Friday or early Monday "]
["morning and submit them to the National Agricultural Statistics Service "]
["(NASS) Field Offices in their States by mail, telephone, fax, e-mail, or "]
["through a secured internet website. A small number of reports are completed "]
["on Thursday, Saturday, and Sunday. Regardless of when questionnaires are "]
["completed, respondents are asked to report for the entire week ending on "]
["Sunday. For reports submitted prior to the Sunday reference date, a degree of "]
["uncertainty is introduced by projections for weekend changes in progress and "]
["condition. By the end of the 2017 season, over 95 percent of the data were "]
["being submitted through the internet website. As a result, the majority of "]
["all data are submitted on Monday morning, significantly reducing projection "]
["uncertainty."]
[]
["Respondents are sent written reporting instructions at the beginning of each "]
["season and are contacted periodically to ensure proper reporting. Terms and "]
["definitions of crop stages and condition categories used as reporting "]
["guidelines are available on the NASS website at "]
["www.nass.usda.gov/Publications/National_Crop_Progress."]
[]
["Estimating Procedures: Reported data are reviewed for reasonableness and "]
["consistency by comparing with data reported the previous week and data "]
["reported in surrounding counties for the current week. Field Offices "]
["summarize the reported data to district and State levels, weighting each "]
["county's reported data by NASS county acreage estimates. Summarized "]
["indications are compared with previous week estimates, and progress items are "]
["compared with earlier stages of development and historical averages to ensure "]
["reasonableness. Weather events and respondent comments are also taken into "]
["consideration. State estimates are submitted to the Agricultural Statistics "]
["Board (ASB) along with supporting comments, where they are compared with "]
["surrounding States and compiled into a National level summary by weighting "]
["each State by its acreage estimates. National crop planting progress, "]
["progress of development stages, and condition estimates are weighted using "]
["the program State's average planted acres over the previous three crop years. "]
["National crop harvest progress estimates are weighted using the program "]
["State's average harvested acres over the previous three crop years. Pasture "]
["and range condition is weighted using pasture acreage and/or livestock "]
["inventories from the most recent Census of Agriculture. Days suitable for "]
["fieldwork, topsoil moisture and subsoil moisture are weighted using cropland "]
["acreage from the Census of Agriculture."]
[" "]
["Revision Policy: Progress and condition estimates in the Crop Progress report "]
["are released after 4:00 pm ET on the first business day of the week. These "]
["estimates are subject to revision the following week."]
[]
["Information Contacts"]
[]
["Listed below are the commodity statisticians in the Crops Branch of the "]
["National Agricultural Statistics Service to contact for additional "]
["information. E-mail inquiries may be sent to nass@nass.usda.gov"]
[]
["Lance Honig, Chief, Crops Branch.......................... (202) 720-2127"]
[]
["Anthony Prillaman, Head, Field Crops Section.............. (202) 720-2127"]
["Natasha Bruton - Current Agricultural Industrial Reports.. (202) 401-0034"]
["David Colwell - Current Agricultural Industrial Reports... (202) 720-3338"]
["     Chris Hawthorn - Corn, Flaxseed, Proso Millet........ (202) 720-9526"]
["     James Johanson - County Estimates, Hay............... (202) 690-8533"]
["     Jeff Lemmons - Oats, Soybeans........................ (202) 690-3234"]
["     Sammy Neal - Peanuts, Rice........................... (202) 720-7688"]
["     Joshua O'Rear - Crop Weather, Barley................. (202) 720-7621"]
["     Jean Porter - Rye, Wheat............................. (202) 720-8068"]
["Bianca Pruneda - Cotton, Cotton Ginnings, Sorghum......... (202) 720-5944"]
["     Travis Thorson - Sunflower, Other Oilseeds........... (202) 720-7369"]
[]
["Access to NASS Reports"]
[]
["For your convenience, you may access NASS reports and products the following "]
["ways:"]
[]
[" ","All reports are available electronically, at no cost, on the NASS web "]
["site: www.nass.usda.gov"]
[]
[" ","Both national and state specific reports are available via a free e-"]
["mail subscription. To set-up this free subscription, visit "]
["www.nass.usda.gov and click on \"National\" or \"State\" in upper right "]
["corner above \"search\" box to create an account and select the reports "]
["you would like to receive."]
[]
["For more information on NASS surveys and reports, call the NASS Agricultural "]
["Statistics Hotline at (800) 727-9540, 7:30 a.m. to 4:00 p.m. ET, or e-mail: "]
["nass@nass.usda.gov. "]
[]
["The U.S. Department of Agriculture (USDA) prohibits discrimination against "]
["its customers, employees, and applicants for employment on the basis of race, "]
["color, national origin, age, disability, sex, gender identity, religion, "]
["reprisal, and where applicable, political beliefs, marital status, familial "]
["or parental status, sexual orientation, or all or part of an individual's "]
["income is derived from any public assistance program, or protected genetic "]
["information in employment or in any program or activity conducted or funded "]
["by the Department. (Not all prohibited bases will apply to all programs "]
["and/or employment activities.) "]
["If you wish to file a Civil Rights program complaint of discrimination, "]
["complete the USDA Program Discrimination Complaint Form (PDF), found online "]
["at www.ascr.usda.gov/filing-program-discrimination-complaint-usda-customer, "]
["or at any USDA office, or call (866) 632-9992 to request the form. You may "]
["also write a letter containing all of the information requested in the form. "]
["Send your completed complaint form or letter to us by mail at U.S. Department "]
["of Agriculture, Director, Office of Adjudication, 1400 Independence Avenue, "]
["S.W., Washington, D.C. 20250-9410, by fax (202) 690-7442 or email at "]
["program.intake@usda.gov. "]
[]
[" "]

{"sheet":"Sheet1","index":2,"n_rows":10,"n_cols":7,"rows_kept":10,"cut":false,"hidden":true,"merged":[]}
[{"$f":"C9&\"s/\"&C10&\"/CropProg-\"&A9&A10&\"-\"&B9&B10&\"-\"&C10&\".txt\"","v":"2010s/2018/CropProg-07-02-2018.txt"},null,null,null,{"$f":"G9&\"s/\"&G10&\"/CropProg-\"&E9&E10&\"-\"&F9&F10&\"-\"&G10&\".txt\"","v":"2010s/2010/CropProg-07-12-2010.txt"}]
[]
[]
[]
[]
[]
[]
[]
[{"$f":"IF(A10<10,0,\"\")","v":0},{"$f":"IF(B10<10,0,\"\")","v":0},{"$f":"IF(C10<2010,2000,IF(AND(C10>2009,C10<2019),2010,2020))","v":2010},null,{"$f":"IF(E10<10,0,\"\")","v":0},{"$f":"IF(F10<10,0,\"\")","v":""},{"$f":"IF(G10<2010,2000,IF(AND(G10>2009,G10<2019),2010,2020))","v":2010}]
[{"$f":"MainDisplay!K27","v":7},{"$f":"MainDisplay!L27","v":2},{"$f":"MainDisplay!M27","v":2018},null,{"$f":"MainDisplay!W27","v":7},{"$f":"MainDisplay!X27","v":12},{"$f":"MainDisplay!Y27","v":2010}]

{"sheet":"Sheet3","index":3,"n_rows":88,"n_cols":22,"rows_kept":88,"cut":false,"hidden":true,"merged":[[33,3,33,6]]}
[{"$f":"IFERROR(INDIRECT(O3),\"\")","v":"Soybeans Blooming - Selected States"},{"$f":"P1","v":"$A$11"},{"$f":"INDIRECT(B1)","v":"Arkansas .......:     68            57            69            46      "},{"$f":"TRIM(RIGHT(INDIRECT(B1),LEN(INDIRECT(B1))-FIND(\":\",INDIRECT(B1))))","v":"68 57 69 46"},{"$f":"IF($M$14=1,VLOOKUP(LEFT(C1,2),$U$1:$V$50,2,FALSE),IFERROR(LEFT(INDIRECT(B1),FIND(\".\",INDIRECT(B1))-2),\"\"))","v":"Arkansas"},{"$f":"IFERROR(LEFT(D1,FIND(\" \",D1)),\"\")","v":"68 "},{"$f":"IFERROR(RIGHT(LEFT(D1,FIND(\"~\",SUBSTITUTE(D1,\" \",\"~\",2))),FIND(\"~\",SUBSTITUTE(D1,\" \",\"~\",2))-FIND(\"~\",SUBSTITUTE(D1,\" \",\"~\",1))),\"\")","v":"57 "},{"$f":"IFERROR(RIGHT(LEFT(D1,FIND(\"~\",SUBSTITUTE(D1,\" \",\"~\",3))),FIND(\"~\",SUBSTITUTE(D1,\" \",\"~\",3))-FIND(\"~\",SUBSTITUTE(D1,\" \",\"~\",2))),\"\")","v":"69 "},{"$f":"IFERROR(RIGHT(D1,LEN(D1)-FIND(\"~\",SUBSTITUTE(D1,\" \",\"~\",3))),\"\")","v":"46"},"Corn",{"$f":"IF(MainDisplay!B27=\"Corn\",\"Corn Planted\",IF(MainDisplay!B27=\"Soybeans\",\"Soybeans Planted\",IF(MainDisplay!B27=\"Spring Wheat\",\"Spring Wheat Planted\",\"Winter Wheat Planted\")))","v":"Soybeans Planted"},null,{"$f":"IF($J$8=\"Corn\",\"        Corn:  Percent Planted,\",IF($J$8=\"Soybeans\",\"      Soybeans:  Percent Planted,\",IF($J$8=\"Spring Wheat\",\"    Spring Wheat:  Percent Planted,\",IF($J$8=\"Winter Wheat\",\"    Winter Wheat:  Percent Planted,\"))))","v":"      Soybeans:  Percent Planted,"},null,{"$f":"IF($M$14=1,IF(LEFT(TRIM(O2),3)=\"Cor\",\"CO\",IF(LEFT(TRIM(O2),3)=\"Soy\",\"AR\",IF(LEFT(TRIM(O2),3)=\"Win\",\"AR\",IF(LEFT(TRIM(O2),3)=\"Spr\",\"ID\")))),IF(LEFT(TRIM(O2),3)=\"Cor\",\"Colorado\",IF(LEFT(TRIM(O2),3)=\"Soy\",\"Arkansa\",IF(LEFT(TRIM(O2),3)=\"Win\",\"Arkansa\",IF(LEFT(TRIM(O2),3)=\"Spr\",\"Idaho\")))))","v":"Arkansa"},{"$f":"CELL(\"address\",INDEX(A1:A38,MATCH(O1&\"*\",A1:A38,0),1))","v":"$A$11"},null,null,null,null,"AL","Alabama"]
[{"$f":"IFERROR(INDIRECT(O4),\"\")","v":"[These 18 States planted 96% of the 2017 soybean acreage]"},{"$f":"(IF(TRIM(A2)=\":\",\"\",IF(LEN(B1)=4,LEFT(B1,3)&RIGHT(B1,1)+1,LEFT(B1,3)&RIGHT(B1,3)+1)))","v":"$A$12"},{"$f":"INDIRECT(B2)","v":"Illinois .......:     14            23            44            11      "},{"$f":"TRIM(RIGHT(INDIRECT(B2),LEN(INDIRECT(B2))-FIND(\":\",INDIRECT(B2))))","v":"14 23 44 11"},{"$f":"IF($M$14=1,VLOOKUP(LEFT(C2,2),$U$1:$V$50,2,FALSE),IFERROR(LEFT(INDIRECT(B2),FIND(\".\",INDIRECT(B2))-2),\"\"))","v":"Illinois"},{"$f":"IFERROR(LEFT(D2,FIND(\" \",D2)),\"\")","v":"14 "},{"$f":"IFERROR(RIGHT(LEFT(D2,FIND(\"~\",SUBSTITUTE(D2,\" \",\"~\",2))),FIND(\"~\",SUBSTITUTE(D2,\" \",\"~\",2))-FIND(\"~\",SUBSTITUTE(D2,\" \",\"~\",1))),\"\")","v":"23 "},{"$f":"IFERROR(RIGHT(LEFT(D2,FIND(\"~\",SUBSTITUTE(D2,\" \",\"~\",3))),FIND(\"~\",SUBSTITUTE(D2,\" \",\"~\",3))-FIND(\"~\",SUBSTITUTE(D2,\" \",\"~\",2))),\"\")","v":"44 "},{"$f":"IFERROR(RIGHT(D2,LEN(D2)-FIND(\"~\",SUBSTITUTE(D2,\" \",\"~\",3))),\"\")","v":"11"},"Soybeans",{"$f":"IF(MainDisplay!B27=\"Corn\",\"Corn Emerged\",IF(MainDisplay!B27=\"Soybeans\",\"Soybeans Emerged\",IF(MainDisplay!B27=\"Spring Wheat\",\"Spring Wheat Emerged\",\"Winter Wheat Emerged\")))","v":"Soybeans Emerged"},null,{"$f":"IF($J$8=\"Corn\",\"        Corn:  Percent Emerged,\",IF($J$8=\"Soybeans\",\"      Soybeans:  Percent Emerged,\",IF($J$8=\"Spring Wheat\",\"    Spring Wheat:  Percent Emerged,\",IF($J$8=\"Winter Wheat\",\"    Winter Wheat:  Percent Emerged,\"))))","v":"      Soybeans:  Percent Emerged,"},null,{"$f":"IF(M14=0,MainDisplay!D27,Sheet3!M16)","v":"Soybeans Blooming"},null,null,null,null,null,"AK","Alaska"]
["------------------------------------------------------------------------",{"$f":"(IF(TRIM(A3)=\":\",\"\",IF(LEN(B2)=4,LEFT(B2,3)&RIGHT(B2,1)+1,LEFT(B2,3)&RIGHT(B2,3)+1)))","v":"$A$13"},"Indiana ........:     12             8            33            11      ","12 8 33 11","Indiana","12 ","8 ","33 ","11","Spring Wheat",{"$f":"IF(MainDisplay!B27=\"Corn\",\"Corn Silking\",IF(MainDisplay!B27=\"Soybeans\",\"Soybeans Blooming\",IF(MainDisplay!B27=\"Spring Wheat\",\"Spring Wheat Headed\",\"Winter Wheat Headed\")))","v":"Soybeans Blooming"},null,{"$f":"IF($J$8=\"Corn\",\"        Corn:  Percent Silking,\",IF($J$8=\"Soybeans\",\"     Soybeans:  Percent Blooming,\",IF($J$8=\"Spring Wheat\",\"     Spring Wheat:  Percent Headed,\",IF($J$8=\"Winter Wheat\",\"    Winter Wheat:  Percent Headed,\"))))","v":"     Soybeans:  Percent Blooming,"},null,{"$f":"CELL(\"address\",INDEX(Sheet2!A1:A1000,MATCH(O2&\"*\",Sheet2!A1:A1000,0),1))","v":"[CQGGlobexGrainsUSDAV3.xlsm]Sheet2!$A$76"},{"$f":"RIGHT(O3,$Q$3-$R$3)","v":"$A$76"},{"$f":"LEN(O3)","v":40},{"$f":"FIND(\"!\",O3)","v":35},null,null,"AZ","Arizona"]
["                :               Week ending               :             ",{"$f":"(IF(TRIM(B3)=\":\",\"\",LEFT(B3,3)&RIGHT(B3,3)+1))","v":"$A$14"},"Iowa ...........:     11             4            21            10      ","11 4 21 10","Iowa","11 ","4 ","21 ","10","Winter Wheat",{"$f":"IF(MainDisplay!B27=\"Corn\",\"Corn Dough\",IF(MainDisplay!B27=\"Soybeans\",\"Soybeans Setting Pods\",IF(MainDisplay!B27=\"Spring Wheat\",\"Spring Wheat Harvested\",\"Winter Wheat Harvested\")))","v":"Soybeans Setting Pods"},null,{"$f":"IF($J$8=\"Corn\",\"         Corn:  Percent Dough,\",IF($J$8=\"Soybeans\",\"   Soybeans:  Percent Setting Pods,\",IF($J$8=\"Spring Wheat\",\"   Spring Wheat:  Percent Harvested,\",IF($J$8=\"Winter Wheat\",\"   Winter Wheat:  Percent Harvested,\"))))","v":"   Soybeans:  Percent Setting Pods,"},null,{"$f":"LEFT($O$3,$R$3)&P4","v":"[CQGGlobexGrainsUSDAV3.xlsm]Sheet2!$A$77"},{"$f":"LEFT(P3,FIND(\"~\",SUBSTITUTE(P3,\"$\",\"~\",2)))&RIGHT(P3,3)+1","v":"$A$77"},null,null,null,null,"AR","Arkansas"]
[{"$f":"IFERROR(INDIRECT(O7),\"\")","v":"                :-----------------------------------------:             "},"$A$15","Kansas .........:     11             7            20             6      ","11 7 20 6","Kansas","11 ","7 ","20 ","6",null,{"$f":"IF(MainDisplay!B27=\"Corn\",\"Corn Dented\",IF(MainDisplay!B27=\"Soybeans\",\"Soybeans Dropping Leaves\",IF(MainDisplay!B27=\"Spring Wheat\",\"\",\"\")))","v":"Soybeans Dropping Leaves"},null,{"$f":"IF($J$8=\"Corn\",\"        Corn:  Percent Dented,\",IF($J$8=\"Soybeans\",\"  Soybeans:  Percent Dropping Leaves, \",IF($J$8=\"Spring Wheat\",\"\",IF($J$8=\"Winter Wheat\",\"\"))))","v":"  Soybeans:  Percent Dropping Leaves, "},null,{"$f":"LEFT($O$3,$R$3)&P5","v":"[CQGGlobexGrainsUSDAV3.xlsm]Sheet2!$A$78"},{"$f":"LEFT(P4,FIND(\"~\",SUBSTITUTE(P4,\"$\",\"~\",2)))&RIGHT(P4,3)+1","v":"$A$78"},null,null,null,null,"CA","California"]
["      State     :   July 1,   :  June 24,   :   July 1,   :  2013-2017  ","$A$16","Kentucky .......:     11             3            12             6      ","11 3 12 6","Kentucky","11 ","3 ","12 ","6",null,{"$f":"IF(MainDisplay!B27=\"Corn\",\"Corn Mature\",IF(MainDisplay!B27=\"Soybeans\",\"Soybeans Harvested\",IF(MainDisplay!B27=\"Spring Wheat\",\"\",\"\")))","v":"Soybeans Harvested"},null,{"$f":"IF($J$8=\"Corn\",\"        Corn:  Percent Mature,\",IF($J$8=\"Soybeans\",\"     Soybeans:  Percent Harvested,\",IF($J$8=\"Spring Wheat\",\"\",IF($J$8=\"Winter Wheat\",\"\"))))","v":"     Soybeans:  Percent Harvested,"},null,"[CQGGlobexGrainsUSDAV3.xlsm]Sheet2!$A$79","$A$79",null,null,null,null,"CO","Colorado"]
["                :    2017     :    2018     :    2018     :   Average   ","$A$17","Louisiana ......:     82            73            82            67      ","82 73 82 67",{"$f":"IF(D7=\"\",\"\",IF($M$14=1,VLOOKUP(LEFT(C7,2),$U$1:$V$50,2,FALSE),IFERROR(LEFT(INDIRECT(B7),FIND(\".\",INDIRECT(B7))-2),\"\")))","v":"Louisiana"},{"$f":"IFERROR(LEFT(D7,FIND(\" \",D7)),\"\")","v":"82 "},{"$f":"IFERROR(RIGHT(LEFT(D7,FIND(\"~\",SUBSTITUTE(D7,\" \",\"~\",2))),FIND(\"~\",SUBSTITUTE(D7,\" \",\"~\",2))-FIND(\"~\",SUBSTITUTE(D7,\" \",\"~\",1))),\"\")","v":"73 "},{"$f":"IFERROR(RIGHT(LEFT(D7,FIND(\"~\",SUBSTITUTE(D7,\" \",\"~\",3))),FIND(\"~\",SUBSTITUTE(D7,\" \",\"~\",3))-FIND(\"~\",SUBSTITUTE(D7,\" \",\"~\",2))),\"\")","v":"82 "},{"$f":"IFERROR(RIGHT(D7,LEN(D7)-FIND(\"~\",SUBSTITUTE(D7,\" \",\"~\",3))),\"\")","v":"67"},null,{"$f":"IF(MainDisplay!B27=\"Corn\",\"Corn Harvested\",IF(MainDisplay!B27=\"Soybean\",\"\",IF(MainDisplay!B27=\"Spring Wheat\",\"\",\"\")))","v":""},null,{"$f":"IF($J$8=\"Corn\",\"       Corn:  Percent Harvested,\",IF($J$8=\"Soybeans\",\"\",IF($J$8=\"Spring Wheat\",\"\",IF($J$8=\"Winter Wheat\",\"\"))))","v":""},null,"[CQGGlobexGrainsUSDAV3.xlsm]Sheet2!$A$80","$A$80",null,null,null,null,"CT","Connecticut"]
["------------------------------------------------------------------------","$A$18","Michigan .......:     11             1            11             7      ","11 1 11 7",{"$f":"IF(E7=\"\",\"\",IF($M$14=1,VLOOKUP(LEFT(C8,2),$U$1:$V$50,2,FALSE),IFERROR(LEFT(INDIRECT(B8),FIND(\".\",INDIRECT(B8))-2),\"\")))","v":"Michigan"},{"$f":"IF(F7=\"\",\"\",IFERROR(LEFT(D8,FIND(\" \",D8)),\"\"))","v":"11 "},{"$f":"IF(G7=\"\",\"\",IFERROR(RIGHT(LEFT(D8,FIND(\"~\",SUBSTITUTE(D8,\" \",\"~\",2))),FIND(\"~\",SUBSTITUTE(D8,\" \",\"~\",2))-FIND(\"~\",SUBSTITUTE(D8,\" \",\"~\",1))),\"\"))","v":"1 "},{"$f":"IF(H7=\"\",\"\",IFERROR(RIGHT(LEFT(D8,FIND(\"~\",SUBSTITUTE(D8,\" \",\"~\",3))),FIND(\"~\",SUBSTITUTE(D8,\" \",\"~\",3))-FIND(\"~\",SUBSTITUTE(D8,\" \",\"~\",2))),\"\"))","v":"11 "},{"$f":"IF(I7=\"\",\"\",IFERROR(RIGHT(D8,LEN(D8)-FIND(\"~\",SUBSTITUTE(D8,\" \",\"~\",3))),\"\"))","v":"7"},{"$f":"MainDisplay!B27","v":"Soybeans"},null,null,null,null,"[CQGGlobexGrainsUSDAV3.xlsm]Sheet2!$A$81","$A$81",null,null,null,null,"DE","Delaware"]
["                :                        percent                        ","$A$19","Minnesota ......:      8             2            13             9      ","8 2 13 9",{"$f":"IF(E8=\"\",\"\",IF($M$14=1,VLOOKUP(LEFT(C9,2),$U$1:$V$50,2,FALSE),IFERROR(LEFT(INDIRECT(B9),FIND(\".\",INDIRECT(B9))-2),\"\")))","v":"Minnesota"},{"$f":"IF(F8=\"\",\"\",IFERROR(LEFT(D9,FIND(\" \",D9)),\"\"))","v":"8 "},{"$f":"IF(G8=\"\",\"\",IFERROR(RIGHT(LEFT(D9,FIND(\"~\",SUBSTITUTE(D9,\" \",\"~\",2))),FIND(\"~\",SUBSTITUTE(D9,\" \",\"~\",2))-FIND(\"~\",SUBSTITUTE(D9,\" \",\"~\",1))),\"\"))","v":"2 "},{"$f":"IF(H8=\"\",\"\",IFERROR(RIGHT(LEFT(D9,FIND(\"~\",SUBSTITUTE(D9,\" \",\"~\",3))),FIND(\"~\",SUBSTITUTE(D9,\" \",\"~\",3))-FIND(\"~\",SUBSTITUTE(D9,\" \",\"~\",2))),\"\"))","v":"13 "},{"$f":"IF(I8=\"\",\"\",IFERROR(RIGHT(D9,LEN(D9)-FIND(\"~\",SUBSTITUTE(D9,\" \",\"~\",3))),\"\"))","v":"9"},null,null,null,null,null,"[CQGGlobexGrainsUSDAV3.xlsm]Sheet2!$A$82","$A$82",null,null,null,null,"FL","Florida"]
["                :                                                       ","$A$20","Mississippi ....:     71            54            69            48      ","71 54 69 48","Mississippi","71 ","54 ","69 ","48",null,null,null,null,null,"[CQGGlobexGrainsUSDAV3.xlsm]Sheet2!$A$83","$A$83",null,null,null,null,"GA","Georgia"]
["Arkansas .......:     68            57            69            46      ","$A$21","Missouri .......:     11             4            27             7      ","11 4 27 7","Missouri","11 ","4 ","27 ","7",null,null,null,{"$f":"DATE(MainDisplay!M27,MainDisplay!K27,MainDisplay!L27)","v":"2018-07-02"},null,"[CQGGlobexGrainsUSDAV3.xlsm]Sheet2!$A$84","$A$84",null,null,null,null,"HI","Hawaii"]
["Illinois .......:     14            23            44            11      ","$A$22","Nebraska .......:     25            14            35            17      ","25 14 35 17","Nebraska","25 ","14 ","35 ","17",null,null,null,40336,null,"[CQGGlobexGrainsUSDAV3.xlsm]Sheet2!$A$85","$A$85",null,null,null,null,"ID","Idaho"]
["Indiana ........:     12             8            33            11      ","$A$23","North Carolina .:     11             5            14             8      ","11 5 14 8","North Carolina","11 ","5 ","14 ","8",null,null,null,null,null,"[CQGGlobexGrainsUSDAV3.xlsm]Sheet2!$A$86","$A$86",null,null,null,null,"IL","Illinois"]
["Iowa ...........:     11             4            21            10      ","$A$24","North Dakota ...:      7             1            11            12      ","7 1 11 12","North Dakota","7 ","1 ","11 ","12",null,null,null,{"$f":"IF(M11<M12,1,)","v":0},null,"[CQGGlobexGrainsUSDAV3.xlsm]Sheet2!$A$87","$A$87",null,null,null,null,"IN","Indiana"]
["Kansas .........:     11             7            20             6      ","$A$25","Ohio ...........:      8             6            22             6      ","8 6 22 6","Ohio","8 ","6 ","22 ","6",null,null,null,{"$f":"MainDisplay!D27","v":"Soybeans Blooming"},null,"[CQGGlobexGrainsUSDAV3.xlsm]Sheet2!$A$88","$A$88",null,null,null,null,"IA","Iowa"]
["Kentucky .......:     11             3            12             6      ","$A$26","South Dakota ...:     14             2             7            13      ","14 2 7 13","South Dakota","14 ","2 ","7 ","13",null,null,null,{"$f":"VLOOKUP(M15,K1:M7,3,FALSE)","v":"     Soybeans:  Percent Blooming,"},null,"[CQGGlobexGrainsUSDAV3.xlsm]Sheet2!$A$89","$A$89",null,null,null,null,"KS","Kansas"]
["Louisiana ......:     82            73            82            67      ","$A$27","Tennessee ......:     18            13            24            10      ","18 13 24 10","Tennessee","18 ","13 ","24 ","10",null,null,null,"   Corn:  Crop Condition by Percent,",null,"[CQGGlobexGrainsUSDAV3.xlsm]Sheet2!$A$90","$A$90",null,"       Soybeans:  Crop Condition",null,null,"KY","Kentucky"]
["Michigan .......:     11             1            11             7      ","$A$28","Wisconsin ......:      9             -            13             7      ","9 - 13 7","Wisconsin","9 ","- ","13 ","7",null,null,null,"       Soybeans:  Crop Condition",null,"[CQGGlobexGrainsUSDAV3.xlsm]Sheet2!$A$91","$A$91",null," Soybeans:  Crop Condition by Percent,",null,null,"LA","Louisiana"]
["Minnesota ......:      8             2            13             9      ","$A$29","                :                                                       ","",{"$f":"IF(E18=\"\",\"\",IFERROR(LEFT(INDIRECT(B19),FIND(\".\",INDIRECT(B19))-2),\"\"))","v":""},{"$f":"IFERROR(LEFT(D19,FIND(\" \",D19)),\"\")","v":""},{"$f":"IFERROR(RIGHT(LEFT(D19,FIND(\"~\",SUBSTITUTE(D19,\" \",\"~\",2))),FIND(\"~\",SUBSTITUTE(D19,\" \",\"~\",2))-FIND(\"~\",SUBSTITUTE(D19,\" \",\"~\",1))),\"\")","v":""},{"$f":"IFERROR(RIGHT(LEFT(D19,FIND(\"~\",SUBSTITUTE(D19,\" \",\"~\",3))),FIND(\"~\",SUBSTITUTE(D19,\" \",\"~\",3))-FIND(\"~\",SUBSTITUTE(D19,\" \",\"~\",2))),\"\")","v":""},{"$f":"IFERROR(RIGHT(D19,LEN(D19)-FIND(\"~\",SUBSTITUTE(D19,\" \",\"~\",3))),\"\")","v":""},null,null,null,null,null,"[CQGGlobexGrainsUSDAV3.xlsm]Sheet2!$A$92","$A$92",null,{"$f":"IF(R9=1,IF($J$8=\"Corn\",R12,IF($J$8=\"Soybeans\",R13)),IF($J$8=\"Soybeans\",\"Soybean Condition\",MainDisplay!$B$27&\" Condition\"))","v":"Soybean Condition"},null,null,"ME","Maine"]
["Mississippi ....:     71            54            69            48      ","$A$30","18 States ......:     17            12            27            13      ",{"$f":"TRIM(RIGHT(INDIRECT(B20),43))","v":"12 27 13"},"",{"$f":"IF(E19=\"\",\"\",IFERROR(LEFT(D20,FIND(\" \",D20)),\"\"))","v":""},{"$f":"IF(E19=\"\",\"\",IFERROR(RIGHT(LEFT(D20,FIND(\"~\",SUBSTITUTE(D20,\" \",\"~\",2))),FIND(\"~\",SUBSTITUTE(D20,\" \",\"~\",2))-FIND(\"~\",SUBSTITUTE(D20,\" \",\"~\",1))),\"\"))","v":""},{"$f":"IF(E19=\"\",\"\",IFERROR(RIGHT(LEFT(D20,FIND(\"~\",SUBSTITUTE(D20,\" \",\"~\",3))),FIND(\"~\",SUBSTITUTE(D20,\" \",\"~\",3))-FIND(\"~\",SUBSTITUTE(D20,\" \",\"~\",2))),\"\"))","v":""},{"$f":"IF(E19=\"\",\"\",IFERROR(RIGHT(D20,LEN(D20)-FIND(\"~\",SUBSTITUTE(D20,\" \",\"~\",3))),\"\"))","v":""},null,null,null,{"$f":"IF($J$8=\"Corn\",\"Corn Condition\",IF($J$8=\"Soybeans\",\"Soybean Condition\",IF($J$8=\"Spring Wheat\",\"Spring Wheat Condition\",IF($J$8=\"Winter Wheat\",\"Winter Wheat Condition\"))))","v":"Soybean Condition"},null,"[CQGGlobexGrainsUSDAV3.xlsm]Sheet2!$A$93","$A$93",null,"     Spring Wheat:  Crop Condition",null,null,"MD","Maryland"]
["Missouri .......:     11             4            27             7      ","$A$31","------------------------------------------------------------------------","-------------------------------------------","","","","","",null,null,null,{"$f":"IF($J$8=\"Corn\",\"         Corn:  Crop Condition\",IF($J$8=\"Soybeans\",\"       Soybeans:  Crop Condition\",IF($J$8=\"Spring Wheat\",\"     Spring Wheat:  Crop Condition\",IF($J$8=\"Winter Wheat\",\"     Winter Wheat:  Crop Condition\"))))","v":"       Soybeans:  Crop Condition"},null,"[CQGGlobexGrainsUSDAV3.xlsm]Sheet2!$A$94","$A$94",null,"         Corn:  Crop Condition",null,null,"MA","Massachusetts"]
["Nebraska .......:     25            14            35            17      ","$A$32","","","","","","","",null,null,null,null,null,"[CQGGlobexGrainsUSDAV3.xlsm]Sheet2!$A$95","$A$95",null,null,null,null,"MI","Michigan"]
["North Carolina .:     11             5            14             8      ","$A$33",0,{"$f":"RIGHT(INDIRECT(B23),43)","v":"0"},"","","","","",null,null,null,{"$f":"IF($J$8=\"Corn\",\"   Corn:  Crop Condition by Percent,\",IF($J$8=\"Soybeans\",\" Soybeans:  Crop Condition by Percent,\",IF($J$8=\"Spring Wheat\",\"     Spring Wheat:  Crop Condition\",IF($J$8=\"Winter Wheat\",\"     Winter Wheat:  Crop Condition\"))))","v":" Soybeans:  Crop Condition by Percent,"},null,"[CQGGlobexGrainsUSDAV3.xlsm]Sheet2!$A$96","$A$96",null,null,null,null,"MN","Minnesota"]
["North Dakota ...:      7             1            11            12      ","$A$34","Soybean Condition - Selected States: Week Ending July 1, 2018","- Selected States: Week Ending July 1, 2018","","","","","",null,null,null,{"$f":"IF(M14=0,M20,M21)","v":"Soybean Condition"},null,"[CQGGlobexGrainsUSDAV3.xlsm]Sheet2!$A$97","$A$97",null,null,null,null,"MS","Mississippi"]
["Ohio ...........:      8             6            22             6      ","$A$35","[These 18 States planted 96% of the 2017 soybean acreage]","es planted 96% of the 2017 soybean acreage]","","","","","",null,null,null,{"$f":"IFERROR(CELL(\"address\",INDEX(Sheet2!A1:A1000,MATCH(M24&\"*\",Sheet2!A1:A1000,0),1)),\"2\")","v":"[CQGGlobexGrainsUSDAV3.xlsm]Sheet2!$A$109"},null,"[CQGGlobexGrainsUSDAV3.xlsm]Sheet2!$A$98","$A$98",null,null,null,null,"MO","Missouri"]
["South Dakota ...:     14             2             7            13      ","$A$36","","",{"$f":"IFERROR(LEFT(INDIRECT(B26),FIND(\".\",INDIRECT(B26))-2),\"\")","v":""},"","","","",null,null,null,null,null,"[CQGGlobexGrainsUSDAV3.xlsm]Sheet2!$A$99","$A$99",null,null,null,null,"MT","Montana"]
["Tennessee ......:     18            13            24            10      ","$A$37","","",null,"","","","",null,null,null,null,null,"[CQGGlobexGrainsUSDAV3.xlsm]Sheet2!$A$100","$A$100",null,null,null,null,"NE","Nebraska"]
["Wisconsin ......:      9             -            13             7      ","$A$38",0,"",null,"",null,"","",null,null,null,null,null,"[CQGGlobexGrainsUSDAV3.xlsm]Sheet2!$A$101","$A$101",null,null,null,null,"NV","Nevada"]
["                :                                                       ","$A$39","Soybean Condition - Selected States: Week Ending July 1, 2018","- Selected States: Week Ending July 1, 2018",null,"- ","Selected ","States: ","Week Ending July 1, 2018",null,null,null,null,null,"[CQGGlobexGrainsUSDAV3.xlsm]Sheet2!$A$102","$A$102",null,null,null,null,"NH","New Hampshire"]
["18 States ......:     17            12            27            13      ","$A$40","[These 18 States planted 96% of the 2017 soybean acreage]","es planted 96% of the 2017 soybean acreage]",null,"es ","planted ","96% ","of the 2017 soybean acreage]",null,null,null,null,null,"[CQGGlobexGrainsUSDAV3.xlsm]Sheet2!$A$103","$A$103",null,null,null,null,"NJ","New Jersey"]
["------------------------------------------------------------------------",null,null,null,null,null,null,null,null,null,null,null,null,null,"[CQGGlobexGrainsUSDAV3.xlsm]Sheet2!$A$104","$A$104",null,null,null,null,"NM","New Mexico"]
["",null,null,null,{"$f":"FIND(\"~\",SUBSTITUTE(D34,\",\",\"~\",1))-FIND(\"~\",SUBSTITUTE(D34,\":\",\"~\",1))","v":8},null,{"$f":"RIGHT(LEFT(D34,FIND(\"~\",SUBSTITUTE(D34,\",\",\"~\",1))-1),FIND(\"~\",SUBSTITUTE(D34,\",\",\"~\",1))-FIND(\"~\",SUBSTITUTE(D34,\":\",\"~\",1))-1)","v":" July 1"},null,null,null,null,null,null,null,"[CQGGlobexGrainsUSDAV3.xlsm]Sheet2!$A$105","$A$105",null,null,null,null,"NY","New York"]
[0,null,null,null,null,null,null,null,{"$f":"RIGHT(A5,6)","v":"      "},null,null,null,null,null,"[CQGGlobexGrainsUSDAV3.xlsm]Sheet2!$A$106","$A$106",null,null,null,null,"NC","North Carolina"]
["Soybean Condition - Selected States: Week Ending July 1, 2018",null,null,{"$f":"TRIM(A6)","v":"State : July 1, : June 24, : July 1, : 2013-2017"},null,null,null,null,null,null,null,null,null,null,"[CQGGlobexGrainsUSDAV3.xlsm]Sheet2!$A$107","$A$107",null,null,null,null,"ND","North Dakota"]
[{"$f":"IFERROR(INDIRECT(O37),\"\")","v":"[These 18 States planted 96% of the 2017 soybean acreage]"},null,{"$f":"TRIM(C19)","v":":"},null,null,{"$f":"RIGHT(LEFT(D34,FIND(\"~\",SUBSTITUTE(D34,\",\",\"~\",1))-1),FIND(\"~\",SUBSTITUTE(D34,\",\",\"~\",1))-FIND(\"~\",SUBSTITUTE(D34,\":\",\"~\",1))-1)","v":" July 1"},{"$f":"RIGHT(LEFT(D34,FIND(\"~\",SUBSTITUTE(D34,\",\",\"~\",2))-1),FIND(\"~\",SUBSTITUTE(D34,\",\",\"~\",1))-FIND(\"~\",SUBSTITUTE(D34,\":\",\"~\",1))-1)","v":"June 24"},{"$f":"RIGHT(LEFT(D34,FIND(\"~\",SUBSTITUTE(D34,\",\",\"~\",3))-1),FIND(\"~\",SUBSTITUTE(D34,\",\",\"~\",1))-FIND(\"~\",SUBSTITUTE(D34,\":\",\"~\",1))-1)","v":" July 1"},{"$f":"IF(M14=1,RIGHT(A5,6)&RIGHT(D34,4),(LEFT(TRIM(RIGHT(D34,LEN(D34)-FIND(\"~\",SUBSTITUTE(D34,\":\",\"~\",4)))),4)&\" - \"&RIGHT(D34,4)))","v":"2013 - 2017"},null,null,null,null,null,"[CQGGlobexGrainsUSDAV3.xlsm]Sheet2!$A$108","$A$108",null,null,null,null,"OH","Ohio"]
["",null,null,null,null,{"$f":"RIGHT(LEFT(D37,6),4)","v":"2017"},{"$f":"RIGHT(LEFT(D37,13),4)","v":"2018"},{"$f":"RIGHT(LEFT(D37,20),4)","v":"2018"},"Average",null,null,null,null,null,"[CQGGlobexGrainsUSDAV3.xlsm]Sheet2!$A$109","$A$109",null,null,null,null,"OK","Oklahoma"]
["",null,null,{"$f":"TRIM(A7)","v":": 2017 : 2018 : 2018 : Average"},null,null,null,null,null,null,null,null,null,null,"[CQGGlobexGrainsUSDAV3.xlsm]Sheet2!$A$110","$A$110",null,null,null,null,"OR","Oregon"]
[null,null,null,null,null,"Very Poor"," Poor ","Fair","Good","Excellent",null,null,null,null,null,null,null,null,null,null,"PA","Pennsylvania"]
[{"$f":"IFERROR(INDIRECT(O41),\"\")","v":"Soybean Condition - Selected States: Week Ending July 1, 2018"},{"$f":"P39","v":"$A$46"},{"$f":"INDIRECT(B39)","v":"Arkansas .......:     2           8          27          46          17     "},{"$f":"TRIM(RIGHT(C39,LEN(C39)-FIND(\"~\",SUBSTITUTE(C39,\":\",\"~\",1))))","v":"2 8 27 46 17"},{"$f":"IF($M$14=1,VLOOKUP(LEFT(C39,2),$U$1:$V$50,2,FALSE),IFERROR(LEFT(INDIRECT(B39),FIND(\".\",INDIRECT(B39))-2),\"\"))","v":"Arkansas"},{"$f":"IFERROR(LEFT(D39,FIND(\" \",D39)),\"\")","v":"2 "},{"$f":"IFERROR(RIGHT(LEFT(D39,FIND(\"~\",SUBSTITUTE(D39,\" \",\"~\",2))),FIND(\"~\",SUBSTITUTE(D39,\" \",\"~\",2))-FIND(\"~\",SUBSTITUTE(D39,\" \",\"~\",1))),\"\")","v":"8 "},{"$f":"IFERROR(RIGHT(LEFT(D39,FIND(\"~\",SUBSTITUTE(D39,\" \",\"~\",3))),FIND(\"~\",SUBSTITUTE(D39,\" \",\"~\",3))-FIND(\"~\",SUBSTITUTE(D39,\" \",\"~\",2))),\"\")","v":"27 "},{"$f":"IFERROR(RIGHT(LEFT(D39,FIND(\"~\",SUBSTITUTE(D39,\" \",\"~\",4))),FIND(\"~\",SUBSTITUTE(D39,\" \",\"~\",4))-FIND(\"~\",SUBSTITUTE(D39,\" \",\"~\",3))),\"\")","v":"46 "},{"$f":"IFERROR(RIGHT(D39,LEN(D39)-FIND(\"~\",SUBSTITUTE(D39,\" \",\"~\",4))),\"\")","v":"17"},null,null,null,null,{"$f":"IF($M$14=1,IF(LEFT(TRIM(O40),3)=\"Cor\",\"CO\",IF(LEFT(TRIM(O40),3)=\"Soy\",\"AR\",IF(LEFT(TRIM(O40),3)=\"Win\",\"AR\",IF(LEFT(TRIM(O40),3)=\"Spr\",\"ID\")))),IF(LEFT(TRIM(O40),3)=\"Cor\",\"Colorado\",IF(LEFT(TRIM(O40),3)=\"Soy\",\"Arkansa\",IF(LEFT(TRIM(O40),3)=\"Win\",\"Arkansa\",IF(LEFT(TRIM(O40),3)=\"Spr\",\"Idaho\")))))","v":"Arkansa"},{"$f":"CELL(\"address\",INDEX(A39:A69,MATCH(O39&\"*\",A39:A69,0),1))","v":"$A$46"},null,null,null,null,"RI","Rhode Island"]
[{"$f":"IFERROR(INDIRECT(O42),\"\")","v":"[These 18 States planted 96% of the 2017 soybean acreage]"},{"$f":"(IF(TRIM(A40)=\":\",\"\",IF(LEN(B39)=4,LEFT(B39,3)&RIGHT(B39,1)+1,LEFT(B39,3)&RIGHT(B39,3)+1)))","v":"$A$47"},{"$f":"INDIRECT(B40)","v":"Illinois .......:     2           3          17          53          25     "},{"$f":"TRIM(RIGHT(C40,LEN(C40)-FIND(\"~\",SUBSTITUTE(C40,\":\",\"~\",1))))","v":"2 3 17 53 25"},{"$f":"IF($M$14=1,VLOOKUP(LEFT(C40,2),$U$1:$V$50,2,FALSE),IFERROR(LEFT(INDIRECT(B40),FIND(\".\",INDIRECT(B40))-2),\"\"))","v":"Illinois"},{"$f":"IFERROR(LEFT(D40,FIND(\" \",D40)),\"\")","v":"2 "},{"$f":"IFERROR(RIGHT(LEFT(D40,FIND(\"~\",SUBSTITUTE(D40,\" \",\"~\",2))),FIND(\"~\",SUBSTITUTE(D40,\" \",\"~\",2))-FIND(\"~\",SUBSTITUTE(D40,\" \",\"~\",1))),\"\")","v":"3 "},{"$f":"IFERROR(RIGHT(LEFT(D40,FIND(\"~\",SUBSTITUTE(D40,\" \",\"~\",3))),FIND(\"~\",SUBSTITUTE(D40,\" \",\"~\",3))-FIND(\"~\",SUBSTITUTE(D40,\" \",\"~\",2))),\"\")","v":"17 "},{"$f":"IFERROR(RIGHT(LEFT(D40,FIND(\"~\",SUBSTITUTE(D40,\" \",\"~\",4))),FIND(\"~\",SUBSTITUTE(D40,\" \",\"~\",4))-FIND(\"~\",SUBSTITUTE(D40,\" \",\"~\",3))),\"\")","v":"53 "},{"$f":"IFERROR(RIGHT(D40,LEN(D40)-FIND(\"~\",SUBSTITUTE(D40,\" \",\"~\",4))),\"\")","v":"25"},null,null,null,null,{"$f":"IF(M14=0,M20,IF(M25=\"2\",M23,M21))","v":"Soybean Condition"},null,null,null,null,null,"SC","South Carolina"]
["----------------------------------------------------------------------------",{"$f":"(IF(TRIM(A41)=\":\",\"\",IF(LEN(B40)=4,LEFT(B40,3)&RIGHT(B40,1)+1,LEFT(B40,3)&RIGHT(B40,3)+1)))","v":"$A$48"},"Indiana ........:     2           5          21          55          17     ","2 5 21 55 17","Indiana","2 ","5 ","21 ","55 ","17",null,null,null,null,{"$f":"CELL(\"address\",INDEX(Sheet2!A1:A1000,MATCH(O40&\"*\",Sheet2!A1:A1000,0),1))","v":"[CQGGlobexGrainsUSDAV3.xlsm]Sheet2!$A$109"},{"$f":"RIGHT(O41,$Q$41-$R$41)","v":"$A$109"},{"$f":"LEN(O41)","v":41},{"$f":"FIND(\"!\",O41)","v":35},null,null,"SD","South Dakota"]
["      State     : Very poor :   Poor    :   Fair    :   Good    : Excellent ",{"$f":"(IF(TRIM(B41)=\":\",\"\",LEFT(B41,3)&RIGHT(B41,3)+1))","v":"$A$49"},"Iowa ...........:     2           4          18          55          21     ","2 4 18 55 21","Iowa","2 ","4 ","18 ","55 ","21",null,null,null,null,{"$f":"LEFT($O$41,$R$41)&P42","v":"[CQGGlobexGrainsUSDAV3.xlsm]Sheet2!$A$110"},{"$f":"LEFT(P41,FIND(\"~\",SUBSTITUTE(P41,\"$\",\"~\",2)))&RIGHT(P41,3)+1","v":"$A$110"},null,null,null,null,"TN","Tennessee"]
["----------------------------------------------------------------------------","$A$50","Kansas .........:     1           8          37          49           5     ","1 8 37 49 5","Kansas","1 ","8 ","37 ","49 ","5",null,null,null,null,{"$f":"LEFT($O$41,$R$41)&P43","v":"[CQGGlobexGrainsUSDAV3.xlsm]Sheet2!$A$111"},{"$f":"LEFT(P42,FIND(\"~\",SUBSTITUTE(P42,\"$\",\"~\",2)))&RIGHT(P42,3)+1","v":"$A$111"},null,null,null,null,"TX","Texas"]
["                :                          percent                          ","$A$51","Kentucky .......:     -           2          12          69          17     ","- 2 12 69 17","Kentucky","- ","2 ","12 ","69 ","17",null,null,null,null,"[CQGGlobexGrainsUSDAV3.xlsm]Sheet2!$A$112","$A$112",null,null,null,null,"UT","Utah"]
["                :                                                           ","$A$52","Louisiana ......:     5          11          36          37          11     ","5 11 36 37 11","Louisiana","5 ","11 ","36 ","37 ","11",null,null,null,null,"[CQGGlobexGrainsUSDAV3.xlsm]Sheet2!$A$113","$A$113",null,null,null,null,"VT","Vermont"]
["Arkansas .......:     2           8          27          46          17     ","$A$53","Michigan .......:     2           4          22          59          13     ","2 4 22 59 13","Michigan",{"$f":"IF(F45=\"\",\"\",IFERROR(LEFT(D46,FIND(\" \",D46)),\"\"))","v":"2 "},{"$f":"IF(G45=\"\",\"\",IFERROR(RIGHT(LEFT(D46,FIND(\"~\",SUBSTITUTE(D46,\" \",\"~\",2))),FIND(\"~\",SUBSTITUTE(D46,\" \",\"~\",2))-FIND(\"~\",SUBSTITUTE(D46,\" \",\"~\",1))),\"\"))","v":"4 "},{"$f":"IF(H45=\"\",\"\",IFERROR(RIGHT(LEFT(D46,FIND(\"~\",SUBSTITUTE(D46,\" \",\"~\",3))),FIND(\"~\",SUBSTITUTE(D46,\" \",\"~\",3))-FIND(\"~\",SUBSTITUTE(D46,\" \",\"~\",2))),\"\"))","v":"22 "},{"$f":"IF(I45=\"\",\"\",IFERROR(RIGHT(LEFT(D46,FIND(\"~\",SUBSTITUTE(D46,\" \",\"~\",4))),FIND(\"~\",SUBSTITUTE(D46,\" \",\"~\",4))-FIND(\"~\",SUBSTITUTE(D46,\" \",\"~\",3))),\"\"))","v":"59 "},{"$f":"IF(J45=\"\",\"\",IFERROR(RIGHT(D46,LEN(D46)-FIND(\"~\",SUBSTITUTE(D46,\" \",\"~\",4))),\"\"))","v":"13"},null,null,null,null,"[CQGGlobexGrainsUSDAV3.xlsm]Sheet2!$A$114","$A$114",null,null,null,null,"VA","Virginia"]
["Illinois .......:     2           3          17          53          25     ","$A$54","Minnesota ......:     -           3          20          57          20     ","- 3 20 57 20","Minnesota",{"$f":"IF(F46=\"\",\"\",IFERROR(LEFT(D47,FIND(\" \",D47)),\"\"))","v":"- "},{"$f":"IF(G46=\"\",\"\",IFERROR(RIGHT(LEFT(D47,FIND(\"~\",SUBSTITUTE(D47,\" \",\"~\",2))),FIND(\"~\",SUBSTITUTE(D47,\" \",\"~\",2))-FIND(\"~\",SUBSTITUTE(D47,\" \",\"~\",1))),\"\"))","v":"3 "},{"$f":"IF(H46=\"\",\"\",IFERROR(RIGHT(LEFT(D47,FIND(\"~\",SUBSTITUTE(D47,\" \",\"~\",3))),FIND(\"~\",SUBSTITUTE(D47,\" \",\"~\",3))-FIND(\"~\",SUBSTITUTE(D47,\" \",\"~\",2))),\"\"))","v":"20 "},{"$f":"IF(I46=\"\",\"\",IFERROR(RIGHT(LEFT(D47,FIND(\"~\",SUBSTITUTE(D47,\" \",\"~\",4))),FIND(\"~\",SUBSTITUTE(D47,\" \",\"~\",4))-FIND(\"~\",SUBSTITUTE(D47,\" \",\"~\",3))),\"\"))","v":"57 "},{"$f":"IF(J46=\"\",\"\",IFERROR(RIGHT(D47,LEN(D47)-FIND(\"~\",SUBSTITUTE(D47,\" \",\"~\",4))),\"\"))","v":"20"},null,null,null,null,"[CQGGlobexGrainsUSDAV3.xlsm]Sheet2!$A$115","$A$115",null,null,null,null,"WA","Washington"]
["Indiana ........:     2           5          21          55          17     ","$A$55","Mississippi ....:     -           2          30          54          14     ","- 2 30 54 14","Mississippi","- ","2 ","30 ","54 ","14",null,null,null,null,"[CQGGlobexGrainsUSDAV3.xlsm]Sheet2!$A$116","$A$116",null,null,null,null,"WV","West Virginia"]
["Iowa ...........:     2           4          18          55          21     ","$A$56","Missouri .......:     3          12          37          43           5     ","3 12 37 43 5","Missouri","3 ","12 ","37 ","43 ","5",null,null,null,null,"[CQGGlobexGrainsUSDAV3.xlsm]Sheet2!$A$117","$A$117",null,null,null,null,"WI","Wisconsin"]
["Kansas .........:     1           8          37          49           5     ","$A$57","Nebraska .......:     1           2          11          70          16     ","1 2 11 70 16","Nebraska","1 ","2 ","11 ","70 ","16",null,null,null,null,"[CQGGlobexGrainsUSDAV3.xlsm]Sheet2!$A$118","$A$118",null,null,null,null,"WY","Wyoming"]
["Kentucky .......:     -           2          12          69          17     ","$A$58","North Carolina .:     -           7          38          50           5     ","- 7 38 50 5","North Carolina","- ","7 ","38 ","50 ","5",null,null,null,null,"[CQGGlobexGrainsUSDAV3.xlsm]Sheet2!$A$119","$A$119"]
["Louisiana ......:     5          11          36          37          11     ","$A$59","North Dakota ...:     -           3          20          68           9     ","- 3 20 68 9","North Dakota","- ","3 ","20 ","68 ","9",null,null,null,null,"[CQGGlobexGrainsUSDAV3.xlsm]Sheet2!$A$120","$A$120"]
["Michigan .......:     2           4          22          59          13     ","$A$60","Ohio ...........:     -           4          20          57          19     ","- 4 20 57 19","Ohio","- ","4 ","20 ","57 ","19",null,null,null,null,"[CQGGlobexGrainsUSDAV3.xlsm]Sheet2!$A$121","$A$121"]
["Minnesota ......:     -           3          20          57          20     ","$A$61","South Dakota ...:     3           6          32          51           8     ","3 6 32 51 8","South Dakota","3 ","6 ","32 ","51 ","8",null,null,null,null,"[CQGGlobexGrainsUSDAV3.xlsm]Sheet2!$A$122","$A$122"]
["Mississippi ....:     -           2          30          54          14     ","$A$62","Tennessee ......:     -           3          19          58          20     ","- 3 19 58 20","Tennessee","- ","3 ","19 ","58 ","20",null,null,null,null,"[CQGGlobexGrainsUSDAV3.xlsm]Sheet2!$A$123","$A$123"]
["Missouri .......:     3          12          37          43           5     ","$A$63","Wisconsin ......:     1           3          13          58          25     ","1 3 13 58 25","Wisconsin",{"$f":"IF(F55=\"\",\"\",IFERROR(LEFT(D56,FIND(\" \",D56)),\"\"))","v":"1 "},{"$f":"IF(G55=\"\",\"\",IFERROR(RIGHT(LEFT(D56,FIND(\"~\",SUBSTITUTE(D56,\" \",\"~\",2))),FIND(\"~\",SUBSTITUTE(D56,\" \",\"~\",2))-FIND(\"~\",SUBSTITUTE(D56,\" \",\"~\",1))),\"\"))","v":"3 "},{"$f":"IF(H55=\"\",\"\",IFERROR(RIGHT(LEFT(D56,FIND(\"~\",SUBSTITUTE(D56,\" \",\"~\",3))),FIND(\"~\",SUBSTITUTE(D56,\" \",\"~\",3))-FIND(\"~\",SUBSTITUTE(D56,\" \",\"~\",2))),\"\"))","v":"13 "},{"$f":"IF(I55=\"\",\"\",IFERROR(RIGHT(LEFT(D56,FIND(\"~\",SUBSTITUTE(D56,\" \",\"~\",4))),FIND(\"~\",SUBSTITUTE(D56,\" \",\"~\",4))-FIND(\"~\",SUBSTITUTE(D56,\" \",\"~\",3))),\"\"))","v":"58 "},{"$f":"IF(J55=\"\",\"\",IFERROR(RIGHT(D56,LEN(D56)-FIND(\"~\",SUBSTITUTE(D56,\" \",\"~\",4))),\"\"))","v":"25"},null,null,null,null,"[CQGGlobexGrainsUSDAV3.xlsm]Sheet2!$A$124","$A$124"]
["Nebraska .......:     1           2          11          70          16     ","$A$64","                :                                                           ",{"$f":"TRIM(RIGHT(INDIRECT(B57),43))","v":""},{"$f":"IF(E56=\"\",\"\",IFERROR(LEFT(INDIRECT(B57),FIND(\".\",INDIRECT(B57))-2),\"\"))","v":""},{"$f":"IFERROR(LEFT(D57,FIND(\" \",D57)),\"\")","v":""},{"$f":"IF(E56=\"\",\"\",IFERROR(RIGHT(LEFT(D57,FIND(\"~\",SUBSTITUTE(D57,\" \",\"~\",2))),FIND(\"~\",SUBSTITUTE(D57,\" \",\"~\",2))-FIND(\"~\",SUBSTITUTE(D57,\" \",\"~\",1))),\"\"))","v":""},{"$f":"IF(E56=\"\",\"\",IFERROR(RIGHT(LEFT(D57,FIND(\"~\",SUBSTITUTE(D57,\" \",\"~\",3))),FIND(\"~\",SUBSTITUTE(D57,\" \",\"~\",3))-FIND(\"~\",SUBSTITUTE(D57,\" \",\"~\",2))),\"\"))","v":""},{"$f":"IF(E56=\"\",\"\",IFERROR(RIGHT(D57,LEN(D57)-FIND(\"~\",SUBSTITUTE(D57,\" \",\"~\",3))),\"\"))","v":""},null,null,null,null,null,"[CQGGlobexGrainsUSDAV3.xlsm]Sheet2!$A$125","$A$125"]
["North Carolina .:     -           7          38          50           5     ","$A$65","18 States ......:     1           5          23          55          16     ","5 23 55 16","","5 ","","","",null,null,null,null,null,"[CQGGlobexGrainsUSDAV3.xlsm]Sheet2!$A$126","$A$126"]
["North Dakota ...:     -           3          20          68           9     ","$A$66","                :                                                           ","","","","",null,"",null,null,null,null,null,"[CQGGlobexGrainsUSDAV3.xlsm]Sheet2!$A$127","$A$127"]
["Ohio ...........:     -           4          20          57          19     ","$A$67","Previous week ..:     1           4          22          58          15     ","4 22 58 15","","4 ","","","",null,null,null,null,null,"[CQGGlobexGrainsUSDAV3.xlsm]Sheet2!$A$128","$A$128"]
["South Dakota ...:     3           6          32          51           8     ","$A$68","Previous year ..:     2           7          27          54          10     ",{"$f":"RIGHT(INDIRECT(B61),43)","v":" 7          27          54          10     "},""," ","","","",null,null,null,null,null,"[CQGGlobexGrainsUSDAV3.xlsm]Sheet2!$A$129","$A$129"]
["Tennessee ......:     -           3          19          58          20     ","$A$69","----------------------------------------------------------------------------","-------------------------------------------","","","","","",null,null,null,null,null,"[CQGGlobexGrainsUSDAV3.xlsm]Sheet2!$A$130","$A$130"]
["Wisconsin ......:     1           3          13          58          25     ","$A$70","","","",{"$f":"IF(E62=\"\",\"\",IFERROR(LEFT(D63,FIND(\" \",D63)),\"\"))","v":""},"","","",null,null,null,null,null,"[CQGGlobexGrainsUSDAV3.xlsm]Sheet2!$A$131","$A$131"]
["                :                                                           ","$A$71",0,"0",{"$f":"IFERROR(LEFT(INDIRECT(B64),FIND(\".\",INDIRECT(B64))-2),\"\")","v":""},{"$f":"IFERROR(LEFT(D64,FIND(\" \",D64)),\"\")","v":""},{"$f":"IFERROR(RIGHT(LEFT(D64,FIND(\"~\",SUBSTITUTE(D64,\" \",\"~\",2))),FIND(\"~\",SUBSTITUTE(D64,\" \",\"~\",2))-FIND(\"~\",SUBSTITUTE(D64,\" \",\"~\",1))),\"\")","v":""},{"$f":"IFERROR(RIGHT(LEFT(D64,FIND(\"~\",SUBSTITUTE(D64,\" \",\"~\",3))),FIND(\"~\",SUBSTITUTE(D64,\" \",\"~\",3))-FIND(\"~\",SUBSTITUTE(D64,\" \",\"~\",2))),\"\")","v":""},{"$f":"IFERROR(RIGHT(D64,LEN(D64)-FIND(\"~\",SUBSTITUTE(D64,\" \",\"~\",3))),\"\")","v":""},null,null,null,null,null,"[CQGGlobexGrainsUSDAV3.xlsm]Sheet2!$A$132","$A$132"]
["18 States ......:     1           5          23          55          16     ","$A$72","Cotton Squaring - Selected States","Cotton Squaring - Selected States",null,"Cotton ","Squaring ","- ","Selected States",null,null,null,null,null,"[CQGGlobexGrainsUSDAV3.xlsm]Sheet2!$A$133","$A$133"]
["                :                                                           ","$A$73","[These 15 States planted 99% of the 2017 cotton acreage]","tes planted 99% of the 2017 cotton acreage]",null,"tes ","planted ","99% ","of the 2017 cotton acreage]",null,null,null,null,null,"[CQGGlobexGrainsUSDAV3.xlsm]Sheet2!$A$134","$A$134"]
["Previous week ..:     1           4          22          58          15     ","$A$74",null,null,null,null,null,null,null,null,null,null,null,null,"[CQGGlobexGrainsUSDAV3.xlsm]Sheet2!$A$135","$A$135"]
["Previous year ..:     2           7          27          54          10     ","$A$75",null,null,null,null,null,null,null,null,null,null,null,null,"[CQGGlobexGrainsUSDAV3.xlsm]Sheet2!$A$136","$A$136"]
["----------------------------------------------------------------------------",null,null,null,null,null,null,null,null,null,null,null,null,null,"[CQGGlobexGrainsUSDAV3.xlsm]Sheet2!$A$137","$A$137"]
["",null,null,null,null,null,null,null,null,null,null,null,null,null,"[CQGGlobexGrainsUSDAV3.xlsm]Sheet2!$A$138","$A$138"]
[0,null,null,null,"- ",{"$f":"IFERROR(IF(F39=$E$71,0,1*F39),\"\")","v":2},{"$f":"IFERROR(IF(G39=$E$71,0,1*G39),\"\")","v":8},27,46,17,null,null,null,null,"[CQGGlobexGrainsUSDAV3.xlsm]Sheet2!$A$139","$A$139"]
["Cotton Squaring - Selected States",null,null,null,null,{"$f":"IFERROR(IF(F40=$E$71,0,1*F40),\"\")","v":2},3,17,53,25,null,null,null,null,"[CQGGlobexGrainsUSDAV3.xlsm]Sheet2!$A$140","$A$140"]
["[These 15 States planted 99% of the 2017 cotton acreage]",null,null,null,null,{"$f":"IFERROR(IF(F41=$E$71,0,1*F41),\"\")","v":2},5,21,55,17,null,null,null,null,"[CQGGlobexGrainsUSDAV3.xlsm]Sheet2!$A$141","$A$141"]
["",null,null,null,null,{"$f":"IFERROR(IF(F42=$E$71,0,1*F42),\"\")","v":2},4,18,55,21,null,null,null,null,"[CQGGlobexGrainsUSDAV3.xlsm]Sheet2!$A$142","$A$142"]
["",null,null,null,null,{"$f":"IFERROR(IF(F43=$E$71,0,1*F43),\"\")","v":1},8,37,49,5,null,null,null,null,"[CQGGlobexGrainsUSDAV3.xlsm]Sheet2!$A$143","$A$143"]
[null,null,null,null,null,{"$f":"IFERROR(IF(F44=$E$71,0,1*F44),\"\")","v":0},2,12,69,17]
[null,null,null,null,null,{"$f":"IFERROR(IF(F45=$E$71,0,1*F45),\"\")","v":5},11,36,37,11]
[null,null,null,null,null,{"$f":"IFERROR(IF(F46=$E$71,0,1*F46),\"\")","v":2},4,22,59,13]
[null,null,null,null,null,{"$f":"IFERROR(IF(F47=$E$71,0,1*F47),\"\")","v":0},3,20,57,20]
[null,null,null,null,null,{"$f":"IFERROR(IF(F48=$E$71,0,1*F48),\"\")","v":0},2,30,54,14]
[null,null,null,null,null,{"$f":"IFERROR(IF(F49=$E$71,0,1*F49),\"\")","v":3},12,37,43,5]
[null,null,null,null,null,{"$f":"IFERROR(IF(F50=$E$71,0,1*F50),\"\")","v":1},2,11,70,16]
[null,null,null,null,null,{"$f":"IFERROR(IF(F51=$E$71,0,1*F51),\"\")","v":0},7,38,50,5]
[null,null,null,null,null,{"$f":"IFERROR(IF(F52=$E$71,0,1*F52),\"\")","v":0},3,20,68,9]
[null,null,null,null,null,{"$f":"IFERROR(IF(F53=$E$71,0,1*F53),\"\")","v":0},4,20,57,19]
[null,null,null,null,null,{"$f":"IFERROR(IF(F54=$E$71,0,1*F54),\"\")","v":3},6,32,51,8]
[null,null,null,null,null,{"$f":"IFERROR(IF(F55=$E$71,0,1*F55),\"\")","v":0},3,19,58,20]
[null,null,null,null,null,{"$f":"IFERROR(IF(F56=$E$71,0,1*F56),\"\")","v":1},3,13,58,25]

{"sheet":"Sheet4","index":4,"n_rows":36,"n_cols":17,"rows_kept":36,"cut":false,"hidden":true,"merged":[]}
[]
[null,"ZSE",null,null,null,{"$f":"IF(RTD(\"cqg.rtd\", ,\"ContractData\",\"ZSE\", \"LastTradeToday\",, \"T\")=\"\",-1,0)","v":0}]
[null,1,{"$f":"$B$2&\"?\"&B3","v":"ZSE?1"},{"$f":"RTD(\"cqg.rtd\",,\"StudyData\",C3,\"Bar\",,\"Close\",\"D\",$F$2,,,,,\"T\")","v":861.5},{"$f":"RTD(\"cqg.rtd\", ,\"ContractData\",C3, \"contractMonth\",, \"T\")","v":"JUL"},{"$f":"IF(RTD(\"cqg.rtd\", ,\"ContractData\",C3, \"NetLastTradeToday\",, \"T\")=\"\",RTD(\"cqg.rtd\",,\"StudyData\",C3,\"Bar\",,\"Close\",\"D\",\"-1\",,,,,\"T\")-RTD(\"cqg.rtd\",,\"StudyData\",C3,\"Bar\",,\"Close\",\"D\",\"-2\",,,,,\"T\"),RTD(\"cqg.rtd\", ,\"ContractData\",C3, \"NetLastTradeToday\",, \"T\"))","v":-12.5},null,{"$f":"RTD(\"cqg.rtd\", ,\"ContractData\",C3, \"Bid\",, \"T\")","v":856.5},{"$f":"RTD(\"cqg.rtd\", ,\"ContractData\",C3, \"Ask\",, \"T\")","v":857.25},null,{"$f":"IFERROR(IF(OR(D3>I3,D3<H3),MEDIAN(I3,H3),D3),NA())","v":856.875},null,{"$f":"IF(RTD(\"cqg.rtd\", ,\"ContractData\",C3, \"NetLastTradeToday\",, \"T\")=\"\",RTD(\"cqg.rtd\",,\"StudyData\",C3,\"Bar\",,\"Close\",\"D\",\"-1\",,,,,\"T\")-RTD(\"cqg.rtd\",,\"StudyData\",C3,\"Bar\",,\"Close\",\"D\",\"-2\",,,,,\"T\"),RTD(\"cqg.rtd\", ,\"ContractData\",C3, \"NetLastTradeToday\",, \"T\"))","v":-12.5},null,{"$f":"IFERROR(IF(RTD(\"cqg.rtd\", ,\"ContractData\",C3, \"NetLastTradeToday\",, \"T\")=\"\",K3-RTD(\"cqg.rtd\",,\"ContractData\",C3,\"Y_Settlement\",,\"T\"),IF(OR(D3>I3,D3<H3),MEDIAN(I3,H3),D3)-RTD(\"cqg.rtd\",,\"ContractData\",C3,\"Y_Settlement\",,\"T\")),NA())","v":-17.125},null,{"$f":"RTD(\"cqg.rtd\",,\"ContractData\",C3,\"Y_Settlement\",,\"T\")","v":874}]
[null,2,"ZSE?2",{"$f":"RTD(\"cqg.rtd\",,\"StudyData\",C4,\"Bar\",,\"Close\",\"D\",$F$2,,,,,\"T\")","v":861},{"$f":"RTD(\"cqg.rtd\", ,\"ContractData\",C4, \"contractMonth\",, \"T\")","v":"AUG"},{"$f":"IF(RTD(\"cqg.rtd\", ,\"ContractData\",C4, \"NetLastTradeToday\",, \"T\")=\"\",RTD(\"cqg.rtd\",,\"StudyData\",C4,\"Bar\",,\"Close\",\"D\",\"-1\",,,,,\"T\")-RTD(\"cqg.rtd\",,\"StudyData\",C4,\"Bar\",,\"Close\",\"D\",\"-2\",,,,,\"T\"),RTD(\"cqg.rtd\", ,\"ContractData\",C4, \"NetLastTradeToday\",, \"T\"))","v":-16.5},null,{"$f":"RTD(\"cqg.rtd\", ,\"ContractData\",C4, \"Bid\",, \"T\")","v":860.75},{"$f":"RTD(\"cqg.rtd\", ,\"ContractData\",C4, \"Ask\",, \"T\")","v":861},null,{"$f":"IFERROR(IF(OR(D4>I4,D4<H4),MEDIAN(I4,H4),D4),NA())","v":861},null,{"$f":"IF(RTD(\"cqg.rtd\", ,\"ContractData\",C4, \"NetLastTradeToday\",, \"T\")=\"\",RTD(\"cqg.rtd\",,\"StudyData\",C4,\"Bar\",,\"Close\",\"D\",\"-1\",,,,,\"T\")-RTD(\"cqg.rtd\",,\"StudyData\",C4,\"Bar\",,\"Close\",\"D\",\"-2\",,,,,\"T\"),RTD(\"cqg.rtd\", ,\"ContractData\",C4, \"NetLastTradeToday\",, \"T\"))","v":-16.5}]
[null,3,"ZSE?3",{"$f":"RTD(\"cqg.rtd\",,\"StudyData\",C5,\"Bar\",,\"Close\",\"D\",$F$2,,,,,\"T\")","v":866.5},{"$f":"RTD(\"cqg.rtd\", ,\"ContractData\",C5, \"contractMonth\",, \"T\")","v":"SEP"},{"$f":"IF(RTD(\"cqg.rtd\", ,\"ContractData\",C5, \"NetLastTradeToday\",, \"T\")=\"\",RTD(\"cqg.rtd\",,\"StudyData\",C5,\"Bar\",,\"Close\",\"D\",\"-1\",,,,,\"T\")-RTD(\"cqg.rtd\",,\"StudyData\",C5,\"Bar\",,\"Close\",\"D\",\"-2\",,,,,\"T\"),RTD(\"cqg.rtd\", ,\"ContractData\",C5, \"NetLastTradeToday\",, \"T\"))","v":-16.75},null,{"$f":"RTD(\"cqg.rtd\", ,\"ContractData\",C5, \"Bid\",, \"T\")","v":866.25},{"$f":"RTD(\"cqg.rtd\", ,\"ContractData\",C5, \"Ask\",, \"T\")","v":866.5},null,866.5,null,{"$f":"IF(RTD(\"cqg.rtd\", ,\"ContractData\",C5, \"NetLastTradeToday\",, \"T\")=\"\",RTD(\"cqg.rtd\",,\"StudyData\",C5,\"Bar\",,\"Close\",\"D\",\"-1\",,,,,\"T\")-RTD(\"cqg.rtd\",,\"StudyData\",C5,\"Bar\",,\"Close\",\"D\",\"-2\",,,,,\"T\"),RTD(\"cqg.rtd\", ,\"ContractData\",C5, \"NetLastTradeToday\",, \"T\"))","v":-16.75}]
[null,4,"ZSE?4",{"$f":"RTD(\"cqg.rtd\",,\"StudyData\",C6,\"Bar\",,\"Close\",\"D\",$F$2,,,,,\"T\")","v":877.75},{"$f":"RTD(\"cqg.rtd\", ,\"ContractData\",C6, \"contractMonth\",, \"T\")","v":"NOV"},{"$f":"IF(RTD(\"cqg.rtd\", ,\"ContractData\",C6, \"NetLastTradeToday\",, \"T\")=\"\",RTD(\"cqg.rtd\",,\"StudyData\",C6,\"Bar\",,\"Close\",\"D\",\"-1\",,,,,\"T\")-RTD(\"cqg.rtd\",,\"StudyData\",C6,\"Bar\",,\"Close\",\"D\",\"-2\",,,,,\"T\"),RTD(\"cqg.rtd\", ,\"ContractData\",C6, \"NetLastTradeToday\",, \"T\"))","v":-16.75},null,{"$f":"RTD(\"cqg.rtd\", ,\"ContractData\",C6, \"Bid\",, \"T\")","v":877.5},{"$f":"RTD(\"cqg.rtd\", ,\"ContractData\",C6, \"Ask\",, \"T\")","v":877.75},null,877.75,null,{"$f":"IF(RTD(\"cqg.rtd\", ,\"ContractData\",C6, \"NetLastTradeToday\",, \"T\")=\"\",RTD(\"cqg.rtd\",,\"StudyData\",C6,\"Bar\",,\"Close\",\"D\",\"-1\",,,,,\"T\")-RTD(\"cqg.rtd\",,\"StudyData\",C6,\"Bar\",,\"Close\",\"D\",\"-2\",,,,,\"T\"),RTD(\"cqg.rtd\", ,\"ContractData\",C6, \"NetLastTradeToday\",, \"T\"))","v":-16.75}]
[null,5,"ZSE?5",{"$f":"RTD(\"cqg.rtd\",,\"StudyData\",C7,\"Bar\",,\"Close\",\"D\",$F$2,,,,,\"T\")","v":887.75},{"$f":"RTD(\"cqg.rtd\", ,\"ContractData\",C7, \"contractMonth\",, \"T\")","v":"JAN"},{"$f":"IF(RTD(\"cqg.rtd\", ,\"ContractData\",C7, \"NetLastTradeToday\",, \"T\")=\"\",RTD(\"cqg.rtd\",,\"StudyData\",C7,\"Bar\",,\"Close\",\"D\",\"-1\",,,,,\"T\")-RTD(\"cqg.rtd\",,\"StudyData\",C7,\"Bar\",,\"Close\",\"D\",\"-2\",,,,,\"T\"),RTD(\"cqg.rtd\", ,\"ContractData\",C7, \"NetLastTradeToday\",, \"T\"))","v":-16.25},null,{"$f":"RTD(\"cqg.rtd\", ,\"ContractData\",C7, \"Bid\",, \"T\")","v":887.5},{"$f":"RTD(\"cqg.rtd\", ,\"ContractData\",C7, \"Ask\",, \"T\")","v":887.75},null,887.75,null,{"$f":"IF(RTD(\"cqg.rtd\", ,\"ContractData\",C7, \"NetLastTradeToday\",, \"T\")=\"\",RTD(\"cqg.rtd\",,\"StudyData\",C7,\"Bar\",,\"Close\",\"D\",\"-1\",,,,,\"T\")-RTD(\"cqg.rtd\",,\"StudyData\",C7,\"Bar\",,\"Close\",\"D\",\"-2\",,,,,\"T\"),RTD(\"cqg.rtd\", ,\"ContractData\",C7, \"NetLastTradeToday\",, \"T\"))","v":-16.25}]
[null,6,"ZSE?6",{"$f":"RTD(\"cqg.rtd\",,\"StudyData\",C8,\"Bar\",,\"Close\",\"D\",$F$2,,,,,\"T\")","v":895},{"$f":"RTD(\"cqg.rtd\", ,\"ContractData\",C8, \"contractMonth\",, \"T\")","v":"MAR"},{"$f":"IF(RTD(\"cqg.rtd\", ,\"ContractData\",C8, \"NetLastTradeToday\",, \"T\")=\"\",RTD(\"cqg.rtd\",,\"StudyData\",C8,\"Bar\",,\"Close\",\"D\",\"-1\",,,,,\"T\")-RTD(\"cqg.rtd\",,\"StudyData\",C8,\"Bar\",,\"Close\",\"D\",\"-2\",,,,,\"T\"),RTD(\"cqg.rtd\", ,\"ContractData\",C8, \"NetLastTradeToday\",, \"T\"))","v":-16},null,{"$f":"RTD(\"cqg.rtd\", ,\"ContractData\",C8, \"Bid\",, \"T\")","v":895},{"$f":"RTD(\"cqg.rtd\", ,\"ContractData\",C8, \"Ask\",, \"T\")","v":895.25},null,895,null,{"$f":"IF(RTD(\"cqg.rtd\", ,\"ContractData\",C8, \"NetLastTradeToday\",, \"T\")=\"\",RTD(\"cqg.rtd\",,\"StudyData\",C8,\"Bar\",,\"Close\",\"D\",\"-1\",,,,,\"T\")-RTD(\"cqg.rtd\",,\"StudyData\",C8,\"Bar\",,\"Close\",\"D\",\"-2\",,,,,\"T\"),RTD(\"cqg.rtd\", ,\"ContractData\",C8, \"NetLastTradeToday\",, \"T\"))","v":-16}]
[null,7,"ZSE?7",{"$f":"RTD(\"cqg.rtd\",,\"StudyData\",C9,\"Bar\",,\"Close\",\"D\",$F$2,,,,,\"T\")","v":904},{"$f":"RTD(\"cqg.rtd\", ,\"ContractData\",C9, \"contractMonth\",, \"T\")","v":"MAY"},{"$f":"IF(RTD(\"cqg.rtd\", ,\"ContractData\",C9, \"NetLastTradeToday\",, \"T\")=\"\",RTD(\"cqg.rtd\",,\"StudyData\",C9,\"Bar\",,\"Close\",\"D\",\"-1\",,,,,\"T\")-RTD(\"cqg.rtd\",,\"StudyData\",C9,\"Bar\",,\"Close\",\"D\",\"-2\",,,,,\"T\"),RTD(\"cqg.rtd\", ,\"ContractData\",C9, \"NetLastTradeToday\",, \"T\"))","v":-15.75},null,{"$f":"RTD(\"cqg.rtd\", ,\"ContractData\",C9, \"Bid\",, \"T\")","v":904},{"$f":"RTD(\"cqg.rtd\", ,\"ContractData\",C9, \"Ask\",, \"T\")","v":904.25},null,904,null,{"$f":"IF(RTD(\"cqg.rtd\", ,\"ContractData\",C9, \"NetLastTradeToday\",, \"T\")=\"\",RTD(\"cqg.rtd\",,\"StudyData\",C9,\"Bar\",,\"Close\",\"D\",\"-1\",,,,,\"T\")-RTD(\"cqg.rtd\",,\"StudyData\",C9,\"Bar\",,\"Close\",\"D\",\"-2\",,,,,\"T\"),RTD(\"cqg.rtd\", ,\"ContractData\",C9, \"NetLastTradeToday\",, \"T\"))","v":-15.75}]
[null,8,"ZSE?8",{"$f":"RTD(\"cqg.rtd\",,\"StudyData\",C10,\"Bar\",,\"Close\",\"D\",$F$2,,,,,\"T\")","v":912.75},{"$f":"RTD(\"cqg.rtd\", ,\"ContractData\",C10, \"contractMonth\",, \"T\")","v":"JUL"},{"$f":"IF(RTD(\"cqg.rtd\", ,\"ContractData\",C10, \"NetLastTradeToday\",, \"T\")=\"\",RTD(\"cqg.rtd\",,\"StudyData\",C10,\"Bar\",,\"Close\",\"D\",\"-1\",,,,,\"T\")-RTD(\"cqg.rtd\",,\"StudyData\",C10,\"Bar\",,\"Close\",\"D\",\"-2\",,,,,\"T\"),RTD(\"cqg.rtd\", ,\"ContractData\",C10, \"NetLastTradeToday\",, \"T\"))","v":-15.5},null,{"$f":"RTD(\"cqg.rtd\", ,\"ContractData\",C10, \"Bid\",, \"T\")","v":912.75},{"$f":"RTD(\"cqg.rtd\", ,\"ContractData\",C10, \"Ask\",, \"T\")","v":913},null,912.75,null,{"$f":"IF(RTD(\"cqg.rtd\", ,\"ContractData\",C10, \"NetLastTradeToday\",, \"T\")=\"\",RTD(\"cqg.rtd\",,\"StudyData\",C10,\"Bar\",,\"Close\",\"D\",\"-1\",,,,,\"T\")-RTD(\"cqg.rtd\",,\"StudyData\",C10,\"Bar\",,\"Close\",\"D\",\"-2\",,,,,\"T\"),RTD(\"cqg.rtd\", ,\"ContractData\",C10, \"NetLastTradeToday\",, \"T\"))","v":-15.5}]
[null,9,"ZSE?9",{"$f":"RTD(\"cqg.rtd\",,\"StudyData\",C11,\"Bar\",,\"Close\",\"D\",$F$2,,,,,\"T\")","v":""},{"$f":"RTD(\"cqg.rtd\", ,\"ContractData\",C11, \"contractMonth\",, \"T\")","v":"AUG"},{"$f":"IF(RTD(\"cqg.rtd\", ,\"ContractData\",C11, \"NetLastTradeToday\",, \"T\")=\"\",RTD(\"cqg.rtd\",,\"StudyData\",C11,\"Bar\",,\"Close\",\"D\",\"-1\",,,,,\"T\")-RTD(\"cqg.rtd\",,\"StudyData\",C11,\"Bar\",,\"Close\",\"D\",\"-2\",,,,,\"T\"),RTD(\"cqg.rtd\", ,\"ContractData\",C11, \"NetLastTradeToday\",, \"T\"))","v":37.5},null,{"$f":"RTD(\"cqg.rtd\", ,\"ContractData\",C11, \"Bid\",, \"T\")","v":912.25},{"$f":"RTD(\"cqg.rtd\", ,\"ContractData\",C11, \"Ask\",, \"T\")","v":913},null,912.625,null,{"$f":"IF(RTD(\"cqg.rtd\", ,\"ContractData\",C11, \"NetLastTradeToday\",, \"T\")=\"\",RTD(\"cqg.rtd\",,\"StudyData\",C11,\"Bar\",,\"Close\",\"D\",\"-1\",,,,,\"T\")-RTD(\"cqg.rtd\",,\"StudyData\",C11,\"Bar\",,\"Close\",\"D\",\"-2\",,,,,\"T\"),RTD(\"cqg.rtd\", ,\"ContractData\",C11, \"NetLastTradeToday\",, \"T\"))","v":37.5}]
[null,10,"ZSE?10",{"$f":"RTD(\"cqg.rtd\",,\"StudyData\",C12,\"Bar\",,\"Close\",\"D\",$F$2,,,,,\"T\")","v":""},{"$f":"RTD(\"cqg.rtd\", ,\"ContractData\",C12, \"contractMonth\",, \"T\")","v":"SEP"},{"$f":"IF(RTD(\"cqg.rtd\", ,\"ContractData\",C12, \"NetLastTradeToday\",, \"T\")=\"\",RTD(\"cqg.rtd\",,\"StudyData\",C12,\"Bar\",,\"Close\",\"D\",\"-1\",,,,,\"T\")-RTD(\"cqg.rtd\",,\"StudyData\",C12,\"Bar\",,\"Close\",\"D\",\"-2\",,,,,\"T\"),RTD(\"cqg.rtd\", ,\"ContractData\",C12, \"NetLastTradeToday\",, \"T\"))","v":33.75},null,{"$f":"RTD(\"cqg.rtd\", ,\"ContractData\",C12, \"Bid\",, \"T\")","v":903.25},{"$f":"RTD(\"cqg.rtd\", ,\"ContractData\",C12, \"Ask\",, \"T\")","v":907.25},null,905.25,null,{"$f":"IF(RTD(\"cqg.rtd\", ,\"ContractData\",C12, \"NetLastTradeToday\",, \"T\")=\"\",RTD(\"cqg.rtd\",,\"StudyData\",C12,\"Bar\",,\"Close\",\"D\",\"-1\",,,,,\"T\")-RTD(\"cqg.rtd\",,\"StudyData\",C12,\"Bar\",,\"Close\",\"D\",\"-2\",,,,,\"T\"),RTD(\"cqg.rtd\", ,\"ContractData\",C12, \"NetLastTradeToday\",, \"T\"))","v":33.75}]
[]
[null,"ZCE"]
[null,1,{"$f":"$B$14&\"?\"&B15","v":"ZCE?1"},{"$f":"RTD(\"cqg.rtd\",,\"StudyData\",C15,\"Bar\",,\"Close\",\"D\",$F$2,,,,,\"T\")","v":345},{"$f":"RTD(\"cqg.rtd\", ,\"ContractData\",C15, \"contractMonth\",, \"T\")","v":"JUL"},{"$f":"IF(RTD(\"cqg.rtd\", ,\"ContractData\",C15, \"NetLastTradeToday\",, \"T\")=\"\",RTD(\"cqg.rtd\",,\"StudyData\",C15,\"Bar\",,\"Close\",\"D\",\"-1\",,,,,\"T\")-RTD(\"cqg.rtd\",,\"StudyData\",C15,\"Bar\",,\"Close\",\"D\",\"-2\",,,,,\"T\"),RTD(\"cqg.rtd\", ,\"ContractData\",C15, \"NetLastTradeToday\",, \"T\"))","v":-6.75},null,{"$f":"RTD(\"cqg.rtd\", ,\"ContractData\",C15, \"Bid\",, \"T\")","v":344.5},{"$f":"RTD(\"cqg.rtd\", ,\"ContractData\",C15, \"Ask\",, \"T\")","v":345},null,{"$f":"IFERROR(IF(OR(D15>I15,D15<H15),MEDIAN(I15,H15),D15),NA())","v":345},null,{"$f":"IF(RTD(\"cqg.rtd\", ,\"ContractData\",C15, \"NetLastTradeToday\",, \"T\")=\"\",RTD(\"cqg.rtd\",,\"StudyData\",C15,\"Bar\",,\"Close\",\"D\",\"-1\",,,,,\"T\")-RTD(\"cqg.rtd\",,\"StudyData\",C15,\"Bar\",,\"Close\",\"D\",\"-2\",,,,,\"T\"),RTD(\"cqg.rtd\", ,\"ContractData\",C15, \"NetLastTradeToday\",, \"T\"))","v":-6.75}]
[null,2,{"$f":"$B$14&\"?\"&B16","v":"ZCE?2"},{"$f":"RTD(\"cqg.rtd\",,\"StudyData\",C16,\"Bar\",,\"Close\",\"D\",$F$2,,,,,\"T\")","v":353.5},{"$f":"RTD(\"cqg.rtd\", ,\"ContractData\",C16, \"contractMonth\",, \"T\")","v":"SEP"},{"$f":"IF(RTD(\"cqg.rtd\", ,\"ContractData\",C16, \"NetLastTradeToday\",, \"T\")=\"\",RTD(\"cqg.rtd\",,\"StudyData\",C16,\"Bar\",,\"Close\",\"D\",\"-1\",,,,,\"T\")-RTD(\"cqg.rtd\",,\"StudyData\",C16,\"Bar\",,\"Close\",\"D\",\"-2\",,,,,\"T\"),RTD(\"cqg.rtd\", ,\"ContractData\",C16, \"NetLastTradeToday\",, \"T\"))","v":-6.75},null,{"$f":"RTD(\"cqg.rtd\", ,\"ContractData\",C16, \"Bid\",, \"T\")","v":353.25},{"$f":"RTD(\"cqg.rtd\", ,\"ContractData\",C16, \"Ask\",, \"T\")","v":353.5},null,353.5,null,{"$f":"IF(RTD(\"cqg.rtd\", ,\"ContractData\",C16, \"NetLastTradeToday\",, \"T\")=\"\",RTD(\"cqg.rtd\",,\"StudyData\",C16,\"Bar\",,\"Close\",\"D\",\"-1\",,,,,\"T\")-RTD(\"cqg.rtd\",,\"StudyData\",C16,\"Bar\",,\"Close\",\"D\",\"-2\",,,,,\"T\"),RTD(\"cqg.rtd\", ,\"ContractData\",C16, \"NetLastTradeToday\",, \"T\"))","v":-6.75}]
[null,3,"ZCE?3",{"$f":"RTD(\"cqg.rtd\",,\"StudyData\",C17,\"Bar\",,\"Close\",\"D\",$F$2,,,,,\"T\")","v":366.5},{"$f":"RTD(\"cqg.rtd\", ,\"ContractData\",C17, \"contractMonth\",, \"T\")","v":"DEC"},{"$f":"IF(RTD(\"cqg.rtd\", ,\"ContractData\",C17, \"NetLastTradeToday\",, \"T\")=\"\",RTD(\"cqg.rtd\",,\"StudyData\",C17,\"Bar\",,\"Close\",\"D\",\"-1\",,,,,\"T\")-RTD(\"cqg.rtd\",,\"StudyData\",C17,\"Bar\",,\"Close\",\"D\",\"-2\",,,,,\"T\"),RTD(\"cqg.rtd\", ,\"ContractData\",C17, \"NetLastTradeToday\",, \"T\"))","v":-6.5},null,{"$f":"RTD(\"cqg.rtd\", ,\"ContractData\",C17, \"Bid\",, \"T\")","v":366.25},{"$f":"RTD(\"cqg.rtd\", ,\"ContractData\",C17, \"Ask\",, \"T\")","v":366.5},null,366.5,null,{"$f":"IF(RTD(\"cqg.rtd\", ,\"ContractData\",C17, \"NetLastTradeToday\",, \"T\")=\"\",RTD(\"cqg.rtd\",,\"StudyData\",C17,\"Bar\",,\"Close\",\"D\",\"-1\",,,,,\"T\")-RTD(\"cqg.rtd\",,\"StudyData\",C17,\"Bar\",,\"Close\",\"D\",\"-2\",,,,,\"T\"),RTD(\"cqg.rtd\", ,\"ContractData\",C17, \"NetLastTradeToday\",, \"T\"))","v":-6.5}]
[null,4,"ZCE?4",{"$f":"RTD(\"cqg.rtd\",,\"StudyData\",C18,\"Bar\",,\"Close\",\"D\",$F$2,,,,,\"T\")","v":376.75},{"$f":"RTD(\"cqg.rtd\", ,\"ContractData\",C18, \"contractMonth\",, \"T\")","v":"MAR"},{"$f":"IF(RTD(\"cqg.rtd\", ,\"ContractData\",C18, \"NetLastTradeToday\",, \"T\")=\"\",RTD(\"cqg.rtd\",,\"StudyData\",C18,\"Bar\",,\"Close\",\"D\",\"-1\",,,,,\"T\")-RTD(\"cqg.rtd\",,\"StudyData\",C18,\"Bar\",,\"Close\",\"D\",\"-2\",,,,,\"T\"),RTD(\"cqg.rtd\", ,\"ContractData\",C18, \"NetLastTradeToday\",, \"T\"))","v":-6.5},null,{"$f":"RTD(\"cqg.rtd\", ,\"ContractData\",C18, \"Bid\",, \"T\")","v":376.75},{"$f":"RTD(\"cqg.rtd\", ,\"ContractData\",C18, \"Ask\",, \"T\")","v":377},null,376.75,null,{"$f":"IF(RTD(\"cqg.rtd\", ,\"ContractData\",C18, \"NetLastTradeToday\",, \"T\")=\"\",RTD(\"cqg.rtd\",,\"StudyData\",C18,\"Bar\",,\"Close\",\"D\",\"-1\",,,,,\"T\")-RTD(\"cqg.rtd\",,\"StudyData\",C18,\"Bar\",,\"Close\",\"D\",\"-2\",,,,,\"T\"),RTD(\"cqg.rtd\", ,\"ContractData\",C18, \"NetLastTradeToday\",, \"T\"))","v":-6.5}]
[null,5,"ZCE?5",{"$f":"RTD(\"cqg.rtd\",,\"StudyData\",C19,\"Bar\",,\"Close\",\"D\",$F$2,,,,,\"T\")","v":384},{"$f":"RTD(\"cqg.rtd\", ,\"ContractData\",C19, \"contractMonth\",, \"T\")","v":"MAY"},{"$f":"IF(RTD(\"cqg.rtd\", ,\"ContractData\",C19, \"NetLastTradeToday\",, \"T\")=\"\",RTD(\"cqg.rtd\",,\"StudyData\",C19,\"Bar\",,\"Close\",\"D\",\"-1\",,,,,\"T\")-RTD(\"cqg.rtd\",,\"StudyData\",C19,\"Bar\",,\"Close\",\"D\",\"-2\",,,,,\"T\"),RTD(\"cqg.rtd\", ,\"ContractData\",C19, \"NetLastTradeToday\",, \"T\"))","v":-6},null,{"$f":"RTD(\"cqg.rtd\", ,\"ContractData\",C19, \"Bid\",, \"T\")","v":383.5},{"$f":"RTD(\"cqg.rtd\", ,\"ContractData\",C19, \"Ask\",, \"T\")","v":383.75},null,383.625,null,{"$f":"IF(RTD(\"cqg.rtd\", ,\"ContractData\",C19, \"NetLastTradeToday\",, \"T\")=\"\",RTD(\"cqg.rtd\",,\"StudyData\",C19,\"Bar\",,\"Close\",\"D\",\"-1\",,,,,\"T\")-RTD(\"cqg.rtd\",,\"StudyData\",C19,\"Bar\",,\"Close\",\"D\",\"-2\",,,,,\"T\"),RTD(\"cqg.rtd\", ,\"ContractData\",C19, \"NetLastTradeToday\",, \"T\"))","v":-6}]
[null,6,"ZCE?6",{"$f":"RTD(\"cqg.rtd\",,\"StudyData\",C20,\"Bar\",,\"Close\",\"D\",$F$2,,,,,\"T\")","v":390},{"$f":"RTD(\"cqg.rtd\", ,\"ContractData\",C20, \"contractMonth\",, \"T\")","v":"JUL"},{"$f":"IF(RTD(\"cqg.rtd\", ,\"ContractData\",C20, \"NetLastTradeToday\",, \"T\")=\"\",RTD(\"cqg.rtd\",,\"StudyData\",C20,\"Bar\",,\"Close\",\"D\",\"-1\",,,,,\"T\")-RTD(\"cqg.rtd\",,\"StudyData\",C20,\"Bar\",,\"Close\",\"D\",\"-2\",,,,,\"T\"),RTD(\"cqg.rtd\", ,\"ContractData\",C20, \"NetLastTradeToday\",, \"T\"))","v":-6.5},null,{"$f":"RTD(\"cqg.rtd\", ,\"ContractData\",C20, \"Bid\",, \"T\")","v":389.75},{"$f":"RTD(\"cqg.rtd\", ,\"ContractData\",C20, \"Ask\",, \"T\")","v":390.25},null,390,null,{"$f":"IF(RTD(\"cqg.rtd\", ,\"ContractData\",C20, \"NetLastTradeToday\",, \"T\")=\"\",RTD(\"cqg.rtd\",,\"StudyData\",C20,\"Bar\",,\"Close\",\"D\",\"-1\",,,,,\"T\")-RTD(\"cqg.rtd\",,\"StudyData\",C20,\"Bar\",,\"Close\",\"D\",\"-2\",,,,,\"T\"),RTD(\"cqg.rtd\", ,\"ContractData\",C20, \"NetLastTradeToday\",, \"T\"))","v":-6.5}]
[null,7,"ZCE?7",{"$f":"RTD(\"cqg.rtd\",,\"StudyData\",C21,\"Bar\",,\"Close\",\"D\",$F$2,,,,,\"T\")","v":389},{"$f":"RTD(\"cqg.rtd\", ,\"ContractData\",C21, \"contractMonth\",, \"T\")","v":"SEP"},{"$f":"IF(RTD(\"cqg.rtd\", ,\"ContractData\",C21, \"NetLastTradeToday\",, \"T\")=\"\",RTD(\"cqg.rtd\",,\"StudyData\",C21,\"Bar\",,\"Close\",\"D\",\"-1\",,,,,\"T\")-RTD(\"cqg.rtd\",,\"StudyData\",C21,\"Bar\",,\"Close\",\"D\",\"-2\",,,,,\"T\"),RTD(\"cqg.rtd\", ,\"ContractData\",C21, \"NetLastTradeToday\",, \"T\"))","v":-5.25},null,{"$f":"RTD(\"cqg.rtd\", ,\"ContractData\",C21, \"Bid\",, \"T\")","v":388.5},{"$f":"RTD(\"cqg.rtd\", ,\"ContractData\",C21, \"Ask\",, \"T\")","v":388.75},null,388.625,null,{"$f":"IF(RTD(\"cqg.rtd\", ,\"ContractData\",C21, \"NetLastTradeToday\",, \"T\")=\"\",RTD(\"cqg.rtd\",,\"StudyData\",C21,\"Bar\",,\"Close\",\"D\",\"-1\",,,,,\"T\")-RTD(\"cqg.rtd\",,\"StudyData\",C21,\"Bar\",,\"Close\",\"D\",\"-2\",,,,,\"T\"),RTD(\"cqg.rtd\", ,\"ContractData\",C21, \"NetLastTradeToday\",, \"T\"))","v":-5.25}]
[null,8,"ZCE?8",{"$f":"RTD(\"cqg.rtd\",,\"StudyData\",C22,\"Bar\",,\"Close\",\"D\",$F$2,,,,,\"T\")","v":394},{"$f":"RTD(\"cqg.rtd\", ,\"ContractData\",C22, \"contractMonth\",, \"T\")","v":"DEC"},{"$f":"IF(RTD(\"cqg.rtd\", ,\"ContractData\",C22, \"NetLastTradeToday\",, \"T\")=\"\",RTD(\"cqg.rtd\",,\"StudyData\",C22,\"Bar\",,\"Close\",\"D\",\"-1\",,,,,\"T\")-RTD(\"cqg.rtd\",,\"StudyData\",C22,\"Bar\",,\"Close\",\"D\",\"-2\",,,,,\"T\"),RTD(\"cqg.rtd\", ,\"ContractData\",C22, \"NetLastTradeToday\",, \"T\"))","v":-5},null,{"$f":"RTD(\"cqg.rtd\", ,\"ContractData\",C22, \"Bid\",, \"T\")","v":393.75},{"$f":"RTD(\"cqg.rtd\", ,\"ContractData\",C22, \"Ask\",, \"T\")","v":394},null,394,null,{"$f":"IF(RTD(\"cqg.rtd\", ,\"ContractData\",C22, \"NetLastTradeToday\",, \"T\")=\"\",RTD(\"cqg.rtd\",,\"StudyData\",C22,\"Bar\",,\"Close\",\"D\",\"-1\",,,,,\"T\")-RTD(\"cqg.rtd\",,\"StudyData\",C22,\"Bar\",,\"Close\",\"D\",\"-2\",,,,,\"T\"),RTD(\"cqg.rtd\", ,\"ContractData\",C22, \"NetLastTradeToday\",, \"T\"))","v":-5}]
[null,9,"ZCE?9",{"$f":"RTD(\"cqg.rtd\",,\"StudyData\",C23,\"Bar\",,\"Close\",\"D\",$F$2,,,,,\"T\")","v":405.5},{"$f":"RTD(\"cqg.rtd\", ,\"ContractData\",C23, \"contractMonth\",, \"T\")","v":"MAR"},{"$f":"IF(RTD(\"cqg.rtd\", ,\"ContractData\",C23, \"NetLastTradeToday\",, \"T\")=\"\",RTD(\"cqg.rtd\",,\"StudyData\",C23,\"Bar\",,\"Close\",\"D\",\"-1\",,,,,\"T\")-RTD(\"cqg.rtd\",,\"StudyData\",C23,\"Bar\",,\"Close\",\"D\",\"-2\",,,,,\"T\"),RTD(\"cqg.rtd\", ,\"ContractData\",C23, \"NetLastTradeToday\",, \"T\"))","v":-3.25},null,{"$f":"RTD(\"cqg.rtd\", ,\"ContractData\",C23, \"Bid\",, \"T\")","v":403.25},{"$f":"RTD(\"cqg.rtd\", ,\"ContractData\",C23, \"Ask\",, \"T\")","v":403.75},null,403.5,null,{"$f":"IF(RTD(\"cqg.rtd\", ,\"ContractData\",C23, \"NetLastTradeToday\",, \"T\")=\"\",RTD(\"cqg.rtd\",,\"StudyData\",C23,\"Bar\",,\"Close\",\"D\",\"-1\",,,,,\"T\")-RTD(\"cqg.rtd\",,\"StudyData\",C23,\"Bar\",,\"Close\",\"D\",\"-2\",,,,,\"T\"),RTD(\"cqg.rtd\", ,\"ContractData\",C23, \"NetLastTradeToday\",, \"T\"))","v":-3.25}]
[null,10,"ZCE?10",{"$f":"RTD(\"cqg.rtd\",,\"StudyData\",C24,\"Bar\",,\"Close\",\"D\",$F$2,,,,,\"T\")","v":""},{"$f":"RTD(\"cqg.rtd\", ,\"ContractData\",C24, \"contractMonth\",, \"T\")","v":"MAY"},{"$f":"IF(RTD(\"cqg.rtd\", ,\"ContractData\",C24, \"NetLastTradeToday\",, \"T\")=\"\",RTD(\"cqg.rtd\",,\"StudyData\",C24,\"Bar\",,\"Close\",\"D\",\"-1\",,,,,\"T\")-RTD(\"cqg.rtd\",,\"StudyData\",C24,\"Bar\",,\"Close\",\"D\",\"-2\",,,,,\"T\"),RTD(\"cqg.rtd\", ,\"ContractData\",C24, \"NetLastTradeToday\",, \"T\"))","v":6.25},null,{"$f":"RTD(\"cqg.rtd\", ,\"ContractData\",C24, \"Bid\",, \"T\")","v":409.25},{"$f":"RTD(\"cqg.rtd\", ,\"ContractData\",C24, \"Ask\",, \"T\")","v":410.25},null,409.75,null,{"$f":"IF(RTD(\"cqg.rtd\", ,\"ContractData\",C24, \"NetLastTradeToday\",, \"T\")=\"\",RTD(\"cqg.rtd\",,\"StudyData\",C24,\"Bar\",,\"Close\",\"D\",\"-1\",,,,,\"T\")-RTD(\"cqg.rtd\",,\"StudyData\",C24,\"Bar\",,\"Close\",\"D\",\"-2\",,,,,\"T\"),RTD(\"cqg.rtd\", ,\"ContractData\",C24, \"NetLastTradeToday\",, \"T\"))","v":6.25}]
[]
[null,"ZWA"]
[null,1,{"$f":"$B$26&\"?\"&B27","v":"ZWA?1"},{"$f":"RTD(\"cqg.rtd\",,\"StudyData\",C27,\"Bar\",,\"Close\",\"D\",$F$2,,,,,\"T\")","v":509.5},{"$f":"RTD(\"cqg.rtd\", ,\"ContractData\",C27, \"contractMonth\",, \"T\")","v":"JUL"},{"$f":"IF(RTD(\"cqg.rtd\", ,\"ContractData\",C27, \"NetLastTradeToday\",, \"T\")=\"\",RTD(\"cqg.rtd\",,\"StudyData\",C27,\"Bar\",,\"Close\",\"D\",\"-1\",,,,,\"T\")-RTD(\"cqg.rtd\",,\"StudyData\",C27,\"Bar\",,\"Close\",\"D\",\"-2\",,,,,\"T\"),RTD(\"cqg.rtd\", ,\"ContractData\",C27, \"NetLastTradeToday\",, \"T\"))","v":-3.25},null,{"$f":"RTD(\"cqg.rtd\", ,\"ContractData\",C27, \"Bid\",, \"T\")","v":503},{"$f":"RTD(\"cqg.rtd\", ,\"ContractData\",C27, \"Ask\",, \"T\")","v":507.25},null,{"$f":"IFERROR(IF(OR(D27>I27,D27<H27),MEDIAN(I27,H27),D27),NA())","v":505.125},null,{"$f":"IF(RTD(\"cqg.rtd\", ,\"ContractData\",C27, \"NetLastTradeToday\",, \"T\")=\"\",RTD(\"cqg.rtd\",,\"StudyData\",C27,\"Bar\",,\"Close\",\"D\",\"-1\",,,,,\"T\")-RTD(\"cqg.rtd\",,\"StudyData\",C27,\"Bar\",,\"Close\",\"D\",\"-2\",,,,,\"T\"),RTD(\"cqg.rtd\", ,\"ContractData\",C27, \"NetLastTradeToday\",, \"T\"))","v":-3.25}]
[null,2,{"$f":"$B$26&\"?\"&B28","v":"ZWA?2"},{"$f":"RTD(\"cqg.rtd\",,\"StudyData\",C28,\"Bar\",,\"Close\",\"D\",$F$2,,,,,\"T\")","v":507.25},{"$f":"RTD(\"cqg.rtd\", ,\"ContractData\",C28, \"contractMonth\",, \"T\")","v":"SEP"},{"$f":"IF(RTD(\"cqg.rtd\", ,\"ContractData\",C28, \"NetLastTradeToday\",, \"T\")=\"\",RTD(\"cqg.rtd\",,\"StudyData\",C28,\"Bar\",,\"Close\",\"D\",\"-1\",,,,,\"T\")-RTD(\"cqg.rtd\",,\"StudyData\",C28,\"Bar\",,\"Close\",\"D\",\"-2\",,,,,\"T\"),RTD(\"cqg.rtd\", ,\"ContractData\",C28, \"NetLastTradeToday\",, \"T\"))","v":-8},null,{"$f":"RTD(\"cqg.rtd\", ,\"ContractData\",C28, \"Bid\",, \"T\")","v":507.25},{"$f":"RTD(\"cqg.rtd\", ,\"ContractData\",C28, \"Ask\",, \"T\")","v":507.5},null,507.25,null,{"$f":"IF(RTD(\"cqg.rtd\", ,\"ContractData\",C28, \"NetLastTradeToday\",, \"T\")=\"\",RTD(\"cqg.rtd\",,\"StudyData\",C28,\"Bar\",,\"Close\",\"D\",\"-1\",,,,,\"T\")-RTD(\"cqg.rtd\",,\"StudyData\",C28,\"Bar\",,\"Close\",\"D\",\"-2\",,,,,\"T\"),RTD(\"cqg.rtd\", ,\"ContractData\",C28, \"NetLastTradeToday\",, \"T\"))","v":-8}]
[null,3,"ZWA?3",{"$f":"RTD(\"cqg.rtd\",,\"StudyData\",C29,\"Bar\",,\"Close\",\"D\",$F$2,,,,,\"T\")","v":523.5},{"$f":"RTD(\"cqg.rtd\", ,\"ContractData\",C29, \"contractMonth\",, \"T\")","v":"DEC"},{"$f":"IF(RTD(\"cqg.rtd\", ,\"ContractData\",C29, \"NetLastTradeToday\",, \"T\")=\"\",RTD(\"cqg.rtd\",,\"StudyData\",C29,\"Bar\",,\"Close\",\"D\",\"-1\",,,,,\"T\")-RTD(\"cqg.rtd\",,\"StudyData\",C29,\"Bar\",,\"Close\",\"D\",\"-2\",,,,,\"T\"),RTD(\"cqg.rtd\", ,\"ContractData\",C29, \"NetLastTradeToday\",, \"T\"))","v":-6.5},null,{"$f":"RTD(\"cqg.rtd\", ,\"ContractData\",C29, \"Bid\",, \"T\")","v":523.25},{"$f":"RTD(\"cqg.rtd\", ,\"ContractData\",C29, \"Ask\",, \"T\")","v":523.75},null,523.5,null,{"$f":"IF(RTD(\"cqg.rtd\", ,\"ContractData\",C29, \"NetLastTradeToday\",, \"T\")=\"\",RTD(\"cqg.rtd\",,\"StudyData\",C29,\"Bar\",,\"Close\",\"D\",\"-1\",,,,,\"T\")-RTD(\"cqg.rtd\",,\"StudyData\",C29,\"Bar\",,\"Close\",\"D\",\"-2\",,,,,\"T\"),RTD(\"cqg.rtd\", ,\"ContractData\",C29, \"NetLastTradeToday\",, \"T\"))","v":-6.5}]
[null,4,"ZWA?4",{"$f":"RTD(\"cqg.rtd\",,\"StudyData\",C30,\"Bar\",,\"Close\",\"D\",$F$2,,,,,\"T\")","v":538.25},{"$f":"RTD(\"cqg.rtd\", ,\"ContractData\",C30, \"contractMonth\",, \"T\")","v":"MAR"},{"$f":"IF(RTD(\"cqg.rtd\", ,\"ContractData\",C30, \"NetLastTradeToday\",, \"T\")=\"\",RTD(\"cqg.rtd\",,\"StudyData\",C30,\"Bar\",,\"Close\",\"D\",\"-1\",,,,,\"T\")-RTD(\"cqg.rtd\",,\"StudyData\",C30,\"Bar\",,\"Close\",\"D\",\"-2\",,,,,\"T\"),RTD(\"cqg.rtd\", ,\"ContractData\",C30, \"NetLastTradeToday\",, \"T\"))","v":-5.5},null,{"$f":"RTD(\"cqg.rtd\", ,\"ContractData\",C30, \"Bid\",, \"T\")","v":538},{"$f":"RTD(\"cqg.rtd\", ,\"ContractData\",C30, \"Ask\",, \"T\")","v":538.5},null,538.25,null,{"$f":"IF(RTD(\"cqg.rtd\", ,\"ContractData\",C30, \"NetLastTradeToday\",, \"T\")=\"\",RTD(\"cqg.rtd\",,\"StudyData\",C30,\"Bar\",,\"Close\",\"D\",\"-1\",,,,,\"T\")-RTD(\"cqg.rtd\",,\"StudyData\",C30,\"Bar\",,\"Close\",\"D\",\"-2\",,,,,\"T\"),RTD(\"cqg.rtd\", ,\"ContractData\",C30, \"NetLastTradeToday\",, \"T\"))","v":-5.5}]
[null,5,"ZWA?5",{"$f":"RTD(\"cqg.rtd\",,\"StudyData\",C31,\"Bar\",,\"Close\",\"D\",$F$2,,,,,\"T\")","v":547.75},{"$f":"RTD(\"cqg.rtd\", ,\"ContractData\",C31, \"contractMonth\",, \"T\")","v":"MAY"},{"$f":"IF(RTD(\"cqg.rtd\", ,\"ContractData\",C31, \"NetLastTradeToday\",, \"T\")=\"\",RTD(\"cqg.rtd\",,\"StudyData\",C31,\"Bar\",,\"Close\",\"D\",\"-1\",,,,,\"T\")-RTD(\"cqg.rtd\",,\"StudyData\",C31,\"Bar\",,\"Close\",\"D\",\"-2\",,,,,\"T\"),RTD(\"cqg.rtd\", ,\"ContractData\",C31, \"NetLastTradeToday\",, \"T\"))","v":-5.25},null,{"$f":"RTD(\"cqg.rtd\", ,\"ContractData\",C31, \"Bid\",, \"T\")","v":547.5},{"$f":"RTD(\"cqg.rtd\", ,\"ContractData\",C31, \"Ask\",, \"T\")","v":548},null,547.75,null,{"$f":"IF(RTD(\"cqg.rtd\", ,\"ContractData\",C31, \"NetLastTradeToday\",, \"T\")=\"\",RTD(\"cqg.rtd\",,\"StudyData\",C31,\"Bar\",,\"Close\",\"D\",\"-1\",,,,,\"T\")-RTD(\"cqg.rtd\",,\"StudyData\",C31,\"Bar\",,\"Close\",\"D\",\"-2\",,,,,\"T\"),RTD(\"cqg.rtd\", ,\"ContractData\",C31, \"NetLastTradeToday\",, \"T\"))","v":-5.25}]
[null,6,"ZWA?6",{"$f":"RTD(\"cqg.rtd\",,\"StudyData\",C32,\"Bar\",,\"Close\",\"D\",$F$2,,,,,\"T\")","v":552.5},{"$f":"RTD(\"cqg.rtd\", ,\"ContractData\",C32, \"contractMonth\",, \"T\")","v":"JUL"},{"$f":"IF(RTD(\"cqg.rtd\", ,\"ContractData\",C32, \"NetLastTradeToday\",, \"T\")=\"\",RTD(\"cqg.rtd\",,\"StudyData\",C32,\"Bar\",,\"Close\",\"D\",\"-1\",,,,,\"T\")-RTD(\"cqg.rtd\",,\"StudyData\",C32,\"Bar\",,\"Close\",\"D\",\"-2\",,,,,\"T\"),RTD(\"cqg.rtd\", ,\"ContractData\",C32, \"NetLastTradeToday\",, \"T\"))","v":-5},null,{"$f":"RTD(\"cqg.rtd\", ,\"ContractData\",C32, \"Bid\",, \"T\")","v":551.5},{"$f":"RTD(\"cqg.rtd\", ,\"ContractData\",C32, \"Ask\",, \"T\")","v":552},null,551.75,null,{"$f":"IF(RTD(\"cqg.rtd\", ,\"ContractData\",C32, \"NetLastTradeToday\",, \"T\")=\"\",RTD(\"cqg.rtd\",,\"StudyData\",C32,\"Bar\",,\"Close\",\"D\",\"-1\",,,,,\"T\")-RTD(\"cqg.rtd\",,\"StudyData\",C32,\"Bar\",,\"Close\",\"D\",\"-2\",,,,,\"T\"),RTD(\"cqg.rtd\", ,\"ContractData\",C32, \"NetLastTradeToday\",, \"T\"))","v":-5}]
[null,7,"ZWA?7",{"$f":"RTD(\"cqg.rtd\",,\"StudyData\",C33,\"Bar\",,\"Close\",\"D\",$F$2,,,,,\"T\")","v":560.25},{"$f":"RTD(\"cqg.rtd\", ,\"ContractData\",C33, \"contractMonth\",, \"T\")","v":"SEP"},{"$f":"IF(RTD(\"cqg.rtd\", ,\"ContractData\",C33, \"NetLastTradeToday\",, \"T\")=\"\",RTD(\"cqg.rtd\",,\"StudyData\",C33,\"Bar\",,\"Close\",\"D\",\"-1\",,,,,\"T\")-RTD(\"cqg.rtd\",,\"StudyData\",C33,\"Bar\",,\"Close\",\"D\",\"-2\",,,,,\"T\"),RTD(\"cqg.rtd\", ,\"ContractData\",C33, \"NetLastTradeToday\",, \"T\"))","v":-5.75},null,{"$f":"RTD(\"cqg.rtd\", ,\"ContractData\",C33, \"Bid\",, \"T\")","v":560},{"$f":"RTD(\"cqg.rtd\", ,\"ContractData\",C33, \"Ask\",, \"T\")","v":560.75},null,560.25,null,{"$f":"IF(RTD(\"cqg.rtd\", ,\"ContractData\",C33, \"NetLastTradeToday\",, \"T\")=\"\",RTD(\"cqg.rtd\",,\"StudyData\",C33,\"Bar\",,\"Close\",\"D\",\"-1\",,,,,\"T\")-RTD(\"cqg.rtd\",,\"StudyData\",C33,\"Bar\",,\"Close\",\"D\",\"-2\",,,,,\"T\"),RTD(\"cqg.rtd\", ,\"ContractData\",C33, \"NetLastTradeToday\",, \"T\"))","v":-5.75}]
[null,8,"ZWA?8",{"$f":"RTD(\"cqg.rtd\",,\"StudyData\",C34,\"Bar\",,\"Close\",\"D\",$F$2,,,,,\"T\")","v":573.5},{"$f":"RTD(\"cqg.rtd\", ,\"ContractData\",C34, \"contractMonth\",, \"T\")","v":"DEC"},{"$f":"IF(RTD(\"cqg.rtd\", ,\"ContractData\",C34, \"NetLastTradeToday\",, \"T\")=\"\",RTD(\"cqg.rtd\",,\"StudyData\",C34,\"Bar\",,\"Close\",\"D\",\"-1\",,,,,\"T\")-RTD(\"cqg.rtd\",,\"StudyData\",C34,\"Bar\",,\"Close\",\"D\",\"-2\",,,,,\"T\"),RTD(\"cqg.rtd\", ,\"ContractData\",C34, \"NetLastTradeToday\",, \"T\"))","v":-5.5},null,{"$f":"RTD(\"cqg.rtd\", ,\"ContractData\",C34, \"Bid\",, \"T\")","v":572.5},{"$f":"RTD(\"cqg.rtd\", ,\"ContractData\",C34, \"Ask\",, \"T\")","v":573.25},null,572.875,null,{"$f":"IF(RTD(\"cqg.rtd\", ,\"ContractData\",C34, \"NetLastTradeToday\",, \"T\")=\"\",RTD(\"cqg.rtd\",,\"StudyData\",C34,\"Bar\",,\"Close\",\"D\",\"-1\",,,,,\"T\")-RTD(\"cqg.rtd\",,\"StudyData\",C34,\"Bar\",,\"Close\",\"D\",\"-2\",,,,,\"T\"),RTD(\"cqg.rtd\", ,\"ContractData\",C34, \"NetLastTradeToday\",, \"T\"))","v":-5.5}]
[null,9,"ZWA?9",{"$f":"RTD(\"cqg.rtd\",,\"StudyData\",C35,\"Bar\",,\"Close\",\"D\",$F$2,,,,,\"T\")","v":""},{"$f":"RTD(\"cqg.rtd\", ,\"ContractData\",C35, \"contractMonth\",, \"T\")","v":"MAR"},{"$f":"IF(RTD(\"cqg.rtd\", ,\"ContractData\",C35, \"NetLastTradeToday\",, \"T\")=\"\",RTD(\"cqg.rtd\",,\"StudyData\",C35,\"Bar\",,\"Close\",\"D\",\"-1\",,,,,\"T\")-RTD(\"cqg.rtd\",,\"StudyData\",C35,\"Bar\",,\"Close\",\"D\",\"-2\",,,,,\"T\"),RTD(\"cqg.rtd\", ,\"ContractData\",C35, \"NetLastTradeToday\",, \"T\"))","v":13},null,{"$f":"RTD(\"cqg.rtd\", ,\"ContractData\",C35, \"Bid\",, \"T\")","v":580.75},{"$f":"RTD(\"cqg.rtd\", ,\"ContractData\",C35, \"Ask\",, \"T\")","v":582.5},null,581.625,null,{"$f":"IF(RTD(\"cqg.rtd\", ,\"ContractData\",C35, \"NetLastTradeToday\",, \"T\")=\"\",RTD(\"cqg.rtd\",,\"StudyData\",C35,\"Bar\",,\"Close\",\"D\",\"-1\",,,,,\"T\")-RTD(\"cqg.rtd\",,\"StudyData\",C35,\"Bar\",,\"Close\",\"D\",\"-2\",,,,,\"T\"),RTD(\"cqg.rtd\", ,\"ContractData\",C35, \"NetLastTradeToday\",, \"T\"))","v":13}]
[null,10,"ZWA?10",{"$f":"RTD(\"cqg.rtd\",,\"StudyData\",C36,\"Bar\",,\"Close\",\"D\",$F$2,,,,,\"T\")","v":""},{"$f":"RTD(\"cqg.rtd\", ,\"ContractData\",C36, \"contractMonth\",, \"T\")","v":"MAY"},{"$f":"IF(RTD(\"cqg.rtd\", ,\"ContractData\",C36, \"NetLastTradeToday\",, \"T\")=\"\",RTD(\"cqg.rtd\",,\"StudyData\",C36,\"Bar\",,\"Close\",\"D\",\"-1\",,,,,\"T\")-RTD(\"cqg.rtd\",,\"StudyData\",C36,\"Bar\",,\"Close\",\"D\",\"-2\",,,,,\"T\"),RTD(\"cqg.rtd\", ,\"ContractData\",C36, \"NetLastTradeToday\",, \"T\"))","v":13},null,{"$f":"RTD(\"cqg.rtd\", ,\"ContractData\",C36, \"Bid\",, \"T\")","v":581.75},{"$f":"RTD(\"cqg.rtd\", ,\"ContractData\",C36, \"Ask\",, \"T\")","v":588.75},null,{"$f":"IFERROR(IF(OR(D36>I36,D36<H36),MEDIAN(I36,H36),D36),RTD(\"cqg.rtd\", ,\"ContractData\",C36, \"Y_Settlement\",, \"T\"))","v":585.25},null,{"$f":"IF(RTD(\"cqg.rtd\", ,\"ContractData\",C36, \"NetLastTradeToday\",, \"T\")=\"\",RTD(\"cqg.rtd\",,\"StudyData\",C36,\"Bar\",,\"Close\",\"D\",\"-1\",,,,,\"T\")-RTD(\"cqg.rtd\",,\"StudyData\",C36,\"Bar\",,\"Close\",\"D\",\"-2\",,,,,\"T\"),RTD(\"cqg.rtd\", ,\"ContractData\",C36, \"NetLastTradeToday\",, \"T\"))","v":13}]

{"sheet":"Sheet5","index":5,"n_rows":809,"n_cols":2,"rows_kept":809,"cut":false,"hidden":true,"merged":[]}
[]
["Crop Progress"]
[]
["ISSN: 1948-3007"]
[]
["Released July 12, 2010, by the National Agricultural Statistics Service "]
["(NASS), Agricultural Statistics Board, United States Department of "]
["Agriculture (USDA)."]
[]
["Cotton Squaring - Selected States"]
["[These 15 States planted 99% of the 2009 cotton acreage]"]
["-----------------------------------------------------------------"]
["                 :            Week ending            :           "]
["                 :-----------------------------------:           "]
["      State      : July 11,  :  July 4,  : July 11,  : 2005-2009 "]
["                 :   2009    :   2010    :   2010    :  Average  "]
["-----------------------------------------------------------------"]
["                 :                    percent                    "]
["                 :                                               "]
["Alabama .........:    73          56          73          69     "]
["Arizona .........:    76          55          70          84     "]
["Arkansas ........:    85          97          99          96     "]
["California ......:    73          60          75          77     "]
["Georgia .........:    68          70          84          75     "]
["Kansas ..........:    43          38          49          52     "]
["Louisiana .......:    98          91          93          95     "]
["Mississippi .....:    89          93          96          92     "]
["Missouri ........:    66          66          78          81     "]
["North Carolina ..:    84          85          87          90     "]
["Oklahoma ........:    61          35          74          51     "]
["South Carolina ..:    67          55          69          63     "]
["Tennessee .......:    81          77          86          89     "]
["Texas ...........:    72          56          75          58     "]
["Virginia ........:    61          36          62          67     "]
["                 :                                               "]
["15 States .......:    74          64          79          68     "]
["-----------------------------------------------------------------"]
[]
["Cotton Setting Bolls - Selected States"]
["[These 15 States planted 99% of the 2009 cotton acreage]"]
["-----------------------------------------------------------------"]
["                 :            Week ending            :           "]
["                 :-----------------------------------:           "]
["      State      : July 11,  :  July 4,  : July 11,  : 2005-2009 "]
["                 :   2009    :   2010    :   2010    :  Average  "]
["-----------------------------------------------------------------"]
["                 :                    percent                    "]
["                 :                                               "]
["Alabama .........:    14          14          35          20     "]
["Arizona .........:    43          16          25          47     "]
["Arkansas ........:    19          31          68          43     "]
["California ......:    27           7          16          28     "]
["Georgia .........:    19          21          40          29     "]
["Kansas ..........:     1           -           1           1     "]
["Louisiana .......:    57          53          60          59     "]
["Mississippi .....:    35          45          67          42     "]
["Missouri ........:     8          16          32          26     "]
["North Carolina ..:    27          10          35          15     "]
["Oklahoma ........:     2           -          18           5     "]
["South Carolina ..:     8           7          18          10     "]
["Tennessee .......:     5          10          18          19     "]
["Texas ...........:    20          11          14          18     "]
["Virginia ........:    12          16          42          11     "]
["                 :                                               "]
["15 States .......:    20          15          26          23     "]
["-----------------------------------------------------------------"]
[{"$f":"-  Represents zero.","v":{"$error":"#NAME?"}}]
[]
["Cotton Condition - Selected States: Week Ending July 11, 2010"]
["[National crop conditions for selected States are weighted based on 2009"]
["planted acreage]"]
["-----------------------------------------------------------------------------"]
["      State      : Very poor :   Poor    :   Fair    :   Good    : Excellent "]
["-----------------------------------------------------------------------------"]
["                 :                          percent                          "]
["                 :                                                           "]
["Alabama .........:     2           4          30          59           5     "]
["Arizona .........:     -           1          25          65           9     "]
["Arkansas ........:     1           3          28          37          31     "]
["California ......:     -           -          35          55          10     "]
["Georgia .........:     2           7          34          46          11     "]
["Kansas ..........:     -           2          27          59          12     "]
["Louisiana .......:     1          13          26          54           6     "]
["Mississippi .....:     2           8          31          41          18     "]
["Missouri ........:     3          14          27          53           3     "]
["North Carolina ..:     7          17          30          41           5     "]
["Oklahoma ........:     -           1          17          71          11     "]
["South Carolina ..:     -           9          34          48           9     "]
["Tennessee .......:     -           2          25          62          11     "]
["Texas ...........:     2           4          23          51          20     "]
["Virginia ........:     -           -          50          50           -     "]
["                 :                                                           "]
["15 States .......:     2           5          26          51          16     "]
["                 :                                                           "]
["Previous week ...:     2           7          26          52          13     "]
["Previous year ...:     7          16          34          35           8     "]
["-----------------------------------------------------------------------------"]
[{"$f":"-  Represents zero.","v":{"$error":"#NAME?"}}]
[]
["Corn Silking - Selected States"]
["[These 18 States planted 92% of the 2009 corn acreage]"]
["-----------------------------------------------------------------"]
["                 :            Week ending            :           "]
["                 :-----------------------------------:           "]
["      State      : July 11,  :  July 4,  : July 11,  : 2005-2009 "]
["                 :   2009    :   2010    :   2010    :  Average  "]
["-----------------------------------------------------------------"]
["                 :                    percent                    "]
["                 :                                               "]
["Colorado ........:     9           2            6         11     "]
["Illinois ........:    10          46           72         41     "]
["Indiana .........:    10          31           62         24     "]
["Iowa ............:     5           2           24         13     "]
["Kansas ..........:    47          32           52         52     "]
["Kentucky ........:    35          51           68         57     "]
["Michigan ........:     1           3           30          8     "]
["Minnesota .......:     1           2           14         12     "]
["Missouri ........:    45          45           60         59     "]
["Nebraska ........:    22           7           26         28     "]
["North Carolina ..:    91          95          100         87     "]
["North Dakota ....:     1           2            9          7     "]
["Ohio ............:    10          14           44         12     "]
["Pennsylvania ....:    19          14           21         16     "]
["South Dakota ....:     -           -            1          2     "]
["Tennessee .......:    78          81           91         82     "]
["Texas ...........:    77          55           74         72     "]
["Wisconsin .......:     1           -           13          4     "]
["                 :                                               "]
["18 States .......:    15          19           38         26     "]
["-----------------------------------------------------------------"]
[{"$f":"-  Represents zero.","v":{"$error":"#NAME?"}}]
[]
["Corn Condition - Selected States: Week Ending July 11, 2010"]
["[National crop conditions for selected States are weighted based on 2009"]
["planted acreage]"]
["-----------------------------------------------------------------------------"]
["      State      : Very poor :   Poor    :   Fair    :   Good    : Excellent "]
["-----------------------------------------------------------------------------"]
["                 :                          percent                          "]
["                 :                                                           "]
["Colorado ........:     -           1          10          67          22     "]
["Illinois ........:     3           9          23          47          18     "]
["Indiana .........:     3           9          26          46          16     "]
["Iowa ............:     3           7          19          51          20     "]
["Kansas ..........:     1           5          20          60          14     "]
["Kentucky ........:     2           7          26          50          15     "]
["Michigan ........:     1           5          16          47          31     "]
["Minnesota .......:     -           3           9          57          31     "]
["Missouri ........:     6          16          28          36          14     "]
["Nebraska ........:     1           3          10          64          22     "]
["North Carolina ..:    11          24          30          29           6     "]
["North Dakota ....:     1           1           9          70          19     "]
["Ohio ............:     2           9          25          47          17     "]
["Pennsylvania ....:     8          20          31          32           9     "]
["South Dakota ....:     1           5          19          53          22     "]
["Tennessee .......:     7          14          30          38          11     "]
["Texas ...........:     3           6          17          56          18     "]
["Wisconsin .......:     1           4          11          46          38     "]
["                 :                                                           "]
["18 States .......:     2           7          18          52          21     "]
["                 :                                                           "]
["Previous week ...:     3           7          19          51          20     "]
["Previous year ...:     2           6          21          52          19     "]
["-----------------------------------------------------------------------------"]
[{"$f":"-  Represents zero.","v":{"$error":"#NAME?"}}]
[]
["Soybeans Blooming - Selected States"]
["[These 18 States planted 95% of the 2009 soybean acreage]"]
["-----------------------------------------------------------------"]
["                 :            Week ending            :           "]
["                 :-----------------------------------:           "]
["      State      : July 11,  :  July 4,  : July 11,  : 2005-2009 "]
["                 :   2009    :   2010    :   2010    :  Average  "]
["-----------------------------------------------------------------"]
["                 :                    percent                    "]
["                 :                                               "]
["Arkansas ........:    35          46          55          42     "]
["Illinois ........:    10          20          43          38     "]
["Indiana .........:    11          23          48          27     "]
["Iowa ............:    37          27          46          47     "]
["Kansas ..........:    24          10          19          30     "]
["Kentucky ........:    16          35          49          28     "]
["Louisiana .......:    76          65          79          79     "]
["Michigan ........:    15          26          40          23     "]
["Minnesota .......:    10          19          35          34     "]
["Mississippi .....:    83          74          87          90     "]
["Missouri ........:    15           8          21          23     "]
["Nebraska ........:    28          17          38          40     "]
["North Carolina ..:     -           5          16           4     "]
["North Dakota ....:    12          25          40          35     "]
["Ohio ............:    23          18          43          35     "]
["South Dakota ....:    27          13          33          32     "]
["Tennessee .......:    27          34          49          44     "]
["Wisconsin .......:     8          10          21          24     "]
["                 :                                               "]
["18 States .......:    22          23          40          37     "]
["-----------------------------------------------------------------"]
[{"$f":"-  Represents zero.","v":{"$error":"#NAME?"}}]
[]
["Soybeans Setting Pods - Selected States"]
["[These 18 States planted 95% of the 2009 soybean acreage]"]
["-----------------------------------------------------------------"]
["                 :            Week ending            :           "]
["                 :-----------------------------------:           "]
["      State      : July 11,  :  July 4,  : July 11,  : 2005-2009 "]
["                 :   2009    :   2010    :   2010    :  Average  "]
["-----------------------------------------------------------------"]
["                 :                    percent                    "]
["                 :                                               "]
["Arkansas ........:    10         (NA)         29          18     "]
["Illinois ........:     3         (NA)          6           5     "]
["Indiana .........:     -         (NA)          9           2     "]
["Iowa ............:     3         (NA)          4           6     "]
["Kansas ..........:     -         (NA)          -           3     "]
["Kentucky ........:     -         (NA)          7           3     "]
["Louisiana .......:    64         (NA)         49          60     "]
["Michigan ........:     -         (NA)         10           2     "]
["Minnesota .......:     -         (NA)          2           2     "]
["Mississippi .....:    54         (NA)         68          63     "]
["Missouri ........:     -         (NA)          3           3     "]
["Nebraska ........:     -         (NA)          2           -     "]
["North Carolina ..:     -         (NA)          2           -     "]
["North Dakota ....:     -         (NA)          3           5     "]
["Ohio ............:     2         (NA)          4           2     "]
["South Dakota ....:     -         (NA)          1           2     "]
["Tennessee .......:     5         (NA)         21          18     "]
["Wisconsin .......:     -         (NA)          -           1     "]
["                 :                                               "]
["18 States .......:     4         (NA)          8           7     "]
["-----------------------------------------------------------------"]
[{"$f":"-     Represents zero.","v":{"$error":"#NAME?"}}]
["(NA)  Not available.                                             "]
[]
["Soybean Condition - Selected States: Week Ending July 11, 2010"]
["[National crop conditions for selected States are weighted based on 2009"]
["planted acreage]"]
["-----------------------------------------------------------------------------"]
["      State      : Very poor :   Poor    :   Fair    :   Good    : Excellent "]
["-----------------------------------------------------------------------------"]
["                 :                          percent                          "]
["                 :                                                           "]
["Arkansas ........:     4          15          36          36           9     "]
["Illinois ........:     3           9          26          48          14     "]
["Indiana .........:     3           8          27          48          14     "]
["Iowa ............:     3           7          21          52          17     "]
["Kansas ..........:     1           4          25          57          13     "]
["Kentucky ........:     1           4          27          44          24     "]
["Louisiana .......:     1          12          32          50           5     "]
["Michigan ........:     1           5          22          49          23     "]
["Minnesota .......:     1           3          13          62          21     "]
["Mississippi .....:     4          14          28          37          17     "]
["Missouri ........:     6          15          35          36           8     "]
["Nebraska ........:     2           3          15          63          17     "]
["North Carolina ..:     5          16          35          41           3     "]
["North Dakota ....:     1           2          10          72          15     "]
["Ohio ............:     3           9          30          46          12     "]
["South Dakota ....:     2           7          22          53          16     "]
["Tennessee .......:     3           7          28          53           9     "]
["Wisconsin .......:     1           2          15          57          25     "]
["                 :                                                           "]
["18 States .......:     3           8          24          50          15     "]
["                 :                                                           "]
["Previous week ...:     2           8          24          51          15     "]
["Previous year ...:     2           6          26          52          14     "]
["-----------------------------------------------------------------------------"]
[]
["Peanuts Pegging - Selected States"]
["[These 8 States planted 97% of the 2009 peanut acreage]"]
["-----------------------------------------------------------------"]
["                 :            Week ending            :           "]
["                 :-----------------------------------:           "]
["      State      : July 11,  :  July 4,  : July 11,  : 2005-2009 "]
["                 :   2009    :   2010    :   2010    :  Average  "]
["-----------------------------------------------------------------"]
["                 :                    percent                    "]
["                 :                                               "]
["Alabama .........:    27          23          31          26     "]
["Florida .........:    54          36          45          55     "]
["Georgia .........:    39          41          58          50     "]
["North Carolina ..:    78          55          64          52     "]
["Oklahoma ........:    54          52          60          72     "]
["South Carolina ..:    65          52          71          60     "]
["Texas ...........:    45          37          65          43     "]
["Virginia ........:    51          27          41          44     "]
["                 :                                               "]
["8 States ........:    44          39          55          47     "]
["-----------------------------------------------------------------"]
[]
["Peanut Condition - Selected States: Week Ending July 11, 2010"]
["[National crop conditions for selected States are weighted based on 2009"]
["planted acreage]"]
["-----------------------------------------------------------------------------"]
["      State      : Very poor :   Poor    :   Fair    :   Good    : Excellent "]
["-----------------------------------------------------------------------------"]
["                 :                          percent                          "]
["                 :                                                           "]
["Alabama .........:     -           5          35          54           6     "]
["Florida .........:     1           1          21          63          14     "]
["Georgia .........:     1           4          32          49          14     "]
["North Carolina ..:     1          15          52          30           2     "]
["Oklahoma ........:     -           -           6          78          16     "]
["South Carolina ..:     1          11          24          61           3     "]
["Texas ...........:     -           -           8          68          24     "]
["Virginia ........:     -           2          40          58           -     "]
["                 :                                                           "]
["8 States ........:     1           4          28          54          13     "]
["                 :                                                           "]
["Previous week ...:     -           3          25          56          16     "]
["Previous year ...:     1           3          35          52           9     "]
["-----------------------------------------------------------------------------"]
[{"$f":"-  Represents zero.","v":{"$error":"#NAME?"}}]
[]
["Sorghum Headed - Selected States"]
["[These 11 States planted 98% of the 2009 sorghum acreage]"]
["-----------------------------------------------------------------"]
["                 :            Week ending            :           "]
["                 :-----------------------------------:           "]
["      State      : July 11,  :  July 4,  : July 11,  : 2005-2009 "]
["                 :   2009    :   2010    :   2010    :  Average  "]
["-----------------------------------------------------------------"]
["                 :                    percent                    "]
["                 :                                               "]
["Arkansas ........:    59          66          85          62     "]
["Colorado ........:    12           3           7          11     "]
["Illinois ........:     -           5          25          11     "]
["Kansas ..........:     -           1           2           2     "]
["Louisiana .......:    88          87          95          83     "]
["Missouri ........:     4           6          14          12     "]
["Nebraska ........:     -           -           1           -     "]
["New Mexico ......:     2           -           1           2     "]
["Oklahoma ........:     4           -          16           9     "]
["South Dakota ....:     5           -           -           7     "]
["Texas ...........:    59          56          57          64     "]
["                 :                                               "]
["11 States .......:    26          25          27          30     "]
["-----------------------------------------------------------------"]
[{"$f":"-  Represents zero.","v":{"$error":"#NAME?"}}]
[]
["Sorghum Coloring - Selected States"]
["[These 11 States planted 98% of the 2009 sorghum acreage]"]
["-----------------------------------------------------------------"]
["                 :            Week ending            :           "]
["                 :-----------------------------------:           "]
["      State      : July 11,  :  July 4,  : July 11,  : 2005-2009 "]
["                 :   2009    :   2010    :   2010    :  Average  "]
["-----------------------------------------------------------------"]
["                 :                    percent                    "]
["                 :                                               "]
["Arkansas ........:     -           -           4           4     "]
["Colorado ........:     3           -           1           2     "]
["Illinois ........:     -           -           -           -     "]
["Kansas ..........:     -           -           -           -     "]
["Louisiana .......:    13          25          51          22     "]
["Missouri ........:     -           -           1           -     "]
["Nebraska ........:     -           -           -           -     "]
["New Mexico ......:     -           -           -           -     "]
["Oklahoma ........:     -           -           -           1     "]
["South Dakota ....:     -           -           -           -     "]
["Texas ...........:    53          45          46          53     "]
["                 :                                               "]
["11 States .......:    22          19          20          22     "]
["-----------------------------------------------------------------"]
[{"$f":"-  Represents zero.","v":{"$error":"#NAME?"}}]
[]
["Sorghum Condition - Selected States: Week Ending July 11, 2010"]
["[National crop conditions for selected States are weighted based on 2009"]
["planted acreage]"]
["-----------------------------------------------------------------------------"]
["      State      : Very poor :   Poor    :   Fair    :   Good    : Excellent "]
["-----------------------------------------------------------------------------"]
["                 :                          percent                          "]
["                 :                                                           "]
["Arkansas ........:     2          10          49          37           2     "]
["Colorado ........:     -           3          24          71           2     "]
["Illinois ........:     3           4          21          52          20     "]
["Kansas ..........:     -           3          21          69           7     "]
["Louisiana .......:     1           6          32          58           3     "]
["Missouri ........:     2           7          30          48          13     "]
["Nebraska ........:     -           1          14          64          21     "]
["New Mexico ......:     1           2          29          67           1     "]
["Oklahoma ........:     1           1          33          56           9     "]
["South Dakota ....:     -           1           9          70          20     "]
["Texas ...........:     2           3          24          58          13     "]
["                 :                                                           "]
["11 States .......:     1           3          23          63          10     "]
["                 :                                                           "]
["Previous week ...:     -           3          26          60          11     "]
["Previous year ...:    11          10          27          45           7     "]
["-----------------------------------------------------------------------------"]
[{"$f":"-  Represents zero.","v":{"$error":"#NAME?"}}]
[]
["Rice Headed - Selected States"]
["[These 6 States planted 100% of the 2009 rice acreage]"]
["-----------------------------------------------------------------"]
["                 :            Week ending            :           "]
["                 :-----------------------------------:           "]
["      State      : July 11,  :  July 4,  : July 11,  : 2005-2009 "]
["                 :   2009    :   2010    :   2010    :  Average  "]
["-----------------------------------------------------------------"]
["                 :                    percent                    "]
["                 :                                               "]
["Arkansas ........:     5           8          16           3     "]
["California ......:     -           -           -           1     "]
["Louisiana .......:    40          45          57          50     "]
["Mississippi .....:    10          18          38          12     "]
["Missouri ........:     -           2           7           4     "]
["Texas ...........:    69          19          37          63     "]
["                 :                                               "]
["6 States ........:    13          13          22          14     "]
["-----------------------------------------------------------------"]
[{"$f":"-  Represents zero.","v":{"$error":"#NAME?"}}]
[]
["Rice Condition - Selected States: Week Ending July 11, 2010"]
["[National crop conditions for selected States are weighted based on 2009"]
["planted acres]"]
["-----------------------------------------------------------------------------"]
["      State      : Very poor :   Poor    :   Fair    :   Good    : Excellent "]
["-----------------------------------------------------------------------------"]
["                 :                          percent                          "]
["                 :                                                           "]
["Arkansas ........:     1           5          30          43          21     "]
["California ......:     -           5          15          70          10     "]
["Louisiana .......:     -           2          17          54          27     "]
["Mississippi .....:     -           4          18          49          29     "]
["Missouri ........:     -           3          12          60          25     "]
["Texas ...........:     -           4          17          49          30     "]
["                 :                                                           "]
["6 States ........:     -           4          23          52          21     "]
["                 :                                                           "]
["Previous week ...:     -           5          23          51          21     "]
["Previous year ...:     1           6          31          46          16     "]
["-----------------------------------------------------------------------------"]
[{"$f":"-  Represents zero.","v":{"$error":"#NAME?"}}]
[]
["Winter Wheat Harvested - Selected States"]
["[These 18 States harvested 89% of the 2009 winter wheat acreage]"]
["-----------------------------------------------------------------"]
["                 :            Week ending            :           "]
["                 :-----------------------------------:           "]
["      State      : July 11,  :  July 4,  : July 11,  : 2005-2009 "]
["                 :   2009    :   2010    :   2010    :  Average  "]
["-----------------------------------------------------------------"]
["                 :                    percent                    "]
["                 :                                               "]
["Arkansas ........:    100         100         100         100    "]
["California ......:     94          70          85          96    "]
["Colorado ........:     23          21          41          52    "]
["Idaho ...........:      -           -           -           -    "]
["Illinois ........:     82          85          95          89    "]
["Indiana .........:     79          71          94          79    "]
["Kansas ..........:     94          84          92          93    "]
["Michigan ........:      1           -          43          12    "]
["Missouri ........:     95          93          98          92    "]
["Montana .........:      -           -           -           1    "]
["Nebraska ........:     26          13          22          47    "]
["North Carolina ..:    100         100         100          98    "]
["Ohio ............:     63          48          95          57    "]
["Oklahoma ........:    100          90          92          94    "]
["Oregon ..........:      5           1           4           7    "]
["South Dakota ....:      1           -           4          18    "]
["Texas ...........:     94          78          91          94    "]
["Washington ......:      4           -           -           3    "]
["                 :                                               "]
["18 States .......:     61          54          63          65    "]
["-----------------------------------------------------------------"]
[{"$f":"-  Represents zero.","v":{"$error":"#NAME?"}}]
[]
["Spring Wheat Headed - Selected States"]
["[These 6 States planted 99% of the 2009 spring wheat acreage]"]
["-----------------------------------------------------------------"]
["                 :            Week ending            :           "]
["                 :-----------------------------------:           "]
["      State      : July 11,  :  July 4,  : July 11,  : 2005-2009 "]
["                 :   2009    :   2010    :   2010    :  Average  "]
["-----------------------------------------------------------------"]
["                 :                    percent                    "]
["                 :                                               "]
["Idaho ...........:    58          25          49          71     "]
["Minnesota .......:    59          91          96          82     "]
["Montana .........:    44          15          45          65     "]
["North Dakota ....:    44          49          72          77     "]
["South Dakota ....:    86          89          95          95     "]
["Washington ......:    98          62          82          95     "]
["                 :                                               "]
["6 States ........:    54          52          72          78     "]
["-----------------------------------------------------------------"]
[]
["Spring Wheat Condition - Selected States: Week Ending July 11, 2010"]
["[National crop conditions for selected States are weighted based on 2009"]
["planted acreage]"]
["-----------------------------------------------------------------------------"]
["      State      : Very poor :   Poor    :   Fair    :   Good    : Excellent "]
["-----------------------------------------------------------------------------"]
["                 :                          percent                          "]
["                 :                                                           "]
["Idaho ...........:     -           -           3          89           8     "]
["Minnesota .......:     1           3          12          55          29     "]
["Montana .........:     -           2          17          65          16     "]
["North Dakota ....:     1           2          14          69          14     "]
["South Dakota ....:     -           2          17          57          24     "]
["Washington ......:     -           2          19          57          22     "]
["                 :                                                           "]
["6 States ........:     1           2          14          66          17     "]
["                 :                                                           "]
["Previous week ...:     -           2          15          65          18     "]
["Previous year ...:     1           4          24          57          14     "]
["-----------------------------------------------------------------------------"]
[{"$f":"-  Represents zero.","v":{"$error":"#NAME?"}}]
[]
["Oats Headed - Selected States"]
["[These 9 States planted 64% of the 2009 oat acreage]"]
["-----------------------------------------------------------------"]
["                 :            Week ending            :           "]
["                 :-----------------------------------:           "]
["      State      : July 11,  :  July 4,  : July 11,  : 2005-2009 "]
["                 :   2009    :   2010    :   2010    :  Average  "]
["-----------------------------------------------------------------"]
["                 :                    percent                    "]
["                 :                                               "]
["Iowa ............:     95          98          99          97    "]
["Minnesota .......:     80          93          98          90    "]
["Nebraska ........:     98          96          98          98    "]
["North Dakota ....:     56          49          77          77    "]
["Ohio ............:     97          92          95          99    "]
["Pennsylvania ....:     96          97          98          94    "]
["South Dakota ....:     90          78          95          95    "]
["Texas ...........:    100         100         100         100    "]
["Wisconsin .......:     90          94          98          93    "]
["                 :                                               "]
["9 States ........:     87          87          95          93    "]
["-----------------------------------------------------------------"]
[]
["Oats Harvested - Selected States"]
["[These 9 States harvested 67% of the 2009 oat acreage]"]
["-----------------------------------------------------------------"]
["                 :            Week ending            :           "]
["                 :-----------------------------------:           "]
["      State      : July 11,  :  July 4,  : July 11,  : 2005-2009 "]
["                 :   2009    :   2010    :   2010    :  Average  "]
["-----------------------------------------------------------------"]
["                 :                    percent                    "]
["                 :                                               "]
["Iowa ............:     2         (NA)          6           6     "]
["Minnesota .......:     -         (NA)          2           1     "]
["Nebraska ........:     7         (NA)          7          21     "]
["North Dakota ....:     -         (NA)          -           -     "]
["Ohio ............:     4         (NA)          5           3     "]
["Pennsylvania ....:     -         (NA)         10           -     "]
["South Dakota ....:     -         (NA)          -           3     "]
["Texas ...........:    99         (NA)         94          97     "]
["Wisconsin .......:     -         (NA)          2           1     "]
["                 :                                               "]
["9 States ........:     7         (NA)          9           8     "]
["-----------------------------------------------------------------"]
[{"$f":"-     Represents zero.","v":{"$error":"#NAME?"}}]
["(NA)  Not available.                                             "]
[]
["Oat Condition - Selected States: Week Ending July 11, 2010"]
["[National crop conditions for selected States are weighted based on 2009"]
["planted acreage]"]
["-----------------------------------------------------------------------------"]
["      State      : Very poor :   Poor    :   Fair    :   Good    : Excellent "]
["-----------------------------------------------------------------------------"]
["                 :                          percent                          "]
["                 :                                                           "]
["Iowa ............:     2           5          19          56          18     "]
["Minnesota .......:     1           1          11          64          23     "]
["Nebraska ........:     -           1           8          65          26     "]
["North Dakota ....:     1           1          16          73           9     "]
["Ohio ............:     -           4          30          54          12     "]
["Pennsylvania ....:     -           4          19          55          22     "]
["South Dakota ....:     -           3          11          65          21     "]
["Texas ...........:     2           7          18          52          21     "]
["Wisconsin .......:     -           3          10          59          28     "]
["                 :                                                           "]
["9 States ........:     1           4          15          60          20     "]
["                 :                                                           "]
["Previous week ...:     1           4          14          63          18     "]
["Previous year ...:    15           7          19          48          11     "]
["-----------------------------------------------------------------------------"]
[{"$f":"-  Represents zero.","v":{"$error":"#NAME?"}}]
[]
["Barley Headed - Selected States"]
["[These 5 States planted 79% of the 2009 barley acreage]"]
["-----------------------------------------------------------------"]
["                 :            Week ending            :           "]
["                 :-----------------------------------:           "]
["      State      : July 11,  :  July 4,  : July 11,  : 2005-2009 "]
["                 :   2009    :   2010    :   2010    :  Average  "]
["-----------------------------------------------------------------"]
["                 :                    percent                    "]
["                 :                                               "]
["Idaho ...........:    58          38          61          66     "]
["Minnesota .......:    56          89          97          81     "]
["Montana .........:    42          28          50          65     "]
["North Dakota ....:    48          54          81          79     "]
["Washington ......:    96          57          84          94     "]
["                 :                                               "]
["5 States ........:    50          44          68          73     "]
["-----------------------------------------------------------------"]
[]
["Barley Condition - Selected States: Week Ending July 11, 2010"]
["[National crop conditions for selected States are weighted based on 2009"]
["planted acreage]"]
["-----------------------------------------------------------------------------"]
["      State      : Very poor :   Poor    :   Fair    :   Good    : Excellent "]
["-----------------------------------------------------------------------------"]
["                 :                          percent                          "]
["                 :                                                           "]
["Idaho ...........:     -           -           2          89           9     "]
["Minnesota .......:     3           4          14          44          35     "]
["Montana .........:     -           1          13          56          30     "]
["North Dakota ....:     1           5          14          65          15     "]
["Washington ......:     -           -           9          70          21     "]
["                 :                                                           "]
["5 States ........:     1           3          11          66          19     "]
["                 :                                                           "]
["Previous week ...:     -           2          13          67          18     "]
["Previous year ...:     -           3          19          64          14     "]
["-----------------------------------------------------------------------------"]
[{"$f":"-  Represents zero.","v":{"$error":"#NAME?"}}]
[]
["Pasture and Range Condition - Selected States: Week Ending July 11, 2010"]
["[National pasture and range conditions for selected States are weighted"]
["based on pasture acreage and/or livestock inventories]"]
["-----------------------------------------------------------------------------"]
["      State      : Very poor :   Poor    :   Fair    :   Good    : Excellent "]
["-----------------------------------------------------------------------------"]
["                 :                          percent                          "]
["                 :                                                           "]
["Alabama .........:     -           9          41          45           5     "]
["Arizona .........:    17          28          46           7           2     "]
["Arkansas ........:     3          10          40          44           3     "]
["California ......:     5           5          20          65           5     "]
["Colorado ........:     1           5          29          55          10     "]
["Connecticut .....:     -          24          48          28           -     "]
["Delaware ........:    12          27          48          13           -     "]
["Florida .........:     -           -          15          60          25     "]
["Georgia .........:     1           8          45          43           3     "]
["Idaho ...........:     -           5           9          60          26     "]
["Illinois ........:     1           3          17          58          21     "]
["Indiana .........:     2           5          23          51          19     "]
["Iowa ............:     1           3          20          55          21     "]
["Kansas ..........:     1           3          20          63          13     "]
["Kentucky ........:     2          11          33          46           8     "]
["Louisiana .......:     3          11          38          39           9     "]
["Maine ...........:     -           -          26          57          17     "]
["Maryland ........:    25          30          25          20           -     "]
["Massachusetts ...:     -           6          35          59           -     "]
["Michigan ........:     -           3          20          56          21     "]
["Minnesota .......:     -           2          12          64          22     "]
["Mississippi .....:     7          15          31          37          10     "]
["Missouri ........:    12           9          28          41          10     "]
["Montana .........:     1           3          14          50          32     "]
["Nebraska ........:     -           1           6          75          18     "]
["Nevada ..........:     -           4          34          51          11     "]
["New Hampshire ...:     6           6          23          65           -     "]
["New Jersey ......:     -          20          30          50           -     "]
["New Mexico ......:     7          19          36          36           2     "]
["New York ........:     3           9          30          49           9     "]
["North Carolina ..:    13          31          32          22           2     "]
["North Dakota ....:     -           2          20          64          14     "]
["Ohio ............:     1           4          25          54          16     "]
["Oklahoma ........:     1           6          28          51          14     "]
["Oregon ..........:     1           3          24          56          16     "]
["Pennsylvania ....:    15          20          38          25           2     "]
["Rhode Island ....:     -           -          40          58           2     "]
["South Carolina ..:     4          14          43          39           -     "]
["South Dakota ....:     -           2           9          56          33     "]
["Tennessee .......:     7          18          41          32           2     "]
["Texas ...........:     3          10          26          41          20     "]
["Utah ............:     -           3          18          68          11     "]
["Vermont .........:     -          18          29          37          16     "]
["Virginia ........:    22          42          25          10           1     "]
["Washington ......:     -          10          28          44          18     "]
["West Virginia ...:    13          28          40          18           1     "]
["Wisconsin .......:     -           1          10          61          28     "]
["Wyoming .........:     -           -          10          70          20     "]
["                 :                                                           "]
["48 States .......:     3           8          24          50          15     "]
["                 :                                                           "]
["Previous week ...:     3           8          24          51          14     "]
["Previous year ...:    10          13          27          40          10     "]
["-----------------------------------------------------------------------------"]
[{"$f":"-  Represents zero.","v":{"$error":"#NAME?"}}]
[]
["Crop Progress and Condition Tables Expected Next Week"]
[]
["Barley: Headed, Condition"]
["Corn: Silking, Dough, Condition"]
["Cotton: Squaring, Setting Bolls, Condition"]
["Oats: Harvested, Condition"]
["Pasture and Range: Condition"]
["Peanuts: Pegging, Condition"]
["Rice: Headed, Condition"]
["Sorghum: Headed, Coloring, Condition"]
["Soybeans: Blooming, Setting Pods, Condition"]
["Spring Wheat: Headed, Condition"]
["Winter Wheat: Harvested"]
[]
["Statistical Methodology"]
[]
["Survey Procedures: Crop progress and condition estimates are based on survey "]
["data collected each week from early April through the end of November. The "]
["non-probability crop progress and condition surveys include input from "]
["approximately 5,000 reporters whose occupations provide them opportunities to "]
["make visual observations and frequently bring them in contact with farmers in "]
["their counties. Based on standard definitions, these reporters subjectively "]
["estimate the progress of crops through various stages of development, as well "]
["as the progress of producer activities. They also provide subjective "]
["evaluations of crop conditions."]
[]
["Most reporters complete their questionnaires on Friday or early Monday "]
["morning and submit them to the National Agricultural Statistics Service "]
["(NASS) Field Offices in their States by mail, telephone, fax, e-mail, or "]
["through a secured internet website. A small number of reports are completed "]
["on Thursday, Saturday, and Sunday. Regardless of when questionnaires are "]
["completed, reporters are asked to report for the entire week ending on "]
["Sunday. For reports submitted prior to the Sunday reference date, a degree of "]
["uncertainty is introduced by projections for weekend changes in progress and "]
["condition. By the end of the 2009 season, over 80 percent of the data were "]
["being submitted through the internet website. As a result, the majority of "]
["all data are submitted on Monday morning, significantly reducing projection "]
["uncertainty."]
[]
["Reporters are sent written reporting instructions at the beginning of each "]
["season and are contacted periodically to ensure proper reporting. Terms and "]
["definitions of crop stages and condition categories used as reporting "]
["guidelines are available on the NASS website at "]
["www.nass.usda.gov/Publications/National_Crop_Progress."]
[]
["Estimating Procedures: Reported data are reviewed for reasonableness and "]
["consistency by comparing with data reported the previous week and data "]
["reported in surrounding counties for the current week. Each State Field "]
["Office summarizes the reported data to district and State levels, weighting "]
["each county's reported data by NASS county acreage estimates. Summarized "]
["indications are compared with previous week estimates, and progress items are "]
["compared with earlier stages of development and historical averages to ensure "]
["reasonableness. Weather events and reporter comments are also taken into "]
["consideration. State estimates are submitted to the Agricultural Statistics "]
["Board (ASB) along with supporting comments, where they are compared with "]
["surrounding States and compiled into a National level summary by weighting "]
["each State by its acreage estimates."]
[" "]
["Revision Policy: Progress and condition estimates in the Crop Progress report "]
["are released after 4:00 pm ET on the first business day of the week. These "]
["estimates are preliminary and subject to corrections or updates in the Weekly "]
["Weather and Crop Bulletin that is released at 12:00 pm ET on the second "]
["business day of the week. These estimates are subject to revision the "]
["following week."]
[]
["Information Contacts"]
[]
["Listed below are the commodity statisticians in the Crops Branch of the "]
["National Agricultural Statistics Service to contact for additional "]
["information. E-mail inquiries may be sent to nass@nass.usda.gov"]
[]
["Lance Honig, Chief, Crops Branch........................... (202) 720-2127"]
[]
["Jacqueline Moore, Head, Field Crops Section................ (202) 720-2127"]
["     Suzanne Avilla - Peanuts, Rice........................ (202) 720-7688"]
["     Shiela Corley - Cotton, Cotton Ginnings, Sorghum...... (202) 720-5944"]
["     Bryan Durham - Hay, Oats.............................. (202) 690-3234"]
["     Anthony Prillaman - Corn, Proso Millet, Flaxseed...... (202) 720-9526"]
["     Nick Schauer - Wheat, Rye............................. (202) 720-8068"]
["     Julie Schmidt - Crop Weather, Barley, Sugar Crops..... (202) 720-7621"]
["     Travis Thorson - Soybeans, Sunflower, Other Oilseeds.. (202) 720-7369"]
[]
["Access to NASS Reports"]
[]
["For your convenience, you may access NASS reports and products the following "]
["ways:"]
[]
[" ","All reports are available electronically, at no cost, on the NASS web "]
["site: http://www.nass.usda.gov"]
[]
[" ","Both national and state specific reports are available via a free e-"]
["mail subscription. To set-up this free subscription, visit "]
["http://www.nass.usda.gov and in the \"Receive NASS Updates\" box under "]
["Receive reports by Email, click on \"National\" or \"State\" to select "]
["the reports you would like to receive. "]
[]
[" ","Printed reports may be purchased from the National Technical "]
["Information Service (NTIS) by calling toll-free (800) 999-6779, or "]
["(703) 605-6220 if calling from outside the United States or Canada. "]
["Accepted methods of payment are Visa, MasterCard, check, or money "]
["order.  "]
[]
["For more information on NASS surveys and reports, call the NASS Agricultural "]
["Statistics Hotline at (800) 727-9540, 7:30 a.m. to 4:00 p.m. ET, or e-mail: "]
["nass@nass.usda.gov. "]
["                                                                                "]
["The United States Department of Agriculture (USDA) prohibits discrimination "]
["in all its programs and activities on the basis of race, color, national "]
["origin, age, disability, and where applicable, sex, marital status, familial "]
["status, parental status, religion, sexual orientation, genetic information, "]
["political beliefs, reprisal, or because all or a part of an individual's "]
["income is derived from any public assistance program. (Not all prohibited "]
["bases apply to all programs.) Persons with disabilities who require "]
["alternative means for communication of program information (Braille, large "]
["print, audiotape, etc.) should contact USDA's TARGET Center at (202) 720-2600 "]
["(voice and TDD)."]
[]
["To file a complaint of discrimination, write to USDA, Director, Office of "]
["Civil Rights, 1400 Independence Avenue, S.W., Washington, D.C. 20250-9410, or "]
["call (800) 795-3272 (voice) or (202) 720-6382 (TDD). USDA is an equal "]
["opportunity provider and employer."]
[]
[" "]

{"sheet":"Sheet6","index":6,"n_rows":108,"n_cols":22,"rows_kept":108,"cut":false,"hidden":true,"merged":[[33,3,33,6]]}
[{"$f":"IFERROR(INDIRECT(O3),\"\")","v":"Soybeans Blooming - Selected States"},{"$f":"P1","v":"$A$11"},{"$f":"INDIRECT(B1)","v":"Arkansas ........:    35          46          55          42     "},{"$f":"TRIM(RIGHT(INDIRECT(B1),LEN(INDIRECT(B1))-FIND(\":\",INDIRECT(B1))))","v":"35 46 55 42"},{"$f":"IF($M$14=1,VLOOKUP(LEFT(C1,2),$U$1:$V$50,2,FALSE),IFERROR(LEFT(INDIRECT(B1),FIND(\".\",INDIRECT(B1))-2),\"\"))","v":"Arkansas"},{"$f":"IFERROR(LEFT(D1,FIND(\" \",D1)),\"\")","v":"35 "},{"$f":"IFERROR(RIGHT(LEFT(D1,FIND(\"~\",SUBSTITUTE(D1,\" \",\"~\",2))),FIND(\"~\",SUBSTITUTE(D1,\" \",\"~\",2))-FIND(\"~\",SUBSTITUTE(D1,\" \",\"~\",1))),\"\")","v":"46 "},{"$f":"IFERROR(RIGHT(LEFT(D1,FIND(\"~\",SUBSTITUTE(D1,\" \",\"~\",3))),FIND(\"~\",SUBSTITUTE(D1,\" \",\"~\",3))-FIND(\"~\",SUBSTITUTE(D1,\" \",\"~\",2))),\"\")","v":"55 "},{"$f":"IFERROR(RIGHT(D1,LEN(D1)-FIND(\"~\",SUBSTITUTE(D1,\" \",\"~\",3))),\"\")","v":"42"},"Corn",{"$f":"IF(MainDisplay!B27=\"Corn\",\"Corn Planted\",IF(MainDisplay!B27=\"Soybeans\",\"Soybeans Planted\",IF(MainDisplay!B27=\"Spring Wheat\",\"Spring Wheat Planted\",\"Winter Wheat Planted\")))","v":"Soybeans Planted"},null,{"$f":"IF($J$8=\"Corn\",\"        Corn:  Percent Planted,\",IF($J$8=\"Soybeans\",\"      Soybeans:  Percent Planted,\",IF($J$8=\"Spring Wheat\",\"    Spring Wheat:  Percent Planted,\",IF($J$8=\"Winter Wheat\",\"    Winter Wheat:  Percent Planted,\"))))","v":"      Soybeans:  Percent Planted,"},null,{"$f":"IF($M$14=1,IF(LEFT(TRIM(O2),3)=\"Cor\",\"CO\",IF(LEFT(TRIM(O2),3)=\"Soy\",\"AR\",IF(LEFT(TRIM(O2),3)=\"Win\",\"AR\",IF(LEFT(TRIM(O2),3)=\"Spr\",\"ID\")))),IF(LEFT(TRIM(O2),3)=\"Cor\",\"Colorado\",IF(LEFT(TRIM(O2),3)=\"Soy\",\"Arkansa\",IF(LEFT(TRIM(O2),3)=\"Win\",\"Arkansa\",IF(LEFT(TRIM(O2),3)=\"Spr\",\"Idaho\")))))","v":"Arkansa"},{"$f":"CELL(\"address\",INDEX(A1:A38,MATCH(O1&\"*\",A1:A38,0),1))","v":"$A$11"},null,null,null,null,"AL","Alabama"]
[{"$f":"IFERROR(INDIRECT(O4),\"\")","v":"[These 18 States planted 95% of the 2009 soybean acreage]"},{"$f":"(IF(TRIM(A2)=\":\",\"\",IF(LEN(B1)=4,LEFT(B1,3)&RIGHT(B1,1)+1,LEFT(B1,3)&RIGHT(B1,3)+1)))","v":"$A$12"},{"$f":"INDIRECT(B2)","v":"Illinois ........:    10          20          43          38     "},{"$f":"TRIM(RIGHT(INDIRECT(B2),LEN(INDIRECT(B2))-FIND(\":\",INDIRECT(B2))))","v":"10 20 43 38"},{"$f":"IF($M$14=1,VLOOKUP(LEFT(C2,2),$U$1:$V$50,2,FALSE),IFERROR(LEFT(INDIRECT(B2),FIND(\".\",INDIRECT(B2))-2),\"\"))","v":"Illinois"},{"$f":"IFERROR(LEFT(D2,FIND(\" \",D2)),\"\")","v":"10 "},{"$f":"IFERROR(RIGHT(LEFT(D2,FIND(\"~\",SUBSTITUTE(D2,\" \",\"~\",2))),FIND(\"~\",SUBSTITUTE(D2,\" \",\"~\",2))-FIND(\"~\",SUBSTITUTE(D2,\" \",\"~\",1))),\"\")","v":"20 "},{"$f":"IFERROR(RIGHT(LEFT(D2,FIND(\"~\",SUBSTITUTE(D2,\" \",\"~\",3))),FIND(\"~\",SUBSTITUTE(D2,\" \",\"~\",3))-FIND(\"~\",SUBSTITUTE(D2,\" \",\"~\",2))),\"\")","v":"43 "},{"$f":"IFERROR(RIGHT(D2,LEN(D2)-FIND(\"~\",SUBSTITUTE(D2,\" \",\"~\",3))),\"\")","v":"38"},"Soybeans",{"$f":"IF(MainDisplay!B27=\"Corn\",\"Corn Emerged\",IF(MainDisplay!B27=\"Soybeans\",\"Soybeans Emerged\",IF(MainDisplay!B27=\"Spring Wheat\",\"Spring Wheat Emerged\",\"Winter Wheat Emerged\")))","v":"Soybeans Emerged"},null,{"$f":"IF($J$8=\"Corn\",\"        Corn:  Percent Emerged,\",IF($J$8=\"Soybeans\",\"      Soybeans:  Percent Emerged,\",IF($J$8=\"Spring Wheat\",\"    Spring Wheat:  Percent Emerged,\",IF($J$8=\"Winter Wheat\",\"    Winter Wheat:  Percent Emerged,\"))))","v":"      Soybeans:  Percent Emerged,"},null,{"$f":"IF(M14=1,M16,Sheet3!O2)","v":"Soybeans Blooming"},null,null,null,null,null,"AK","Alaska"]
["-----------------------------------------------------------------",{"$f":"(IF(TRIM(A3)=\":\",\"\",IF(LEN(B2)=4,LEFT(B2,3)&RIGHT(B2,1)+1,LEFT(B2,3)&RIGHT(B2,3)+1)))","v":"$A$13"},"Indiana .........:    11          23          48          27     ","11 23 48 27","Indiana","11 ","23 ","48 ","27","Spring Wheat",{"$f":"IF(MainDisplay!B27=\"Corn\",\"Corn Silking\",IF(MainDisplay!B27=\"Soybeans\",\"Soybeans Blooming\",IF(MainDisplay!B27=\"Spring Wheat\",\"Spring Wheat Headed\",\"Winter Wheat Headed\")))","v":"Soybeans Blooming"},null,{"$f":"IF($J$8=\"Corn\",\"        Corn:  Percent Silking,\",IF($J$8=\"Soybeans\",\"     Soybeans:  Percent Blooming,\",IF($J$8=\"Spring Wheat\",\"    Spring Wheat:  Percent Headed,\",IF($J$8=\"Winter Wheat\",\"    Winter Wheat:  Percent Headed,\"))))","v":"     Soybeans:  Percent Blooming,"},null,{"$f":"CELL(\"address\",INDEX(Sheet5!A1:A1000,MATCH(\"*\"&O2&\"*\",Sheet5!A1:A1000,0),1))","v":"[CQGGlobexGrainsUSDAV3.xlsm]Sheet5!$A$167"},{"$f":"RIGHT(O3,$Q$3-$R$3)","v":"$A$167"},{"$f":"LEN(O3)","v":41},{"$f":"FIND(\"!\",O3)","v":35},null,null,"AZ","Arizona"]
["                 :            Week ending            :           ",{"$f":"(IF(TRIM(B3)=\":\",\"\",LEFT(B3,3)&RIGHT(B3,3)+1))","v":"$A$14"},"Iowa ............:    37          27          46          47     ","37 27 46 47","Iowa","37 ","27 ","46 ","47","Winter Wheat",{"$f":"IF(MainDisplay!B27=\"Corn\",\"Corn Dough\",IF(MainDisplay!B27=\"Soybeans\",\"Soybeans Setting Pods\",IF(MainDisplay!B27=\"Spring Wheat\",\"Spring Wheat Harvested\",\"Winter Wheat Harvested\")))","v":"Soybeans Setting Pods"},null,{"$f":"IF($J$8=\"Corn\",\"         Corn:  Percent Dough,\",IF($J$8=\"Soybeans\",\"   Soybeans:  Percent Setting Pods,\",IF($J$8=\"Spring Wheat\",\"   Spring Wheat:  Percent Harvested,\",IF($J$8=\"Winter Wheat\",\"   Winter Wheat:  Percent Harvested,\"))))","v":"   Soybeans:  Percent Setting Pods,"},null,{"$f":"LEFT($O$3,$R$3)&P4","v":"[CQGGlobexGrainsUSDAV3.xlsm]Sheet5!$A$168"},{"$f":"LEFT(P3,FIND(\"~\",SUBSTITUTE(P3,\"$\",\"~\",2)))&RIGHT(P3,3)+1","v":"$A$168"},null,null,null,null,"AR","Arkansas"]
[{"$f":"IFERROR(INDIRECT(O7),\"\")","v":"                 :-----------------------------------:           "},"$A$15","Kansas ..........:    24          10          19          30     ","24 10 19 30","Kansas","24 ","10 ","19 ","30",null,{"$f":"IF(MainDisplay!B27=\"Corn\",\"Corn Dented\",IF(MainDisplay!B27=\"Soybeans\",\"Soybeans Dropping Leaves\",IF(MainDisplay!B27=\"Spring Wheat\",\"\",\"\")))","v":"Soybeans Dropping Leaves"},null,{"$f":"IF($J$8=\"Corn\",\"        Corn:  Percent Dented,\",IF($J$8=\"Soybeans\",\"  Soybeans:  Percent Dropping Leaves, \",IF($J$8=\"Spring Wheat\",\"\",IF($J$8=\"Winter Wheat\",\"\"))))","v":"  Soybeans:  Percent Dropping Leaves, "},null,{"$f":"LEFT($O$3,$R$3)&P5","v":"[CQGGlobexGrainsUSDAV3.xlsm]Sheet5!$A$169"},{"$f":"LEFT(P4,FIND(\"~\",SUBSTITUTE(P4,\"$\",\"~\",2)))&RIGHT(P4,3)+1","v":"$A$169"},null,null,null,null,"CA","California"]
["      State      : July 11,  :  July 4,  : July 11,  : 2005-2009 ","$A$16","Kentucky ........:    16          35          49          28     ","16 35 49 28","Kentucky","16 ","35 ","49 ","28",null,{"$f":"IF(MainDisplay!B27=\"Corn\",\"Corn Mature\",IF(MainDisplay!B27=\"Soybeans\",\"Soybeans Harvested\",IF(MainDisplay!B27=\"Spring Wheat\",\"\",\"\")))","v":"Soybeans Harvested"},null,{"$f":"IF($J$8=\"Corn\",\"        Corn:  Percent Mature,\",IF($J$8=\"Soybeans\",\"     Soybeans:  Percent Harvested,\",IF($J$8=\"Spring Wheat\",\"\",IF($J$8=\"Winter Wheat\",\"\"))))","v":"     Soybeans:  Percent Harvested,"},null,"[CQGGlobexGrainsUSDAV3.xlsm]Sheet5!$A$170","$A$170",null,null,null,null,"CO","Colorado"]
["                 :   2009    :   2010    :   2010    :  Average  ","$A$17","Louisiana .......:    76          65          79          79     ","76 65 79 79",{"$f":"IF(D7=\"\",\"\",IF($M$14=1,VLOOKUP(LEFT(C7,2),$U$1:$V$50,2,FALSE),IFERROR(LEFT(INDIRECT(B7),FIND(\".\",INDIRECT(B7))-2),\"\")))","v":"Louisiana"},{"$f":"IFERROR(LEFT(D7,FIND(\" \",D7)),\"\")","v":"76 "},{"$f":"IFERROR(RIGHT(LEFT(D7,FIND(\"~\",SUBSTITUTE(D7,\" \",\"~\",2))),FIND(\"~\",SUBSTITUTE(D7,\" \",\"~\",2))-FIND(\"~\",SUBSTITUTE(D7,\" \",\"~\",1))),\"\")","v":"65 "},{"$f":"IFERROR(RIGHT(LEFT(D7,FIND(\"~\",SUBSTITUTE(D7,\" \",\"~\",3))),FIND(\"~\",SUBSTITUTE(D7,\" \",\"~\",3))-FIND(\"~\",SUBSTITUTE(D7,\" \",\"~\",2))),\"\")","v":"79 "},{"$f":"IFERROR(RIGHT(D7,LEN(D7)-FIND(\"~\",SUBSTITUTE(D7,\" \",\"~\",3))),\"\")","v":"79"},null,{"$f":"IF(MainDisplay!B27=\"Corn\",\"Corn Harvested\",IF(MainDisplay!B27=\"Soybean\",\"\",IF(MainDisplay!B27=\"Spring Wheat\",\"\",\"\")))","v":""},null,{"$f":"IF($J$8=\"Corn\",\"       Corn:  Percent Harvested,\",IF($J$8=\"Soybeans\",\"\",IF($J$8=\"Spring Wheat\",\"\",IF($J$8=\"Winter Wheat\",\"\"))))","v":""},null,"[CQGGlobexGrainsUSDAV3.xlsm]Sheet5!$A$171","$A$171",null,null,null,null,"CT","Connecticut"]
["-----------------------------------------------------------------","$A$18","Michigan ........:    15          26          40          23     ","15 26 40 23",{"$f":"IF(E7=\"\",\"\",IF($M$14=1,VLOOKUP(LEFT(C8,2),$U$1:$V$50,2,FALSE),IFERROR(LEFT(INDIRECT(B8),FIND(\".\",INDIRECT(B8))-2),\"\")))","v":"Michigan"},{"$f":"IF(F7=\"\",\"\",IFERROR(LEFT(D8,FIND(\" \",D8)),\"\"))","v":"15 "},{"$f":"IF(G7=\"\",\"\",IFERROR(RIGHT(LEFT(D8,FIND(\"~\",SUBSTITUTE(D8,\" \",\"~\",2))),FIND(\"~\",SUBSTITUTE(D8,\" \",\"~\",2))-FIND(\"~\",SUBSTITUTE(D8,\" \",\"~\",1))),\"\"))","v":"26 "},{"$f":"IF(H7=\"\",\"\",IFERROR(RIGHT(LEFT(D8,FIND(\"~\",SUBSTITUTE(D8,\" \",\"~\",3))),FIND(\"~\",SUBSTITUTE(D8,\" \",\"~\",3))-FIND(\"~\",SUBSTITUTE(D8,\" \",\"~\",2))),\"\"))","v":"40 "},{"$f":"IF(I7=\"\",\"\",IFERROR(RIGHT(D8,LEN(D8)-FIND(\"~\",SUBSTITUTE(D8,\" \",\"~\",3))),\"\"))","v":"23"},{"$f":"MainDisplay!B27","v":"Soybeans"},null,null,null,null,"[CQGGlobexGrainsUSDAV3.xlsm]Sheet5!$A$172","$A$172",null,null,null,null,"DE","Delaware"]
["                 :                    percent                    ","$A$19","Minnesota .......:    10          19          35          34     ","10 19 35 34",{"$f":"IF(E8=\"\",\"\",IF($M$14=1,VLOOKUP(LEFT(C9,2),$U$1:$V$50,2,FALSE),IFERROR(LEFT(INDIRECT(B9),FIND(\".\",INDIRECT(B9))-2),\"\")))","v":"Minnesota"},{"$f":"IF(F8=\"\",\"\",IFERROR(LEFT(D9,FIND(\" \",D9)),\"\"))","v":"10 "},{"$f":"IF(G8=\"\",\"\",IFERROR(RIGHT(LEFT(D9,FIND(\"~\",SUBSTITUTE(D9,\" \",\"~\",2))),FIND(\"~\",SUBSTITUTE(D9,\" \",\"~\",2))-FIND(\"~\",SUBSTITUTE(D9,\" \",\"~\",1))),\"\"))","v":"19 "},{"$f":"IF(H8=\"\",\"\",IFERROR(RIGHT(LEFT(D9,FIND(\"~\",SUBSTITUTE(D9,\" \",\"~\",3))),FIND(\"~\",SUBSTITUTE(D9,\" \",\"~\",3))-FIND(\"~\",SUBSTITUTE(D9,\" \",\"~\",2))),\"\"))","v":"35 "},{"$f":"IF(I8=\"\",\"\",IFERROR(RIGHT(D9,LEN(D9)-FIND(\"~\",SUBSTITUTE(D9,\" \",\"~\",3))),\"\"))","v":"34"},null,null,null,null,null,"[CQGGlobexGrainsUSDAV3.xlsm]Sheet5!$A$173","$A$173",null,null,null,null,"FL","Florida"]
["                 :                                               ","$A$20","Mississippi .....:    83          74          87          90     ","83 74 87 90","Mississippi","83 ","74 ","87 ","90",null,null,null,null,null,"[CQGGlobexGrainsUSDAV3.xlsm]Sheet5!$A$174","$A$174",null,null,null,null,"GA","Georgia"]
["Arkansas ........:    35          46          55          42     ","$A$21","Missouri ........:    15           8          21          23     ","15 8 21 23","Missouri","15 ","8 ","21 ","23",null,null,null,{"$f":"DATE(MainDisplay!Y27,MainDisplay!W27,MainDisplay!X27)","v":"2010-07-12"},null,"[CQGGlobexGrainsUSDAV3.xlsm]Sheet5!$A$175","$A$175",null,null,null,null,"HI","Hawaii"]
["Illinois ........:    10          20          43          38     ","$A$22","Nebraska ........:    28          17          38          40     ","28 17 38 40","Nebraska","28 ","17 ","38 ","40",null,null,null,40336,null,"[CQGGlobexGrainsUSDAV3.xlsm]Sheet5!$A$176","$A$176",null,null,null,null,"ID","Idaho"]
["Indiana .........:    11          23          48          27     ","$A$23","North Carolina ..:     -           5          16           4     ","- 5 16 4","North Carolina","- ","5 ","16 ","4",null,null,null,null,null,"[CQGGlobexGrainsUSDAV3.xlsm]Sheet5!$A$177","$A$177",null,null,null,null,"IL","Illinois"]
["Iowa ............:    37          27          46          47     ","$A$24","North Dakota ....:    12          25          40          35     ","12 25 40 35","North Dakota","12 ","25 ","40 ","35",null,null,null,{"$f":"IF(M11<M12,1,)","v":0},null,"[CQGGlobexGrainsUSDAV3.xlsm]Sheet5!$A$178","$A$178",null,null,null,null,"IN","Indiana"]
["Kansas ..........:    24          10          19          30     ","$A$25","Ohio ............:    23          18          43          35     ","23 18 43 35","Ohio","23 ","18 ","43 ","35",null,null,null,{"$f":"MainDisplay!D27","v":"Soybeans Blooming"},null,"[CQGGlobexGrainsUSDAV3.xlsm]Sheet5!$A$179","$A$179",null,null,null,null,"IA","Iowa"]
["Kentucky ........:    16          35          49          28     ","$A$26","South Dakota ....:    27          13          33          32     ","27 13 33 32","South Dakota","27 ","13 ","33 ","32",null,null,null,{"$f":"VLOOKUP(M15,K1:M7,3,FALSE)","v":"     Soybeans:  Percent Blooming,"},null,"[CQGGlobexGrainsUSDAV3.xlsm]Sheet5!$A$180","$A$180",null,null,null,null,"KS","Kansas"]
["Louisiana .......:    76          65          79          79     ","$A$27","Tennessee .......:    27          34          49          44     ","27 34 49 44","Tennessee","27 ","34 ","49 ","44",null,null,null,"   Corn:  Crop Condition by Percent,",null,"[CQGGlobexGrainsUSDAV3.xlsm]Sheet5!$A$181","$A$181",null,null,null,null,"KY","Kentucky"]
["Michigan ........:    15          26          40          23     ","$A$28","Wisconsin .......:     8          10          21          24     ","8 10 21 24","Wisconsin","8 ","10 ","21 ","24",null,null,null,"       Soybeans:  Crop Condition",null,"[CQGGlobexGrainsUSDAV3.xlsm]Sheet5!$A$182","$A$182",null,null,null,null,"LA","Louisiana"]
["Minnesota .......:    10          19          35          34     ","$A$29","                 :                                               ","",{"$f":"IF(E18=\"\",\"\",IFERROR(LEFT(INDIRECT(B19),FIND(\".\",INDIRECT(B19))-2),\"\"))","v":""},{"$f":"IFERROR(LEFT(D19,FIND(\" \",D19)),\"\")","v":""},{"$f":"IFERROR(RIGHT(LEFT(D19,FIND(\"~\",SUBSTITUTE(D19,\" \",\"~\",2))),FIND(\"~\",SUBSTITUTE(D19,\" \",\"~\",2))-FIND(\"~\",SUBSTITUTE(D19,\" \",\"~\",1))),\"\")","v":""},{"$f":"IFERROR(RIGHT(LEFT(D19,FIND(\"~\",SUBSTITUTE(D19,\" \",\"~\",3))),FIND(\"~\",SUBSTITUTE(D19,\" \",\"~\",3))-FIND(\"~\",SUBSTITUTE(D19,\" \",\"~\",2))),\"\")","v":""},{"$f":"IFERROR(RIGHT(D19,LEN(D19)-FIND(\"~\",SUBSTITUTE(D19,\" \",\"~\",3))),\"\")","v":""},null,null,null,null,null,"[CQGGlobexGrainsUSDAV3.xlsm]Sheet5!$A$183","$A$183",null,null,null,null,"ME","Maine"]
["Mississippi .....:    83          74          87          90     ","$A$30","18 States .......:    22          23          40          37     ",{"$f":"TRIM(RIGHT(INDIRECT(B20),43))","v":"22 23 40 37"},"",{"$f":"IF(E19=\"\",\"\",IFERROR(LEFT(D20,FIND(\" \",D20)),\"\"))","v":""},{"$f":"IF(E19=\"\",\"\",IFERROR(RIGHT(LEFT(D20,FIND(\"~\",SUBSTITUTE(D20,\" \",\"~\",2))),FIND(\"~\",SUBSTITUTE(D20,\" \",\"~\",2))-FIND(\"~\",SUBSTITUTE(D20,\" \",\"~\",1))),\"\"))","v":""},{"$f":"IF(E19=\"\",\"\",IFERROR(RIGHT(LEFT(D20,FIND(\"~\",SUBSTITUTE(D20,\" \",\"~\",3))),FIND(\"~\",SUBSTITUTE(D20,\" \",\"~\",3))-FIND(\"~\",SUBSTITUTE(D20,\" \",\"~\",2))),\"\"))","v":""},{"$f":"IF(E19=\"\",\"\",IFERROR(RIGHT(D20,LEN(D20)-FIND(\"~\",SUBSTITUTE(D20,\" \",\"~\",3))),\"\"))","v":""},null,null,null,{"$f":"IF($J$8=\"Corn\",\"Corn Condition\",IF($J$8=\"Soybeans\",\"Soybean Condition\",IF($J$8=\"Spring Wheat\",\"Spring Wheat Condition\",IF($J$8=\"Winter Wheat\",\"Winter Wheat Condition\"))))","v":"Soybean Condition"},null,"[CQGGlobexGrainsUSDAV3.xlsm]Sheet5!$A$184","$A$184",null,null,null,null,"MD","Maryland"]
["Missouri ........:    15           8          21          23     ","$A$31","-----------------------------------------------------------------","-------------------------------------------","","","","","",null,null,null,{"$f":"IF($J$8=\"Corn\",\"         Corn:  Crop Condition\",IF($J$8=\"Soybeans\",\"       Soybeans:  Crop Condition\",IF($J$8=\"Spring Wheat\",\"    Spring Wheat:   Crop Condition\",IF($J$8=\"Winter Wheat\",\"    Winter Wheat:  Crop Condition\"))))","v":"       Soybeans:  Crop Condition"},null,"[CQGGlobexGrainsUSDAV3.xlsm]Sheet5!$A$185","$A$185",null,null,null,null,"MA","Massachusetts"]
["Nebraska ........:    28          17          38          40     ","$A$32","","","","","","","",null,null,null,null,null,"[CQGGlobexGrainsUSDAV3.xlsm]Sheet5!$A$186","$A$186",null,null,null,null,"MI","Michigan"]
["North Carolina ..:     -           5          16           4     ","$A$33",0,{"$f":"RIGHT(INDIRECT(B23),43)","v":"0"},"","","","","",null,null,null,{"$f":"IF($J$8=\"Corn\",\"   Corn:  Crop Condition by Percent,\",IF($J$8=\"Soybeans\",\" Soybeans:  Crop Condition by Percent,\",IF($J$8=\"Spring Wheat\",\"     Spring Wheat:  Crop Condition\",IF($J$8=\"Winter Wheat\",\"     Winter Wheat:  Crop Condition\"))))","v":" Soybeans:  Crop Condition by Percent,"},null,"[CQGGlobexGrainsUSDAV3.xlsm]Sheet5!$A$187","$A$187",null,null,null,null,"MN","Minnesota"]
["North Dakota ....:    12          25          40          35     ","$A$34","Soybeans Setting Pods - Selected States","Soybeans Setting Pods - Selected States","","","","","",null,null,null,{"$f":"IF(M14=0,M20,M21)","v":"Soybean Condition"},null,"[CQGGlobexGrainsUSDAV3.xlsm]Sheet5!$A$188","$A$188",null,null,null,null,"MS","Mississippi"]
["Ohio ............:    23          18          43          35     ","$A$35","[These 18 States planted 95% of the 2009 soybean acreage]","es planted 95% of the 2009 soybean acreage]","","","","","",null,null,null,{"$f":"IFERROR(CELL(\"address\",INDEX(Sheet5!A1:A1000,MATCH(M24&\"*\",Sheet5!A1:A1000,0),1)),\"2\")","v":"[CQGGlobexGrainsUSDAV3.xlsm]Sheet5!$A$234"},null,"[CQGGlobexGrainsUSDAV3.xlsm]Sheet5!$A$189","$A$189",null,null,null,null,"MO","Missouri"]
["South Dakota ....:    27          13          33          32     ","$A$36","","",{"$f":"IFERROR(LEFT(INDIRECT(B26),FIND(\".\",INDIRECT(B26))-2),\"\")","v":""},"","","","",null,null,null,null,null,"[CQGGlobexGrainsUSDAV3.xlsm]Sheet5!$A$190","$A$190",null,null,null,null,"MT","Montana"]
["Tennessee .......:    27          34          49          44     ","$A$37","","",null,"","","","",null,null,null,null,null,"[CQGGlobexGrainsUSDAV3.xlsm]Sheet5!$A$191","$A$191",null,null,null,null,"NE","Nebraska"]
["Wisconsin .......:     8          10          21          24     ","$A$38",0,"",null,"",null,"","",null,null,null,null,null,"[CQGGlobexGrainsUSDAV3.xlsm]Sheet5!$A$192","$A$192",null,null,null,null,"NV","Nevada"]
["                 :                                               ","$A$39","Soybean Condition - Selected States: Week Ending July 11, 2010"," Selected States: Week Ending July 11, 2010",null," ","Selected ","States: ","Week Ending July 11, 2010",null,null,null,null,null,"[CQGGlobexGrainsUSDAV3.xlsm]Sheet5!$A$193","$A$193",null,null,null,null,"NH","New Hampshire"]
["18 States .......:    22          23          40          37     ","$A$40","[National crop conditions for selected States are weighted based on 2009"," selected States are weighted based on 2009",null," ","selected ","States ","are weighted based on 2009",null,null,null,null,null,"[CQGGlobexGrainsUSDAV3.xlsm]Sheet5!$A$194","$A$194",null,null,null,null,"NJ","New Jersey"]
["-----------------------------------------------------------------",null,null,null,null,null,null,null,null,null,null,null,null,null,"[CQGGlobexGrainsUSDAV3.xlsm]Sheet5!$A$195","$A$195",null,null,null,null,"NM","New Mexico"]
["",null,null,null,{"$f":"FIND(\"~\",SUBSTITUTE(D34,\",\",\"~\",1))-FIND(\"~\",SUBSTITUTE(D34,\":\",\"~\",1))","v":9},null,{"$f":"RIGHT(LEFT(D34,FIND(\"~\",SUBSTITUTE(D34,\",\",\"~\",1))-1),FIND(\"~\",SUBSTITUTE(D34,\",\",\"~\",1))-FIND(\"~\",SUBSTITUTE(D34,\":\",\"~\",1))-1)","v":" July 11"},null,null,null,null,null,null,null,"[CQGGlobexGrainsUSDAV3.xlsm]Sheet5!$A$196","$A$196",null,null,null,null,"NY","New York"]
[0,null,null,null,null,null,null,null,{"$f":"RIGHT(A5,6)","v":"      "},null,null,null,null,null,"[CQGGlobexGrainsUSDAV3.xlsm]Sheet5!$A$197","$A$197",null,null,null,null,"NC","North Carolina"]
["Soybeans Setting Pods - Selected States",null,null,{"$f":"TRIM(A6)","v":"State : July 11, : July 4, : July 11, : 2005-2009"},null,null,null,null,null,null,null,null,null,null,"[CQGGlobexGrainsUSDAV3.xlsm]Sheet5!$A$198","$A$198",null,null,null,null,"ND","North Dakota"]
[{"$f":"IFERROR(INDIRECT(O37),\"\")","v":"[These 18 States planted 95% of the 2009 soybean acreage]"},null,{"$f":"TRIM(C19)","v":":"},null,null,{"$f":"RIGHT(LEFT(D34,FIND(\"~\",SUBSTITUTE(D34,\",\",\"~\",1))-1),FIND(\"~\",SUBSTITUTE(D34,\",\",\"~\",1))-FIND(\"~\",SUBSTITUTE(D34,\":\",\"~\",1))-1)","v":" July 11"},{"$f":"RIGHT(LEFT(D34,FIND(\"~\",SUBSTITUTE(D34,\",\",\"~\",2))-1),FIND(\"~\",SUBSTITUTE(D34,\",\",\"~\",1))-FIND(\"~\",SUBSTITUTE(D34,\":\",\"~\",1))-1)","v":": July 4"},{"$f":"RIGHT(LEFT(D34,FIND(\"~\",SUBSTITUTE(D34,\",\",\"~\",3))-1),FIND(\"~\",SUBSTITUTE(D34,\",\",\"~\",1))-FIND(\"~\",SUBSTITUTE(D34,\":\",\"~\",1))-1)","v":" July 11"},{"$f":"IF(M14=1,RIGHT(A5,6)&RIGHT(D34,4),(LEFT(TRIM(RIGHT(D34,LEN(D34)-FIND(\"~\",SUBSTITUTE(D34,\":\",\"~\",4)))),4)&\" - \"&RIGHT(D34,4)))","v":"2005 - 2009"},null,null,null,null,null,"[CQGGlobexGrainsUSDAV3.xlsm]Sheet5!$A$199","$A$199",null,null,null,null,"OH","Ohio"]
["",null,null,null,null,{"$f":"RIGHT(LEFT(D37,6),4)","v":"2009"},{"$f":"RIGHT(LEFT(D37,13),4)","v":"2010"},{"$f":"RIGHT(LEFT(D37,20),4)","v":"2010"},"Average",null,null,null,null,null,"[CQGGlobexGrainsUSDAV3.xlsm]Sheet5!$A$200","$A$200",null,null,null,null,"OK","Oklahoma"]
["",null,null,{"$f":"TRIM(A7)","v":": 2009 : 2010 : 2010 : Average"},null,null,null,null,null,null,null,null,null,null,"[CQGGlobexGrainsUSDAV3.xlsm]Sheet5!$A$201","$A$201",null,null,null,null,"OR","Oregon"]
[null,null,null,null,null,"Very Poor"," Poor ","Fair","Good","Excellent",null,null,null,null,null,null,null,null,null,null,"PA","Pennsylvania"]
[{"$f":"IFERROR(INDIRECT(O41),\"\")","v":"Soybean Condition - Selected States: Week Ending July 11, 2010"},{"$f":"P39","v":"$A$47"},{"$f":"INDIRECT(B39)","v":"Arkansas ........:     4          15          36          36           9     "},{"$f":"TRIM(RIGHT(C39,LEN(C39)-FIND(\"~\",SUBSTITUTE(C39,\":\",\"~\",1))))","v":"4 15 36 36 9"},{"$f":"IF($M$14=1,VLOOKUP(LEFT(C39,2),$U$1:$V$50,2,FALSE),IFERROR(LEFT(INDIRECT(B39),FIND(\".\",INDIRECT(B39))-2),\"\"))","v":"Arkansas"},{"$f":"IFERROR(LEFT(D39,FIND(\" \",D39)),\"\")","v":"4 "},{"$f":"IFERROR(RIGHT(LEFT(D39,FIND(\"~\",SUBSTITUTE(D39,\" \",\"~\",2))),FIND(\"~\",SUBSTITUTE(D39,\" \",\"~\",2))-FIND(\"~\",SUBSTITUTE(D39,\" \",\"~\",1))),\"\")","v":"15 "},{"$f":"IFERROR(RIGHT(LEFT(D39,FIND(\"~\",SUBSTITUTE(D39,\" \",\"~\",3))),FIND(\"~\",SUBSTITUTE(D39,\" \",\"~\",3))-FIND(\"~\",SUBSTITUTE(D39,\" \",\"~\",2))),\"\")","v":"36 "},{"$f":"IFERROR(RIGHT(LEFT(D39,FIND(\"~\",SUBSTITUTE(D39,\" \",\"~\",4))),FIND(\"~\",SUBSTITUTE(D39,\" \",\"~\",4))-FIND(\"~\",SUBSTITUTE(D39,\" \",\"~\",3))),\"\")","v":"36 "},{"$f":"IFERROR(RIGHT(D39,LEN(D39)-FIND(\"~\",SUBSTITUTE(D39,\" \",\"~\",4))),\"\")","v":"9"},null,null,null,null,{"$f":"IF($M$14=1,IF(LEFT(TRIM(O40),3)=\"Cor\",\"CO\",IF(LEFT(TRIM(O40),3)=\"Soy\",\"AR\",IF(LEFT(TRIM(O40),3)=\"Win\",\"AR\",IF(LEFT(TRIM(O40),3)=\"Spr\",\"ID\")))),IF(LEFT(TRIM(O40),3)=\"Cor\",\"Colorado\",IF(LEFT(TRIM(O40),3)=\"Soy\",\"Arkansa\",IF(LEFT(TRIM(O40),3)=\"Win\",\"Arkansa\",IF(LEFT(TRIM(O40),3)=\"Spr\",\"Idaho\")))))","v":"Arkansa"},{"$f":"CELL(\"address\",INDEX(A39:A69,MATCH(O39&\"*\",A39:A69,0),1))","v":"$A$47"},null,null,null,null,"RI","Rhode Island"]
[{"$f":"IFERROR(INDIRECT(O42),\"\")","v":"[National crop conditions for selected States are weighted based on 2009"},{"$f":"(IF(TRIM(A40)=\":\",\"\",IF(LEN(B39)=4,LEFT(B39,3)&RIGHT(B39,1)+1,LEFT(B39,3)&RIGHT(B39,3)+1)))","v":"$A$48"},{"$f":"INDIRECT(B40)","v":"Illinois ........:     3           9          26          48          14     "},{"$f":"TRIM(RIGHT(C40,LEN(C40)-FIND(\"~\",SUBSTITUTE(C40,\":\",\"~\",1))))","v":"3 9 26 48 14"},{"$f":"IF($M$14=1,VLOOKUP(LEFT(C40,2),$U$1:$V$50,2,FALSE),IFERROR(LEFT(INDIRECT(B40),FIND(\".\",INDIRECT(B40))-2),\"\"))","v":"Illinois"},{"$f":"IFERROR(LEFT(D40,FIND(\" \",D40)),\"\")","v":"3 "},{"$f":"IFERROR(RIGHT(LEFT(D40,FIND(\"~\",SUBSTITUTE(D40,\" \",\"~\",2))),FIND(\"~\",SUBSTITUTE(D40,\" \",\"~\",2))-FIND(\"~\",SUBSTITUTE(D40,\" \",\"~\",1))),\"\")","v":"9 "},{"$f":"IFERROR(RIGHT(LEFT(D40,FIND(\"~\",SUBSTITUTE(D40,\" \",\"~\",3))),FIND(\"~\",SUBSTITUTE(D40,\" \",\"~\",3))-FIND(\"~\",SUBSTITUTE(D40,\" \",\"~\",2))),\"\")","v":"26 "},{"$f":"IFERROR(RIGHT(LEFT(D40,FIND(\"~\",SUBSTITUTE(D40,\" \",\"~\",4))),FIND(\"~\",SUBSTITUTE(D40,\" \",\"~\",4))-FIND(\"~\",SUBSTITUTE(D40,\" \",\"~\",3))),\"\")","v":"48 "},{"$f":"IFERROR(RIGHT(D40,LEN(D40)-FIND(\"~\",SUBSTITUTE(D40,\" \",\"~\",4))),\"\")","v":"14"},null,null,null,null,{"$f":"IF(M14=0,M20,IF(M25=\"2\",M23,M21))","v":"Soybean Condition"},null,null,null,null,null,"SC","South Carolina"]
["planted acreage]",{"$f":"(IF(TRIM(A41)=\":\",\"\",IF(LEN(B40)=4,LEFT(B40,3)&RIGHT(B40,1)+1,LEFT(B40,3)&RIGHT(B40,3)+1)))","v":"$A$49"},"Indiana .........:     3           8          27          48          14     ","3 8 27 48 14","Indiana","3 ","8 ","27 ","48 ","14",null,null,null,null,{"$f":"CELL(\"address\",INDEX(Sheet5!A1:A1000,MATCH(O40&\"*\",Sheet5!A1:A1000,0),1))","v":"[CQGGlobexGrainsUSDAV3.xlsm]Sheet5!$A$234"},{"$f":"RIGHT(O41,$Q$41-$R$41)","v":"$A$234"},{"$f":"LEN(O41)","v":41},{"$f":"FIND(\"!\",O41)","v":35},null,null,"SD","South Dakota"]
["-----------------------------------------------------------------------------",{"$f":"(IF(TRIM(B41)=\":\",\"\",LEFT(B41,3)&RIGHT(B41,3)+1))","v":"$A$50"},"Iowa ............:     3           7          21          52          17     ","3 7 21 52 17","Iowa","3 ","7 ","21 ","52 ","17",null,null,null,null,{"$f":"LEFT($O$41,$R$41)&P42","v":"[CQGGlobexGrainsUSDAV3.xlsm]Sheet5!$A$235"},{"$f":"LEFT(P41,FIND(\"~\",SUBSTITUTE(P41,\"$\",\"~\",2)))&RIGHT(P41,3)+1","v":"$A$235"},null,null,null,null,"TN","Tennessee"]
["      State      : Very poor :   Poor    :   Fair    :   Good    : Excellent ","$A$51","Kansas ..........:     1           4          25          57          13     ","1 4 25 57 13","Kansas","1 ","4 ","25 ","57 ","13",null,null,null,null,{"$f":"LEFT($O$41,$R$41)&P43","v":"[CQGGlobexGrainsUSDAV3.xlsm]Sheet5!$A$236"},{"$f":"LEFT(P42,FIND(\"~\",SUBSTITUTE(P42,\"$\",\"~\",2)))&RIGHT(P42,3)+1","v":"$A$236"},null,null,null,null,"TX","Texas"]
["-----------------------------------------------------------------------------","$A$52","Kentucky ........:     1           4          27          44          24     ","1 4 27 44 24","Kentucky","1 ","4 ","27 ","44 ","24",null,null,null,null,"[CQGGlobexGrainsUSDAV3.xlsm]Sheet5!$A$237","$A$237",null,null,null,null,"UT","Utah"]
["                 :                          percent                          ","$A$53","Louisiana .......:     1          12          32          50           5     ","1 12 32 50 5","Louisiana","1 ","12 ","32 ","50 ","5",null,null,null,null,"[CQGGlobexGrainsUSDAV3.xlsm]Sheet5!$A$238","$A$238",null,null,null,null,"VT","Vermont"]
["                 :                                                           ","$A$54","Michigan ........:     1           5          22          49          23     ","1 5 22 49 23","Michigan",{"$f":"IF(F45=\"\",\"\",IFERROR(LEFT(D46,FIND(\" \",D46)),\"\"))","v":"1 "},{"$f":"IF(G45=\"\",\"\",IFERROR(RIGHT(LEFT(D46,FIND(\"~\",SUBSTITUTE(D46,\" \",\"~\",2))),FIND(\"~\",SUBSTITUTE(D46,\" \",\"~\",2))-FIND(\"~\",SUBSTITUTE(D46,\" \",\"~\",1))),\"\"))","v":"5 "},{"$f":"IF(H45=\"\",\"\",IFERROR(RIGHT(LEFT(D46,FIND(\"~\",SUBSTITUTE(D46,\" \",\"~\",3))),FIND(\"~\",SUBSTITUTE(D46,\" \",\"~\",3))-FIND(\"~\",SUBSTITUTE(D46,\" \",\"~\",2))),\"\"))","v":"22 "},{"$f":"IF(I45=\"\",\"\",IFERROR(RIGHT(LEFT(D46,FIND(\"~\",SUBSTITUTE(D46,\" \",\"~\",4))),FIND(\"~\",SUBSTITUTE(D46,\" \",\"~\",4))-FIND(\"~\",SUBSTITUTE(D46,\" \",\"~\",3))),\"\"))","v":"49 "},{"$f":"IF(J45=\"\",\"\",IFERROR(RIGHT(D46,LEN(D46)-FIND(\"~\",SUBSTITUTE(D46,\" \",\"~\",4))),\"\"))","v":"23"},null,null,null,null,"[CQGGlobexGrainsUSDAV3.xlsm]Sheet5!$A$239","$A$239",null,null,null,null,"VA","Virginia"]
["Arkansas ........:     4          15          36          36           9     ","$A$55","Minnesota .......:     1           3          13          62          21     ","1 3 13 62 21","Minnesota",{"$f":"IF(F46=\"\",\"\",IFERROR(LEFT(D47,FIND(\" \",D47)),\"\"))","v":"1 "},{"$f":"IF(G46=\"\",\"\",IFERROR(RIGHT(LEFT(D47,FIND(\"~\",SUBSTITUTE(D47,\" \",\"~\",2))),FIND(\"~\",SUBSTITUTE(D47,\" \",\"~\",2))-FIND(\"~\",SUBSTITUTE(D47,\" \",\"~\",1))),\"\"))","v":"3 "},{"$f":"IF(H46=\"\",\"\",IFERROR(RIGHT(LEFT(D47,FIND(\"~\",SUBSTITUTE(D47,\" \",\"~\",3))),FIND(\"~\",SUBSTITUTE(D47,\" \",\"~\",3))-FIND(\"~\",SUBSTITUTE(D47,\" \",\"~\",2))),\"\"))","v":"13 "},{"$f":"IF(I46=\"\",\"\",IFERROR(RIGHT(LEFT(D47,FIND(\"~\",SUBSTITUTE(D47,\" \",\"~\",4))),FIND(\"~\",SUBSTITUTE(D47,\" \",\"~\",4))-FIND(\"~\",SUBSTITUTE(D47,\" \",\"~\",3))),\"\"))","v":"62 "},{"$f":"IF(J46=\"\",\"\",IFERROR(RIGHT(D47,LEN(D47)-FIND(\"~\",SUBSTITUTE(D47,\" \",\"~\",4))),\"\"))","v":"21"},null,null,null,null,"[CQGGlobexGrainsUSDAV3.xlsm]Sheet5!$A$240","$A$240",null,null,null,null,"WA","Washington"]
["Illinois ........:     3           9          26          48          14     ","$A$56","Mississippi .....:     4          14          28          37          17     ","4 14 28 37 17","Mississippi","4 ","14 ","28 ","37 ","17",null,null,null,null,"[CQGGlobexGrainsUSDAV3.xlsm]Sheet5!$A$241","$A$241",null,null,null,null,"WV","West Virginia"]
["Indiana .........:     3           8          27          48          14     ","$A$57","Missouri ........:     6          15          35          36           8     ","6 15 35 36 8","Missouri","6 ","15 ","35 ","36 ","8",null,null,null,null,"[CQGGlobexGrainsUSDAV3.xlsm]Sheet5!$A$242","$A$242",null,null,null,null,"WI","Wisconsin"]
["Iowa ............:     3           7          21          52          17     ","$A$58","Nebraska ........:     2           3          15          63          17     ","2 3 15 63 17","Nebraska","2 ","3 ","15 ","63 ","17",null,null,null,null,"[CQGGlobexGrainsUSDAV3.xlsm]Sheet5!$A$243","$A$243",null,null,null,null,"WY","Wyoming"]
["Kansas ..........:     1           4          25          57          13     ","$A$59","North Carolina ..:     5          16          35          41           3     ","5 16 35 41 3","North Carolina","5 ","16 ","35 ","41 ","3",null,null,null,null,"[CQGGlobexGrainsUSDAV3.xlsm]Sheet5!$A$244","$A$244"]
["Kentucky ........:     1           4          27          44          24     ","$A$60","North Dakota ....:     1           2          10          72          15     ","1 2 10 72 15","North Dakota","1 ","2 ","10 ","72 ","15",null,null,null,null,"[CQGGlobexGrainsUSDAV3.xlsm]Sheet5!$A$245","$A$245"]
["Louisiana .......:     1          12          32          50           5     ","$A$61","Ohio ............:     3           9          30          46          12     ","3 9 30 46 12","Ohio","3 ","9 ","30 ","46 ","12",null,null,null,null,"[CQGGlobexGrainsUSDAV3.xlsm]Sheet5!$A$246","$A$246"]
["Michigan ........:     1           5          22          49          23     ","$A$62","South Dakota ....:     2           7          22          53          16     ","2 7 22 53 16","South Dakota","2 ","7 ","22 ","53 ","16",null,null,null,null,"[CQGGlobexGrainsUSDAV3.xlsm]Sheet5!$A$247","$A$247"]
["Minnesota .......:     1           3          13          62          21     ","$A$63","Tennessee .......:     3           7          28          53           9     ","3 7 28 53 9","Tennessee","3 ","7 ","28 ","53 ","9",null,null,null,null,"[CQGGlobexGrainsUSDAV3.xlsm]Sheet5!$A$248","$A$248"]
["Mississippi .....:     4          14          28          37          17     ","$A$64","Wisconsin .......:     1           2          15          57          25     ","1 2 15 57 25","Wisconsin","1 ","2 ","15 ","57 ","25",null,null,null,null,"[CQGGlobexGrainsUSDAV3.xlsm]Sheet5!$A$249","$A$249"]
["Missouri ........:     6          15          35          36           8     ","$A$65","                 :                                                           ",{"$f":"TRIM(RIGHT(INDIRECT(B57),43))","v":""},{"$f":"IF(E56=\"\",\"\",IFERROR(LEFT(INDIRECT(B57),FIND(\".\",INDIRECT(B57))-2),\"\"))","v":""},{"$f":"IFERROR(LEFT(D57,FIND(\" \",D57)),\"\")","v":""},{"$f":"IF(E56=\"\",\"\",IFERROR(RIGHT(LEFT(D57,FIND(\"~\",SUBSTITUTE(D57,\" \",\"~\",2))),FIND(\"~\",SUBSTITUTE(D57,\" \",\"~\",2))-FIND(\"~\",SUBSTITUTE(D57,\" \",\"~\",1))),\"\"))","v":""},{"$f":"IF(E56=\"\",\"\",IFERROR(RIGHT(LEFT(D57,FIND(\"~\",SUBSTITUTE(D57,\" \",\"~\",3))),FIND(\"~\",SUBSTITUTE(D57,\" \",\"~\",3))-FIND(\"~\",SUBSTITUTE(D57,\" \",\"~\",2))),\"\"))","v":""},{"$f":"IF(E56=\"\",\"\",IFERROR(RIGHT(D57,LEN(D57)-FIND(\"~\",SUBSTITUTE(D57,\" \",\"~\",3))),\"\"))","v":""},null,null,null,null,null,"[CQGGlobexGrainsUSDAV3.xlsm]Sheet5!$A$250","$A$250"]
["Nebraska ........:     2           3          15          63          17     ","$A$66","18 States .......:     3           8          24          50          15     ","8 24 50 15","","8 ","","","",null,null,null,null,null,"[CQGGlobexGrainsUSDAV3.xlsm]Sheet5!$A$251","$A$251"]
["North Carolina ..:     5          16          35          41           3     ","$A$67","                 :                                                           ","","","","",null,"",null,null,null,null,null,"[CQGGlobexGrainsUSDAV3.xlsm]Sheet5!$A$252","$A$252"]
["North Dakota ....:     1           2          10          72          15     ","$A$68","Previous week ...:     2           8          24          51          15     ","8 24 51 15","","8 ","","","",null,null,null,null,null,"[CQGGlobexGrainsUSDAV3.xlsm]Sheet5!$A$253","$A$253"]
["Ohio ............:     3           9          30          46          12     ","$A$69","Previous year ...:     2           6          26          52          14     ",{"$f":"RIGHT(INDIRECT(B61),43)","v":" 6          26          52          14     "},""," ","","","",null,null,null,null,null,"[CQGGlobexGrainsUSDAV3.xlsm]Sheet5!$A$254","$A$254"]
["South Dakota ....:     2           7          22          53          16     ","$A$70","-----------------------------------------------------------------------------","-------------------------------------------","","","","","",null,null,null,null,null,"[CQGGlobexGrainsUSDAV3.xlsm]Sheet5!$A$255","$A$255"]
["Tennessee .......:     3           7          28          53           9     ","$A$71",0,"0","",{"$f":"IF(E62=\"\",\"\",IFERROR(LEFT(D63,FIND(\" \",D63)),\"\"))","v":""},"","","",null,null,null,null,null,"[CQGGlobexGrainsUSDAV3.xlsm]Sheet5!$A$256","$A$256"]
["Wisconsin .......:     1           2          15          57          25     ","$A$72","Peanuts Pegging - Selected States","Peanuts Pegging - Selected States",{"$f":"IFERROR(LEFT(INDIRECT(B64),FIND(\".\",INDIRECT(B64))-2),\"\")","v":""},{"$f":"IFERROR(LEFT(D64,FIND(\" \",D64)),\"\")","v":"Peanuts "},{"$f":"IFERROR(RIGHT(LEFT(D64,FIND(\"~\",SUBSTITUTE(D64,\" \",\"~\",2))),FIND(\"~\",SUBSTITUTE(D64,\" \",\"~\",2))-FIND(\"~\",SUBSTITUTE(D64,\" \",\"~\",1))),\"\")","v":"Pegging "},{"$f":"IFERROR(RIGHT(LEFT(D64,FIND(\"~\",SUBSTITUTE(D64,\" \",\"~\",3))),FIND(\"~\",SUBSTITUTE(D64,\" \",\"~\",3))-FIND(\"~\",SUBSTITUTE(D64,\" \",\"~\",2))),\"\")","v":"- "},{"$f":"IFERROR(RIGHT(D64,LEN(D64)-FIND(\"~\",SUBSTITUTE(D64,\" \",\"~\",3))),\"\")","v":"Selected States"},null,null,null,null,null,"[CQGGlobexGrainsUSDAV3.xlsm]Sheet5!$A$257","$A$257"]
["                 :                                                           ","$A$73","[These 8 States planted 97% of the 2009 peanut acreage]","tes planted 97% of the 2009 peanut acreage]",null,"tes ","planted ","97% ","of the 2009 peanut acreage]",null,null,null,null,null,"[CQGGlobexGrainsUSDAV3.xlsm]Sheet5!$A$258","$A$258"]
["18 States .......:     3           8          24          50          15     ","$A$74","","",null,"","","","",null,null,null,null,null,"[CQGGlobexGrainsUSDAV3.xlsm]Sheet5!$A$259","$A$259"]
["                 :                                                           ","$A$75",null,null,null,null,null,null,null,null,null,null,null,null,"[CQGGlobexGrainsUSDAV3.xlsm]Sheet5!$A$260","$A$260"]
["Previous week ...:     2           8          24          51          15     ","$A$76",null,null,null,null,null,null,null,null,null,null,null,null,"[CQGGlobexGrainsUSDAV3.xlsm]Sheet5!$A$261","$A$261"]
["Previous year ...:     2           6          26          52          14     ",null,null,null,null,null,null,null,null,null,null,null,null,null,"[CQGGlobexGrainsUSDAV3.xlsm]Sheet5!$A$262","$A$262"]
["-----------------------------------------------------------------------------",null,null,null,null,null,null,null,null,null,null,null,null,null,"[CQGGlobexGrainsUSDAV3.xlsm]Sheet5!$A$263","$A$263"]
[0,null,null,null,"- ",{"$f":"IFERROR(IF(F39=$E$71,0,1*F39),\"\")","v":4},{"$f":"IFERROR(IF(G39=$E$71,0,1*G39),\"\")","v":15},36,36,9,null,null,null,null,"[CQGGlobexGrainsUSDAV3.xlsm]Sheet5!$A$264","$A$264"]
["Peanuts Pegging - Selected States",null,null,null,null,{"$f":"IFERROR(IF(F40=$E$71,0,1*F40),\"\")","v":3},9,26,48,14,null,null,null,null,"[CQGGlobexGrainsUSDAV3.xlsm]Sheet5!$A$265","$A$265"]
["[These 8 States planted 97% of the 2009 peanut acreage]",null,null,null,null,3,8,27,48,14,null,null,null,null,"[CQGGlobexGrainsUSDAV3.xlsm]Sheet5!$A$266","$A$266"]
["",null,null,null,null,3,7,21,52,17,null,null,null,null,"[CQGGlobexGrainsUSDAV3.xlsm]Sheet5!$A$267","$A$267"]
["",null,null,null,null,1,4,25,57,13,null,null,null,null,"[CQGGlobexGrainsUSDAV3.xlsm]Sheet5!$A$268","$A$268"]
[null,null,null,null,null,1,4,27,44,24]
[null,null,null,null,null,1,12,32,50,5]
[null,null,null,null,null,1,5,22,49,23]
[null,null,null,null,null,1,3,13,62,21]
[null,null,null,null,null,4,14,28,37,17]
[null,null,null,null,null,6,15,35,36,8]
[null,null,null,null,null,2,3,15,63,17]
[null,null,null,null,null,5,16,35,41,3]
[null,null,null,null,null,1,2,10,72,15]
[null,null,null,null,null,3,9,30,46,12]
[null,null,null,null,null,2,7,22,53,16]
[null,null,null,null,null,3,7,28,53,9]
[null,null,null,null,null,{"$f":"IFERROR(IF(F56=$E$71,0,1*F56),\"\")","v":1},2,15,57,25]
[]
[]
[null,null,null,null,null,{"$f":"IFERROR(Sheet3!F39-Sheet6!F71,\"\")","v":-2},{"$f":"IFERROR(Sheet3!G39-Sheet6!G71,\"\")","v":-7},{"$f":"IFERROR(Sheet3!H39-Sheet6!H71,\"\")","v":-9},{"$f":"IFERROR(Sheet3!I39-Sheet6!I71,\"\")","v":10},{"$f":"IFERROR(Sheet3!J39-Sheet6!J71,\"\")","v":8}]
[null,null,null,null,null,{"$f":"IFERROR(Sheet3!F40-Sheet6!F72,\"\")","v":-1},{"$f":"IFERROR(Sheet3!G40-Sheet6!G72,\"\")","v":-6},{"$f":"IFERROR(Sheet3!H40-Sheet6!H72,\"\")","v":-9},{"$f":"IFERROR(Sheet3!I40-Sheet6!I72,\"\")","v":5},{"$f":"IFERROR(Sheet3!J40-Sheet6!J72,\"\")","v":11}]
[null,null,null,null,null,{"$f":"IFERROR(Sheet3!F41-Sheet6!F73,\"\")","v":-1},{"$f":"IFERROR(Sheet3!G41-Sheet6!G73,\"\")","v":-3},{"$f":"IFERROR(Sheet3!H41-Sheet6!H73,\"\")","v":-6},{"$f":"IFERROR(Sheet3!I41-Sheet6!I73,\"\")","v":7},{"$f":"IFERROR(Sheet3!J41-Sheet6!J73,\"\")","v":3}]
[null,null,null,null,null,{"$f":"IFERROR(Sheet3!F42-Sheet6!F74,\"\")","v":-1},{"$f":"IFERROR(Sheet3!G42-Sheet6!G74,\"\")","v":-3},{"$f":"IFERROR(Sheet3!H42-Sheet6!H74,\"\")","v":-3},{"$f":"IFERROR(Sheet3!I42-Sheet6!I74,\"\")","v":3},{"$f":"IFERROR(Sheet3!J42-Sheet6!J74,\"\")","v":4}]
[null,null,null,null,null,{"$f":"IFERROR(Sheet3!F43-Sheet6!F75,\"\")","v":0},{"$f":"IFERROR(Sheet3!G43-Sheet6!G75,\"\")","v":4},{"$f":"IFERROR(Sheet3!H43-Sheet6!H75,\"\")","v":12},{"$f":"IFERROR(Sheet3!I43-Sheet6!I75,\"\")","v":-8},{"$f":"IFERROR(Sheet3!J43-Sheet6!J75,\"\")","v":-8}]
[null,null,null,null,null,{"$f":"IFERROR(Sheet3!F44-Sheet6!F76,\"\")","v":""},{"$f":"IFERROR(Sheet3!G44-Sheet6!G76,\"\")","v":-2},{"$f":"IFERROR(Sheet3!H44-Sheet6!H76,\"\")","v":-15},{"$f":"IFERROR(Sheet3!I44-Sheet6!I76,\"\")","v":25},{"$f":"IFERROR(Sheet3!J44-Sheet6!J76,\"\")","v":-7}]
[null,null,null,null,null,{"$f":"IFERROR(Sheet3!F45-Sheet6!F77,\"\")","v":4},{"$f":"IFERROR(Sheet3!G45-Sheet6!G77,\"\")","v":-1},{"$f":"IFERROR(Sheet3!H45-Sheet6!H77,\"\")","v":4},{"$f":"IFERROR(Sheet3!I45-Sheet6!I77,\"\")","v":-13},{"$f":"IFERROR(Sheet3!J45-Sheet6!J77,\"\")","v":6}]
[null,null,null,null,null,{"$f":"IFERROR(Sheet3!F46-Sheet6!F78,\"\")","v":1},{"$f":"IFERROR(Sheet3!G46-Sheet6!G78,\"\")","v":-1},{"$f":"IFERROR(Sheet3!H46-Sheet6!H78,\"\")","v":0},{"$f":"IFERROR(Sheet3!I46-Sheet6!I78,\"\")","v":10},{"$f":"IFERROR(Sheet3!J46-Sheet6!J78,\"\")","v":-10}]
[null,null,null,null,null,{"$f":"IFERROR(Sheet3!F47-Sheet6!F79,\"\")","v":""},{"$f":"IFERROR(Sheet3!G47-Sheet6!G79,\"\")","v":0},{"$f":"IFERROR(Sheet3!H47-Sheet6!H79,\"\")","v":7},{"$f":"IFERROR(Sheet3!I47-Sheet6!I79,\"\")","v":-5},{"$f":"IFERROR(Sheet3!J47-Sheet6!J79,\"\")","v":-1}]
[null,null,null,null,null,{"$f":"IFERROR(Sheet3!F48-Sheet6!F80,\"\")","v":""},{"$f":"IFERROR(Sheet3!G48-Sheet6!G80,\"\")","v":-12},{"$f":"IFERROR(Sheet3!H48-Sheet6!H80,\"\")","v":2},{"$f":"IFERROR(Sheet3!I48-Sheet6!I80,\"\")","v":17},{"$f":"IFERROR(Sheet3!J48-Sheet6!J80,\"\")","v":-3}]
[null,null,null,null,null,{"$f":"IFERROR(Sheet3!F49-Sheet6!F81,\"\")","v":-3},{"$f":"IFERROR(Sheet3!G49-Sheet6!G81,\"\")","v":-3},{"$f":"IFERROR(Sheet3!H49-Sheet6!H81,\"\")","v":2},{"$f":"IFERROR(Sheet3!I49-Sheet6!I81,\"\")","v":7},{"$f":"IFERROR(Sheet3!J49-Sheet6!J81,\"\")","v":-3}]
[null,null,null,null,null,{"$f":"IFERROR(Sheet3!F50-Sheet6!F82,\"\")","v":-1},{"$f":"IFERROR(Sheet3!G50-Sheet6!G82,\"\")","v":-1},{"$f":"IFERROR(Sheet3!H50-Sheet6!H82,\"\")","v":-4},{"$f":"IFERROR(Sheet3!I50-Sheet6!I82,\"\")","v":7},{"$f":"IFERROR(Sheet3!J50-Sheet6!J82,\"\")","v":-1}]
[null,null,null,null,null,{"$f":"IFERROR(Sheet3!F51-Sheet6!F83,\"\")","v":""},{"$f":"IFERROR(Sheet3!G51-Sheet6!G83,\"\")","v":-9},{"$f":"IFERROR(Sheet3!H51-Sheet6!H83,\"\")","v":3},{"$f":"IFERROR(Sheet3!I51-Sheet6!I83,\"\")","v":9},{"$f":"IFERROR(Sheet3!J51-Sheet6!J83,\"\")","v":2}]
[null,null,null,null,null,{"$f":"IFERROR(Sheet3!F52-Sheet6!F84,\"\")","v":""},{"$f":"IFERROR(Sheet3!G52-Sheet6!G84,\"\")","v":1},{"$f":"IFERROR(Sheet3!H52-Sheet6!H84,\"\")","v":10},{"$f":"IFERROR(Sheet3!I52-Sheet6!I84,\"\")","v":-4},{"$f":"IFERROR(Sheet3!J52-Sheet6!J84,\"\")","v":-6}]
[null,null,null,null,null,{"$f":"IFERROR(Sheet3!F53-Sheet6!F85,\"\")","v":""},{"$f":"IFERROR(Sheet3!G53-Sheet6!G85,\"\")","v":-5},{"$f":"IFERROR(Sheet3!H53-Sheet6!H85,\"\")","v":-10},{"$f":"IFERROR(Sheet3!I53-Sheet6!I85,\"\")","v":11},{"$f":"IFERROR(Sheet3!J53-Sheet6!J85,\"\")","v":7}]
[null,null,null,null,null,{"$f":"IFERROR(Sheet3!F54-Sheet6!F86,\"\")","v":1},{"$f":"IFERROR(Sheet3!G54-Sheet6!G86,\"\")","v":-1},{"$f":"IFERROR(Sheet3!H54-Sheet6!H86,\"\")","v":10},{"$f":"IFERROR(Sheet3!I54-Sheet6!I86,\"\")","v":-2},{"$f":"IFERROR(Sheet3!J54-Sheet6!J86,\"\")","v":-8}]
[null,null,null,null,null,{"$f":"IFERROR(Sheet3!F55-Sheet6!F87,\"\")","v":""},{"$f":"IFERROR(Sheet3!G55-Sheet6!G87,\"\")","v":-4},{"$f":"IFERROR(Sheet3!H55-Sheet6!H87,\"\")","v":-9},{"$f":"IFERROR(Sheet3!I55-Sheet6!I87,\"\")","v":5},{"$f":"IFERROR(Sheet3!J55-Sheet6!J87,\"\")","v":11}]
[null,null,null,null,null,{"$f":"IFERROR(Sheet3!F56-Sheet6!F88,\"\")","v":0},{"$f":"IFERROR(Sheet3!G56-Sheet6!G88,\"\")","v":1},{"$f":"IFERROR(Sheet3!H56-Sheet6!H88,\"\")","v":-2},{"$f":"IFERROR(Sheet3!I56-Sheet6!I88,\"\")","v":1},{"$f":"IFERROR(Sheet3!J56-Sheet6!J88,\"\")","v":0}]

{"sheet":"Release Information","index":7,"n_rows":39,"n_cols":5,"rows_kept":39,"cut":false,"hidden":false,"merged":[[38,1,38,2]]}
[null,"Corn","Soybeans","Spring Wheat ","Winter Wheat "]
["April 1st Report",null,null,null,"Winter Wheat Condition"]
["April 2nd Report","Corn: Planted",null,"Spring Wheat: Planted","Winter Wheat: Headed, Condition "]
["April 3rd Report","Corn: Planted",null,"Spring Wheat: Planted","Winter Wheat: Headed, Condition "]
["April 4th Report","Corn: Planted, Emerged","Soybeans: Planted","Spring Wheat: Planted, Emerged","Winter Wheat: Headed, Condition "]
["May 1st Report","Corn: Planted, Emerged","Soybeans: Planted","Spring Wheat: Planted, Emerged","Winter Wheat: Headed, Condition"]
["May 2nd Report","Corn: Planted, Emerged","Soybeans: Planted","Spring Wheat: Planted, Emerged","Winter Wheat: Headed, Condition"]
["May 3rd Report","Corn: Planted, Emerged  ","Soybeans: Planted, Emerged","Spring Wheat: Planted, Emerged","Winter Wheat: Headed, Condition"]
["May 4th Report","Corn: Planted, Emerged, Condition       ","Soybeans: Planted, Emerged","Spring Wheat: Planted, Emerged, Condition","Winter Wheat: Headed, Condition"]
["May 5th Report","Corn: Planted, Emerged, Condition       ","Soybeans: Planted, Emerged","Spring Wheat: Emerged, Condition","Winter Wheat: Headed, Harvested, Condition"]
["June 1st Report","Corn: Emerged, Condition       ","Soybeans: Planted, Emerged, Condition","Spring Wheat: Emerged, Condition","Winter Wheat: Headed, Harvested, Condition"]
["June 2nd Report","Corn: Emerged, Condition       ","Soybeans: Planted, Emerged, Condition","Spring Wheat: Emerged, Condition","Winter Wheat: Headed, Harvested, Condition"]
["June 3rd Report","Corn: Silking, Condition","Soybeans: Emerged, Blooming, Condition","Spring Wheat: Headed, Condition","Winter Wheat: Harvested, Condition"]
["June 4th Report","Corn: Silking, Condition","Soybeans: Emerged, Blooming, Condition","Spring Wheat: Headed, Condition","Winter Wheat: Harvested, Condition"]
["July 1st Report","Corn: Silking, Condition","Soybeans: Blooming, Setting Pods, Condition","Spring Wheat: Headed, Condition","Winter Wheat: Harvested"]
["July 2nd Report","Corn: Silking, Condition","Soybeans: Blooming, Setting Pods, Condition","Spring Wheat: Headed, Condition","Winter Wheat: Harvested"]
["July 3rd Report","Corn: Silking, Dough, Condition","Soybeans: Blooming, Setting Pods, Condition","Spring Wheat: Headed, Condition","Winter Wheat: Harvested"]
["July 4th Report","Corn: Silking, Dough, Condition","Soybeans: Blooming, Setting Pods, Condition","Spring Wheat: Harvested, Condition","Winter Wheat: Harvested"]
["July 5th Report","Corn: Silking, Dough, Dented, Condition","Soybeans: Blooming, Setting Pods, Condition","Spring Wheat: Harvested, Condition","Winter Wheat: Harvested"]
["August 1st Report","Corn: Silking, Dough, Dented, Condition","Soybeans: Blooming, Setting Pods, Condition","Spring Wheat: Harvested, Condition","Winter Wheat: Harvested"]
["August 2nd Report","Corn: Dough, Dented, Condition","Soybeans: Blooming, Setting Pods, Condition","Spring Wheat: Harvested, Condition"]
["August 3rd Report","Corn: Dough, Dented, Mature, Condition","Soybeans: Setting Pods, Dropping Leaves, Condition","Spring Wheat: Harvested"]
["August 4th Report","Corn: Dough, Dented, Mature, Condition","Soybeans: Setting Pods, Dropping Leaves, Condition","Spring Wheat: Harvested"]
["September 1st Report","Corn: Dough, Dented, Mature, Harvested, Condition","Soybeans: Dropping Leaves, Condition","Spring Wheat: Harvested"]
["September 2nd Report","Corn: Dough, Dented, Mature, Harvested, Condition","Soybeans: Dropping Leaves, Harvested, Condition","Spring Wheat: Harvested"]
["September 3rd Report","Corn: Dented, Mature, Harvested, Condition","Soybeans: Dropping Leaves, Harvested, Condition",null,"Winter Wheat: Planted"]
["September 4th Report","Corn: Dented, Mature, Harvested, Condition","Soybeans: Dropping Leaves, Harvested, Condition",null,"Winter Wheat: Planted, Emerged"]
["October 1st Report","Corn: Mature, Harvested, Condition","Soybeans: Dropping Leaves, Harvested, Condition",null,"Winter Wheat: Planted, Emerged"]
["October 2nd Report","Corn: Mature, Harvested, Condition","Soybeans: Dropping Leaves, Harvested, Condition",null,"Winter Wheat: Planted, Emerged"]
["October 3rd Report","Corn: Mature, Harvested, Condition","Soybeans: Dropping Leaves, Harvested",null,"Winter Wheat: Planted, Emerged"]
["October 4th Report","Corn: Harvested, Condition","Soybeans: Harvested",null,"Winter Wheat: Planted, Emerged, Condition"]
["October 5th Report","Corn: Harvested","Soybeans: Harvested",null,"Winter Wheat: Planted, Emerged, Condition"]
["November 1st Report","Corn: Harvested","Soybeans: Harvested",null,"Winter Wheat: Planted, Emerged, Condition"]
["November 2nd Report","Corn: Harvested","Soybeans: Harvested",null,"Winter Wheat: Emerged, Condition"]
["November 3rd Report","Corn: Harvested",null,null,"Winter Wheat: Emerged, Condition"]
["November 4th Report","Final"]
[]
[]
[null,"This tables lists approximate information in each report."]