{"text_format":"1","workbook":"xlsx","n_sheets":4,"sheets":["Main","Symbols","NASDAQ100","S&P500"],"not_rendered":{"charts":2,"images":2,"macros":1,"external_links":0,"defined_names":0,"comments":0,"pivot_tables":0},"unopened":[],"bounds":{"document_bytes":16777216,"sheet_cells":100000,"rows_first":2000,"rows_last":500,"rows_between":2000,"halvings":0,"cell_chars":16384,"cell_head_chars":4096},"cells_cut":0,"cells_raw":0,"read":"whole","date_system":"1900"}

{"sheet":"Main","index":0,"n_rows":48,"n_cols":28,"rows_kept":48,"cut":false,"hidden":false,"merged":[[46,19,46,26],[3,22,3,23],[4,22,4,23],[44,1,44,3],[45,1,45,3],[39,1,39,3],[40,1,40,3],[41,1,41,3],[42,1,42,3],[43,1,43,3],[10,17,10,19],[3,6,3,7],[4,6,4,7],[37,1,37,3],[38,1,38,3],[35,1,35,10],[26,1,26,3],[27,1,27,3],[28,1,28,3],[29,1,29,3],[30,1,30,3],[31,1,31,3],[32,1,32,3],[33,1,33,3],[9,17,9,19],[9,1,9,3],[10,1,10,3],[3,24,4,24],[3,25,4,25],[5,17,5,19],[6,1,6,3],[7,1,7,3],[6,17,6,19],[7,17,7,19],[3,17,4,19],[3,11,4,16],[1,24,2,26],[1,4,2,23],[5,1,5,3],[3,1,4,3],[3,8,4,8],[3,9,4,9],[3,10,4,10],[8,1,8,3],[8,17,8,19],[3,26,4,26],[5,11,5,16],[45,17,45,19],[22,1,23,3],[22,8,23,8],[22,9,23,9],[22,10,23,10],[22,17,23,19],[39,17,39,19],[40,17,40,19],[41,17,41,19],[42,17,42,19],[43,17,43,19],[34,17,34,19],[35,17,35,26],[36,17,36,19],[37,17,37,19],[38,17,38,19],[29,17,29,19],[30,17,30,19],[31,17,31,19],[34,1,34,3],[33,17,33,19],[25,1,25,3],[32,17,32,19],[36,1,36,3],[11,1,11,3],[11,17,11,19],[23,11,23,13],[24,11,24,13],[30,11,30,13],[28,11,28,13],[27,11,27,13],[25,11,25,13],[30,14,30,16],[28,14,28,16],[27,14,27,16],[25,14,25,16],[24,14,24,16],[23,14,23,16],[24,17,24,26],[25,17,25,19],[24,1,24,10],[12,17,12,19],[22,24,23,24],[22,25,23,25],[22,26,23,26],[27,17,27,19],[28,17,28,19],[26,11,26,13],[17,17,17,19],[15,17,15,19],[14,17,14,19],[26,17,26,19],[16,17,16,19],[13,1,13,3],[12,1,12,3],[21,1,21,3],[20,1,20,3],[19,1,19,3],[18,1,18,3],[17,1,17,3],[16,1,16,3],[22,11,22,16],[26,14,26,16],[14,11,14,16],[15,1,15,3],[14,1,14,3],[38,14,38,16],[41,11,41,13],[41,14,41,16],[44,11,44,13],[44,14,44,16],[21,17,21,19],[20,17,20,19],[19,17,19,19],[18,17,18,19],[33,14,33,16],[33,11,33,13],[31,14,31,16],[31,11,31,13],[44,17,44,19],[29,11,29,13],[29,14,29,16],[32,11,32,13],[36,14,36,16],[32,14,32,16],[46,1,47,1],[46,2,47,3],[46,4,47,6],[46,7,47,18],[47,19,47,26],[13,17,13,19],[36,11,36,13],[34,14,34,16],[34,11,34,13],[45,14,45,16],[45,11,45,13],[43,14,43,16],[43,11,43,13],[42,14,42,16],[42,11,42,13],[40,14,40,16],[40,11,40,13],[35,11,35,13],[35,14,35,16],[38,11,38,13],[39,14,39,16],[39,11,39,13],[37,14,37,16],[37,11,37,13]]}
[]
[null,null,null,null,"CQG S&P 500® and Nasdaq 100® Performance Dashboard",null,null,null,null,null,null,null,null,null,null,null,null,null,null,null,null,null,null,null,{"$f":"RTD(\"cqg.rtd\", ,\"SystemInfo\", \"Linetime\")","v":42779.620034722218}]
[]
[null,"Description",null,null,null,"Net","% Net",null,"Open","High","Low","5-minute Charts",null,null,null,null,null,"Description",null,null,"Last","Net","% Net",null,"Open","High","Low"]
[null,null,null,null,null,"Change","Change",null,null,null,null,null,null,null,null,null,null,null,null,null,"Price","Change","Change"]
[{"$f":"Symbols!C5","v":"X.US.SPC"},{"$f":"RTD(\"cqg.rtd\",,\"ContractData\",A6,\"LongDescription\",,\"T\")&\"  (\"&RIGHT(A6,LEN(A6)-5)&\")\"","v":"S&P 500  (SPC)"},null,null,{"$f":"IFERROR(RTD(\"cqg.rtd\", ,\"ContractData\",A6, \"LastTrade\",, \"T\"),\"\")","v":2328.94},{"$f":"IFERROR(RTD(\"cqg.rtd\", ,\"ContractData\",A6, \"NetChange\",, \"T\"),\"\")","v":12.67},{"$f":"IFERROR(RTD(\"cqg.rtd\", ,\"ContractData\",A6, \"PerCentNetLastTrade\",, \"T\")/100,\"\")","v":5.5438020810845822E-3},{"$f":"G6","v":5.5438020810845822E-3},{"$f":"IFERROR(RTD(\"cqg.rtd\", ,\"ContractData\",A6, \"Open\",, \"T\"),\"\")","v":2321.7200000000003},{"$f":"IFERROR(RTD(\"cqg.rtd\", ,\"ContractData\",A6, \"High\",, \"T\"),\"\")","v":2331.58},{"$f":"IFERROR(RTD(\"cqg.rtd\", ,\"ContractData\",A6, \"Low\",, \"T\"),\"\")","v":2321.42},{"$f":"B6","v":"S&P 500  (SPC)"},null,null,null,null,null,{"$f":"IFERROR(RTD(\"cqg.rtd\", ,\"ContractData\",AB6, \"LongDescription\",, \"T\"),\"\")&\"  (\"&RIGHT(AB6,LEN(AB6)-5)&\")\"","v":"NASDAQ Composite Index  (NQCOMP)"},null,null,{"$f":"IFERROR(RTD(\"cqg.rtd\", ,\"ContractData\",AB6, \"LastTrade\",, \"T\"),\"\")","v":5764.32},{"$f":"IFERROR(RTD(\"cqg.rtd\", ,\"ContractData\",AB6, \"NetChange\",, \"T\"),\"\")","v":30.19},{"$f":"IFERROR(RTD(\"cqg.rtd\", ,\"ContractData\",AB6, \"PerCentNetLastTrade\",, \"T\")/100,\"\")","v":5.264966089014376E-3},{"$f":"W6","v":5.264966089014376E-3},{"$f":"IFERROR(RTD(\"cqg.rtd\", ,\"ContractData\",AB6, \"Open\",, \"T\"),\"\")","v":5753.1900000000005},{"$f":"IFERROR(RTD(\"cqg.rtd\", ,\"ContractData\",AB6, \"High\",, \"T\"),\"\")","v":5770.99},{"$f":"IFERROR(RTD(\"cqg.rtd\", ,\"ContractData\",AB6, \"Low\",, \"T\"),\"\")","v":5751.92},{"$f":"Symbols!H5","v":"X.US.NQCOMP"}]
[{"$f":"Symbols!C6","v":"X.US.DJI"},{"$f":"RTD(\"cqg.rtd\",,\"ContractData\",A7,\"LongDescription\",,\"T\")&\"  (\"&RIGHT(A7,LEN(A7)-5)&\")\"","v":"DJ Industrial Average  (DJI)"},null,null,{"$f":"IFERROR(RTD(\"cqg.rtd\", ,\"ContractData\",A7, \"LastTrade\",, \"T\"),\"\")","v":20415.900000000001},{"$f":"IFERROR(RTD(\"cqg.rtd\", ,\"ContractData\",A7, \"NetChange\",, \"T\"),\"\")","v":145.80000000000001},{"$f":"IFERROR(RTD(\"cqg.rtd\", ,\"ContractData\",A7, \"PerCentNetLastTrade\",, \"T\")/100,\"\")","v":7.2326128677359354E-3},7.2326128677359354E-3,{"$f":"IFERROR(RTD(\"cqg.rtd\", ,\"ContractData\",A7, \"Open\",, \"T\"),\"\")","v":20338.5},{"$f":"IFERROR(RTD(\"cqg.rtd\", ,\"ContractData\",A7, \"High\",, \"T\"),\"\")","v":20441.400000000001},{"$f":"IFERROR(RTD(\"cqg.rtd\", ,\"ContractData\",A7, \"Low\",, \"T\"),\"\")","v":20322.900000000001},null,null,null,null,null,null,{"$f":"IFERROR(RTD(\"cqg.rtd\", ,\"ContractData\",AB7, \"LongDescription\",, \"T\"),\"\")&\"  (\"&RIGHT(AB7,LEN(AB7)-5)&\")\"","v":"NASDAQ-100 Index  (NDX)"},null,null,{"$f":"IFERROR(RTD(\"cqg.rtd\", ,\"ContractData\",AB7, \"LastTrade\",, \"T\"),\"\")","v":5257.24},{"$f":"IFERROR(RTD(\"cqg.rtd\", ,\"ContractData\",AB7, \"NetChange\",, \"T\"),\"\")","v":30.55},{"$f":"IFERROR(RTD(\"cqg.rtd\", ,\"ContractData\",AB7, \"PerCentNetLastTrade\",, \"T\")/100,\"\")","v":5.8449994164566869E-3},5.8449994164566869E-3,{"$f":"IFERROR(RTD(\"cqg.rtd\", ,\"ContractData\",AB7, \"Open\",, \"T\"),\"\")","v":5242.49},{"$f":"IFERROR(RTD(\"cqg.rtd\", ,\"ContractData\",AB7, \"High\",, \"T\"),\"\")","v":5262.42},{"$f":"IFERROR(RTD(\"cqg.rtd\", ,\"ContractData\",AB7, \"Low\",, \"T\"),\"\")","v":5241},{"$f":"Symbols!H6","v":"X.US.NDX"}]
[{"$f":"Symbols!C7","v":"S.US.XLF"},{"$f":"RTD(\"cqg.rtd\",,\"ContractData\",A8,\"LongDescription\",,\"T\")&\"  (\"&RIGHT(A8,LEN(A8)-5)&\")\"","v":"Financial Select Sector SPDR  (XLF)"},null,null,{"$f":"IFERROR(RTD(\"cqg.rtd\", ,\"ContractData\",A8, \"LastTrade\",, \"T\"),\"\")","v":24.07},{"$f":"IFERROR(RTD(\"cqg.rtd\", ,\"ContractData\",A8, \"NetChange\",, \"T\"),\"\")","v":0.28999999999999998},{"$f":"IFERROR(RTD(\"cqg.rtd\", ,\"ContractData\",A8, \"PerCentNetLastTrade\",, \"T\")/100,\"\")","v":1.2195121951219513E-2},1.2195121951219513E-2,{"$f":"IFERROR(RTD(\"cqg.rtd\", ,\"ContractData\",A8, \"Open\",, \"T\"),\"\")","v":23.93},{"$f":"IFERROR(RTD(\"cqg.rtd\", ,\"ContractData\",A8, \"High\",, \"T\"),\"\")","v":24.16},{"$f":"IFERROR(RTD(\"cqg.rtd\", ,\"ContractData\",A8, \"Low\",, \"T\"),\"\")","v":23.89},null,null,null,null,null,null,{"$f":"IFERROR(RTD(\"cqg.rtd\", ,\"ContractData\",AB8, \"LongDescription\",, \"T\"),\"\")&\"  (\"&RIGHT(AB8,LEN(AB8)-5)&\")\"","v":"NASDAQ Financial 100  (IXF)"},null,null,{"$f":"IFERROR(RTD(\"cqg.rtd\", ,\"ContractData\",AB8, \"LastTrade\",, \"T\"),\"\")","v":4094.37},{"$f":"IFERROR(RTD(\"cqg.rtd\", ,\"ContractData\",AB8, \"NetChange\",, \"T\"),\"\")","v":39.200000000000003},{"$f":"IFERROR(RTD(\"cqg.rtd\", ,\"ContractData\",AB8, \"PerCentNetLastTrade\",, \"T\")/100,\"\")","v":9.6666724206383465E-3},9.6666724206383465E-3,{"$f":"IFERROR(RTD(\"cqg.rtd\", ,\"ContractData\",AB8, \"Open\",, \"T\"),\"\")","v":4074.7400000000002},{"$f":"IFERROR(RTD(\"cqg.rtd\", ,\"ContractData\",AB8, \"High\",, \"T\"),\"\")","v":4107.18},{"$f":"IFERROR(RTD(\"cqg.rtd\", ,\"ContractData\",AB8, \"Low\",, \"T\"),\"\")","v":4074.1800000000003},{"$f":"Symbols!H7","v":"X.US.IXF"}]
[{"$f":"Symbols!C8","v":"X.US.BTK"},{"$f":"RTD(\"cqg.rtd\",,\"ContractData\",A9,\"LongDescription\",,\"T\")&\"  (\"&RIGHT(A9,LEN(A9)-5)&\")\"","v":"Biotechnology Index  (BTK)"},null,null,{"$f":"IFERROR(RTD(\"cqg.rtd\", ,\"ContractData\",A9, \"LastTrade\",, \"T\"),\"\")","v":3365.55},{"$f":"IFERROR(RTD(\"cqg.rtd\", ,\"ContractData\",A9, \"NetChange\",, \"T\"),\"\")","v":28.53},{"$f":"IFERROR(RTD(\"cqg.rtd\", ,\"ContractData\",A9, \"PerCentNetLastTrade\",, \"T\")/100,\"\")","v":8.5495442041102539E-3},8.5495442041102539E-3,{"$f":"IFERROR(RTD(\"cqg.rtd\", ,\"ContractData\",A9, \"Open\",, \"T\"),\"\")","v":3353.61},{"$f":"IFERROR(RTD(\"cqg.rtd\", ,\"ContractData\",A9, \"High\",, \"T\"),\"\")","v":3376.75},{"$f":"IFERROR(RTD(\"cqg.rtd\", ,\"ContractData\",A9, \"Low\",, \"T\"),\"\")","v":3346.42},null,null,null,null,null,null,{"$f":"IFERROR(RTD(\"cqg.rtd\", ,\"ContractData\",AB9, \"LongDescription\",, \"T\"),\"\")&\"  (\"&RIGHT(AB9,LEN(AB9)-5)&\")\"","v":"NASDAQ Biotechnology  (NBI)"},null,null,{"$f":"IFERROR(RTD(\"cqg.rtd\", ,\"ContractData\",AB9, \"LastTrade\",, \"T\"),\"\")","v":2996.81},{"$f":"IFERROR(RTD(\"cqg.rtd\", ,\"ContractData\",AB9, \"NetChange\",, \"T\"),\"\")","v":20.51},{"$f":"IFERROR(RTD(\"cqg.rtd\", ,\"ContractData\",AB9, \"PerCentNetLastTrade\",, \"T\")/100,\"\")","v":6.8911064072842117E-3},6.8911064072842117E-3,{"$f":"IFERROR(RTD(\"cqg.rtd\", ,\"ContractData\",AB9, \"Open\",, \"T\"),\"\")","v":2989.15},{"$f":"IFERROR(RTD(\"cqg.rtd\", ,\"ContractData\",AB9, \"High\",, \"T\"),\"\")","v":3001.62},{"$f":"IFERROR(RTD(\"cqg.rtd\", ,\"ContractData\",AB9, \"Low\",, \"T\"),\"\")","v":2983.03},{"$f":"Symbols!H8","v":"X.US.NBI"}]
[{"$f":"Symbols!C9","v":"X.US.NYPID"},{"$f":"RTD(\"cqg.rtd\",,\"ContractData\",A10,\"LongDescription\",,\"T\")&\"  (\"&RIGHT(A10,LEN(A10)-5)&\")\"","v":"NYSE Healthcare Index  (NYPID)"},null,null,{"$f":"IFERROR(RTD(\"cqg.rtd\", ,\"ContractData\",A10, \"LastTrade\",, \"T\"),\"\")","v":12378.81},{"$f":"IFERROR(RTD(\"cqg.rtd\", ,\"ContractData\",A10, \"NetChange\",, \"T\"),\"\")","v":62.61},{"$f":"IFERROR(RTD(\"cqg.rtd\", ,\"ContractData\",A10, \"PerCentNetLastTrade\",, \"T\")/100,\"\")","v":5.0835484971013785E-3},5.0835484971013785E-3,{"$f":"IFERROR(RTD(\"cqg.rtd\", ,\"ContractData\",A10, \"Open\",, \"T\"),\"\")","v":12316.2},{"$f":"IFERROR(RTD(\"cqg.rtd\", ,\"ContractData\",A10, \"High\",, \"T\"),\"\")","v":12381.89},{"$f":"IFERROR(RTD(\"cqg.rtd\", ,\"ContractData\",A10, \"Low\",, \"T\"),\"\")","v":12316.2},null,null,null,null,null,null,{"$f":"IFERROR(RTD(\"cqg.rtd\", ,\"ContractData\",AB10, \"LongDescription\",, \"T\"),\"\")&\"  (\"&RIGHT(AB10,LEN(AB10)-5)&\")\"","v":"Nasdaq Health Care Index  (NHC)"},null,null,{"$f":"IFERROR(RTD(\"cqg.rtd\", ,\"ContractData\",AB10, \"LastTrade\",, \"T\"),\"\")","v":668.53},{"$f":"IFERROR(RTD(\"cqg.rtd\", ,\"ContractData\",AB10, \"NetChange\",, \"T\"),\"\")","v":4.29},{"$f":"IFERROR(RTD(\"cqg.rtd\", ,\"ContractData\",AB10, \"PerCentNetLastTrade\",, \"T\")/100,\"\")","v":6.4585089726604842E-3},6.4585089726604842E-3,{"$f":"IFERROR(RTD(\"cqg.rtd\", ,\"ContractData\",AB10, \"Open\",, \"T\"),\"\")","v":666.68000000000006},{"$f":"IFERROR(RTD(\"cqg.rtd\", ,\"ContractData\",AB10, \"High\",, \"T\"),\"\")","v":669.15},{"$f":"IFERROR(RTD(\"cqg.rtd\", ,\"ContractData\",AB10, \"Low\",, \"T\"),\"\")","v":665.6},{"$f":"Symbols!H9","v":"X.US.NHC"}]
[{"$f":"Symbols!C10","v":"X.US.IXE"},{"$f":"RTD(\"cqg.rtd\",,\"ContractData\",A11,\"LongDescription\",,\"T\")&\"  (\"&RIGHT(A11,LEN(A11)-5)&\")\"","v":"S&P 500 Select Sector Energy Index  (IXE)"},null,null,{"$f":"IFERROR(RTD(\"cqg.rtd\", ,\"ContractData\",A11, \"LastTrade\",, \"T\"),\"\")","v":734.73},{"$f":"IFERROR(RTD(\"cqg.rtd\", ,\"ContractData\",A11, \"NetChange\",, \"T\"),\"\")","v":0.44},{"$f":"IFERROR(RTD(\"cqg.rtd\", ,\"ContractData\",A11, \"PerCentNetLastTrade\",, \"T\")/100,\"\")","v":5.9921829250023833E-4},5.9921829250023833E-4,{"$f":"IFERROR(RTD(\"cqg.rtd\", ,\"ContractData\",A11, \"Open\",, \"T\"),\"\")","v":733.29},{"$f":"IFERROR(RTD(\"cqg.rtd\", ,\"ContractData\",A11, \"High\",, \"T\"),\"\")","v":734.84},{"$f":"IFERROR(RTD(\"cqg.rtd\", ,\"ContractData\",A11, \"Low\",, \"T\"),\"\")","v":730.4},null,null,null,null,null,null,{"$f":"IFERROR(RTD(\"cqg.rtd\", ,\"ContractData\",AB11, \"LongDescription\",, \"T\"),\"\")&\"  (\"&RIGHT(AB11,LEN(AB11)-5)&\")\"","v":"PHLX Oil Service Sector  (OSX)"},null,null,{"$f":"IFERROR(RTD(\"cqg.rtd\", ,\"ContractData\",AB11, \"LastTrade\",, \"T\"),\"\")","v":180.66},{"$f":"IFERROR(RTD(\"cqg.rtd\", ,\"ContractData\",AB11, \"NetChange\",, \"T\"),\"\")","v":0.44},{"$f":"IFERROR(RTD(\"cqg.rtd\", ,\"ContractData\",AB11, \"PerCentNetLastTrade\",, \"T\")/100,\"\")","v":2.4414604372433694E-3},2.4414604372433694E-3,{"$f":"IFERROR(RTD(\"cqg.rtd\", ,\"ContractData\",AB11, \"Open\",, \"T\"),\"\")","v":180.02},{"$f":"IFERROR(RTD(\"cqg.rtd\", ,\"ContractData\",AB11, \"High\",, \"T\"),\"\")","v":181.54},{"$f":"IFERROR(RTD(\"cqg.rtd\", ,\"ContractData\",AB11, \"Low\",, \"T\"),\"\")","v":179.23},{"$f":"Symbols!H10","v":"X.US.OSX"}]
[{"$f":"Symbols!C11","v":"S.US.BAC"},{"$f":"RTD(\"cqg.rtd\",,\"ContractData\",A12,\"LongDescription\",,\"T\")&\"  (\"&RIGHT(A12,LEN(A12)-5)&\")\"","v":"Bank of America Corp  (BAC)"},null,null,{"$f":"IFERROR(RTD(\"cqg.rtd\", ,\"ContractData\",A12, \"LastTrade\",, \"T\"),\"\")","v":23.45},{"$f":"IFERROR(RTD(\"cqg.rtd\", ,\"ContractData\",A12, \"NetChange\",, \"T\"),\"\")","v":0.37},{"$f":"IFERROR(RTD(\"cqg.rtd\", ,\"ContractData\",A12, \"PerCentNetLastTrade\",, \"T\")/100,\"\")","v":1.6031195840554593E-2},{"$f":"G12","v":1.6031195840554593E-2},{"$f":"IFERROR(RTD(\"cqg.rtd\", ,\"ContractData\",A12, \"Open\",, \"T\"),\"\")","v":23.17},{"$f":"IFERROR(RTD(\"cqg.rtd\", ,\"ContractData\",A12, \"High\",, \"T\"),\"\")","v":23.54},{"$f":"IFERROR(RTD(\"cqg.rtd\", ,\"ContractData\",A12, \"Low\",, \"T\"),\"\")","v":23.17},null,null,null,null,null,null,{"$f":"IFERROR(RTD(\"cqg.rtd\", ,\"ContractData\",AB12, \"LongDescription\",, \"T\"),\"\")&\"  (\"&RIGHT(AB12,LEN(AB12)-5)&\")\"","v":"Energy Select Sector SPDR  (XLE)"},null,null,{"$f":"IFERROR(RTD(\"cqg.rtd\", ,\"ContractData\",AB12, \"LastTrade\",, \"T\"),\"\")","v":73.42},{"$f":"IFERROR(RTD(\"cqg.rtd\", ,\"ContractData\",AB12, \"NetChange\",, \"T\"),\"\")","v":0.14000000000000001},{"$f":"IFERROR(RTD(\"cqg.rtd\", ,\"ContractData\",AB12, \"PerCentNetLastTrade\",, \"T\")/100,\"\")","v":1.9104803493449783E-3},1.9104803493449783E-3,{"$f":"IFERROR(RTD(\"cqg.rtd\", ,\"ContractData\",AB12, \"Open\",, \"T\"),\"\")","v":73.13},{"$f":"IFERROR(RTD(\"cqg.rtd\", ,\"ContractData\",AB12, \"High\",, \"T\"),\"\")","v":73.45},{"$f":"IFERROR(RTD(\"cqg.rtd\", ,\"ContractData\",AB12, \"Low\",, \"T\"),\"\")","v":72.989999999999995},{"$f":"Symbols!H11","v":"S.US.XLE"}]
[{"$f":"Symbols!C12","v":"S.US.RSP"},{"$f":"RTD(\"cqg.rtd\",,\"ContractData\",A13,\"LongDescription\",,\"T\")&\"  (\"&RIGHT(A13,LEN(A13)-5)&\")\"","v":"Guggenheim S&P 500 Equal Weight ETF  (RSP)"},null,null,{"$f":"IFERROR(RTD(\"cqg.rtd\", ,\"ContractData\",A13, \"LastTrade\",, \"T\"),\"\")","v":90.31},{"$f":"IFERROR(RTD(\"cqg.rtd\", ,\"ContractData\",A13, \"NetChange\",, \"T\"),\"\")","v":0.43},{"$f":"IFERROR(RTD(\"cqg.rtd\", ,\"ContractData\",A13, \"PerCentNetLastTrade\",, \"T\")/100,\"\")","v":4.8959608323133411E-3},{"$f":"G13","v":4.8959608323133411E-3},{"$f":"IFERROR(RTD(\"cqg.rtd\", ,\"ContractData\",A13, \"Open\",, \"T\"),\"\")","v":90.14},{"$f":"IFERROR(RTD(\"cqg.rtd\", ,\"ContractData\",A13, \"High\",, \"T\"),\"\")","v":90.41},{"$f":"IFERROR(RTD(\"cqg.rtd\", ,\"ContractData\",A13, \"Low\",, \"T\"),\"\")","v":90.070000000000007},null,null,null,null,null,null,{"$f":"IFERROR(RTD(\"cqg.rtd\", ,\"ContractData\",AB13, \"LongDescription\",, \"T\"),\"\")&\"  (\"&RIGHT(AB13,LEN(AB13)-5)&\")\"","v":"Apple Inc  (AAPL)"},null,null,{"$f":"IFERROR(RTD(\"cqg.rtd\", ,\"ContractData\",AB13, \"LastTrade\",, \"T\"),\"\")","v":133.44},{"$f":"IFERROR(RTD(\"cqg.rtd\", ,\"ContractData\",AB13, \"NetChange\",, \"T\"),\"\")","v":1.32},{"$f":"IFERROR(RTD(\"cqg.rtd\", ,\"ContractData\",AB13, \"PerCentNetLastTrade\",, \"T\")/100,\"\")","v":9.9909173478655768E-3},{"$f":"W13","v":9.9909173478655768E-3},{"$f":"IFERROR(RTD(\"cqg.rtd\", ,\"ContractData\",AB13, \"Open\",, \"T\"),\"\")","v":133.08000000000001},{"$f":"IFERROR(RTD(\"cqg.rtd\", ,\"ContractData\",AB13, \"High\",, \"T\"),\"\")","v":133.82},{"$f":"IFERROR(RTD(\"cqg.rtd\", ,\"ContractData\",AB13, \"Low\",, \"T\"),\"\")","v":132.75},{"$f":"Symbols!H12","v":"S.US.AAPL"}]
[{"$f":"Symbols!C13","v":"S.US.SPY"},{"$f":"RTD(\"cqg.rtd\",,\"ContractData\",A14,\"LongDescription\",,\"T\")&\"  (\"&RIGHT(A14,LEN(A14)-5)&\")\"","v":"SPDR S&P 500  (SPY)"},null,null,{"$f":"IFERROR(RTD(\"cqg.rtd\", ,\"ContractData\",A14, \"LastTrade\",, \"T\"),\"\")","v":232.79},{"$f":"IFERROR(RTD(\"cqg.rtd\", ,\"ContractData\",A14, \"NetChange\",, \"T\"),\"\")","v":1.29},{"$f":"IFERROR(RTD(\"cqg.rtd\", ,\"ContractData\",A14, \"PerCentNetLastTrade\",, \"T\")/100,\"\")","v":5.5289188371992568E-3},5.5289188371992568E-3,{"$f":"IFERROR(RTD(\"cqg.rtd\", ,\"ContractData\",A14, \"Open\",, \"T\"),\"\")","v":232.08},{"$f":"IFERROR(RTD(\"cqg.rtd\", ,\"ContractData\",A14, \"High\",, \"T\"),\"\")","v":233.07},{"$f":"IFERROR(RTD(\"cqg.rtd\", ,\"ContractData\",A14, \"Low\",, \"T\"),\"\")","v":232.05},null,null,null,null,null,null,{"$f":"IFERROR(RTD(\"cqg.rtd\", ,\"ContractData\",AB14, \"LongDescription\",, \"T\"),\"\")&\"  (\"&RIGHT(AB14,LEN(AB14)-5)&\")\"","v":"Tesla, Inc.  (TSLA)"},null,null,{"$f":"IFERROR(RTD(\"cqg.rtd\", ,\"ContractData\",AB14, \"LastTrade\",, \"T\"),\"\")","v":280.56},{"$f":"IFERROR(RTD(\"cqg.rtd\", ,\"ContractData\",AB14, \"NetChange\",, \"T\"),\"\")","v":11.39},{"$f":"IFERROR(RTD(\"cqg.rtd\", ,\"ContractData\",AB14, \"PerCentNetLastTrade\",, \"T\")/100,\"\")","v":4.2082977379935375E-2},4.2082977379935375E-2,{"$f":"IFERROR(RTD(\"cqg.rtd\", ,\"ContractData\",AB14, \"Open\",, \"T\"),\"\")","v":270.74},{"$f":"IFERROR(RTD(\"cqg.rtd\", ,\"ContractData\",AB14, \"High\",, \"T\"),\"\")","v":280.78000000000003},{"$f":"IFERROR(RTD(\"cqg.rtd\", ,\"ContractData\",AB14, \"Low\",, \"T\"),\"\")","v":270.51},{"$f":"Symbols!H13","v":"S.US.TSLA"}]
[{"$f":"Symbols!C14","v":"F.US.EP"},{"$f":"RTD(\"cqg.rtd\",,\"ContractData\",A15,\"LongDescription\",,\"T\")&\"  (\"&RIGHT(A15,LEN(A15)-5)&\")\"","v":"E-Mini S&P 500, Mar 17  (EP)"},null,null,{"$f":"IFERROR(RTD(\"cqg.rtd\", ,\"ContractData\",A15, \"LastTrade\",, \"T\"),\"\")","v":2326},{"$f":"IFERROR(RTD(\"cqg.rtd\", ,\"ContractData\",A15, \"NetChange\",, \"T\"),\"\")","v":13.5},{"$f":"IFERROR(RTD(\"cqg.rtd\", ,\"ContractData\",A15, \"PerCentNetLastTrade\",, \"T\")/100,\"\")","v":5.7291103664468702E-3},5.7291103664468702E-3,{"$f":"IFERROR(RTD(\"cqg.rtd\", ,\"ContractData\",A15, \"Open\",, \"T\"),\"\")","v":2314.25},{"$f":"IFERROR(RTD(\"cqg.rtd\", ,\"ContractData\",A15, \"High\",, \"T\"),\"\")","v":2329},{"$f":"IFERROR(RTD(\"cqg.rtd\", ,\"ContractData\",A15, \"Low\",, \"T\"),\"\")","v":2313.25},{"$f":"R6","v":"NASDAQ Composite Index  (NQCOMP)"},null,null,null,null,null,{"$f":"IFERROR(RTD(\"cqg.rtd\", ,\"ContractData\",AB15, \"LongDescription\",, \"T\"),\"\")&\"  (\"&RIGHT(AB15,LEN(AB15)-5)&\")\"","v":"Micron Technology Inc  (MU)"},null,null,{"$f":"IFERROR(RTD(\"cqg.rtd\", ,\"ContractData\",AB15, \"LastTrade\",, \"T\"),\"\")","v":23.94},{"$f":"IFERROR(RTD(\"cqg.rtd\", ,\"ContractData\",AB15, \"NetChange\",, \"T\"),\"\")","v":-0.11},{"$f":"IFERROR(RTD(\"cqg.rtd\", ,\"ContractData\",AB15, \"PerCentNetLastTrade\",, \"T\")/100,\"\")","v":-4.5738045738045741E-3},-4.5738045738045741E-3,{"$f":"IFERROR(RTD(\"cqg.rtd\", ,\"ContractData\",AB15, \"Open\",, \"T\"),\"\")","v":24.07},{"$f":"IFERROR(RTD(\"cqg.rtd\", ,\"ContractData\",AB15, \"High\",, \"T\"),\"\")","v":24.2},{"$f":"IFERROR(RTD(\"cqg.rtd\", ,\"ContractData\",AB15, \"Low\",, \"T\"),\"\")","v":23.82},{"$f":"Symbols!H14","v":"S.US.MU"}]
[{"$f":"Symbols!C15","v":"F.US.CLE"},{"$f":"RTD(\"cqg.rtd\",,\"ContractData\",A16,\"LongDescription\",,\"T\")&\"  (\"&RIGHT(A16,LEN(A16)-5)&\")\"","v":"Crude Light (Globex), Mar 17  (CLE)"},null,null,{"$f":"IFERROR(RTD(\"cqg.rtd\", ,\"ContractData\",A16, \"LastTrade\",, \"T\"),\"\")","v":52.88},{"$f":"IFERROR(RTD(\"cqg.rtd\", ,\"ContractData\",A16, \"NetChange\",, \"T\"),\"\")","v":-0.98},{"$f":"IFERROR(RTD(\"cqg.rtd\", ,\"ContractData\",A16, \"PerCentNetLastTrade\",, \"T\")/100,\"\")","v":-1.8195321203119195E-2},-1.8195321203119195E-2,{"$f":"IFERROR(RTD(\"cqg.rtd\", ,\"ContractData\",A16, \"Open\",, \"T\"),\"\")","v":53.800000000000004},{"$f":"IFERROR(RTD(\"cqg.rtd\", ,\"ContractData\",A16, \"High\",, \"T\"),\"\")","v":53.95},{"$f":"IFERROR(RTD(\"cqg.rtd\", ,\"ContractData\",A16, \"Low\",, \"T\"),\"\")","v":52.77},null,null,null,null,null,null,{"$f":"IFERROR(RTD(\"cqg.rtd\", ,\"ContractData\",AB16, \"LongDescription\",, \"T\"),\"\")&\"  (\"&RIGHT(AB16,LEN(AB16)-5)&\")\"","v":"Powershares QQQ Trust  (QQQ)"},null,null,{"$f":"IFERROR(RTD(\"cqg.rtd\", ,\"ContractData\",AB16, \"LastTrade\",, \"T\"),\"\")","v":128.13},{"$f":"IFERROR(RTD(\"cqg.rtd\", ,\"ContractData\",AB16, \"NetChange\",, \"T\"),\"\")","v":0.74},{"$f":"IFERROR(RTD(\"cqg.rtd\", ,\"ContractData\",AB16, \"PerCentNetLastTrade\",, \"T\")/100,\"\")","v":5.8093892290783482E-3},5.8093892290783482E-3,{"$f":"IFERROR(RTD(\"cqg.rtd\", ,\"ContractData\",AB16, \"Open\",, \"T\"),\"\")","v":127.76},{"$f":"IFERROR(RTD(\"cqg.rtd\", ,\"ContractData\",AB16, \"High\",, \"T\"),\"\")","v":128.26},{"$f":"IFERROR(RTD(\"cqg.rtd\", ,\"ContractData\",AB16, \"Low\",, \"T\"),\"\")","v":127.71000000000001},{"$f":"Symbols!H15","v":"S.US.QQQ"}]
[{"$f":"Symbols!C16","v":"F.US.HOE"},{"$f":"RTD(\"cqg.rtd\",,\"ContractData\",A17,\"LongDescription\",,\"T\")&\"  (\"&RIGHT(A17,LEN(A17)-5)&\")\"","v":"NY Harbor ULSD, Mar 17  (HOE)"},null,null,{"$f":"IFERROR(RTD(\"cqg.rtd\", ,\"ContractData\",A17, \"LastTrade\",, \"T\"),\"\")","v":1.6249},{"$f":"IFERROR(RTD(\"cqg.rtd\", ,\"ContractData\",A17, \"NetChange\",, \"T\"),\"\")","v":-4.1100000000000005E-2},{"$f":"IFERROR(RTD(\"cqg.rtd\", ,\"ContractData\",A17, \"PerCentNetLastTrade\",, \"T\")/100,\"\")","v":-2.4611321207755568E-2},-2.4611321207755568E-2,{"$f":"IFERROR(RTD(\"cqg.rtd\", ,\"ContractData\",A17, \"Open\",, \"T\"),\"\")","v":1.6661000000000001},{"$f":"IFERROR(RTD(\"cqg.rtd\", ,\"ContractData\",A17, \"High\",, \"T\"),\"\")","v":1.6724000000000001},{"$f":"IFERROR(RTD(\"cqg.rtd\", ,\"ContractData\",A17, \"Low\",, \"T\"),\"\")","v":1.6189},null,null,null,null,null,null,{"$f":"IFERROR(RTD(\"cqg.rtd\", ,\"ContractData\",AB17, \"LongDescription\",, \"T\"),\"\")&\"  (\"&RIGHT(AB17,LEN(AB17)-5)&\")\"","v":"Cisco Systems Inc  (CSCO)"},null,null,{"$f":"IFERROR(RTD(\"cqg.rtd\", ,\"ContractData\",AB17, \"LastTrade\",, \"T\"),\"\")","v":31.98},{"$f":"IFERROR(RTD(\"cqg.rtd\", ,\"ContractData\",AB17, \"NetChange\",, \"T\"),\"\")","v":0.47000000000000003},{"$f":"IFERROR(RTD(\"cqg.rtd\", ,\"ContractData\",AB17, \"PerCentNetLastTrade\",, \"T\")/100,\"\")","v":1.4915899714376388E-2},1.4915899714376388E-2,{"$f":"IFERROR(RTD(\"cqg.rtd\", ,\"ContractData\",AB17, \"Open\",, \"T\"),\"\")","v":31.67},{"$f":"IFERROR(RTD(\"cqg.rtd\", ,\"ContractData\",AB17, \"High\",, \"T\"),\"\")","v":31.990000000000002},{"$f":"IFERROR(RTD(\"cqg.rtd\", ,\"ContractData\",AB17, \"Low\",, \"T\"),\"\")","v":31.55},{"$f":"Symbols!H16","v":"S.US.CSCO"}]
[{"$f":"Symbols!C17","v":"F.US.RBE"},{"$f":"RTD(\"cqg.rtd\",,\"ContractData\",A18,\"LongDescription\",,\"T\")&\"  (\"&RIGHT(A18,LEN(A18)-5)&\")\"","v":"RBOB Gasoline (Globex), Mar 17  (RBE)"},null,null,{"$f":"IFERROR(RTD(\"cqg.rtd\", ,\"ContractData\",A18, \"LastTrade\",, \"T\"),\"\")","v":1.5425},{"$f":"IFERROR(RTD(\"cqg.rtd\", ,\"ContractData\",A18, \"NetChange\",, \"T\"),\"\")","v":-4.7199999999999999E-2},{"$f":"IFERROR(RTD(\"cqg.rtd\", ,\"ContractData\",A18, \"PerCentNetLastTrade\",, \"T\")/100,\"\")","v":-2.9630095621540013E-2},-2.9630095621540013E-2,{"$f":"IFERROR(RTD(\"cqg.rtd\", ,\"ContractData\",A18, \"Open\",, \"T\"),\"\")","v":1.589},{"$f":"IFERROR(RTD(\"cqg.rtd\", ,\"ContractData\",A18, \"High\",, \"T\"),\"\")","v":1.6031},{"$f":"IFERROR(RTD(\"cqg.rtd\", ,\"ContractData\",A18, \"Low\",, \"T\"),\"\")","v":1.5399},null,null,null,null,null,null,{"$f":"IFERROR(RTD(\"cqg.rtd\", ,\"ContractData\",AB18, \"LongDescription\",, \"T\"),\"\")&\"  (\"&RIGHT(AB18,LEN(AB18)-5)&\")\"","v":"Facebook, Inc.  (FB)"},null,null,{"$f":"IFERROR(RTD(\"cqg.rtd\", ,\"ContractData\",AB18, \"LastTrade\",, \"T\"),\"\")","v":134.02000000000001},{"$f":"IFERROR(RTD(\"cqg.rtd\", ,\"ContractData\",AB18, \"NetChange\",, \"T\"),\"\")","v":-0.17},{"$f":"IFERROR(RTD(\"cqg.rtd\", ,\"ContractData\",AB18, \"PerCentNetLastTrade\",, \"T\")/100,\"\")","v":-1.2668604217899993E-3},-1.2668604217899993E-3,{"$f":"IFERROR(RTD(\"cqg.rtd\", ,\"ContractData\",AB18, \"Open\",, \"T\"),\"\")","v":134.69},{"$f":"IFERROR(RTD(\"cqg.rtd\", ,\"ContractData\",AB18, \"High\",, \"T\"),\"\")","v":134.69},{"$f":"IFERROR(RTD(\"cqg.rtd\", ,\"ContractData\",AB18, \"Low\",, \"T\"),\"\")","v":133.69999999999999},{"$f":"Symbols!H17","v":"S.US.FB"}]
[{"$f":"Symbols!C18","v":"F.US.GCE"},{"$f":"RTD(\"cqg.rtd\",,\"ContractData\",A19,\"LongDescription\",,\"T\")&\"  (\"&RIGHT(A19,LEN(A19)-5)&\")\"","v":"Gold (Globex), Apr 17  (GCE)"},null,null,{"$f":"IFERROR(RTD(\"cqg.rtd\", ,\"ContractData\",A19, \"LastTrade\",, \"T\"),\"\")","v":1227.2},{"$f":"IFERROR(RTD(\"cqg.rtd\", ,\"ContractData\",A19, \"NetChange\",, \"T\"),\"\")","v":-8.7000000000000011},{"$f":"IFERROR(RTD(\"cqg.rtd\", ,\"ContractData\",A19, \"PerCentNetLastTrade\",, \"T\")/100,\"\")","v":-7.0394044825633139E-3},-7.0394044825633139E-3,{"$f":"IFERROR(RTD(\"cqg.rtd\", ,\"ContractData\",A19, \"Open\",, \"T\"),\"\")","v":1234.2},{"$f":"IFERROR(RTD(\"cqg.rtd\", ,\"ContractData\",A19, \"High\",, \"T\"),\"\")","v":1234.4000000000001},{"$f":"IFERROR(RTD(\"cqg.rtd\", ,\"ContractData\",A19, \"Low\",, \"T\"),\"\")","v":1220.3},null,null,null,null,null,null,{"$f":"IFERROR(RTD(\"cqg.rtd\", ,\"ContractData\",AB19, \"LongDescription\",, \"T\"),\"\")&\"  (\"&RIGHT(AB19,LEN(AB19)-5)&\")\"","v":"iShares 20+ Year Treasury Bond ETF  (TLT)"},null,null,{"$f":"IFERROR(RTD(\"cqg.rtd\", ,\"ContractData\",AB19, \"LastTrade\",, \"T\"),\"\")","v":120.32000000000001},{"$f":"IFERROR(RTD(\"cqg.rtd\", ,\"ContractData\",AB19, \"NetChange\",, \"T\"),\"\")","v":-0.44},{"$f":"IFERROR(RTD(\"cqg.rtd\", ,\"ContractData\",AB19, \"PerCentNetLastTrade\",, \"T\")/100,\"\")","v":-3.6435905929115605E-3},-3.6435905929115605E-3,{"$f":"IFERROR(RTD(\"cqg.rtd\", ,\"ContractData\",AB19, \"Open\",, \"T\"),\"\")","v":120.25},{"$f":"IFERROR(RTD(\"cqg.rtd\", ,\"ContractData\",AB19, \"High\",, \"T\"),\"\")","v":120.41},{"$f":"IFERROR(RTD(\"cqg.rtd\", ,\"ContractData\",AB19, \"Low\",, \"T\"),\"\")","v":119.88},{"$f":"Symbols!H18","v":"S.US.TLT"}]
[{"$f":"Symbols!C19","v":"F.US.DD"},{"$f":"RTD(\"cqg.rtd\",,\"ContractData\",A20,\"LongDescription\",,\"T\")&\"  (\"&RIGHT(A20,LEN(A20)-5)&\")\"","v":"DAX Index, Mar 17  (DD)"},null,null,{"$f":"IFERROR(RTD(\"cqg.rtd\", ,\"ContractData\",A20, \"LastTrade\",, \"T\"),\"\")","v":11781.5},{"$f":"IFERROR(RTD(\"cqg.rtd\", ,\"ContractData\",A20, \"NetChange\",, \"T\"),\"\")","v":122},{"$f":"IFERROR(RTD(\"cqg.rtd\", ,\"ContractData\",A20, \"PerCentNetLastTrade\",, \"T\")/100,\"\")","v":1.0420240137221268E-2},1.0420240137221268E-2,{"$f":"IFERROR(RTD(\"cqg.rtd\", ,\"ContractData\",A20, \"Open\",, \"T\"),\"\")","v":11665.5},{"$f":"IFERROR(RTD(\"cqg.rtd\", ,\"ContractData\",A20, \"High\",, \"T\"),\"\")","v":11809},{"$f":"IFERROR(RTD(\"cqg.rtd\", ,\"ContractData\",A20, \"Low\",, \"T\"),\"\")","v":11664},null,null,null,null,null,null,{"$f":"IFERROR(RTD(\"cqg.rtd\", ,\"ContractData\",AB20, \"LongDescription\",, \"T\"),\"\")&\"  (\"&RIGHT(AB20,LEN(AB20)-5)&\")\"","v":"Intel Corporation  (INTC)"},null,null,{"$f":"IFERROR(RTD(\"cqg.rtd\", ,\"ContractData\",AB20, \"LastTrade\",, \"T\"),\"\")","v":35.770000000000003},{"$f":"IFERROR(RTD(\"cqg.rtd\", ,\"ContractData\",AB20, \"NetChange\",, \"T\"),\"\")","v":0.43},{"$f":"IFERROR(RTD(\"cqg.rtd\", ,\"ContractData\",AB20, \"PerCentNetLastTrade\",, \"T\")/100,\"\")","v":1.21675155631013E-2},1.21675155631013E-2,{"$f":"IFERROR(RTD(\"cqg.rtd\", ,\"ContractData\",AB20, \"Open\",, \"T\"),\"\")","v":35.57},{"$f":"IFERROR(RTD(\"cqg.rtd\", ,\"ContractData\",AB20, \"High\",, \"T\"),\"\")","v":35.85},{"$f":"IFERROR(RTD(\"cqg.rtd\", ,\"ContractData\",AB20, \"Low\",, \"T\"),\"\")","v":35.340000000000003},{"$f":"Symbols!H19","v":"S.US.INTC"}]
[{"$f":"Symbols!C20","v":"F.US.DSX"},{"$f":"RTD(\"cqg.rtd\",,\"ContractData\",A21,\"LongDescription\",,\"T\")&\"  (\"&RIGHT(A21,LEN(A21)-5)&\")\"","v":"Euro STOXX 50, Mar 17  (DSX)"},null,null,{"$f":"IFERROR(RTD(\"cqg.rtd\", ,\"ContractData\",A21, \"LastTrade\",, \"T\"),\"\")","v":3307},{"$f":"IFERROR(RTD(\"cqg.rtd\", ,\"ContractData\",A21, \"NetChange\",, \"T\"),\"\")","v":37},{"$f":"IFERROR(RTD(\"cqg.rtd\", ,\"ContractData\",A21, \"PerCentNetLastTrade\",, \"T\")/100,\"\")","v":1.1314984709480122E-2},1.1314984709480122E-2,{"$f":"IFERROR(RTD(\"cqg.rtd\", ,\"ContractData\",A21, \"Open\",, \"T\"),\"\")","v":3272},{"$f":"IFERROR(RTD(\"cqg.rtd\", ,\"ContractData\",A21, \"High\",, \"T\"),\"\")","v":3314},{"$f":"IFERROR(RTD(\"cqg.rtd\", ,\"ContractData\",A21, \"Low\",, \"T\"),\"\")","v":3272},null,null,null,null,null,null,{"$f":"IFERROR(RTD(\"cqg.rtd\", ,\"ContractData\",AB21, \"LongDescription\",, \"T\"),\"\")&\"  (\"&RIGHT(AB21,LEN(AB21)-5)&\")\"","v":"QUALCOMM Inc  (QCOM)"},null,null,{"$f":"IFERROR(RTD(\"cqg.rtd\", ,\"ContractData\",AB21, \"LastTrade\",, \"T\"),\"\")","v":54.980000000000004},{"$f":"IFERROR(RTD(\"cqg.rtd\", ,\"ContractData\",AB21, \"NetChange\",, \"T\"),\"\")","v":0.98},{"$f":"IFERROR(RTD(\"cqg.rtd\", ,\"ContractData\",AB21, \"PerCentNetLastTrade\",, \"T\")/100,\"\")","v":1.8148148148148149E-2},1.8148148148148149E-2,{"$f":"IFERROR(RTD(\"cqg.rtd\", ,\"ContractData\",AB21, \"Open\",, \"T\"),\"\")","v":54.58},{"$f":"IFERROR(RTD(\"cqg.rtd\", ,\"ContractData\",AB21, \"High\",, \"T\"),\"\")","v":55.13},{"$f":"IFERROR(RTD(\"cqg.rtd\", ,\"ContractData\",AB21, \"Low\",, \"T\"),\"\")","v":54.26},{"$f":"Symbols!H20","v":"S.US.QCOM"}]
[{"$f":"Symbols!C21","v":"F.US.TYA"},{"$f":"RTD(\"cqg.rtd\",,\"ContractData\",A22,\"LongDescription\",,\"T\")&\"  (\"&RIGHT(A22,LEN(A22)-5)&\")\"","v":"10yr US Treasury Notes (Globex), Mar 17  (TYA)"},null,null,{"$f":"IFERROR(RTD(\"cqg.rtd\", ,\"ContractData\",A22, \"LastTrade\",, \"T\"),\"\")","v":124.59375},{"$f":"IFERROR(RTD(\"cqg.rtd\", ,\"ContractData\",A22, \"NetChange\",, \"T\"),\"\")","v":-0.1875},{"$f":"IFERROR(RTD(\"cqg.rtd\", ,\"ContractData\",A22, \"PerCentNetLastTrade\",, \"T\")/100,\"\")","v":-1.5026296018031554E-3},-1.5026296018031554E-3,{"$f":"IFERROR(RTD(\"cqg.rtd\", ,\"ContractData\",A22, \"Open\",, \"T\"),\"\")","v":124.734375},{"$f":"IFERROR(RTD(\"cqg.rtd\", ,\"ContractData\",A22, \"High\",, \"T\"),\"\")","v":124.75},{"$f":"IFERROR(RTD(\"cqg.rtd\", ,\"ContractData\",A22, \"Low\",, \"T\"),\"\")","v":124.4375},null,null,null,null,null,null,{"$f":"IFERROR(RTD(\"cqg.rtd\", ,\"ContractData\",AB22, \"LongDescription\",, \"T\"),\"\")&\"  (\"&RIGHT(AB22,LEN(AB22)-5)&\")\"","v":"American Airlines Group Inc.  (AAL)"},null,null,{"$f":"IFERROR(RTD(\"cqg.rtd\", ,\"ContractData\",AB22, \"LastTrade\",, \"T\"),\"\")","v":47.53},{"$f":"IFERROR(RTD(\"cqg.rtd\", ,\"ContractData\",AB22, \"NetChange\",, \"T\"),\"\")","v":1.08},{"$f":"IFERROR(RTD(\"cqg.rtd\", ,\"ContractData\",AB22, \"PerCentNetLastTrade\",, \"T\")/100,\"\")","v":2.3250807319698599E-2},2.3250807319698599E-2,{"$f":"IFERROR(RTD(\"cqg.rtd\", ,\"ContractData\",AB22, \"Open\",, \"T\"),\"\")","v":46.56},{"$f":"IFERROR(RTD(\"cqg.rtd\", ,\"ContractData\",AB22, \"High\",, \"T\"),\"\")","v":47.78},{"$f":"IFERROR(RTD(\"cqg.rtd\", ,\"ContractData\",AB22, \"Low\",, \"T\"),\"\")","v":46.5},{"$f":"Symbols!H21","v":"S.US.AAL"}]
[null,"Description",null,null,"Last","Net","% Net","Tdy Vol","Open","High","Low",null,null,null,null,null,null,"Description",null,null,"Last","Net","% Net","Tdy Vol","Open","High","Low"]
[null,null,null,null,"Price","Change","Change","21d-Vol",null,null,null,"NYSE Total Volume",null,null,"NASDAQ Total Volume",null,null,null,null,null,"Price","Change","Change","21d-Vol"]
[null,"CQG Top Ten Percentage Performers in the S&P 500",null,null,null,null,null,null,null,null,null,{"$f":"IFERROR(RTD(\"cqg.rtd\", ,\"ContractData\",\"DJTOV\", \"LastTrade\",, \"T\"),\"\")","v":564796},null,null,{"$f":"O28+O31+O34","v":1699358},null,null,"CQG Top Ten Percentage Performers in the NASDAQ 100"]
[{"$f":"TRIM('S&P500'!I1)","v":"S.US.GT"},{"$f":"IFERROR(RTD(\"cqg.rtd\",,\"ContractData\",A26,\"LongDescription\",,\"T\")&\"  (\"&RIGHT(A26,LEN(A26)-5)&\")\",\"\")","v":"Goodyear Tire & Rbr Co  (GT)"},null,null,{"$f":"IF(B26=\"\",\"\",IFERROR(RTD(\"cqg.rtd\",,\"ContractData\",A26,\"LastTrade\",,\"T\"),\"\"))","v":35.660000000000004},{"$f":"IF(B26=\"\",\"\",IFERROR(RTD(\"cqg.rtd\", ,\"ContractData\",A26, \"NetChange\",, \"T\"),\"\"))","v":1.94},{"$f":"IFERROR(RTD(\"cqg.rtd\", ,\"ContractData\",A26, \"PerCentNetLastTrade\",, \"T\")/100,\"\")","v":5.7532621589561093E-2},{"$f":"IFERROR(RTD(\"cqg.rtd\",,\"StudyData\",A26, \"Vol\", \"VolType=Exchange,CoCType=Exchange\", \"Vol\",\"ADC\",\"0\",\"ALL\",,,\"TRUE\",\"T\")/ RTD(\"cqg.rtd\",,\"StudyData\",A26, \"MA\", \"InputChoice=ContractVol,MAType=Sim,Period=21\", \"MA\",\"D\",\"-1\",\"all\",,,,\"T\"),\"\")","v":2.1759493580891505},{"$f":"IF(B26=\"\",\"\",IFERROR(RTD(\"cqg.rtd\", ,\"ContractData\",A26, \"Open\",, \"T\"),\"\"))","v":33.700000000000003},{"$f":"IF(B26=\"\",\"\",IFERROR(RTD(\"cqg.rtd\", ,\"ContractData\",A26, \"High\",, \"T\"),\"\"))","v":35.700000000000003},{"$f":"IF(B26=\"\",\"\",IFERROR(RTD(\"cqg.rtd\",,\"ContractData\",A26,\"Low\",,\"T\"),\"\"))","v":33.700000000000003},"NYSE Up Volume",null,null,"NASDAQ Up Volume",null,null,{"$f":"IFERROR(RTD(\"cqg.rtd\",,\"ContractData\",AB26,\"LongDescription\",,\"T\")&\"  (\"&RIGHT(AB26,LEN(AB26)-5)&\")\",\"\")","v":"Regeneron Pharm Inc  (REGN)"},null,null,{"$f":"IF(R26=\"\",\"\",IFERROR(RTD(\"cqg.rtd\",,\"ContractData\",AB26,\"LastTrade\",,\"T\"),\"\"))","v":375.41},{"$f":"IF(R26=\"\",\"\",IFERROR(RTD(\"cqg.rtd\", ,\"ContractData\",AB26, \"NetChange\",, \"T\"),\"\"))","v":15.540000000000001},{"$f":"IFERROR(RTD(\"cqg.rtd\", ,\"ContractData\",AB26, \"PerCentNetLastTrade\",, \"T\")/100,\"\")","v":4.3182260260649682E-2},{"$f":"IFERROR(RTD(\"cqg.rtd\",,\"StudyData\",AB26, \"Vol\", \"VolType=Exchange,CoCType=Exchange\", \"Vol\",\"ADC\",\"0\",\"ALL\",,,\"TRUE\",\"T\")/ RTD(\"cqg.rtd\",,\"StudyData\",AB26, \"MA\", \"InputChoice=ContractVol,MAType=Sim,Period=21\", \"MA\",\"D\",\"-1\",\"all\",,,,\"T\"),\"\")","v":1.6802457531343875},{"$f":"IF(R26=\"\",\"\",IFERROR(RTD(\"cqg.rtd\", ,\"ContractData\",AB26, \"Open\",, \"T\"),\"\"))","v":364.22},{"$f":"IF(R26=\"\",\"\",IFERROR(RTD(\"cqg.rtd\", ,\"ContractData\",AB26, \"High\",, \"T\"),\"\"))","v":378.46},{"$f":"IF(R26=\"\",\"\",IFERROR(RTD(\"cqg.rtd\", ,\"ContractData\",AB26, \"Low\",, \"T\"),\"\"))","v":363.2},{"$f":"NASDAQ100!I1","v":"S.US.REGN"}]
[{"$f":"TRIM('S&P500'!I2)","v":"S.US.NUE"},{"$f":"IFERROR(RTD(\"cqg.rtd\",,\"ContractData\",A27,\"LongDescription\",,\"T\")&\"  (\"&RIGHT(A27,LEN(A27)-5)&\")\",\"\")","v":"Nucor Corp  (NUE)"},null,null,{"$f":"IF(B27=\"\",\"\",IFERROR(RTD(\"cqg.rtd\",,\"ContractData\",A27,\"LastTrade\",,\"T\"),\"\"))","v":63.77},{"$f":"IF(B27=\"\",\"\",IFERROR(RTD(\"cqg.rtd\", ,\"ContractData\",A27, \"NetChange\",, \"T\"),\"\"))","v":2.7800000000000002},{"$f":"IFERROR(RTD(\"cqg.rtd\", ,\"ContractData\",A27, \"PerCentNetLastTrade\",, \"T\")/100,\"\")","v":4.5581242826692903E-2},{"$f":"IFERROR(RTD(\"cqg.rtd\",,\"StudyData\",A27, \"Vol\", \"VolType=Exchange,CoCType=Exchange\", \"Vol\",\"ADC\",\"0\",\"ALL\",,,\"TRUE\",\"T\")/ RTD(\"cqg.rtd\",,\"StudyData\",A27, \"MA\", \"InputChoice=ContractVol,MAType=Sim,Period=21\", \"MA\",\"D\",\"-1\",\"all\",,,,\"T\"),\"\")","v":0.98543060728776943},{"$f":"IF(B27=\"\",\"\",IFERROR(RTD(\"cqg.rtd\", ,\"ContractData\",A27, \"Open\",, \"T\"),\"\"))","v":62.36},{"$f":"IF(B27=\"\",\"\",IFERROR(RTD(\"cqg.rtd\", ,\"ContractData\",A27, \"High\",, \"T\"),\"\"))","v":63.97},{"$f":"IF(B27=\"\",\"\",IFERROR(RTD(\"cqg.rtd\",,\"ContractData\",A27,\"Low\",,\"T\"),\"\"))","v":62.25},null,null,null,null,null,null,{"$f":"IFERROR(RTD(\"cqg.rtd\",,\"ContractData\",AB27,\"LongDescription\",,\"T\")&\"  (\"&RIGHT(AB27,LEN(AB27)-5)&\")\",\"\")","v":"Tesla, Inc.  (TSLA)"},null,null,{"$f":"IF(R27=\"\",\"\",IFERROR(RTD(\"cqg.rtd\",,\"ContractData\",AB27,\"LastTrade\",,\"T\"),\"\"))","v":280.56},{"$f":"IF(R27=\"\",\"\",IFERROR(RTD(\"cqg.rtd\", ,\"ContractData\",AB27, \"NetChange\",, \"T\"),\"\"))","v":11.39},{"$f":"IFERROR(RTD(\"cqg.rtd\", ,\"ContractData\",AB27, \"PerCentNetLastTrade\",, \"T\")/100,\"\")","v":4.2082977379935375E-2},{"$f":"IFERROR(RTD(\"cqg.rtd\",,\"StudyData\",AB27, \"Vol\", \"VolType=Exchange,CoCType=Exchange\", \"Vol\",\"ADC\",\"0\",\"ALL\",,,\"TRUE\",\"T\")/ RTD(\"cqg.rtd\",,\"StudyData\",AB27, \"MA\", \"InputChoice=ContractVol,MAType=Sim,Period=21\", \"MA\",\"D\",\"-1\",\"all\",,,,\"T\"),\"\")","v":1.5087675505935791},{"$f":"IF(R27=\"\",\"\",IFERROR(RTD(\"cqg.rtd\", ,\"ContractData\",AB27, \"Open\",, \"T\"),\"\"))","v":270.74},{"$f":"IF(R27=\"\",\"\",IFERROR(RTD(\"cqg.rtd\", ,\"ContractData\",AB27, \"High\",, \"T\"),\"\"))","v":280.78000000000003},{"$f":"IF(R27=\"\",\"\",IFERROR(RTD(\"cqg.rtd\", ,\"ContractData\",AB27, \"Low\",, \"T\"),\"\"))","v":270.51},{"$f":"NASDAQ100!I2","v":"S.US.TSLA"}]
[{"$f":"TRIM('S&P500'!I3)","v":"S.US.REGN"},{"$f":"IFERROR(RTD(\"cqg.rtd\",,\"ContractData\",A28,\"LongDescription\",,\"T\")&\"  (\"&RIGHT(A28,LEN(A28)-5)&\")\",\"\")","v":"Regeneron Pharm Inc  (REGN)"},null,null,{"$f":"IF(B28=\"\",\"\",IFERROR(RTD(\"cqg.rtd\",,\"ContractData\",A28,\"LastTrade\",,\"T\"),\"\"))","v":375.41},{"$f":"IF(B28=\"\",\"\",IFERROR(RTD(\"cqg.rtd\", ,\"ContractData\",A28, \"NetChange\",, \"T\"),\"\"))","v":15.540000000000001},{"$f":"IFERROR(RTD(\"cqg.rtd\", ,\"ContractData\",A28, \"PerCentNetLastTrade\",, \"T\")/100,\"\")","v":4.3182260260649682E-2},{"$f":"IFERROR(RTD(\"cqg.rtd\",,\"StudyData\",A28, \"Vol\", \"VolType=Exchange,CoCType=Exchange\", \"Vol\",\"ADC\",\"0\",\"ALL\",,,\"TRUE\",\"T\")/ RTD(\"cqg.rtd\",,\"StudyData\",A28, \"MA\", \"InputChoice=ContractVol,MAType=Sim,Period=21\", \"MA\",\"D\",\"-1\",\"all\",,,,\"T\"),\"\")","v":1.6802457531343875},{"$f":"IF(B28=\"\",\"\",IFERROR(RTD(\"cqg.rtd\", ,\"ContractData\",A28, \"Open\",, \"T\"),\"\"))","v":364.22},{"$f":"IF(B28=\"\",\"\",IFERROR(RTD(\"cqg.rtd\", ,\"ContractData\",A28, \"High\",, \"T\"),\"\"))","v":378.46},{"$f":"IF(B28=\"\",\"\",IFERROR(RTD(\"cqg.rtd\",,\"ContractData\",A28,\"Low\",,\"T\"),\"\"))","v":363.2},{"$f":"IFERROR(RTD(\"cqg.rtd\", ,\"ContractData\",\"DJUPV\", \"LastTrade\",, \"T\"),\"\")","v":372209},null,null,{"$f":"IFERROR(RTD(\"cqg.rtd\", ,\"ContractData\",\"NASUPV\", \"LastTrade\",, \"T\"),\"\")","v":956818},null,null,{"$f":"IFERROR(RTD(\"cqg.rtd\",,\"ContractData\",AB28,\"LongDescription\",,\"T\")&\"  (\"&RIGHT(AB28,LEN(AB28)-5)&\")\",\"\")","v":"Seagate Technology  (STX)"},null,null,{"$f":"IF(R28=\"\",\"\",IFERROR(RTD(\"cqg.rtd\",,\"ContractData\",AB28,\"LastTrade\",,\"T\"),\"\"))","v":47.78},{"$f":"IF(R28=\"\",\"\",IFERROR(RTD(\"cqg.rtd\", ,\"ContractData\",AB28, \"NetChange\",, \"T\"),\"\"))","v":1.32},{"$f":"IFERROR(RTD(\"cqg.rtd\", ,\"ContractData\",AB28, \"PerCentNetLastTrade\",, \"T\")/100,\"\")","v":2.8411536805854499E-2},{"$f":"IFERROR(RTD(\"cqg.rtd\",,\"StudyData\",AB28, \"Vol\", \"VolType=Exchange,CoCType=Exchange\", \"Vol\",\"ADC\",\"0\",\"ALL\",,,\"TRUE\",\"T\")/ RTD(\"cqg.rtd\",,\"StudyData\",AB28, \"MA\", \"InputChoice=ContractVol,MAType=Sim,Period=21\", \"MA\",\"D\",\"-1\",\"all\",,,,\"T\"),\"\")","v":0.70919278066719538},{"$f":"IF(R28=\"\",\"\",IFERROR(RTD(\"cqg.rtd\", ,\"ContractData\",AB28, \"Open\",, \"T\"),\"\"))","v":46.89},{"$f":"IF(R28=\"\",\"\",IFERROR(RTD(\"cqg.rtd\", ,\"ContractData\",AB28, \"High\",, \"T\"),\"\"))","v":48.08},{"$f":"IF(R28=\"\",\"\",IFERROR(RTD(\"cqg.rtd\", ,\"ContractData\",AB28, \"Low\",, \"T\"),\"\"))","v":46.58},{"$f":"NASDAQ100!I3","v":"S.US.STX"}]
[{"$f":"TRIM('S&P500'!I4)","v":"S.US.CCI"},{"$f":"IFERROR(RTD(\"cqg.rtd\",,\"ContractData\",A29,\"LongDescription\",,\"T\")&\"  (\"&RIGHT(A29,LEN(A29)-5)&\")\",\"\")","v":"Crown Castle Intl  (CCI)"},null,null,{"$f":"IF(B29=\"\",\"\",IFERROR(RTD(\"cqg.rtd\",,\"ContractData\",A29,\"LastTrade\",,\"T\"),\"\"))","v":90.18},{"$f":"IF(B29=\"\",\"\",IFERROR(RTD(\"cqg.rtd\", ,\"ContractData\",A29, \"NetChange\",, \"T\"),\"\"))","v":2.62},{"$f":"IFERROR(RTD(\"cqg.rtd\", ,\"ContractData\",A29, \"PerCentNetLastTrade\",, \"T\")/100,\"\")","v":2.9922338967565097E-2},{"$f":"IFERROR(RTD(\"cqg.rtd\",,\"StudyData\",A29, \"Vol\", \"VolType=Exchange,CoCType=Exchange\", \"Vol\",\"ADC\",\"0\",\"ALL\",,,\"TRUE\",\"T\")/ RTD(\"cqg.rtd\",,\"StudyData\",A29, \"MA\", \"InputChoice=ContractVol,MAType=Sim,Period=21\", \"MA\",\"D\",\"-1\",\"all\",,,,\"T\"),\"\")","v":0.93659040947106709},{"$f":"IF(B29=\"\",\"\",IFERROR(RTD(\"cqg.rtd\", ,\"ContractData\",A29, \"Open\",, \"T\"),\"\"))","v":87.94},{"$f":"IF(B29=\"\",\"\",IFERROR(RTD(\"cqg.rtd\", ,\"ContractData\",A29, \"High\",, \"T\"),\"\"))","v":90.18},{"$f":"IF(B29=\"\",\"\",IFERROR(RTD(\"cqg.rtd\",,\"ContractData\",A29,\"Low\",,\"T\"),\"\"))","v":87.92},"NYSE Down Volume",null,null,"NASDAQ Down Volume",null,null,{"$f":"IFERROR(RTD(\"cqg.rtd\",,\"ContractData\",AB29,\"LongDescription\",,\"T\")&\"  (\"&RIGHT(AB29,LEN(AB29)-5)&\")\",\"\")","v":"Xilinx Inc  (XLNX)"},null,null,{"$f":"IF(R29=\"\",\"\",IFERROR(RTD(\"cqg.rtd\",,\"ContractData\",AB29,\"LastTrade\",,\"T\"),\"\"))","v":59.56},{"$f":"IF(R29=\"\",\"\",IFERROR(RTD(\"cqg.rtd\", ,\"ContractData\",AB29, \"NetChange\",, \"T\"),\"\"))","v":1.55},{"$f":"IFERROR(RTD(\"cqg.rtd\", ,\"ContractData\",AB29, \"PerCentNetLastTrade\",, \"T\")/100,\"\")","v":2.6719531115324945E-2},{"$f":"IFERROR(RTD(\"cqg.rtd\",,\"StudyData\",AB29, \"Vol\", \"VolType=Exchange,CoCType=Exchange\", \"Vol\",\"ADC\",\"0\",\"ALL\",,,\"TRUE\",\"T\")/ RTD(\"cqg.rtd\",,\"StudyData\",AB29, \"MA\", \"InputChoice=ContractVol,MAType=Sim,Period=21\", \"MA\",\"D\",\"-1\",\"all\",,,,\"T\"),\"\")","v":1.2582943832978715},{"$f":"IF(R29=\"\",\"\",IFERROR(RTD(\"cqg.rtd\", ,\"ContractData\",AB29, \"Open\",, \"T\"),\"\"))","v":58.26},{"$f":"IF(R29=\"\",\"\",IFERROR(RTD(\"cqg.rtd\", ,\"ContractData\",AB29, \"High\",, \"T\"),\"\"))","v":59.7},{"$f":"IF(R29=\"\",\"\",IFERROR(RTD(\"cqg.rtd\", ,\"ContractData\",AB29, \"Low\",, \"T\"),\"\"))","v":58.15},{"$f":"NASDAQ100!I4","v":"S.US.XLNX"}]
[{"$f":"TRIM('S&P500'!I5)","v":"S.US.STX"},{"$f":"IFERROR(RTD(\"cqg.rtd\",,\"ContractData\",A30,\"LongDescription\",,\"T\")&\"  (\"&RIGHT(A30,LEN(A30)-5)&\")\",\"\")","v":"Seagate Technology  (STX)"},null,null,{"$f":"IF(B30=\"\",\"\",IFERROR(RTD(\"cqg.rtd\",,\"ContractData\",A30,\"LastTrade\",,\"T\"),\"\"))","v":47.78},{"$f":"IF(B30=\"\",\"\",IFERROR(RTD(\"cqg.rtd\", ,\"ContractData\",A30, \"NetChange\",, \"T\"),\"\"))","v":1.32},{"$f":"IFERROR(RTD(\"cqg.rtd\", ,\"ContractData\",A30, \"PerCentNetLastTrade\",, \"T\")/100,\"\")","v":2.8411536805854499E-2},{"$f":"IFERROR(RTD(\"cqg.rtd\",,\"StudyData\",A30, \"Vol\", \"VolType=Exchange,CoCType=Exchange\", \"Vol\",\"ADC\",\"0\",\"ALL\",,,\"TRUE\",\"T\")/ RTD(\"cqg.rtd\",,\"StudyData\",A30, \"MA\", \"InputChoice=ContractVol,MAType=Sim,Period=21\", \"MA\",\"D\",\"-1\",\"all\",,,,\"T\"),\"\")","v":0.70919278066719538},{"$f":"IF(B30=\"\",\"\",IFERROR(RTD(\"cqg.rtd\", ,\"ContractData\",A30, \"Open\",, \"T\"),\"\"))","v":46.89},{"$f":"IF(B30=\"\",\"\",IFERROR(RTD(\"cqg.rtd\", ,\"ContractData\",A30, \"High\",, \"T\"),\"\"))","v":48.08},{"$f":"IF(B30=\"\",\"\",IFERROR(RTD(\"cqg.rtd\",,\"ContractData\",A30,\"Low\",,\"T\"),\"\"))","v":46.58},null,null,null,null,null,null,{"$f":"IFERROR(RTD(\"cqg.rtd\",,\"ContractData\",AB30,\"LongDescription\",,\"T\")&\"  (\"&RIGHT(AB30,LEN(AB30)-5)&\")\",\"\")","v":"SBA Comms Corp  (SBAC)"},null,null,{"$f":"IF(R30=\"\",\"\",IFERROR(RTD(\"cqg.rtd\",,\"ContractData\",AB30,\"LastTrade\",,\"T\"),\"\"))","v":109.47},{"$f":"IF(R30=\"\",\"\",IFERROR(RTD(\"cqg.rtd\", ,\"ContractData\",AB30, \"NetChange\",, \"T\"),\"\"))","v":2.54},{"$f":"IFERROR(RTD(\"cqg.rtd\", ,\"ContractData\",AB30, \"PerCentNetLastTrade\",, \"T\")/100,\"\")","v":2.3466716529543755E-2},{"$f":"IFERROR(RTD(\"cqg.rtd\",,\"StudyData\",AB30, \"Vol\", \"VolType=Exchange,CoCType=Exchange\", \"Vol\",\"ADC\",\"0\",\"ALL\",,,\"TRUE\",\"T\")/ RTD(\"cqg.rtd\",,\"StudyData\",AB30, \"MA\", \"InputChoice=ContractVol,MAType=Sim,Period=21\", \"MA\",\"D\",\"-1\",\"all\",,,,\"T\"),\"\")","v":0.89579256051885914},{"$f":"IF(R30=\"\",\"\",IFERROR(RTD(\"cqg.rtd\", ,\"ContractData\",AB30, \"Open\",, \"T\"),\"\"))","v":107.14},{"$f":"IF(R30=\"\",\"\",IFERROR(RTD(\"cqg.rtd\", ,\"ContractData\",AB30, \"High\",, \"T\"),\"\"))","v":109.55},{"$f":"IF(R30=\"\",\"\",IFERROR(RTD(\"cqg.rtd\", ,\"ContractData\",AB30, \"Low\",, \"T\"),\"\"))","v":105.74000000000001},{"$f":"NASDAQ100!I5","v":"S.US.SBAC"}]
[{"$f":"TRIM('S&P500'!I6)","v":"S.US.XLNX"},{"$f":"IFERROR(RTD(\"cqg.rtd\",,\"ContractData\",A31,\"LongDescription\",,\"T\")&\"  (\"&RIGHT(A31,LEN(A31)-5)&\")\",\"\")","v":"Xilinx Inc  (XLNX)"},null,null,{"$f":"IF(B31=\"\",\"\",IFERROR(RTD(\"cqg.rtd\",,\"ContractData\",A31,\"LastTrade\",,\"T\"),\"\"))","v":59.56},{"$f":"IF(B31=\"\",\"\",IFERROR(RTD(\"cqg.rtd\", ,\"ContractData\",A31, \"NetChange\",, \"T\"),\"\"))","v":1.55},{"$f":"IFERROR(RTD(\"cqg.rtd\", ,\"ContractData\",A31, \"PerCentNetLastTrade\",, \"T\")/100,\"\")","v":2.6719531115324945E-2},{"$f":"IFERROR(RTD(\"cqg.rtd\",,\"StudyData\",A31, \"Vol\", \"VolType=Exchange,CoCType=Exchange\", \"Vol\",\"ADC\",\"0\",\"ALL\",,,\"TRUE\",\"T\")/ RTD(\"cqg.rtd\",,\"StudyData\",A31, \"MA\", \"InputChoice=ContractVol,MAType=Sim,Period=21\", \"MA\",\"D\",\"-1\",\"all\",,,,\"T\"),\"\")","v":1.2582943832978715},{"$f":"IF(B31=\"\",\"\",IFERROR(RTD(\"cqg.rtd\", ,\"ContractData\",A31, \"Open\",, \"T\"),\"\"))","v":58.26},{"$f":"IF(B31=\"\",\"\",IFERROR(RTD(\"cqg.rtd\", ,\"ContractData\",A31, \"High\",, \"T\"),\"\"))","v":59.7},{"$f":"IF(B31=\"\",\"\",IFERROR(RTD(\"cqg.rtd\",,\"ContractData\",A31,\"Low\",,\"T\"),\"\"))","v":58.15},{"$f":"IFERROR(RTD(\"cqg.rtd\", ,\"ContractData\",\"DJDNV\", \"LastTrade\",, \"T\"),\"\")","v":187378},null,null,{"$f":"IFERROR(RTD(\"cqg.rtd\", ,\"ContractData\",\"NASDNV\", \"LastTrade\",, \"T\"),\"\")","v":585008},null,null,{"$f":"IFERROR(RTD(\"cqg.rtd\",,\"ContractData\",AB31,\"LongDescription\",,\"T\")&\"  (\"&RIGHT(AB31,LEN(AB31)-5)&\")\",\"\")","v":"American Airlines Group Inc.  (AAL)"},null,null,{"$f":"IF(R31=\"\",\"\",IFERROR(RTD(\"cqg.rtd\",,\"ContractData\",AB31,\"LastTrade\",,\"T\"),\"\"))","v":47.53},{"$f":"IF(R31=\"\",\"\",IFERROR(RTD(\"cqg.rtd\", ,\"ContractData\",AB31, \"NetChange\",, \"T\"),\"\"))","v":1.08},{"$f":"IFERROR(RTD(\"cqg.rtd\", ,\"ContractData\",AB31, \"PerCentNetLastTrade\",, \"T\")/100,\"\")","v":2.3250807319698599E-2},{"$f":"IFERROR(RTD(\"cqg.rtd\",,\"StudyData\",AB31, \"Vol\", \"VolType=Exchange,CoCType=Exchange\", \"Vol\",\"ADC\",\"0\",\"ALL\",,,\"TRUE\",\"T\")/ RTD(\"cqg.rtd\",,\"StudyData\",AB31, \"MA\", \"InputChoice=ContractVol,MAType=Sim,Period=21\", \"MA\",\"D\",\"-1\",\"all\",,,,\"T\"),\"\")","v":0.75586664315359242},{"$f":"IF(R31=\"\",\"\",IFERROR(RTD(\"cqg.rtd\", ,\"ContractData\",AB31, \"Open\",, \"T\"),\"\"))","v":46.56},{"$f":"IF(R31=\"\",\"\",IFERROR(RTD(\"cqg.rtd\", ,\"ContractData\",AB31, \"High\",, \"T\"),\"\"))","v":47.78},{"$f":"IF(R31=\"\",\"\",IFERROR(RTD(\"cqg.rtd\", ,\"ContractData\",AB31, \"Low\",, \"T\"),\"\"))","v":46.5},{"$f":"NASDAQ100!I6","v":"S.US.AAL"}]
[{"$f":"TRIM('S&P500'!I7)","v":"S.US.MOS"},{"$f":"IFERROR(RTD(\"cqg.rtd\",,\"ContractData\",A32,\"LongDescription\",,\"T\")&\"  (\"&RIGHT(A32,LEN(A32)-5)&\")\",\"\")","v":"Mosaic Company  (MOS)"},null,null,{"$f":"IF(B32=\"\",\"\",IFERROR(RTD(\"cqg.rtd\",,\"ContractData\",A32,\"LastTrade\",,\"T\"),\"\"))","v":33.71},{"$f":"IF(B32=\"\",\"\",IFERROR(RTD(\"cqg.rtd\", ,\"ContractData\",A32, \"NetChange\",, \"T\"),\"\"))","v":0.85},{"$f":"IFERROR(RTD(\"cqg.rtd\", ,\"ContractData\",A32, \"PerCentNetLastTrade\",, \"T\")/100,\"\")","v":2.5867315885575167E-2},{"$f":"IFERROR(RTD(\"cqg.rtd\",,\"StudyData\",A32, \"Vol\", \"VolType=Exchange,CoCType=Exchange\", \"Vol\",\"ADC\",\"0\",\"ALL\",,,\"TRUE\",\"T\")/ RTD(\"cqg.rtd\",,\"StudyData\",A32, \"MA\", \"InputChoice=ContractVol,MAType=Sim,Period=21\", \"MA\",\"D\",\"-1\",\"all\",,,,\"T\"),\"\")","v":1.0403637248160635},{"$f":"IF(B32=\"\",\"\",IFERROR(RTD(\"cqg.rtd\", ,\"ContractData\",A32, \"Open\",, \"T\"),\"\"))","v":33.130000000000003},{"$f":"IF(B32=\"\",\"\",IFERROR(RTD(\"cqg.rtd\", ,\"ContractData\",A32, \"High\",, \"T\"),\"\"))","v":34.36},{"$f":"IF(B32=\"\",\"\",IFERROR(RTD(\"cqg.rtd\",,\"ContractData\",A32,\"Low\",,\"T\"),\"\"))","v":33.1},"NYSE Unchanged Vol",null,null,"NASDAQ Unchanged Vol",null,null,{"$f":"IFERROR(RTD(\"cqg.rtd\",,\"ContractData\",AB32,\"LongDescription\",,\"T\")&\"  (\"&RIGHT(AB32,LEN(AB32)-5)&\")\",\"\")","v":"Discovery Holding Channel Common A  (DISCA)"},null,null,{"$f":"IF(R32=\"\",\"\",IFERROR(RTD(\"cqg.rtd\",,\"ContractData\",AB32,\"LastTrade\",,\"T\"),\"\"))","v":29.060000000000002},{"$f":"IF(R32=\"\",\"\",IFERROR(RTD(\"cqg.rtd\", ,\"ContractData\",AB32, \"NetChange\",, \"T\"),\"\"))","v":0.57999999999999996},{"$f":"IFERROR(RTD(\"cqg.rtd\", ,\"ContractData\",AB32, \"PerCentNetLastTrade\",, \"T\")/100,\"\")","v":2.0365168539325844E-2},{"$f":"IFERROR(RTD(\"cqg.rtd\",,\"StudyData\",AB32, \"Vol\", \"VolType=Exchange,CoCType=Exchange\", \"Vol\",\"ADC\",\"0\",\"ALL\",,,\"TRUE\",\"T\")/ RTD(\"cqg.rtd\",,\"StudyData\",AB32, \"MA\", \"InputChoice=ContractVol,MAType=Sim,Period=21\", \"MA\",\"D\",\"-1\",\"all\",,,,\"T\"),\"\")","v":1.6458244571884801},{"$f":"IF(R32=\"\",\"\",IFERROR(RTD(\"cqg.rtd\", ,\"ContractData\",AB32, \"Open\",, \"T\"),\"\"))","v":28.51},{"$f":"IF(R32=\"\",\"\",IFERROR(RTD(\"cqg.rtd\", ,\"ContractData\",AB32, \"High\",, \"T\"),\"\"))","v":29.2},{"$f":"IF(R32=\"\",\"\",IFERROR(RTD(\"cqg.rtd\", ,\"ContractData\",AB32, \"Low\",, \"T\"),\"\"))","v":28.51},{"$f":"NASDAQ100!I7","v":"S.US.DISCA"}]
[{"$f":"TRIM('S&P500'!I8)","v":"S.US.CF"},{"$f":"IFERROR(RTD(\"cqg.rtd\",,\"ContractData\",A33,\"LongDescription\",,\"T\")&\"  (\"&RIGHT(A33,LEN(A33)-5)&\")\",\"\")","v":"CF Industries Holdings, Inc  (CF)"},null,null,{"$f":"IF(B33=\"\",\"\",IFERROR(RTD(\"cqg.rtd\",,\"ContractData\",A33,\"LastTrade\",,\"T\"),\"\"))","v":36.75},{"$f":"IF(B33=\"\",\"\",IFERROR(RTD(\"cqg.rtd\", ,\"ContractData\",A33, \"NetChange\",, \"T\"),\"\"))","v":0.91},{"$f":"IFERROR(RTD(\"cqg.rtd\", ,\"ContractData\",A33, \"PerCentNetLastTrade\",, \"T\")/100,\"\")","v":2.5390625E-2},{"$f":"IFERROR(RTD(\"cqg.rtd\",,\"StudyData\",A33, \"Vol\", \"VolType=Exchange,CoCType=Exchange\", \"Vol\",\"ADC\",\"0\",\"ALL\",,,\"TRUE\",\"T\")/ RTD(\"cqg.rtd\",,\"StudyData\",A33, \"MA\", \"InputChoice=ContractVol,MAType=Sim,Period=21\", \"MA\",\"D\",\"-1\",\"all\",,,,\"T\"),\"\")","v":1.0896021874696022},{"$f":"IF(B33=\"\",\"\",IFERROR(RTD(\"cqg.rtd\", ,\"ContractData\",A33, \"Open\",, \"T\"),\"\"))","v":36.08},{"$f":"IF(B33=\"\",\"\",IFERROR(RTD(\"cqg.rtd\", ,\"ContractData\",A33, \"High\",, \"T\"),\"\"))","v":37.1},{"$f":"IF(B33=\"\",\"\",IFERROR(RTD(\"cqg.rtd\",,\"ContractData\",A33,\"Low\",,\"T\"),\"\"))","v":36.020000000000003},null,null,null,null,null,null,{"$f":"IFERROR(RTD(\"cqg.rtd\",,\"ContractData\",AB33,\"LongDescription\",,\"T\")&\"  (\"&RIGHT(AB33,LEN(AB33)-5)&\")\",\"\")","v":"Gilead Sciences Inc  (GILD)"},null,null,{"$f":"IF(R33=\"\",\"\",IFERROR(RTD(\"cqg.rtd\",,\"ContractData\",AB33,\"LastTrade\",,\"T\"),\"\"))","v":67.61},{"$f":"IF(R33=\"\",\"\",IFERROR(RTD(\"cqg.rtd\", ,\"ContractData\",AB33, \"NetChange\",, \"T\"),\"\"))","v":1.25},{"$f":"IFERROR(RTD(\"cqg.rtd\", ,\"ContractData\",AB33, \"PerCentNetLastTrade\",, \"T\")/100,\"\")","v":1.8836648583484026E-2},{"$f":"IFERROR(RTD(\"cqg.rtd\",,\"StudyData\",AB33, \"Vol\", \"VolType=Exchange,CoCType=Exchange\", \"Vol\",\"ADC\",\"0\",\"ALL\",,,\"TRUE\",\"T\")/ RTD(\"cqg.rtd\",,\"StudyData\",AB33, \"MA\", \"InputChoice=ContractVol,MAType=Sim,Period=21\", \"MA\",\"D\",\"-1\",\"all\",,,,\"T\"),\"\")","v":1.0663700772066014},{"$f":"IF(R33=\"\",\"\",IFERROR(RTD(\"cqg.rtd\", ,\"ContractData\",AB33, \"Open\",, \"T\"),\"\"))","v":66.81},{"$f":"IF(R33=\"\",\"\",IFERROR(RTD(\"cqg.rtd\", ,\"ContractData\",AB33, \"High\",, \"T\"),\"\"))","v":67.78},{"$f":"IF(R33=\"\",\"\",IFERROR(RTD(\"cqg.rtd\", ,\"ContractData\",AB33, \"Low\",, \"T\"),\"\"))","v":66.5},{"$f":"NASDAQ100!I8","v":"S.US.GILD"}]
[{"$f":"TRIM('S&P500'!I9)","v":"S.US.ICE"},{"$f":"IFERROR(RTD(\"cqg.rtd\",,\"ContractData\",A34,\"LongDescription\",,\"T\")&\"  (\"&RIGHT(A34,LEN(A34)-5)&\")\",\"\")","v":"Intercontinental, Inc.  (ICE)"},null,null,{"$f":"IF(B34=\"\",\"\",IFERROR(RTD(\"cqg.rtd\",,\"ContractData\",A34,\"LastTrade\",,\"T\"),\"\"))","v":59.07},{"$f":"IF(B34=\"\",\"\",IFERROR(RTD(\"cqg.rtd\", ,\"ContractData\",A34, \"NetChange\",, \"T\"),\"\"))","v":1.42},{"$f":"IFERROR(RTD(\"cqg.rtd\", ,\"ContractData\",A34, \"PerCentNetLastTrade\",, \"T\")/100,\"\")","v":2.4631396357328708E-2},{"$f":"IFERROR(RTD(\"cqg.rtd\",,\"StudyData\",A34, \"Vol\", \"VolType=Exchange,CoCType=Exchange\", \"Vol\",\"ADC\",\"0\",\"ALL\",,,\"TRUE\",\"T\")/ RTD(\"cqg.rtd\",,\"StudyData\",A34, \"MA\", \"InputChoice=ContractVol,MAType=Sim,Period=21\", \"MA\",\"D\",\"-1\",\"all\",,,,\"T\"),\"\")","v":0.69342898098809724},{"$f":"IF(B34=\"\",\"\",IFERROR(RTD(\"cqg.rtd\", ,\"ContractData\",A34, \"Open\",, \"T\"),\"\"))","v":58.120000000000005},{"$f":"IF(B34=\"\",\"\",IFERROR(RTD(\"cqg.rtd\", ,\"ContractData\",A34, \"High\",, \"T\"),\"\"))","v":59.11},{"$f":"IF(B34=\"\",\"\",IFERROR(RTD(\"cqg.rtd\",,\"ContractData\",A34,\"Low\",,\"T\"),\"\"))","v":57.82},{"$f":"IFERROR(RTD(\"cqg.rtd\", ,\"ContractData\",\"DJUCV\", \"LastTrade\",, \"T\"),\"\")","v":5208},null,null,{"$f":"IFERROR(RTD(\"cqg.rtd\", ,\"ContractData\",\"NASUCV\", \"LastTrade\",, \"T\"),\"\")","v":157532},null,null,{"$f":"IFERROR(RTD(\"cqg.rtd\",,\"ContractData\",AB34,\"LongDescription\",,\"T\")&\"  (\"&RIGHT(AB34,LEN(AB34)-5)&\")\",\"\")","v":"Cerner Corporation  (CERN)"},null,null,{"$f":"IF(R34=\"\",\"\",IFERROR(RTD(\"cqg.rtd\",,\"ContractData\",AB34,\"LastTrade\",,\"T\"),\"\"))","v":52.46},{"$f":"IF(R34=\"\",\"\",IFERROR(RTD(\"cqg.rtd\", ,\"ContractData\",AB34, \"NetChange\",, \"T\"),\"\"))","v":0.96},{"$f":"IFERROR(RTD(\"cqg.rtd\", ,\"ContractData\",AB34, \"PerCentNetLastTrade\",, \"T\")/100,\"\")","v":1.8640776699029128E-2},{"$f":"IFERROR(RTD(\"cqg.rtd\",,\"StudyData\",AB34, \"Vol\", \"VolType=Exchange,CoCType=Exchange\", \"Vol\",\"ADC\",\"0\",\"ALL\",,,\"TRUE\",\"T\")/ RTD(\"cqg.rtd\",,\"StudyData\",AB34, \"MA\", \"InputChoice=ContractVol,MAType=Sim,Period=21\", \"MA\",\"D\",\"-1\",\"all\",,,,\"T\"),\"\")","v":0.94625496264083375},{"$f":"IF(R34=\"\",\"\",IFERROR(RTD(\"cqg.rtd\", ,\"ContractData\",AB34, \"Open\",, \"T\"),\"\"))","v":51.53},{"$f":"IF(R34=\"\",\"\",IFERROR(RTD(\"cqg.rtd\", ,\"ContractData\",AB34, \"High\",, \"T\"),\"\"))","v":52.47},{"$f":"IF(R34=\"\",\"\",IFERROR(RTD(\"cqg.rtd\", ,\"ContractData\",AB34, \"Low\",, \"T\"),\"\"))","v":51.26},{"$f":"NASDAQ100!I9","v":"S.US.CERN"}]
[{"$f":"TRIM('S&P500'!I10)","v":"S.US.C"},{"$f":"IFERROR(RTD(\"cqg.rtd\",,\"ContractData\",A35,\"LongDescription\",,\"T\")&\"  (\"&RIGHT(A35,LEN(A35)-5)&\")\",\"\")","v":"Citigroup Inc  (C)"},null,null,{"$f":"IF(B35=\"\",\"\",IFERROR(RTD(\"cqg.rtd\",,\"ContractData\",A35,\"LastTrade\",,\"T\"),\"\"))","v":59.06},{"$f":"IF(B35=\"\",\"\",IFERROR(RTD(\"cqg.rtd\", ,\"ContractData\",A35, \"NetChange\",, \"T\"),\"\"))","v":1.43},{"$f":"IFERROR(RTD(\"cqg.rtd\", ,\"ContractData\",A35, \"PerCentNetLastTrade\",, \"T\")/100,\"\")","v":2.4813465209092486E-2},{"$f":"IFERROR(RTD(\"cqg.rtd\",,\"StudyData\",A35, \"Vol\", \"VolType=Exchange,CoCType=Exchange\", \"Vol\",\"ADC\",\"0\",\"ALL\",,,\"TRUE\",\"T\")/ RTD(\"cqg.rtd\",,\"StudyData\",A35, \"MA\", \"InputChoice=ContractVol,MAType=Sim,Period=21\", \"MA\",\"D\",\"-1\",\"all\",,,,\"T\"),\"\")","v":0.92062130147544086},{"$f":"IF(B35=\"\",\"\",IFERROR(RTD(\"cqg.rtd\", ,\"ContractData\",A35, \"Open\",, \"T\"),\"\"))","v":57.99},{"$f":"IF(B35=\"\",\"\",IFERROR(RTD(\"cqg.rtd\", ,\"ContractData\",A35, \"High\",, \"T\"),\"\"))","v":59.36},{"$f":"IF(B35=\"\",\"\",IFERROR(RTD(\"cqg.rtd\",,\"ContractData\",A35,\"Low\",,\"T\"),\"\"))","v":57.99},"NYSE Adv Issues",null,null,"NASDAQ Adv Issues",null,null,{"$f":"IFERROR(RTD(\"cqg.rtd\",,\"ContractData\",AB35,\"LongDescription\",,\"T\")&\"  (\"&RIGHT(AB35,LEN(AB35)-5)&\")\",\"\")","v":"Analog Devices Inc  (ADI)"},null,null,{"$f":"IF(R35=\"\",\"\",IFERROR(RTD(\"cqg.rtd\",,\"ContractData\",AB35,\"LastTrade\",,\"T\"),\"\"))","v":77.97},{"$f":"IF(R35=\"\",\"\",IFERROR(RTD(\"cqg.rtd\", ,\"ContractData\",AB35, \"NetChange\",, \"T\"),\"\"))","v":1.44},{"$f":"IFERROR(RTD(\"cqg.rtd\", ,\"ContractData\",AB35, \"PerCentNetLastTrade\",, \"T\")/100,\"\")","v":1.8816150529204233E-2},{"$f":"IFERROR(RTD(\"cqg.rtd\",,\"StudyData\",AB35, \"Vol\", \"VolType=Exchange,CoCType=Exchange\", \"Vol\",\"ADC\",\"0\",\"ALL\",,,\"TRUE\",\"T\")/ RTD(\"cqg.rtd\",,\"StudyData\",AB35, \"MA\", \"InputChoice=ContractVol,MAType=Sim,Period=21\", \"MA\",\"D\",\"-1\",\"all\",,,,\"T\"),\"\")","v":0.86931488565227755},{"$f":"IF(R35=\"\",\"\",IFERROR(RTD(\"cqg.rtd\", ,\"ContractData\",AB35, \"Open\",, \"T\"),\"\"))","v":77.010000000000005},{"$f":"IF(R35=\"\",\"\",IFERROR(RTD(\"cqg.rtd\", ,\"ContractData\",AB35, \"High\",, \"T\"),\"\"))","v":78.03},{"$f":"IF(R35=\"\",\"\",IFERROR(RTD(\"cqg.rtd\", ,\"ContractData\",AB35, \"Low\",, \"T\"),\"\"))","v":76.81},{"$f":"NASDAQ100!I10","v":"S.US.ADI"}]
[null,"CQG Bottom Ten Percentage Performers in the S&P 500",null,null,null,null,null,null,null,null,null,null,null,null,null,null,null,"CQG Bottom Ten Percentage Performers in the NASDAQ 100"]
[{"$f":"TRIM('S&P500'!N1)","v":"S.US.NVDA"},{"$f":"IFERROR(RTD(\"cqg.rtd\",,\"ContractData\",A37,\"LongDescription\",,\"T\")&\"  (\"&RIGHT(A37,LEN(A37)-5)&\")\",\"\")","v":"NVIDIA Corp  (NVDA)"},null,null,{"$f":"IF(B37=\"\",\"\",IFERROR(RTD(\"cqg.rtd\",,\"ContractData\",A37,\"LastTrade\",,\"T\"),\"\"))","v":108.57000000000001},{"$f":"IF(B37=\"\",\"\",IFERROR(RTD(\"cqg.rtd\", ,\"ContractData\",A37, \"NetChange\",, \"T\"),\"\"))","v":-5.04},{"$f":"IFERROR(RTD(\"cqg.rtd\", ,\"ContractData\",A37, \"PerCentNetLastTrade\",, \"T\")/100,\"\")","v":-4.4446400281640555E-2},{"$f":"IFERROR(RTD(\"cqg.rtd\",,\"StudyData\",A37, \"Vol\", \"VolType=Exchange,CoCType=Exchange\", \"Vol\",\"ADC\",\"0\",\"ALL\",,,\"TRUE\",\"T\")/ RTD(\"cqg.rtd\",,\"StudyData\",A37, \"MA\", \"InputChoice=ContractVol,MAType=Sim,Period=21\", \"MA\",\"D\",\"-1\",\"all\",,,,\"T\"),\"\")","v":1.9080612163174888},{"$f":"IF(B37=\"\",\"\",IFERROR(RTD(\"cqg.rtd\", ,\"ContractData\",A37, \"Open\",, \"T\"),\"\"))","v":113.39},{"$f":"IF(B37=\"\",\"\",IFERROR(RTD(\"cqg.rtd\", ,\"ContractData\",A37, \"High\",, \"T\"),\"\"))","v":113.98},{"$f":"IF(B37=\"\",\"\",IFERROR(RTD(\"cqg.rtd\",,\"ContractData\",A37,\"Low\",,\"T\"),\"\"))","v":108.2},{"$f":"IFERROR(RTD(\"cqg.rtd\", ,\"ContractData\",\"DJIUP\", \"LastTrade\",, \"T\"),\"\")","v":1681},null,null,{"$f":"IFERROR(RTD(\"cqg.rtd\", ,\"ContractData\",\"NASIUP\", \"LastTrade\",, \"T\"),\"\")","v":1624},null,null,{"$f":"IFERROR(RTD(\"cqg.rtd\",,\"ContractData\",AB37,\"LongDescription\",,\"T\")&\"  (\"&RIGHT(AB37,LEN(AB37)-5)&\")\",\"\")","v":"NVIDIA Corp  (NVDA)"},null,null,{"$f":"IF(R37=\"\",\"\",IFERROR(RTD(\"cqg.rtd\",,\"ContractData\",AB37,\"LastTrade\",,\"T\"),\"\"))","v":108.57000000000001},{"$f":"IF(R37=\"\",\"\",IFERROR(RTD(\"cqg.rtd\", ,\"ContractData\",AB37, \"NetChange\",, \"T\"),\"\"))","v":-5.04},{"$f":"IFERROR(RTD(\"cqg.rtd\", ,\"ContractData\",AB37, \"PerCentNetLastTrade\",, \"T\")/100,\"\")","v":-4.4446400281640555E-2},{"$f":"IFERROR(RTD(\"cqg.rtd\",,\"StudyData\",AB37, \"Vol\", \"VolType=Exchange,CoCType=Exchange\", \"Vol\",\"ADC\",\"0\",\"ALL\",,,\"TRUE\",\"T\")/ RTD(\"cqg.rtd\",,\"StudyData\",AB37, \"MA\", \"InputChoice=ContractVol,MAType=Sim,Period=21\", \"MA\",\"D\",\"-1\",\"all\",,,,\"T\"),\"\")","v":1.9080612163174888},{"$f":"IF(R37=\"\",\"\",IFERROR(RTD(\"cqg.rtd\", ,\"ContractData\",AB37, \"Open\",, \"T\"),\"\"))","v":113.39},{"$f":"IF(R37=\"\",\"\",IFERROR(RTD(\"cqg.rtd\", ,\"ContractData\",AB37, \"High\",, \"T\"),\"\"))","v":113.98},{"$f":"IF(R37=\"\",\"\",IFERROR(RTD(\"cqg.rtd\", ,\"ContractData\",AB37, \"Low\",, \"T\"),\"\"))","v":108.2},{"$f":"NASDAQ100!N1","v":"S.US.NVDA"}]
[{"$f":"TRIM('S&P500'!N2)","v":"S.US.ATVI"},{"$f":"IFERROR(RTD(\"cqg.rtd\",,\"ContractData\",A38,\"LongDescription\",,\"T\")&\"  (\"&RIGHT(A38,LEN(A38)-5)&\")\",\"\")","v":"Activision Blizzard Inc  (ATVI)"},null,null,{"$f":"IF(B38=\"\",\"\",IFERROR(RTD(\"cqg.rtd\",,\"ContractData\",A38,\"LastTrade\",,\"T\"),\"\"))","v":45.74},{"$f":"IF(B38=\"\",\"\",IFERROR(RTD(\"cqg.rtd\", ,\"ContractData\",A38, \"NetChange\",, \"T\"),\"\"))","v":-1.49},{"$f":"IFERROR(RTD(\"cqg.rtd\", ,\"ContractData\",A38, \"PerCentNetLastTrade\",, \"T\")/100,\"\")","v":-3.1547745077281392E-2},{"$f":"IFERROR(RTD(\"cqg.rtd\",,\"StudyData\",A38, \"Vol\", \"VolType=Exchange,CoCType=Exchange\", \"Vol\",\"ADC\",\"0\",\"ALL\",,,\"TRUE\",\"T\")/ RTD(\"cqg.rtd\",,\"StudyData\",A38, \"MA\", \"InputChoice=ContractVol,MAType=Sim,Period=21\", \"MA\",\"D\",\"-1\",\"all\",,,,\"T\"),\"\")","v":2.187281237502829},{"$f":"IF(B38=\"\",\"\",IFERROR(RTD(\"cqg.rtd\", ,\"ContractData\",A38, \"Open\",, \"T\"),\"\"))","v":46.04},{"$f":"IF(B38=\"\",\"\",IFERROR(RTD(\"cqg.rtd\", ,\"ContractData\",A38, \"High\",, \"T\"),\"\"))","v":46.7},{"$f":"IF(B38=\"\",\"\",IFERROR(RTD(\"cqg.rtd\",,\"ContractData\",A38,\"Low\",,\"T\"),\"\"))","v":45.39},"NYSE Dec Issues",null,null,"NASDAQ Dec Issues",null,null,{"$f":"IFERROR(RTD(\"cqg.rtd\",,\"ContractData\",AB38,\"LongDescription\",,\"T\")&\"  (\"&RIGHT(AB38,LEN(AB38)-5)&\")\",\"\")","v":"Activision Blizzard Inc  (ATVI)"},null,null,{"$f":"IF(R38=\"\",\"\",IFERROR(RTD(\"cqg.rtd\",,\"ContractData\",AB38,\"LastTrade\",,\"T\"),\"\"))","v":45.74},{"$f":"IF(R38=\"\",\"\",IFERROR(RTD(\"cqg.rtd\", ,\"ContractData\",AB38, \"NetChange\",, \"T\"),\"\"))","v":-1.49},{"$f":"IFERROR(RTD(\"cqg.rtd\", ,\"ContractData\",AB38, \"PerCentNetLastTrade\",, \"T\")/100,\"\")","v":-3.1547745077281392E-2},{"$f":"IFERROR(RTD(\"cqg.rtd\",,\"StudyData\",AB38, \"Vol\", \"VolType=Exchange,CoCType=Exchange\", \"Vol\",\"ADC\",\"0\",\"ALL\",,,\"TRUE\",\"T\")/ RTD(\"cqg.rtd\",,\"StudyData\",AB38, \"MA\", \"InputChoice=ContractVol,MAType=Sim,Period=21\", \"MA\",\"D\",\"-1\",\"all\",,,,\"T\"),\"\")","v":2.187281237502829},{"$f":"IF(R38=\"\",\"\",IFERROR(RTD(\"cqg.rtd\", ,\"ContractData\",AB38, \"Open\",, \"T\"),\"\"))","v":46.04},{"$f":"IF(R38=\"\",\"\",IFERROR(RTD(\"cqg.rtd\", ,\"ContractData\",AB38, \"High\",, \"T\"),\"\"))","v":46.7},{"$f":"IF(R38=\"\",\"\",IFERROR(RTD(\"cqg.rtd\", ,\"ContractData\",AB38, \"Low\",, \"T\"),\"\"))","v":45.39},{"$f":"NASDAQ100!N2","v":"S.US.ATVI"}]
[{"$f":"TRIM('S&P500'!N3)","v":"S.US.EQT"},{"$f":"IFERROR(RTD(\"cqg.rtd\",,\"ContractData\",A39,\"LongDescription\",,\"T\")&\"  (\"&RIGHT(A39,LEN(A39)-5)&\")\",\"\")","v":"EQT Corp  (EQT)"},null,null,{"$f":"IF(B39=\"\",\"\",IFERROR(RTD(\"cqg.rtd\",,\"ContractData\",A39,\"LastTrade\",,\"T\"),\"\"))","v":62.59},{"$f":"IF(B39=\"\",\"\",IFERROR(RTD(\"cqg.rtd\", ,\"ContractData\",A39, \"NetChange\",, \"T\"),\"\"))","v":-1.76},{"$f":"IFERROR(RTD(\"cqg.rtd\", ,\"ContractData\",A39, \"PerCentNetLastTrade\",, \"T\")/100,\"\")","v":-2.735042735042735E-2},{"$f":"IFERROR(RTD(\"cqg.rtd\",,\"StudyData\",A39, \"Vol\", \"VolType=Exchange,CoCType=Exchange\", \"Vol\",\"ADC\",\"0\",\"ALL\",,,\"TRUE\",\"T\")/ RTD(\"cqg.rtd\",,\"StudyData\",A39, \"MA\", \"InputChoice=ContractVol,MAType=Sim,Period=21\", \"MA\",\"D\",\"-1\",\"all\",,,,\"T\"),\"\")","v":0.48355138403444431},{"$f":"IF(B39=\"\",\"\",IFERROR(RTD(\"cqg.rtd\", ,\"ContractData\",A39, \"Open\",, \"T\"),\"\"))","v":63.95},{"$f":"IF(B39=\"\",\"\",IFERROR(RTD(\"cqg.rtd\", ,\"ContractData\",A39, \"High\",, \"T\"),\"\"))","v":64.05},{"$f":"IF(B39=\"\",\"\",IFERROR(RTD(\"cqg.rtd\",,\"ContractData\",A39,\"Low\",,\"T\"),\"\"))","v":62.51},null,null,null,null,null,null,{"$f":"IFERROR(RTD(\"cqg.rtd\",,\"ContractData\",AB39,\"LongDescription\",,\"T\")&\"  (\"&RIGHT(AB39,LEN(AB39)-5)&\")\",\"\")","v":"T-Mobile US, Inc.  (TMUS)"},null,null,{"$f":"IF(R39=\"\",\"\",IFERROR(RTD(\"cqg.rtd\",,\"ContractData\",AB39,\"LastTrade\",,\"T\"),\"\"))","v":60.75},{"$f":"IF(R39=\"\",\"\",IFERROR(RTD(\"cqg.rtd\", ,\"ContractData\",AB39, \"NetChange\",, \"T\"),\"\"))","v":-1.6400000000000001},{"$f":"IFERROR(RTD(\"cqg.rtd\", ,\"ContractData\",AB39, \"PerCentNetLastTrade\",, \"T\")/100,\"\")","v":-2.6286263824330823E-2},{"$f":"IFERROR(RTD(\"cqg.rtd\",,\"StudyData\",AB39, \"Vol\", \"VolType=Exchange,CoCType=Exchange\", \"Vol\",\"ADC\",\"0\",\"ALL\",,,\"TRUE\",\"T\")/ RTD(\"cqg.rtd\",,\"StudyData\",AB39, \"MA\", \"InputChoice=ContractVol,MAType=Sim,Period=21\", \"MA\",\"D\",\"-1\",\"all\",,,,\"T\"),\"\")","v":2.1997498591051245},{"$f":"IF(R39=\"\",\"\",IFERROR(RTD(\"cqg.rtd\", ,\"ContractData\",AB39, \"Open\",, \"T\"),\"\"))","v":60.59},{"$f":"IF(R39=\"\",\"\",IFERROR(RTD(\"cqg.rtd\", ,\"ContractData\",AB39, \"High\",, \"T\"),\"\"))","v":61},{"$f":"IF(R39=\"\",\"\",IFERROR(RTD(\"cqg.rtd\", ,\"ContractData\",AB39, \"Low\",, \"T\"),\"\"))","v":60.03},{"$f":"NASDAQ100!N3","v":"S.US.TMUS"}]
[{"$f":"TRIM('S&P500'!N4)","v":"S.US.GPS"},{"$f":"IFERROR(RTD(\"cqg.rtd\",,\"ContractData\",A40,\"LongDescription\",,\"T\")&\"  (\"&RIGHT(A40,LEN(A40)-5)&\")\",\"\")","v":"Gap Inc  (GPS)"},null,null,{"$f":"IF(B40=\"\",\"\",IFERROR(RTD(\"cqg.rtd\",,\"ContractData\",A40,\"LastTrade\",,\"T\"),\"\"))","v":23.69},{"$f":"IF(B40=\"\",\"\",IFERROR(RTD(\"cqg.rtd\", ,\"ContractData\",A40, \"NetChange\",, \"T\"),\"\"))","v":-0.67},{"$f":"IFERROR(RTD(\"cqg.rtd\", ,\"ContractData\",A40, \"PerCentNetLastTrade\",, \"T\")/100,\"\")","v":-2.7504105090311984E-2},{"$f":"IFERROR(RTD(\"cqg.rtd\",,\"StudyData\",A40, \"Vol\", \"VolType=Exchange,CoCType=Exchange\", \"Vol\",\"ADC\",\"0\",\"ALL\",,,\"TRUE\",\"T\")/ RTD(\"cqg.rtd\",,\"StudyData\",A40, \"MA\", \"InputChoice=ContractVol,MAType=Sim,Period=21\", \"MA\",\"D\",\"-1\",\"all\",,,,\"T\"),\"\")","v":0.77623808387668836},{"$f":"IF(B40=\"\",\"\",IFERROR(RTD(\"cqg.rtd\", ,\"ContractData\",A40, \"Open\",, \"T\"),\"\"))","v":24.36},{"$f":"IF(B40=\"\",\"\",IFERROR(RTD(\"cqg.rtd\", ,\"ContractData\",A40, \"High\",, \"T\"),\"\"))","v":24.38},{"$f":"IF(B40=\"\",\"\",IFERROR(RTD(\"cqg.rtd\",,\"ContractData\",A40,\"Low\",,\"T\"),\"\"))","v":23.44},{"$f":"IFERROR(RTD(\"cqg.rtd\", ,\"ContractData\",\"DJIDN\", \"LastTrade\",, \"T\"),\"\")","v":1300},null,null,{"$f":"IFERROR(RTD(\"cqg.rtd\", ,\"ContractData\",\"NASIDN\", \"LastTrade\",, \"T\"),\"\")","v":1208},null,null,{"$f":"IFERROR(RTD(\"cqg.rtd\",,\"ContractData\",AB40,\"LongDescription\",,\"T\")&\"  (\"&RIGHT(AB40,LEN(AB40)-5)&\")\",\"\")","v":"Expedia Inc  (EXPE)"},null,null,{"$f":"IF(R40=\"\",\"\",IFERROR(RTD(\"cqg.rtd\",,\"ContractData\",AB40,\"LastTrade\",,\"T\"),\"\"))","v":119.45},{"$f":"IF(R40=\"\",\"\",IFERROR(RTD(\"cqg.rtd\", ,\"ContractData\",AB40, \"NetChange\",, \"T\"),\"\"))","v":-3.2},{"$f":"IFERROR(RTD(\"cqg.rtd\", ,\"ContractData\",AB40, \"PerCentNetLastTrade\",, \"T\")/100,\"\")","v":-2.6090501426824297E-2},{"$f":"IFERROR(RTD(\"cqg.rtd\",,\"StudyData\",AB40, \"Vol\", \"VolType=Exchange,CoCType=Exchange\", \"Vol\",\"ADC\",\"0\",\"ALL\",,,\"TRUE\",\"T\")/ RTD(\"cqg.rtd\",,\"StudyData\",AB40, \"MA\", \"InputChoice=ContractVol,MAType=Sim,Period=21\", \"MA\",\"D\",\"-1\",\"all\",,,,\"T\"),\"\")","v":1.955845866361787},{"$f":"IF(R40=\"\",\"\",IFERROR(RTD(\"cqg.rtd\", ,\"ContractData\",AB40, \"Open\",, \"T\"),\"\"))","v":123.06},{"$f":"IF(R40=\"\",\"\",IFERROR(RTD(\"cqg.rtd\", ,\"ContractData\",AB40, \"High\",, \"T\"),\"\"))","v":123.06},{"$f":"IF(R40=\"\",\"\",IFERROR(RTD(\"cqg.rtd\", ,\"ContractData\",AB40, \"Low\",, \"T\"),\"\"))","v":119.38},{"$f":"NASDAQ100!N4","v":"S.US.EXPE"}]
[{"$f":"TRIM('S&P500'!N5)","v":"S.US.EXPE"},{"$f":"IFERROR(RTD(\"cqg.rtd\",,\"ContractData\",A41,\"LongDescription\",,\"T\")&\"  (\"&RIGHT(A41,LEN(A41)-5)&\")\",\"\")","v":"Expedia Inc  (EXPE)"},null,null,{"$f":"IF(B41=\"\",\"\",IFERROR(RTD(\"cqg.rtd\",,\"ContractData\",A41,\"LastTrade\",,\"T\"),\"\"))","v":119.45},{"$f":"IF(B41=\"\",\"\",IFERROR(RTD(\"cqg.rtd\", ,\"ContractData\",A41, \"NetChange\",, \"T\"),\"\"))","v":-3.2},{"$f":"IFERROR(RTD(\"cqg.rtd\", ,\"ContractData\",A41, \"PerCentNetLastTrade\",, \"T\")/100,\"\")","v":-2.6090501426824297E-2},{"$f":"IFERROR(RTD(\"cqg.rtd\",,\"StudyData\",A41, \"Vol\", \"VolType=Exchange,CoCType=Exchange\", \"Vol\",\"ADC\",\"0\",\"ALL\",,,\"TRUE\",\"T\")/ RTD(\"cqg.rtd\",,\"StudyData\",A41, \"MA\", \"InputChoice=ContractVol,MAType=Sim,Period=21\", \"MA\",\"D\",\"-1\",\"all\",,,,\"T\"),\"\")","v":1.955845866361787},{"$f":"IF(B41=\"\",\"\",IFERROR(RTD(\"cqg.rtd\", ,\"ContractData\",A41, \"Open\",, \"T\"),\"\"))","v":123.06},{"$f":"IF(B41=\"\",\"\",IFERROR(RTD(\"cqg.rtd\", ,\"ContractData\",A41, \"High\",, \"T\"),\"\"))","v":123.06},{"$f":"IF(B41=\"\",\"\",IFERROR(RTD(\"cqg.rtd\",,\"ContractData\",A41,\"Low\",,\"T\"),\"\"))","v":119.38},"NYSE Unc Issues",null,null,"NASDAQ Unc Issues",null,null,{"$f":"IFERROR(RTD(\"cqg.rtd\",,\"ContractData\",AB41,\"LongDescription\",,\"T\")&\"  (\"&RIGHT(AB41,LEN(AB41)-5)&\")\",\"\")","v":"Liberty Global plc LiLAC Class A  (LILA)"},null,null,{"$f":"IF(R41=\"\",\"\",IFERROR(RTD(\"cqg.rtd\",,\"ContractData\",AB41,\"LastTrade\",,\"T\"),\"\"))","v":22.650000000000002},{"$f":"IF(R41=\"\",\"\",IFERROR(RTD(\"cqg.rtd\", ,\"ContractData\",AB41, \"NetChange\",, \"T\"),\"\"))","v":-0.55000000000000004},{"$f":"IFERROR(RTD(\"cqg.rtd\", ,\"ContractData\",AB41, \"PerCentNetLastTrade\",, \"T\")/100,\"\")","v":-2.3706896551724137E-2},{"$f":"IFERROR(RTD(\"cqg.rtd\",,\"StudyData\",AB41, \"Vol\", \"VolType=Exchange,CoCType=Exchange\", \"Vol\",\"ADC\",\"0\",\"ALL\",,,\"TRUE\",\"T\")/ RTD(\"cqg.rtd\",,\"StudyData\",AB41, \"MA\", \"InputChoice=ContractVol,MAType=Sim,Period=21\", \"MA\",\"D\",\"-1\",\"all\",,,,\"T\"),\"\")","v":0.39453134150055624},{"$f":"IF(R41=\"\",\"\",IFERROR(RTD(\"cqg.rtd\", ,\"ContractData\",AB41, \"Open\",, \"T\"),\"\"))","v":23.31},{"$f":"IF(R41=\"\",\"\",IFERROR(RTD(\"cqg.rtd\", ,\"ContractData\",AB41, \"High\",, \"T\"),\"\"))","v":23.330000000000002},{"$f":"IF(R41=\"\",\"\",IFERROR(RTD(\"cqg.rtd\", ,\"ContractData\",AB41, \"Low\",, \"T\"),\"\"))","v":22.580000000000002},{"$f":"NASDAQ100!N5","v":"S.US.LILA"}]
[{"$f":"TRIM('S&P500'!N6)","v":"S.US.UA"},{"$f":"IFERROR(RTD(\"cqg.rtd\",,\"ContractData\",A42,\"LongDescription\",,\"T\")&\"  (\"&RIGHT(A42,LEN(A42)-5)&\")\",\"\")","v":"Under Armour Inc  (UA)"},null,null,{"$f":"IF(B42=\"\",\"\",IFERROR(RTD(\"cqg.rtd\",,\"ContractData\",A42,\"LastTrade\",,\"T\"),\"\"))","v":18.63},{"$f":"IF(B42=\"\",\"\",IFERROR(RTD(\"cqg.rtd\", ,\"ContractData\",A42, \"NetChange\",, \"T\"),\"\"))","v":-0.41000000000000003},{"$f":"IFERROR(RTD(\"cqg.rtd\", ,\"ContractData\",A42, \"PerCentNetLastTrade\",, \"T\")/100,\"\")","v":-2.1533613445378151E-2},{"$f":"IFERROR(RTD(\"cqg.rtd\",,\"StudyData\",A42, \"Vol\", \"VolType=Exchange,CoCType=Exchange\", \"Vol\",\"ADC\",\"0\",\"ALL\",,,\"TRUE\",\"T\")/ RTD(\"cqg.rtd\",,\"StudyData\",A42, \"MA\", \"InputChoice=ContractVol,MAType=Sim,Period=21\", \"MA\",\"D\",\"-1\",\"all\",,,,\"T\"),\"\")","v":0.53361370434085109},{"$f":"IF(B42=\"\",\"\",IFERROR(RTD(\"cqg.rtd\", ,\"ContractData\",A42, \"Open\",, \"T\"),\"\"))","v":19.25},{"$f":"IF(B42=\"\",\"\",IFERROR(RTD(\"cqg.rtd\", ,\"ContractData\",A42, \"High\",, \"T\"),\"\"))","v":19.260000000000002},{"$f":"IF(B42=\"\",\"\",IFERROR(RTD(\"cqg.rtd\",,\"ContractData\",A42,\"Low\",,\"T\"),\"\"))","v":18.53},null,null,null,null,null,null,{"$f":"IFERROR(RTD(\"cqg.rtd\",,\"ContractData\",AB42,\"LongDescription\",,\"T\")&\"  (\"&RIGHT(AB42,LEN(AB42)-5)&\")\",\"\")","v":"Liberty Global plc LiLAC Class C  (LILAK)"},null,null,{"$f":"IF(R42=\"\",\"\",IFERROR(RTD(\"cqg.rtd\",,\"ContractData\",AB42,\"LastTrade\",,\"T\"),\"\"))","v":21.97},{"$f":"IF(R42=\"\",\"\",IFERROR(RTD(\"cqg.rtd\", ,\"ContractData\",AB42, \"NetChange\",, \"T\"),\"\"))","v":-0.49},{"$f":"IFERROR(RTD(\"cqg.rtd\", ,\"ContractData\",AB42, \"PerCentNetLastTrade\",, \"T\")/100,\"\")","v":-2.1816562778272486E-2},{"$f":"IFERROR(RTD(\"cqg.rtd\",,\"StudyData\",AB42, \"Vol\", \"VolType=Exchange,CoCType=Exchange\", \"Vol\",\"ADC\",\"0\",\"ALL\",,,\"TRUE\",\"T\")/ RTD(\"cqg.rtd\",,\"StudyData\",AB42, \"MA\", \"InputChoice=ContractVol,MAType=Sim,Period=21\", \"MA\",\"D\",\"-1\",\"all\",,,,\"T\"),\"\")","v":0.57938995863383891},{"$f":"IF(R42=\"\",\"\",IFERROR(RTD(\"cqg.rtd\", ,\"ContractData\",AB42, \"Open\",, \"T\"),\"\"))","v":22.580000000000002},{"$f":"IF(R42=\"\",\"\",IFERROR(RTD(\"cqg.rtd\", ,\"ContractData\",AB42, \"High\",, \"T\"),\"\"))","v":22.7},{"$f":"IF(R42=\"\",\"\",IFERROR(RTD(\"cqg.rtd\", ,\"ContractData\",AB42, \"Low\",, \"T\"),\"\"))","v":21.87},{"$f":"NASDAQ100!N6","v":"S.US.LILAK"}]
[{"$f":"TRIM('S&P500'!N7)","v":"S.US.SWN"},{"$f":"IFERROR(RTD(\"cqg.rtd\",,\"ContractData\",A43,\"LongDescription\",,\"T\")&\"  (\"&RIGHT(A43,LEN(A43)-5)&\")\",\"\")","v":"SOUTHWESTERN ENERGY CO  (SWN)"},null,null,{"$f":"IF(B43=\"\",\"\",IFERROR(RTD(\"cqg.rtd\",,\"ContractData\",A43,\"LastTrade\",,\"T\"),\"\"))","v":8.84},{"$f":"IF(B43=\"\",\"\",IFERROR(RTD(\"cqg.rtd\", ,\"ContractData\",A43, \"NetChange\",, \"T\"),\"\"))","v":-0.17},{"$f":"IFERROR(RTD(\"cqg.rtd\", ,\"ContractData\",A43, \"PerCentNetLastTrade\",, \"T\")/100,\"\")","v":-1.8867924528301886E-2},{"$f":"IFERROR(RTD(\"cqg.rtd\",,\"StudyData\",A43, \"Vol\", \"VolType=Exchange,CoCType=Exchange\", \"Vol\",\"ADC\",\"0\",\"ALL\",,,\"TRUE\",\"T\")/ RTD(\"cqg.rtd\",,\"StudyData\",A43, \"MA\", \"InputChoice=ContractVol,MAType=Sim,Period=21\", \"MA\",\"D\",\"-1\",\"all\",,,,\"T\"),\"\")","v":0.68031902212935946},{"$f":"IF(B43=\"\",\"\",IFERROR(RTD(\"cqg.rtd\", ,\"ContractData\",A43, \"Open\",, \"T\"),\"\"))","v":8.9600000000000009},{"$f":"IF(B43=\"\",\"\",IFERROR(RTD(\"cqg.rtd\", ,\"ContractData\",A43, \"High\",, \"T\"),\"\"))","v":9},{"$f":"IF(B43=\"\",\"\",IFERROR(RTD(\"cqg.rtd\",,\"ContractData\",A43,\"Low\",,\"T\"),\"\"))","v":8.7200000000000006},{"$f":"IFERROR(RTD(\"cqg.rtd\", ,\"ContractData\",\"DJIUC\", \"LastTrade\",, \"T\"),\"\")","v":92},null,null,{"$f":"IFERROR(RTD(\"cqg.rtd\", ,\"ContractData\",\"NASIUC\", \"LastTrade\",, \"T\"),\"\")","v":126},null,null,{"$f":"IFERROR(RTD(\"cqg.rtd\",,\"ContractData\",AB43,\"LongDescription\",,\"T\")&\"  (\"&RIGHT(AB43,LEN(AB43)-5)&\")\",\"\")","v":"Liberty Interactive Corporation Series A  (QVCA)"},null,null,{"$f":"IF(R43=\"\",\"\",IFERROR(RTD(\"cqg.rtd\",,\"ContractData\",AB43,\"LastTrade\",,\"T\"),\"\"))","v":19.010000000000002},{"$f":"IF(R43=\"\",\"\",IFERROR(RTD(\"cqg.rtd\", ,\"ContractData\",AB43, \"NetChange\",, \"T\"),\"\"))","v":-0.31},{"$f":"IFERROR(RTD(\"cqg.rtd\", ,\"ContractData\",AB43, \"PerCentNetLastTrade\",, \"T\")/100,\"\")","v":-1.6045548654244304E-2},{"$f":"IFERROR(RTD(\"cqg.rtd\",,\"StudyData\",AB43, \"Vol\", \"VolType=Exchange,CoCType=Exchange\", \"Vol\",\"ADC\",\"0\",\"ALL\",,,\"TRUE\",\"T\")/ RTD(\"cqg.rtd\",,\"StudyData\",AB43, \"MA\", \"InputChoice=ContractVol,MAType=Sim,Period=21\", \"MA\",\"D\",\"-1\",\"all\",,,,\"T\"),\"\")","v":0.62032371889930182},{"$f":"IF(R43=\"\",\"\",IFERROR(RTD(\"cqg.rtd\", ,\"ContractData\",AB43, \"Open\",, \"T\"),\"\"))","v":19.34},{"$f":"IF(R43=\"\",\"\",IFERROR(RTD(\"cqg.rtd\", ,\"ContractData\",AB43, \"High\",, \"T\"),\"\"))","v":19.510000000000002},{"$f":"IF(R43=\"\",\"\",IFERROR(RTD(\"cqg.rtd\", ,\"ContractData\",AB43, \"Low\",, \"T\"),\"\"))","v":18.97},{"$f":"NASDAQ100!N7","v":"S.US.QVCA"}]
[{"$f":"TRIM('S&P500'!N8)","v":"S.US.HBI"},{"$f":"IFERROR(RTD(\"cqg.rtd\",,\"ContractData\",A44,\"LongDescription\",,\"T\")&\"  (\"&RIGHT(A44,LEN(A44)-5)&\")\",\"\")","v":"Hanesbrands, Inc  (HBI)"},null,null,{"$f":"IF(B44=\"\",\"\",IFERROR(RTD(\"cqg.rtd\",,\"ContractData\",A44,\"LastTrade\",,\"T\"),\"\"))","v":20.46},{"$f":"IF(B44=\"\",\"\",IFERROR(RTD(\"cqg.rtd\", ,\"ContractData\",A44, \"NetChange\",, \"T\"),\"\"))","v":-0.39},{"$f":"IFERROR(RTD(\"cqg.rtd\", ,\"ContractData\",A44, \"PerCentNetLastTrade\",, \"T\")/100,\"\")","v":-1.870503597122302E-2},{"$f":"IFERROR(RTD(\"cqg.rtd\",,\"StudyData\",A44, \"Vol\", \"VolType=Exchange,CoCType=Exchange\", \"Vol\",\"ADC\",\"0\",\"ALL\",,,\"TRUE\",\"T\")/ RTD(\"cqg.rtd\",,\"StudyData\",A44, \"MA\", \"InputChoice=ContractVol,MAType=Sim,Period=21\", \"MA\",\"D\",\"-1\",\"all\",,,,\"T\"),\"\")","v":0.78486946234406263},{"$f":"IF(B44=\"\",\"\",IFERROR(RTD(\"cqg.rtd\", ,\"ContractData\",A44, \"Open\",, \"T\"),\"\"))","v":21.02},{"$f":"IF(B44=\"\",\"\",IFERROR(RTD(\"cqg.rtd\", ,\"ContractData\",A44, \"High\",, \"T\"),\"\"))","v":21.04},{"$f":"IF(B44=\"\",\"\",IFERROR(RTD(\"cqg.rtd\",,\"ContractData\",A44,\"Low\",,\"T\"),\"\"))","v":20.37},"NYSE Tick",null,null,"NASDAQ Tick",null,null,{"$f":"IFERROR(RTD(\"cqg.rtd\",,\"ContractData\",AB44,\"LongDescription\",,\"T\")&\"  (\"&RIGHT(AB44,LEN(AB44)-5)&\")\",\"\")","v":"Tractor Supply Co  (TSCO)"},null,null,{"$f":"IF(R44=\"\",\"\",IFERROR(RTD(\"cqg.rtd\",,\"ContractData\",AB44,\"LastTrade\",,\"T\"),\"\"))","v":73.150000000000006},{"$f":"IF(R44=\"\",\"\",IFERROR(RTD(\"cqg.rtd\", ,\"ContractData\",AB44, \"NetChange\",, \"T\"),\"\"))","v":-1.1000000000000001},{"$f":"IFERROR(RTD(\"cqg.rtd\", ,\"ContractData\",AB44, \"PerCentNetLastTrade\",, \"T\")/100,\"\")","v":-1.4814814814814814E-2},{"$f":"IFERROR(RTD(\"cqg.rtd\",,\"StudyData\",AB44, \"Vol\", \"VolType=Exchange,CoCType=Exchange\", \"Vol\",\"ADC\",\"0\",\"ALL\",,,\"TRUE\",\"T\")/ RTD(\"cqg.rtd\",,\"StudyData\",AB44, \"MA\", \"InputChoice=ContractVol,MAType=Sim,Period=21\", \"MA\",\"D\",\"-1\",\"all\",,,,\"T\"),\"\")","v":0.48917830165329512},{"$f":"IF(R44=\"\",\"\",IFERROR(RTD(\"cqg.rtd\", ,\"ContractData\",AB44, \"Open\",, \"T\"),\"\"))","v":74.48},{"$f":"IF(R44=\"\",\"\",IFERROR(RTD(\"cqg.rtd\", ,\"ContractData\",AB44, \"High\",, \"T\"),\"\"))","v":74.55},{"$f":"IF(R44=\"\",\"\",IFERROR(RTD(\"cqg.rtd\", ,\"ContractData\",AB44, \"Low\",, \"T\"),\"\"))","v":73.14},{"$f":"NASDAQ100!N8","v":"S.US.TSCO"}]
[{"$f":"TRIM('S&P500'!N9)","v":"S.US.T"},{"$f":"IFERROR(RTD(\"cqg.rtd\",,\"ContractData\",A45,\"LongDescription\",,\"T\")&\"  (\"&RIGHT(A45,LEN(A45)-5)&\")\",\"\")","v":"AT&T Inc  (T)"},null,null,{"$f":"IF(B45=\"\",\"\",IFERROR(RTD(\"cqg.rtd\",,\"ContractData\",A45,\"LastTrade\",,\"T\"),\"\"))","v":40.6},{"$f":"IF(B45=\"\",\"\",IFERROR(RTD(\"cqg.rtd\", ,\"ContractData\",A45, \"NetChange\",, \"T\"),\"\"))","v":-0.78},{"$f":"IFERROR(RTD(\"cqg.rtd\", ,\"ContractData\",A45, \"PerCentNetLastTrade\",, \"T\")/100,\"\")","v":-1.8849685838569358E-2},{"$f":"IFERROR(RTD(\"cqg.rtd\",,\"StudyData\",A45, \"Vol\", \"VolType=Exchange,CoCType=Exchange\", \"Vol\",\"ADC\",\"0\",\"ALL\",,,\"TRUE\",\"T\")/ RTD(\"cqg.rtd\",,\"StudyData\",A45, \"MA\", \"InputChoice=ContractVol,MAType=Sim,Period=21\", \"MA\",\"D\",\"-1\",\"all\",,,,\"T\"),\"\")","v":1.3899901307892135},{"$f":"IF(B45=\"\",\"\",IFERROR(RTD(\"cqg.rtd\", ,\"ContractData\",A45, \"Open\",, \"T\"),\"\"))","v":40.82},{"$f":"IF(B45=\"\",\"\",IFERROR(RTD(\"cqg.rtd\", ,\"ContractData\",A45, \"High\",, \"T\"),\"\"))","v":41.14},{"$f":"IF(B45=\"\",\"\",IFERROR(RTD(\"cqg.rtd\",,\"ContractData\",A45,\"Low\",,\"T\"),\"\"))","v":40.49},null,null,null,null,null,null,{"$f":"IFERROR(RTD(\"cqg.rtd\",,\"ContractData\",AB45,\"LongDescription\",,\"T\")&\"  (\"&RIGHT(AB45,LEN(AB45)-5)&\")\",\"\")","v":"Liberty Interactive Corporation Series A  (LVNTA)"},null,null,{"$f":"IF(R45=\"\",\"\",IFERROR(RTD(\"cqg.rtd\",,\"ContractData\",AB45,\"LastTrade\",,\"T\"),\"\"))","v":43.89},{"$f":"IF(R45=\"\",\"\",IFERROR(RTD(\"cqg.rtd\", ,\"ContractData\",AB45, \"NetChange\",, \"T\"),\"\"))","v":-0.62},{"$f":"IFERROR(RTD(\"cqg.rtd\", ,\"ContractData\",AB45, \"PerCentNetLastTrade\",, \"T\")/100,\"\")","v":-1.392945405526848E-2},{"$f":"IFERROR(RTD(\"cqg.rtd\",,\"StudyData\",AB45, \"Vol\", \"VolType=Exchange,CoCType=Exchange\", \"Vol\",\"ADC\",\"0\",\"ALL\",,,\"TRUE\",\"T\")/ RTD(\"cqg.rtd\",,\"StudyData\",AB45, \"MA\", \"InputChoice=ContractVol,MAType=Sim,Period=21\", \"MA\",\"D\",\"-1\",\"all\",,,,\"T\"),\"\")","v":0.52610795945292521},{"$f":"IF(R45=\"\",\"\",IFERROR(RTD(\"cqg.rtd\", ,\"ContractData\",AB45, \"Open\",, \"T\"),\"\"))","v":44.65},{"$f":"IF(R45=\"\",\"\",IFERROR(RTD(\"cqg.rtd\", ,\"ContractData\",AB45, \"High\",, \"T\"),\"\"))","v":44.78},{"$f":"IF(R45=\"\",\"\",IFERROR(RTD(\"cqg.rtd\", ,\"ContractData\",AB45, \"Low\",, \"T\"),\"\"))","v":43.87},{"$f":"NASDAQ100!N9","v":"S.US.LVNTA"}]
[{"$f":"TRIM('S&P500'!N10)","v":"S.US.KORS"},{"$f":"IFERROR(RTD(\"cqg.rtd\",,\"ContractData\",A46,\"LongDescription\",,\"T\")&\"  (\"&RIGHT(A46,LEN(A46)-5)&\")\",\"\")","v":"Michael Kors Holdings Limited  (KORS)"},null,null,{"$f":"IF(B46=\"\",\"\",IFERROR(RTD(\"cqg.rtd\",,\"ContractData\",A46,\"LastTrade\",,\"T\"),\"\"))","v":37.71},{"$f":"IF(B46=\"\",\"\",IFERROR(RTD(\"cqg.rtd\", ,\"ContractData\",A46, \"NetChange\",, \"T\"),\"\"))","v":-0.67},{"$f":"IFERROR(RTD(\"cqg.rtd\", ,\"ContractData\",A46, \"PerCentNetLastTrade\",, \"T\")/100,\"\")","v":-1.7457008858780612E-2},{"$f":"IFERROR(RTD(\"cqg.rtd\",,\"StudyData\",A46, \"Vol\", \"VolType=Exchange,CoCType=Exchange\", \"Vol\",\"ADC\",\"0\",\"ALL\",,,\"TRUE\",\"T\")/ RTD(\"cqg.rtd\",,\"StudyData\",A46, \"MA\", \"InputChoice=ContractVol,MAType=Sim,Period=21\", \"MA\",\"D\",\"-1\",\"all\",,,,\"T\"),\"\")","v":0.83049133736028657},{"$f":"IF(B46=\"\",\"\",IFERROR(RTD(\"cqg.rtd\", ,\"ContractData\",A46, \"Open\",, \"T\"),\"\"))","v":38.29},{"$f":"IF(B46=\"\",\"\",IFERROR(RTD(\"cqg.rtd\", ,\"ContractData\",A46, \"High\",, \"T\"),\"\"))","v":38.450000000000003},{"$f":"IF(B46=\"\",\"\",IFERROR(RTD(\"cqg.rtd\",,\"ContractData\",A46,\"Low\",,\"T\"),\"\"))","v":37.61},{"$f":"IFERROR(RTD(\"cqg.rtd\", ,\"ContractData\",\"DJTIC\", \"LastTrade\",, \"T\"),\"\")","v":-190},null,null,{"$f":"IFERROR(RTD(\"cqg.rtd\", ,\"ContractData\",\"NASTIC\", \"LastTrade\",, \"T\"),\"\")","v":164},null,null,{"$f":"IFERROR(RTD(\"cqg.rtd\",,\"ContractData\",AB46,\"LongDescription\",,\"T\")&\"  (\"&RIGHT(AB46,LEN(AB46)-5)&\")\",\"\")","v":"OReilly Automotive Inc  (ORLY)"},null,null,{"$f":"IF(R46=\"\",\"\",IFERROR(RTD(\"cqg.rtd\",,\"ContractData\",AB46,\"LastTrade\",,\"T\"),\"\"))","v":268.35000000000002},{"$f":"IF(R46=\"\",\"\",IFERROR(RTD(\"cqg.rtd\", ,\"ContractData\",AB46, \"NetChange\",, \"T\"),\"\"))","v":-3.45},{"$f":"IFERROR(RTD(\"cqg.rtd\", ,\"ContractData\",AB46, \"PerCentNetLastTrade\",, \"T\")/100,\"\")","v":-1.2693156732891833E-2},{"$f":"IFERROR(RTD(\"cqg.rtd\",,\"StudyData\",AB46, \"Vol\", \"VolType=Exchange,CoCType=Exchange\", \"Vol\",\"ADC\",\"0\",\"ALL\",,,\"TRUE\",\"T\")/ RTD(\"cqg.rtd\",,\"StudyData\",AB46, \"MA\", \"InputChoice=ContractVol,MAType=Sim,Period=21\", \"MA\",\"D\",\"-1\",\"all\",,,,\"T\"),\"\")","v":0.6374329659090423},{"$f":"IF(R46=\"\",\"\",IFERROR(RTD(\"cqg.rtd\", ,\"ContractData\",AB46, \"Open\",, \"T\"),\"\"))","v":272.45999999999998},{"$f":"IF(R46=\"\",\"\",IFERROR(RTD(\"cqg.rtd\", ,\"ContractData\",AB46, \"High\",, \"T\"),\"\"))","v":272.63},{"$f":"IF(R46=\"\",\"\",IFERROR(RTD(\"cqg.rtd\", ,\"ContractData\",AB46, \"Low\",, \"T\"),\"\"))","v":268.19},{"$f":"NASDAQ100!N10","v":"S.US.ORLY"}]
[null,null,"  Copyright © 2016",null,"Designed by Thom Hartle",null,null,null,null,null,null,null,null,null,null,null,null,null,null,"To better manage performance the dashboard ranking does not update on every quote, but once every"]
[null,null,null,null,null,null,null,null,null,null,null,null,null,null,null,null,null,null,null,"second. Click \"Rank\" to force an update if the percent net change column is out of order."]

{"sheet":"Symbols","index":1,"n_rows":41,"n_cols":51,"rows_kept":41,"cut":false,"hidden":false,"merged":[]}
[]
[null,null,null,null,"Requires Real-Time Data"]
[null,null,"Left hand display",null,null,null,null,"Right hand display",null,null,null,"DJUPV",null,null,"DJDNV",null,null,"NASUPV",null,null,"NASDNV",null,null,"DJUCV",null,null,"NASUCV",null,null,"DJIUP",null,null,"NASIUP",null,null,"DJIDN",null,null,"NASIDN",null,null,"DJIUC",null,null,"NASIUC",null,null,"DJTIC",null,null,"NASTIC"]
[null,null,"Symbols","Description",null,null,null,"Symbols","Description",null,-10,{"$f":"RTD(\"cqg.rtd\",,\"StudyData\",$L$3,\"Bar\",,\"Close\",\"5\",K4,,,,,\"T\")","v":324750},null,-10,{"$f":"RTD(\"cqg.rtd\",,\"StudyData\",$O$3,\"Bar\",,\"Close\",\"5\",N4,,,,,\"T\")","v":153315},null,-10,{"$f":"RTD(\"cqg.rtd\",,\"StudyData\",$R$3,\"Bar\",,\"Close\",\"5\",Q4,,,,,\"T\")","v":811908},null,-10,{"$f":"RTD(\"cqg.rtd\",,\"StudyData\",$U$3,\"Bar\",,\"Close\",\"5\",T4,,,,,\"T\")","v":486351},null,-10,{"$f":"RTD(\"cqg.rtd\",,\"StudyData\",$X$3,\"Bar\",,\"Close\",\"5\",W4,,,,,\"T\")","v":4145},null,-10,{"$f":"RTD(\"cqg.rtd\",,\"StudyData\",$AA$3,\"Bar\",,\"Close\",\"5\",Z4,,,,,\"T\")","v":159237},null,-10,{"$f":"RTD(\"cqg.rtd\",,\"StudyData\",$AD$3,\"Bar\",,\"Close\",\"5\",AC4,,,,,\"T\")","v":1698},null,-10,{"$f":"RTD(\"cqg.rtd\",,\"StudyData\",$AG$3,\"Bar\",,\"Close\",\"5\",AF4,,,,,\"T\")","v":1584},null,-10,{"$f":"RTD(\"cqg.rtd\",,\"StudyData\",$AJ$3,\"Bar\",,\"Close\",\"5\",AI4,,,,,\"T\")","v":1289},null,-10,{"$f":"RTD(\"cqg.rtd\",,\"StudyData\",$AM$3,\"Bar\",,\"Close\",\"5\",AL4,,,,,\"T\")","v":1218},null,-10,{"$f":"RTD(\"cqg.rtd\",,\"StudyData\",$AP$3,\"Bar\",,\"Close\",\"5\",AO4,,,,,\"T\")","v":80},null,-10,{"$f":"RTD(\"cqg.rtd\",,\"StudyData\",$AS$3,\"Bar\",,\"Close\",\"5\",AR4,,,,,\"T\")","v":142},null,-10,{"$f":"RTD(\"cqg.rtd\",,\"StudyData\",$AV$3,\"Bar\",,\"Close\",\"5\",AU4,,,,,\"T\")","v":-200},null,-10,{"$f":"RTD(\"cqg.rtd\",,\"StudyData\",$AY$3,\"Bar\",,\"Close\",\"5\",AX4,,,,,\"T\")","v":131}]
[null,null,"X.US.SPC",{"$f":"RTD(\"cqg.rtd\", ,\"ContractData\",C5, \"LongDescription\",, \"T\")","v":"S&P 500"},null,null,null,"X.US.NQCOMP",{"$f":"RTD(\"cqg.rtd\", ,\"ContractData\",H5, \"LongDescription\",, \"T\")","v":"NASDAQ Composite Index"},null,{"$f":"K4+1","v":-9},{"$f":"RTD(\"cqg.rtd\",,\"StudyData\",$L$3,\"Bar\",,\"Close\",\"5\",K5,,,,,\"T\")","v":328635},null,{"$f":"N4+1","v":-9},{"$f":"RTD(\"cqg.rtd\",,\"StudyData\",$O$3,\"Bar\",,\"Close\",\"5\",N5,,,,,\"T\")","v":154597},null,{"$f":"Q4+1","v":-9},{"$f":"RTD(\"cqg.rtd\",,\"StudyData\",$R$3,\"Bar\",,\"Close\",\"5\",Q5,,,,,\"T\")","v":808440},null,{"$f":"T4+1","v":-9},{"$f":"RTD(\"cqg.rtd\",,\"StudyData\",$U$3,\"Bar\",,\"Close\",\"5\",T5,,,,,\"T\")","v":496467},null,{"$f":"W4+1","v":-9},{"$f":"RTD(\"cqg.rtd\",,\"StudyData\",$X$3,\"Bar\",,\"Close\",\"5\",W5,,,,,\"T\")","v":5020},null,{"$f":"Z4+1","v":-9},{"$f":"RTD(\"cqg.rtd\",,\"StudyData\",$AA$3,\"Bar\",,\"Close\",\"5\",Z5,,,,,\"T\")","v":278099},null,{"$f":"AC4+1","v":-9},{"$f":"RTD(\"cqg.rtd\",,\"StudyData\",$AD$3,\"Bar\",,\"Close\",\"5\",AC5,,,,,\"T\")","v":1716},null,{"$f":"AF4+1","v":-9},{"$f":"RTD(\"cqg.rtd\",,\"StudyData\",$AG$3,\"Bar\",,\"Close\",\"5\",AF5,,,,,\"T\")","v":1572},null,{"$f":"AI4+1","v":-9},{"$f":"RTD(\"cqg.rtd\",,\"StudyData\",$AJ$3,\"Bar\",,\"Close\",\"5\",AI5,,,,,\"T\")","v":1274},null,{"$f":"AL4+1","v":-9},{"$f":"RTD(\"cqg.rtd\",,\"StudyData\",$AM$3,\"Bar\",,\"Close\",\"5\",AL5,,,,,\"T\")","v":1223},null,{"$f":"AO4+1","v":-9},{"$f":"RTD(\"cqg.rtd\",,\"StudyData\",$AP$3,\"Bar\",,\"Close\",\"5\",AO5,,,,,\"T\")","v":78},null,{"$f":"AR4+1","v":-9},{"$f":"RTD(\"cqg.rtd\",,\"StudyData\",$AS$3,\"Bar\",,\"Close\",\"5\",AR5,,,,,\"T\")","v":150},null,{"$f":"AU4+1","v":-9},{"$f":"RTD(\"cqg.rtd\",,\"StudyData\",$AV$3,\"Bar\",,\"Close\",\"5\",AU5,,,,,\"T\")","v":-105},null,{"$f":"AX4+1","v":-9},{"$f":"RTD(\"cqg.rtd\",,\"StudyData\",$AY$3,\"Bar\",,\"Close\",\"5\",AX5,,,,,\"T\")","v":135}]
[null,null,"X.US.DJI",{"$f":"RTD(\"cqg.rtd\", ,\"ContractData\",C6, \"LongDescription\",, \"T\")","v":"DJ Industrial Average"},null,null,null,"X.US.NDX",{"$f":"RTD(\"cqg.rtd\", ,\"ContractData\",H6, \"LongDescription\",, \"T\")","v":"NASDAQ-100 Index"},null,{"$f":"K5+1","v":-8},{"$f":"RTD(\"cqg.rtd\",,\"StudyData\",$L$3,\"Bar\",,\"Close\",\"5\",K6,,,,,\"T\")","v":335688},null,{"$f":"N5+1","v":-8},{"$f":"RTD(\"cqg.rtd\",,\"StudyData\",$O$3,\"Bar\",,\"Close\",\"5\",N6,,,,,\"T\")","v":155816},null,{"$f":"Q5+1","v":-8},{"$f":"RTD(\"cqg.rtd\",,\"StudyData\",$R$3,\"Bar\",,\"Close\",\"5\",Q6,,,,,\"T\")","v":829145},null,{"$f":"T5+1","v":-8},{"$f":"RTD(\"cqg.rtd\",,\"StudyData\",$U$3,\"Bar\",,\"Close\",\"5\",T6,,,,,\"T\")","v":506063},null,{"$f":"W5+1","v":-8},{"$f":"RTD(\"cqg.rtd\",,\"StudyData\",$X$3,\"Bar\",,\"Close\",\"5\",W6,,,,,\"T\")","v":2376},null,{"$f":"Z5+1","v":-8},{"$f":"RTD(\"cqg.rtd\",,\"StudyData\",$AA$3,\"Bar\",,\"Close\",\"5\",Z6,,,,,\"T\")","v":175866},null,{"$f":"AC5+1","v":-8},{"$f":"RTD(\"cqg.rtd\",,\"StudyData\",$AD$3,\"Bar\",,\"Close\",\"5\",AC6,,,,,\"T\")","v":1725},null,{"$f":"AF5+1","v":-8},{"$f":"RTD(\"cqg.rtd\",,\"StudyData\",$AG$3,\"Bar\",,\"Close\",\"5\",AF6,,,,,\"T\")","v":1578},null,{"$f":"AI5+1","v":-8},{"$f":"RTD(\"cqg.rtd\",,\"StudyData\",$AJ$3,\"Bar\",,\"Close\",\"5\",AI6,,,,,\"T\")","v":1270},null,{"$f":"AL5+1","v":-8},{"$f":"RTD(\"cqg.rtd\",,\"StudyData\",$AM$3,\"Bar\",,\"Close\",\"5\",AL6,,,,,\"T\")","v":1214},null,{"$f":"AO5+1","v":-8},{"$f":"RTD(\"cqg.rtd\",,\"StudyData\",$AP$3,\"Bar\",,\"Close\",\"5\",AO6,,,,,\"T\")","v":74},null,{"$f":"AR5+1","v":-8},{"$f":"RTD(\"cqg.rtd\",,\"StudyData\",$AS$3,\"Bar\",,\"Close\",\"5\",AR6,,,,,\"T\")","v":153},null,{"$f":"AU5+1","v":-8},{"$f":"RTD(\"cqg.rtd\",,\"StudyData\",$AV$3,\"Bar\",,\"Close\",\"5\",AU6,,,,,\"T\")","v":-50},null,{"$f":"AX5+1","v":-8},{"$f":"RTD(\"cqg.rtd\",,\"StudyData\",$AY$3,\"Bar\",,\"Close\",\"5\",AX6,,,,,\"T\")","v":142}]
[null,null,"S.US.XLF",{"$f":"RTD(\"cqg.rtd\", ,\"ContractData\",C7, \"LongDescription\",, \"T\")","v":"Financial Select Sector SPDR"},null,null,null,"X.US.IXF",{"$f":"RTD(\"cqg.rtd\", ,\"ContractData\",H7, \"LongDescription\",, \"T\")","v":"NASDAQ Financial 100"},null,-7,{"$f":"RTD(\"cqg.rtd\",,\"StudyData\",$L$3,\"Bar\",,\"Close\",\"5\",K7,,,,,\"T\")","v":336324},null,-7,{"$f":"RTD(\"cqg.rtd\",,\"StudyData\",$O$3,\"Bar\",,\"Close\",\"5\",N7,,,,,\"T\")","v":156897},null,-7,{"$f":"RTD(\"cqg.rtd\",,\"StudyData\",$R$3,\"Bar\",,\"Close\",\"5\",Q7,,,,,\"T\")","v":838270},null,-7,{"$f":"RTD(\"cqg.rtd\",,\"StudyData\",$U$3,\"Bar\",,\"Close\",\"5\",T7,,,,,\"T\")","v":516374},null,-7,{"$f":"RTD(\"cqg.rtd\",,\"StudyData\",$X$3,\"Bar\",,\"Close\",\"5\",W7,,,,,\"T\")","v":6245},null,-7,{"$f":"RTD(\"cqg.rtd\",,\"StudyData\",$AA$3,\"Bar\",,\"Close\",\"5\",Z7,,,,,\"T\")","v":164938},null,-7,{"$f":"RTD(\"cqg.rtd\",,\"StudyData\",$AD$3,\"Bar\",,\"Close\",\"5\",AC7,,,,,\"T\")","v":1698},null,-7,{"$f":"RTD(\"cqg.rtd\",,\"StudyData\",$AG$3,\"Bar\",,\"Close\",\"5\",AF7,,,,,\"T\")","v":1576},null,-7,{"$f":"RTD(\"cqg.rtd\",,\"StudyData\",$AJ$3,\"Bar\",,\"Close\",\"5\",AI7,,,,,\"T\")","v":1286},null,-7,{"$f":"RTD(\"cqg.rtd\",,\"StudyData\",$AM$3,\"Bar\",,\"Close\",\"5\",AL7,,,,,\"T\")","v":1233},null,-7,{"$f":"RTD(\"cqg.rtd\",,\"StudyData\",$AP$3,\"Bar\",,\"Close\",\"5\",AO7,,,,,\"T\")","v":85},null,-7,{"$f":"RTD(\"cqg.rtd\",,\"StudyData\",$AS$3,\"Bar\",,\"Close\",\"5\",AR7,,,,,\"T\")","v":136},null,-7,{"$f":"RTD(\"cqg.rtd\",,\"StudyData\",$AV$3,\"Bar\",,\"Close\",\"5\",AU7,,,,,\"T\")","v":-194},null,-7,{"$f":"RTD(\"cqg.rtd\",,\"StudyData\",$AY$3,\"Bar\",,\"Close\",\"5\",AX7,,,,,\"T\")","v":141}]
[null,null,"X.US.BTK",{"$f":"RTD(\"cqg.rtd\", ,\"ContractData\",C8, \"LongDescription\",, \"T\")","v":"Biotechnology Index"},null,null,null,"X.US.NBI",{"$f":"RTD(\"cqg.rtd\", ,\"ContractData\",H8, \"LongDescription\",, \"T\")","v":"NASDAQ Biotechnology"},null,-6,{"$f":"RTD(\"cqg.rtd\",,\"StudyData\",$L$3,\"Bar\",,\"Close\",\"5\",K8,,,,,\"T\")","v":333638},null,-6,{"$f":"RTD(\"cqg.rtd\",,\"StudyData\",$O$3,\"Bar\",,\"Close\",\"5\",N8,,,,,\"T\")","v":165750},null,-6,{"$f":"RTD(\"cqg.rtd\",,\"StudyData\",$R$3,\"Bar\",,\"Close\",\"5\",Q8,,,,,\"T\")","v":835739},null,-6,{"$f":"RTD(\"cqg.rtd\",,\"StudyData\",$U$3,\"Bar\",,\"Close\",\"5\",T8,,,,,\"T\")","v":533999},null,-6,{"$f":"RTD(\"cqg.rtd\",,\"StudyData\",$X$3,\"Bar\",,\"Close\",\"5\",W8,,,,,\"T\")","v":6515},null,-6,{"$f":"RTD(\"cqg.rtd\",,\"StudyData\",$AA$3,\"Bar\",,\"Close\",\"5\",Z8,,,,,\"T\")","v":191309},null,-6,{"$f":"RTD(\"cqg.rtd\",,\"StudyData\",$AD$3,\"Bar\",,\"Close\",\"5\",AC8,,,,,\"T\")","v":1676},null,-6,{"$f":"RTD(\"cqg.rtd\",,\"StudyData\",$AG$3,\"Bar\",,\"Close\",\"5\",AF8,,,,,\"T\")","v":1562},null,-6,{"$f":"RTD(\"cqg.rtd\",,\"StudyData\",$AJ$3,\"Bar\",,\"Close\",\"5\",AI8,,,,,\"T\")","v":1307},null,-6,{"$f":"RTD(\"cqg.rtd\",,\"StudyData\",$AM$3,\"Bar\",,\"Close\",\"5\",AL8,,,,,\"T\")","v":1249},null,-6,{"$f":"RTD(\"cqg.rtd\",,\"StudyData\",$AP$3,\"Bar\",,\"Close\",\"5\",AO8,,,,,\"T\")","v":86},null,-6,{"$f":"RTD(\"cqg.rtd\",,\"StudyData\",$AS$3,\"Bar\",,\"Close\",\"5\",AR8,,,,,\"T\")","v":135},null,-6,{"$f":"RTD(\"cqg.rtd\",,\"StudyData\",$AV$3,\"Bar\",,\"Close\",\"5\",AU8,,,,,\"T\")","v":-194},null,-6,{"$f":"RTD(\"cqg.rtd\",,\"StudyData\",$AY$3,\"Bar\",,\"Close\",\"5\",AX8,,,,,\"T\")","v":135}]
[null,null,"X.US.NYPID",{"$f":"RTD(\"cqg.rtd\", ,\"ContractData\",C9, \"LongDescription\",, \"T\")","v":"NYSE Healthcare Index"},null,null,null,"X.US.NHC",{"$f":"RTD(\"cqg.rtd\", ,\"ContractData\",H9, \"LongDescription\",, \"T\")","v":"Nasdaq Health Care Index"},null,-5,{"$f":"RTD(\"cqg.rtd\",,\"StudyData\",$L$3,\"Bar\",,\"Close\",\"5\",K9,,,,,\"T\")","v":337267},null,-5,{"$f":"RTD(\"cqg.rtd\",,\"StudyData\",$O$3,\"Bar\",,\"Close\",\"5\",N9,,,,,\"T\")","v":172263},null,-5,{"$f":"RTD(\"cqg.rtd\",,\"StudyData\",$R$3,\"Bar\",,\"Close\",\"5\",Q9,,,,,\"T\")","v":857952},null,-5,{"$f":"RTD(\"cqg.rtd\",,\"StudyData\",$U$3,\"Bar\",,\"Close\",\"5\",T9,,,,,\"T\")","v":539664},null,-5,{"$f":"RTD(\"cqg.rtd\",,\"StudyData\",$X$3,\"Bar\",,\"Close\",\"5\",W9,,,,,\"T\")","v":4026},null,-5,{"$f":"RTD(\"cqg.rtd\",,\"StudyData\",$AA$3,\"Bar\",,\"Close\",\"5\",Z9,,,,,\"T\")","v":180274},null,-5,{"$f":"RTD(\"cqg.rtd\",,\"StudyData\",$AD$3,\"Bar\",,\"Close\",\"5\",AC9,,,,,\"T\")","v":1664},null,-5,{"$f":"RTD(\"cqg.rtd\",,\"StudyData\",$AG$3,\"Bar\",,\"Close\",\"5\",AF9,,,,,\"T\")","v":1563},null,-5,{"$f":"RTD(\"cqg.rtd\",,\"StudyData\",$AJ$3,\"Bar\",,\"Close\",\"5\",AI9,,,,,\"T\")","v":1321},null,-5,{"$f":"RTD(\"cqg.rtd\",,\"StudyData\",$AM$3,\"Bar\",,\"Close\",\"5\",AL9,,,,,\"T\")","v":1248},null,-5,{"$f":"RTD(\"cqg.rtd\",,\"StudyData\",$AP$3,\"Bar\",,\"Close\",\"5\",AO9,,,,,\"T\")","v":85},null,-5,{"$f":"RTD(\"cqg.rtd\",,\"StudyData\",$AS$3,\"Bar\",,\"Close\",\"5\",AR9,,,,,\"T\")","v":137},null,-5,{"$f":"RTD(\"cqg.rtd\",,\"StudyData\",$AV$3,\"Bar\",,\"Close\",\"5\",AU9,,,,,\"T\")","v":-54},null,-5,{"$f":"RTD(\"cqg.rtd\",,\"StudyData\",$AY$3,\"Bar\",,\"Close\",\"5\",AX9,,,,,\"T\")","v":123}]
[null,null,"X.US.IXE",{"$f":"RTD(\"cqg.rtd\", ,\"ContractData\",C10, \"LongDescription\",, \"T\")","v":"S&P 500 Select Sector Energy Index"},null,null,null,"X.US.OSX",{"$f":"RTD(\"cqg.rtd\", ,\"ContractData\",H10, \"LongDescription\",, \"T\")","v":"PHLX Oil Service Sector"},null,-4,{"$f":"RTD(\"cqg.rtd\",,\"StudyData\",$L$3,\"Bar\",,\"Close\",\"5\",K10,,,,,\"T\")","v":344552},null,-4,{"$f":"RTD(\"cqg.rtd\",,\"StudyData\",$O$3,\"Bar\",,\"Close\",\"5\",N10,,,,,\"T\")","v":171809},null,-4,{"$f":"RTD(\"cqg.rtd\",,\"StudyData\",$R$3,\"Bar\",,\"Close\",\"5\",Q10,,,,,\"T\")","v":864974},null,-4,{"$f":"RTD(\"cqg.rtd\",,\"StudyData\",$U$3,\"Bar\",,\"Close\",\"5\",T10,,,,,\"T\")","v":554590},null,-4,{"$f":"RTD(\"cqg.rtd\",,\"StudyData\",$X$3,\"Bar\",,\"Close\",\"5\",W10,,,,,\"T\")","v":4964},null,-4,{"$f":"RTD(\"cqg.rtd\",,\"StudyData\",$AA$3,\"Bar\",,\"Close\",\"5\",Z10,,,,,\"T\")","v":184353},null,-4,{"$f":"RTD(\"cqg.rtd\",,\"StudyData\",$AD$3,\"Bar\",,\"Close\",\"5\",AC10,,,,,\"T\")","v":1641},null,-4,{"$f":"RTD(\"cqg.rtd\",,\"StudyData\",$AG$3,\"Bar\",,\"Close\",\"5\",AF10,,,,,\"T\")","v":1539},null,-4,{"$f":"RTD(\"cqg.rtd\",,\"StudyData\",$AJ$3,\"Bar\",,\"Close\",\"5\",AI10,,,,,\"T\")","v":1342},null,-4,{"$f":"RTD(\"cqg.rtd\",,\"StudyData\",$AM$3,\"Bar\",,\"Close\",\"5\",AL10,,,,,\"T\")","v":1268},null,-4,{"$f":"RTD(\"cqg.rtd\",,\"StudyData\",$AP$3,\"Bar\",,\"Close\",\"5\",AO10,,,,,\"T\")","v":88},null,-4,{"$f":"RTD(\"cqg.rtd\",,\"StudyData\",$AS$3,\"Bar\",,\"Close\",\"5\",AR10,,,,,\"T\")","v":143},null,-4,{"$f":"RTD(\"cqg.rtd\",,\"StudyData\",$AV$3,\"Bar\",,\"Close\",\"5\",AU10,,,,,\"T\")","v":-107},null,-4,{"$f":"RTD(\"cqg.rtd\",,\"StudyData\",$AY$3,\"Bar\",,\"Close\",\"5\",AX10,,,,,\"T\")","v":108}]
[null,null,"S.US.BAC",{"$f":"RTD(\"cqg.rtd\", ,\"ContractData\",C11, \"LongDescription\",, \"T\")","v":"Bank of America Corp"},null,null,null,"S.US.XLE",{"$f":"RTD(\"cqg.rtd\", ,\"ContractData\",H11, \"LongDescription\",, \"T\")","v":"Energy Select Sector SPDR"},null,-3,{"$f":"RTD(\"cqg.rtd\",,\"StudyData\",$L$3,\"Bar\",,\"Close\",\"5\",K11,,,,,\"T\")","v":355155},null,-3,{"$f":"RTD(\"cqg.rtd\",,\"StudyData\",$O$3,\"Bar\",,\"Close\",\"5\",N11,,,,,\"T\")","v":169692},null,-3,{"$f":"RTD(\"cqg.rtd\",,\"StudyData\",$R$3,\"Bar\",,\"Close\",\"5\",Q11,,,,,\"T\")","v":891564},null,-3,{"$f":"RTD(\"cqg.rtd\",,\"StudyData\",$U$3,\"Bar\",,\"Close\",\"5\",T11,,,,,\"T\")","v":553280},null,-3,{"$f":"RTD(\"cqg.rtd\",,\"StudyData\",$X$3,\"Bar\",,\"Close\",\"5\",W11,,,,,\"T\")","v":5894},null,-3,{"$f":"RTD(\"cqg.rtd\",,\"StudyData\",$AA$3,\"Bar\",,\"Close\",\"5\",Z11,,,,,\"T\")","v":187553},null,-3,{"$f":"RTD(\"cqg.rtd\",,\"StudyData\",$AD$3,\"Bar\",,\"Close\",\"5\",AC11,,,,,\"T\")","v":1672},null,-3,{"$f":"RTD(\"cqg.rtd\",,\"StudyData\",$AG$3,\"Bar\",,\"Close\",\"5\",AF11,,,,,\"T\")","v":1568},null,-3,{"$f":"RTD(\"cqg.rtd\",,\"StudyData\",$AJ$3,\"Bar\",,\"Close\",\"5\",AI11,,,,,\"T\")","v":1314},null,-3,{"$f":"RTD(\"cqg.rtd\",,\"StudyData\",$AM$3,\"Bar\",,\"Close\",\"5\",AL11,,,,,\"T\")","v":1248},null,-3,{"$f":"RTD(\"cqg.rtd\",,\"StudyData\",$AP$3,\"Bar\",,\"Close\",\"5\",AO11,,,,,\"T\")","v":86},null,-3,{"$f":"RTD(\"cqg.rtd\",,\"StudyData\",$AS$3,\"Bar\",,\"Close\",\"5\",AR11,,,,,\"T\")","v":135},null,-3,{"$f":"RTD(\"cqg.rtd\",,\"StudyData\",$AV$3,\"Bar\",,\"Close\",\"5\",AU11,,,,,\"T\")","v":161},null,-3,{"$f":"RTD(\"cqg.rtd\",,\"StudyData\",$AY$3,\"Bar\",,\"Close\",\"5\",AX11,,,,,\"T\")","v":126}]
[null,null,"S.US.RSP",{"$f":"RTD(\"cqg.rtd\", ,\"ContractData\",C12, \"LongDescription\",, \"T\")","v":"Guggenheim S&P 500 Equal Weight ETF"},null,null,null,"S.US.AAPL",{"$f":"RTD(\"cqg.rtd\", ,\"ContractData\",H12, \"LongDescription\",, \"T\")","v":"Apple Inc"},null,-2,{"$f":"RTD(\"cqg.rtd\",,\"StudyData\",$L$3,\"Bar\",,\"Close\",\"5\",K12,,,,,\"T\")","v":367589},null,-2,{"$f":"RTD(\"cqg.rtd\",,\"StudyData\",$O$3,\"Bar\",,\"Close\",\"5\",N12,,,,,\"T\")","v":171617},null,-2,{"$f":"RTD(\"cqg.rtd\",,\"StudyData\",$R$3,\"Bar\",,\"Close\",\"5\",Q12,,,,,\"T\")","v":905370},null,-2,{"$f":"RTD(\"cqg.rtd\",,\"StudyData\",$U$3,\"Bar\",,\"Close\",\"5\",T12,,,,,\"T\")","v":566322},null,-2,{"$f":"RTD(\"cqg.rtd\",,\"StudyData\",$X$3,\"Bar\",,\"Close\",\"5\",W12,,,,,\"T\")","v":3074},null,-2,{"$f":"RTD(\"cqg.rtd\",,\"StudyData\",$AA$3,\"Bar\",,\"Close\",\"5\",Z12,,,,,\"T\")","v":199161},null,-2,{"$f":"RTD(\"cqg.rtd\",,\"StudyData\",$AD$3,\"Bar\",,\"Close\",\"5\",AC12,,,,,\"T\")","v":1686},null,-2,{"$f":"RTD(\"cqg.rtd\",,\"StudyData\",$AG$3,\"Bar\",,\"Close\",\"5\",AF12,,,,,\"T\")","v":1579},null,-2,{"$f":"RTD(\"cqg.rtd\",,\"StudyData\",$AJ$3,\"Bar\",,\"Close\",\"5\",AI12,,,,,\"T\")","v":1295},null,-2,{"$f":"RTD(\"cqg.rtd\",,\"StudyData\",$AM$3,\"Bar\",,\"Close\",\"5\",AL12,,,,,\"T\")","v":1233},null,-2,{"$f":"RTD(\"cqg.rtd\",,\"StudyData\",$AP$3,\"Bar\",,\"Close\",\"5\",AO12,,,,,\"T\")","v":91},null,-2,{"$f":"RTD(\"cqg.rtd\",,\"StudyData\",$AS$3,\"Bar\",,\"Close\",\"5\",AR12,,,,,\"T\")","v":143},null,-2,{"$f":"RTD(\"cqg.rtd\",,\"StudyData\",$AV$3,\"Bar\",,\"Close\",\"5\",AU12,,,,,\"T\")","v":21},null,-2,{"$f":"RTD(\"cqg.rtd\",,\"StudyData\",$AY$3,\"Bar\",,\"Close\",\"5\",AX12,,,,,\"T\")","v":119}]
[null,null,"S.US.SPY",{"$f":"RTD(\"cqg.rtd\", ,\"ContractData\",C13, \"LongDescription\",, \"T\")","v":"SPDR S&P 500"},null,null,null,"S.US.TSLA",{"$f":"RTD(\"cqg.rtd\", ,\"ContractData\",H13, \"LongDescription\",, \"T\")","v":"Tesla, Inc."},null,-1,{"$f":"RTD(\"cqg.rtd\",,\"StudyData\",$L$3,\"Bar\",,\"Close\",\"5\",K13,,,,,\"T\")","v":371899},null,-1,{"$f":"RTD(\"cqg.rtd\",,\"StudyData\",$O$3,\"Bar\",,\"Close\",\"5\",N13,,,,,\"T\")","v":181360},null,-1,{"$f":"RTD(\"cqg.rtd\",,\"StudyData\",$R$3,\"Bar\",,\"Close\",\"5\",Q13,,,,,\"T\")","v":929789},null,-1,{"$f":"RTD(\"cqg.rtd\",,\"StudyData\",$U$3,\"Bar\",,\"Close\",\"5\",T13,,,,,\"T\")","v":579854},null,-1,{"$f":"RTD(\"cqg.rtd\",,\"StudyData\",$X$3,\"Bar\",,\"Close\",\"5\",W13,,,,,\"T\")","v":2886},null,-1,{"$f":"RTD(\"cqg.rtd\",,\"StudyData\",$AA$3,\"Bar\",,\"Close\",\"5\",Z13,,,,,\"T\")","v":166949},null,-1,{"$f":"RTD(\"cqg.rtd\",,\"StudyData\",$AD$3,\"Bar\",,\"Close\",\"5\",AC13,,,,,\"T\")","v":1687},null,-1,{"$f":"RTD(\"cqg.rtd\",,\"StudyData\",$AG$3,\"Bar\",,\"Close\",\"5\",AF13,,,,,\"T\")","v":1577},null,-1,{"$f":"RTD(\"cqg.rtd\",,\"StudyData\",$AJ$3,\"Bar\",,\"Close\",\"5\",AI13,,,,,\"T\")","v":1301},null,-1,{"$f":"RTD(\"cqg.rtd\",,\"StudyData\",$AM$3,\"Bar\",,\"Close\",\"5\",AL13,,,,,\"T\")","v":1254},null,-1,{"$f":"RTD(\"cqg.rtd\",,\"StudyData\",$AP$3,\"Bar\",,\"Close\",\"5\",AO13,,,,,\"T\")","v":85},null,-1,{"$f":"RTD(\"cqg.rtd\",,\"StudyData\",$AS$3,\"Bar\",,\"Close\",\"5\",AR13,,,,,\"T\")","v":125},null,-1,{"$f":"RTD(\"cqg.rtd\",,\"StudyData\",$AV$3,\"Bar\",,\"Close\",\"5\",AU13,,,,,\"T\")","v":64},null,-1,{"$f":"RTD(\"cqg.rtd\",,\"StudyData\",$AY$3,\"Bar\",,\"Close\",\"5\",AX13,,,,,\"T\")","v":140}]
[null,null,"F.US.EP",{"$f":"RTD(\"cqg.rtd\", ,\"ContractData\",C14, \"LongDescription\",, \"T\")","v":"E-Mini S&P 500, Mar 17"},null,null,null,"S.US.MU",{"$f":"RTD(\"cqg.rtd\", ,\"ContractData\",H14, \"LongDescription\",, \"T\")","v":"Micron Technology Inc"},null,{"$f":"K13+1","v":0},{"$f":"RTD(\"cqg.rtd\",,\"StudyData\",$L$3,\"Bar\",,\"Close\",\"5\",K14,,,,,\"T\")","v":372209},null,0,{"$f":"RTD(\"cqg.rtd\",,\"StudyData\",$O$3,\"Bar\",,\"Close\",\"5\",N14,,,,,\"T\")","v":187378},null,0,{"$f":"RTD(\"cqg.rtd\",,\"StudyData\",$R$3,\"Bar\",,\"Close\",\"5\",Q14,,,,,\"T\")","v":956818},null,0,{"$f":"RTD(\"cqg.rtd\",,\"StudyData\",$U$3,\"Bar\",,\"Close\",\"5\",T14,,,,,\"T\")","v":585008},null,0,{"$f":"RTD(\"cqg.rtd\",,\"StudyData\",$X$3,\"Bar\",,\"Close\",\"5\",W14,,,,,\"T\")","v":5208},null,0,{"$f":"RTD(\"cqg.rtd\",,\"StudyData\",$AA$3,\"Bar\",,\"Close\",\"5\",Z14,,,,,\"T\")","v":157532},null,0,{"$f":"RTD(\"cqg.rtd\",,\"StudyData\",$AD$3,\"Bar\",,\"Close\",\"5\",AC14,,,,,\"T\")","v":1681},null,0,{"$f":"RTD(\"cqg.rtd\",,\"StudyData\",$AG$3,\"Bar\",,\"Close\",\"5\",AF14,,,,,\"T\")","v":1624},null,0,{"$f":"RTD(\"cqg.rtd\",,\"StudyData\",$AJ$3,\"Bar\",,\"Close\",\"5\",AI14,,,,,\"T\")","v":1300},null,0,{"$f":"RTD(\"cqg.rtd\",,\"StudyData\",$AM$3,\"Bar\",,\"Close\",\"5\",AL14,,,,,\"T\")","v":1208},null,0,{"$f":"RTD(\"cqg.rtd\",,\"StudyData\",$AP$3,\"Bar\",,\"Close\",\"5\",AO14,,,,,\"T\")","v":92},null,0,{"$f":"RTD(\"cqg.rtd\",,\"StudyData\",$AS$3,\"Bar\",,\"Close\",\"5\",AR14,,,,,\"T\")","v":126},null,0,{"$f":"RTD(\"cqg.rtd\",,\"StudyData\",$AV$3,\"Bar\",,\"Close\",\"5\",AU14,,,,,\"T\")","v":-190},null,0,{"$f":"RTD(\"cqg.rtd\",,\"StudyData\",$AY$3,\"Bar\",,\"Close\",\"5\",AX14,,,,,\"T\")","v":164}]
[null,null,"F.US.CLE",{"$f":"RTD(\"cqg.rtd\", ,\"ContractData\",C15, \"LongDescription\",, \"T\")","v":"Crude Light (Globex), Mar 17"},null,null,null,"S.US.QQQ",{"$f":"RTD(\"cqg.rtd\", ,\"ContractData\",H15, \"LongDescription\",, \"T\")","v":"Powershares QQQ Trust"}]
[null,null,"F.US.HOE",{"$f":"RTD(\"cqg.rtd\", ,\"ContractData\",C16, \"LongDescription\",, \"T\")","v":"NY Harbor ULSD, Mar 17"},null,null,null,"S.US.CSCO",{"$f":"RTD(\"cqg.rtd\", ,\"ContractData\",H16, \"LongDescription\",, \"T\")","v":"Cisco Systems Inc"}]
[null,null,"F.US.RBE",{"$f":"RTD(\"cqg.rtd\", ,\"ContractData\",C17, \"LongDescription\",, \"T\")","v":"RBOB Gasoline (Globex), Mar 17"},null,null,null,"S.US.FB",{"$f":"RTD(\"cqg.rtd\", ,\"ContractData\",H17, \"LongDescription\",, \"T\")","v":"Facebook, Inc."},null,-24,{"$f":"RTD(\"cqg.rtd\",,\"StudyData\",$C$5,\"Bar\",,\"Time\",\"5\",K17,,,,,\"T\")","v":42779.534722222219},{"$f":"RTD(\"cqg.rtd\",,\"StudyData\",$C$5,\"Bar\",,\"Open\",\"5\",K17,,,,,\"T\")","v":2330.17},{"$f":"RTD(\"cqg.rtd\",,\"StudyData\",$C$5,\"Bar\",,\"High\",\"5\",K17,,,,,\"T\")","v":2330.44},{"$f":"RTD(\"cqg.rtd\",,\"StudyData\",$C$5,\"Bar\",,\"Low\",\"5\",K17,,,,,\"T\")","v":2329.88},{"$f":"RTD(\"cqg.rtd\",,\"StudyData\",$C$5,\"Bar\",,\"Close\",\"5\",K17,,,,,\"T\")","v":2330.37},null,-24,{"$f":"RTD(\"cqg.rtd\",,\"StudyData\",$H$5,\"Bar\",,\"Time\",\"5\",R17,,,,,\"T\")","v":42779.534722222219},{"$f":"RTD(\"cqg.rtd\",,\"StudyData\",$H$5,\"Bar\",,\"Open\",\"5\",R17,,,,,\"T\")","v":5767.26},{"$f":"RTD(\"cqg.rtd\",,\"StudyData\",$H$5,\"Bar\",,\"High\",\"5\",R17,,,,,\"T\")","v":5768.04},{"$f":"RTD(\"cqg.rtd\",,\"StudyData\",$H$5,\"Bar\",,\"Low\",\"5\",R17,,,,,\"T\")","v":5766.78},{"$f":"RTD(\"cqg.rtd\",,\"StudyData\",$H$5,\"Bar\",,\"Close\",\"5\",R17,,,,,\"T\")","v":5768.04}]
[null,null,"F.US.GCE",{"$f":"RTD(\"cqg.rtd\", ,\"ContractData\",C18, \"LongDescription\",, \"T\")","v":"Gold (Globex), Apr 17"},null,null,null,"S.US.TLT",{"$f":"RTD(\"cqg.rtd\", ,\"ContractData\",H18, \"LongDescription\",, \"T\")","v":"iShares 20+ Year Treasury Bond ETF"},null,{"$f":"K17+1","v":-23},{"$f":"RTD(\"cqg.rtd\",,\"StudyData\",$C$5,\"Bar\",,\"Time\",\"5\",K18,,,,,\"T\")","v":42779.538194444445},{"$f":"RTD(\"cqg.rtd\",,\"StudyData\",$C$5,\"Bar\",,\"Open\",\"5\",K18,,,,,\"T\")","v":2330.38},{"$f":"RTD(\"cqg.rtd\",,\"StudyData\",$C$5,\"Bar\",,\"High\",\"5\",K18,,,,,\"T\")","v":2330.52},{"$f":"RTD(\"cqg.rtd\",,\"StudyData\",$C$5,\"Bar\",,\"Low\",\"5\",K18,,,,,\"T\")","v":2330.09},{"$f":"RTD(\"cqg.rtd\",,\"StudyData\",$C$5,\"Bar\",,\"Close\",\"5\",K18,,,,,\"T\")","v":2330.1799999999998},null,{"$f":"R17+1","v":-23},{"$f":"RTD(\"cqg.rtd\",,\"StudyData\",$H$5,\"Bar\",,\"Time\",\"5\",R18,,,,,\"T\")","v":42779.538194444445},{"$f":"RTD(\"cqg.rtd\",,\"StudyData\",$H$5,\"Bar\",,\"Open\",\"5\",R18,,,,,\"T\")","v":5768.05},{"$f":"RTD(\"cqg.rtd\",,\"StudyData\",$H$5,\"Bar\",,\"High\",\"5\",R18,,,,,\"T\")","v":5768.79},{"$f":"RTD(\"cqg.rtd\",,\"StudyData\",$H$5,\"Bar\",,\"Low\",\"5\",R18,,,,,\"T\")","v":5768},{"$f":"RTD(\"cqg.rtd\",,\"StudyData\",$H$5,\"Bar\",,\"Close\",\"5\",R18,,,,,\"T\")","v":5768.27}]
[null,null,"F.US.DD",{"$f":"RTD(\"cqg.rtd\", ,\"ContractData\",C19, \"LongDescription\",, \"T\")","v":"DAX Index, Mar 17"},null,null,null,"S.US.INTC",{"$f":"RTD(\"cqg.rtd\", ,\"ContractData\",H19, \"LongDescription\",, \"T\")","v":"Intel Corporation"},null,{"$f":"K18+1","v":-22},{"$f":"RTD(\"cqg.rtd\",,\"StudyData\",$C$5,\"Bar\",,\"Time\",\"5\",K19,,,,,\"T\")","v":42779.541666666664},{"$f":"RTD(\"cqg.rtd\",,\"StudyData\",$C$5,\"Bar\",,\"Open\",\"5\",K19,,,,,\"T\")","v":2330.1999999999998},{"$f":"RTD(\"cqg.rtd\",,\"StudyData\",$C$5,\"Bar\",,\"High\",\"5\",K19,,,,,\"T\")","v":2330.1999999999998},{"$f":"RTD(\"cqg.rtd\",,\"StudyData\",$C$5,\"Bar\",,\"Low\",\"5\",K19,,,,,\"T\")","v":2329.59},{"$f":"RTD(\"cqg.rtd\",,\"StudyData\",$C$5,\"Bar\",,\"Close\",\"5\",K19,,,,,\"T\")","v":2330.0300000000002},null,{"$f":"R18+1","v":-22},{"$f":"RTD(\"cqg.rtd\",,\"StudyData\",$H$5,\"Bar\",,\"Time\",\"5\",R19,,,,,\"T\")","v":42779.541666666664},{"$f":"RTD(\"cqg.rtd\",,\"StudyData\",$H$5,\"Bar\",,\"Open\",\"5\",R19,,,,,\"T\")","v":5768.26},{"$f":"RTD(\"cqg.rtd\",,\"StudyData\",$H$5,\"Bar\",,\"High\",\"5\",R19,,,,,\"T\")","v":5768.51},{"$f":"RTD(\"cqg.rtd\",,\"StudyData\",$H$5,\"Bar\",,\"Low\",\"5\",R19,,,,,\"T\")","v":5766.99},{"$f":"RTD(\"cqg.rtd\",,\"StudyData\",$H$5,\"Bar\",,\"Close\",\"5\",R19,,,,,\"T\")","v":5768.26}]
[null,null,"F.US.DSX",{"$f":"RTD(\"cqg.rtd\", ,\"ContractData\",C20, \"LongDescription\",, \"T\")","v":"Euro STOXX 50, Mar 17"},null,null,null,"S.US.QCOM",{"$f":"RTD(\"cqg.rtd\", ,\"ContractData\",H20, \"LongDescription\",, \"T\")","v":"QUALCOMM Inc"},null,-21,{"$f":"RTD(\"cqg.rtd\",,\"StudyData\",$C$5,\"Bar\",,\"Time\",\"5\",K20,,,,,\"T\")","v":42779.545138888891},{"$f":"RTD(\"cqg.rtd\",,\"StudyData\",$C$5,\"Bar\",,\"Open\",\"5\",K20,,,,,\"T\")","v":2330.02},{"$f":"RTD(\"cqg.rtd\",,\"StudyData\",$C$5,\"Bar\",,\"High\",\"5\",K20,,,,,\"T\")","v":2330.4899999999998},{"$f":"RTD(\"cqg.rtd\",,\"StudyData\",$C$5,\"Bar\",,\"Low\",\"5\",K20,,,,,\"T\")","v":2329.73},{"$f":"RTD(\"cqg.rtd\",,\"StudyData\",$C$5,\"Bar\",,\"Close\",\"5\",K20,,,,,\"T\")","v":2330.4899999999998},null,-21,{"$f":"RTD(\"cqg.rtd\",,\"StudyData\",$H$5,\"Bar\",,\"Time\",\"5\",R20,,,,,\"T\")","v":42779.545138888891},{"$f":"RTD(\"cqg.rtd\",,\"StudyData\",$H$5,\"Bar\",,\"Open\",\"5\",R20,,,,,\"T\")","v":5768.25},{"$f":"RTD(\"cqg.rtd\",,\"StudyData\",$H$5,\"Bar\",,\"High\",\"5\",R20,,,,,\"T\")","v":5769.59},{"$f":"RTD(\"cqg.rtd\",,\"StudyData\",$H$5,\"Bar\",,\"Low\",\"5\",R20,,,,,\"T\")","v":5768.2},{"$f":"RTD(\"cqg.rtd\",,\"StudyData\",$H$5,\"Bar\",,\"Close\",\"5\",R20,,,,,\"T\")","v":5769.59}]
[null,null,"F.US.TYA",{"$f":"RTD(\"cqg.rtd\", ,\"ContractData\",C21, \"LongDescription\",, \"T\")","v":"10yr US Treasury Notes (Globex), Mar 17"},null,null,null,"S.US.AAL",{"$f":"RTD(\"cqg.rtd\", ,\"ContractData\",H21, \"LongDescription\",, \"T\")","v":"American Airlines Group Inc."},null,-20,{"$f":"RTD(\"cqg.rtd\",,\"StudyData\",$C$5,\"Bar\",,\"Time\",\"5\",K21,,,,,\"T\")","v":42779.548611111109},{"$f":"RTD(\"cqg.rtd\",,\"StudyData\",$C$5,\"Bar\",,\"Open\",\"5\",K21,,,,,\"T\")","v":2330.5},{"$f":"RTD(\"cqg.rtd\",,\"StudyData\",$C$5,\"Bar\",,\"High\",\"5\",K21,,,,,\"T\")","v":2330.84},{"$f":"RTD(\"cqg.rtd\",,\"StudyData\",$C$5,\"Bar\",,\"Low\",\"5\",K21,,,,,\"T\")","v":2330.3000000000002},{"$f":"RTD(\"cqg.rtd\",,\"StudyData\",$C$5,\"Bar\",,\"Close\",\"5\",K21,,,,,\"T\")","v":2330.77},null,-20,{"$f":"RTD(\"cqg.rtd\",,\"StudyData\",$H$5,\"Bar\",,\"Time\",\"5\",R21,,,,,\"T\")","v":42779.548611111109},{"$f":"RTD(\"cqg.rtd\",,\"StudyData\",$H$5,\"Bar\",,\"Open\",\"5\",R21,,,,,\"T\")","v":5769.58},{"$f":"RTD(\"cqg.rtd\",,\"StudyData\",$H$5,\"Bar\",,\"High\",\"5\",R21,,,,,\"T\")","v":5770.99},{"$f":"RTD(\"cqg.rtd\",,\"StudyData\",$H$5,\"Bar\",,\"Low\",\"5\",R21,,,,,\"T\")","v":5769.24},{"$f":"RTD(\"cqg.rtd\",,\"StudyData\",$H$5,\"Bar\",,\"Close\",\"5\",R21,,,,,\"T\")","v":5770.79}]
[null,null,null,null,null,null,null,null,null,null,-19,{"$f":"RTD(\"cqg.rtd\",,\"StudyData\",$C$5,\"Bar\",,\"Time\",\"5\",K22,,,,,\"T\")","v":42779.552083333336},{"$f":"RTD(\"cqg.rtd\",,\"StudyData\",$C$5,\"Bar\",,\"Open\",\"5\",K22,,,,,\"T\")","v":2330.75},{"$f":"RTD(\"cqg.rtd\",,\"StudyData\",$C$5,\"Bar\",,\"High\",\"5\",K22,,,,,\"T\")","v":2330.75},{"$f":"RTD(\"cqg.rtd\",,\"StudyData\",$C$5,\"Bar\",,\"Low\",\"5\",K22,,,,,\"T\")","v":2329.58},{"$f":"RTD(\"cqg.rtd\",,\"StudyData\",$C$5,\"Bar\",,\"Close\",\"5\",K22,,,,,\"T\")","v":2330.04},null,-19,{"$f":"RTD(\"cqg.rtd\",,\"StudyData\",$H$5,\"Bar\",,\"Time\",\"5\",R22,,,,,\"T\")","v":42779.552083333336},{"$f":"RTD(\"cqg.rtd\",,\"StudyData\",$H$5,\"Bar\",,\"Open\",\"5\",R22,,,,,\"T\")","v":5770.77},{"$f":"RTD(\"cqg.rtd\",,\"StudyData\",$H$5,\"Bar\",,\"High\",\"5\",R22,,,,,\"T\")","v":5770.77},{"$f":"RTD(\"cqg.rtd\",,\"StudyData\",$H$5,\"Bar\",,\"Low\",\"5\",R22,,,,,\"T\")","v":5768.39},{"$f":"RTD(\"cqg.rtd\",,\"StudyData\",$H$5,\"Bar\",,\"Close\",\"5\",R22,,,,,\"T\")","v":5769.24}]
[null,null,"Enter in the symbols you require.",null,null,null,null,null,null,null,-18,{"$f":"RTD(\"cqg.rtd\",,\"StudyData\",$C$5,\"Bar\",,\"Time\",\"5\",K23,,,,,\"T\")","v":42779.555555555555},{"$f":"RTD(\"cqg.rtd\",,\"StudyData\",$C$5,\"Bar\",,\"Open\",\"5\",K23,,,,,\"T\")","v":2330.04},{"$f":"RTD(\"cqg.rtd\",,\"StudyData\",$C$5,\"Bar\",,\"High\",\"5\",K23,,,,,\"T\")","v":2330.1799999999998},{"$f":"RTD(\"cqg.rtd\",,\"StudyData\",$C$5,\"Bar\",,\"Low\",\"5\",K23,,,,,\"T\")","v":2329.6},{"$f":"RTD(\"cqg.rtd\",,\"StudyData\",$C$5,\"Bar\",,\"Close\",\"5\",K23,,,,,\"T\")","v":2329.9699999999998},null,-18,{"$f":"RTD(\"cqg.rtd\",,\"StudyData\",$H$5,\"Bar\",,\"Time\",\"5\",R23,,,,,\"T\")","v":42779.555555555555},{"$f":"RTD(\"cqg.rtd\",,\"StudyData\",$H$5,\"Bar\",,\"Open\",\"5\",R23,,,,,\"T\")","v":5769.25},{"$f":"RTD(\"cqg.rtd\",,\"StudyData\",$H$5,\"Bar\",,\"High\",\"5\",R23,,,,,\"T\")","v":5769.89},{"$f":"RTD(\"cqg.rtd\",,\"StudyData\",$H$5,\"Bar\",,\"Low\",\"5\",R23,,,,,\"T\")","v":5768.94},{"$f":"RTD(\"cqg.rtd\",,\"StudyData\",$H$5,\"Bar\",,\"Close\",\"5\",R23,,,,,\"T\")","v":5769.45}]
[null,null,"The two charts in the center top of the main page use the first symbol in the Left Hand and Right Hand Display columns above.",null,null,null,null,null,null,null,-17,{"$f":"RTD(\"cqg.rtd\",,\"StudyData\",$C$5,\"Bar\",,\"Time\",\"5\",K24,,,,,\"T\")","v":42779.559027777781},{"$f":"RTD(\"cqg.rtd\",,\"StudyData\",$C$5,\"Bar\",,\"Open\",\"5\",K24,,,,,\"T\")","v":2329.96},{"$f":"RTD(\"cqg.rtd\",,\"StudyData\",$C$5,\"Bar\",,\"High\",\"5\",K24,,,,,\"T\")","v":2330.2800000000002},{"$f":"RTD(\"cqg.rtd\",,\"StudyData\",$C$5,\"Bar\",,\"Low\",\"5\",K24,,,,,\"T\")","v":2329.79},{"$f":"RTD(\"cqg.rtd\",,\"StudyData\",$C$5,\"Bar\",,\"Close\",\"5\",K24,,,,,\"T\")","v":2329.85},null,-17,{"$f":"RTD(\"cqg.rtd\",,\"StudyData\",$H$5,\"Bar\",,\"Time\",\"5\",R24,,,,,\"T\")","v":42779.559027777781},{"$f":"RTD(\"cqg.rtd\",,\"StudyData\",$H$5,\"Bar\",,\"Open\",\"5\",R24,,,,,\"T\")","v":5769.45},{"$f":"RTD(\"cqg.rtd\",,\"StudyData\",$H$5,\"Bar\",,\"High\",\"5\",R24,,,,,\"T\")","v":5769.68},{"$f":"RTD(\"cqg.rtd\",,\"StudyData\",$H$5,\"Bar\",,\"Low\",\"5\",R24,,,,,\"T\")","v":5767.93},{"$f":"RTD(\"cqg.rtd\",,\"StudyData\",$H$5,\"Bar\",,\"Close\",\"5\",R24,,,,,\"T\")","v":5767.93}]
[null,null,null,null,null,null,null,null,null,null,-16,{"$f":"RTD(\"cqg.rtd\",,\"StudyData\",$C$5,\"Bar\",,\"Time\",\"5\",K25,,,,,\"T\")","v":42779.5625},{"$f":"RTD(\"cqg.rtd\",,\"StudyData\",$C$5,\"Bar\",,\"Open\",\"5\",K25,,,,,\"T\")","v":2329.86},{"$f":"RTD(\"cqg.rtd\",,\"StudyData\",$C$5,\"Bar\",,\"High\",\"5\",K25,,,,,\"T\")","v":2329.87},{"$f":"RTD(\"cqg.rtd\",,\"StudyData\",$C$5,\"Bar\",,\"Low\",\"5\",K25,,,,,\"T\")","v":2329.0700000000002},{"$f":"RTD(\"cqg.rtd\",,\"StudyData\",$C$5,\"Bar\",,\"Close\",\"5\",K25,,,,,\"T\")","v":2329.27},null,-16,{"$f":"RTD(\"cqg.rtd\",,\"StudyData\",$H$5,\"Bar\",,\"Time\",\"5\",R25,,,,,\"T\")","v":42779.5625},{"$f":"RTD(\"cqg.rtd\",,\"StudyData\",$H$5,\"Bar\",,\"Open\",\"5\",R25,,,,,\"T\")","v":5767.93},{"$f":"RTD(\"cqg.rtd\",,\"StudyData\",$H$5,\"Bar\",,\"High\",\"5\",R25,,,,,\"T\")","v":5767.93},{"$f":"RTD(\"cqg.rtd\",,\"StudyData\",$H$5,\"Bar\",,\"Low\",\"5\",R25,,,,,\"T\")","v":5766.06},{"$f":"RTD(\"cqg.rtd\",,\"StudyData\",$H$5,\"Bar\",,\"Close\",\"5\",R25,,,,,\"T\")","v":5766.41}]
[null,null,null,null,null,null,null,null,null,null,-15,{"$f":"RTD(\"cqg.rtd\",,\"StudyData\",$C$5,\"Bar\",,\"Time\",\"5\",K26,,,,,\"T\")","v":42779.565972222219},{"$f":"RTD(\"cqg.rtd\",,\"StudyData\",$C$5,\"Bar\",,\"Open\",\"5\",K26,,,,,\"T\")","v":2329.27},{"$f":"RTD(\"cqg.rtd\",,\"StudyData\",$C$5,\"Bar\",,\"High\",\"5\",K26,,,,,\"T\")","v":2329.41},{"$f":"RTD(\"cqg.rtd\",,\"StudyData\",$C$5,\"Bar\",,\"Low\",\"5\",K26,,,,,\"T\")","v":2329.0500000000002},{"$f":"RTD(\"cqg.rtd\",,\"StudyData\",$C$5,\"Bar\",,\"Close\",\"5\",K26,,,,,\"T\")","v":2329.2199999999998},null,-15,{"$f":"RTD(\"cqg.rtd\",,\"StudyData\",$H$5,\"Bar\",,\"Time\",\"5\",R26,,,,,\"T\")","v":42779.565972222219},{"$f":"RTD(\"cqg.rtd\",,\"StudyData\",$H$5,\"Bar\",,\"Open\",\"5\",R26,,,,,\"T\")","v":5766.41},{"$f":"RTD(\"cqg.rtd\",,\"StudyData\",$H$5,\"Bar\",,\"High\",\"5\",R26,,,,,\"T\")","v":5766.61},{"$f":"RTD(\"cqg.rtd\",,\"StudyData\",$H$5,\"Bar\",,\"Low\",\"5\",R26,,,,,\"T\")","v":5766},{"$f":"RTD(\"cqg.rtd\",,\"StudyData\",$H$5,\"Bar\",,\"Close\",\"5\",R26,,,,,\"T\")","v":5766.49}]
[null,null,"When entering symbols the \"F.US.\" for futures or the \"S.US.\" for stocks or the \"X.US.\" for indicies are required.",null,null,null,null,null,null,null,-14,{"$f":"RTD(\"cqg.rtd\",,\"StudyData\",$C$5,\"Bar\",,\"Time\",\"5\",K27,,,,,\"T\")","v":42779.569444444445},{"$f":"RTD(\"cqg.rtd\",,\"StudyData\",$C$5,\"Bar\",,\"Open\",\"5\",K27,,,,,\"T\")","v":2329.2199999999998},{"$f":"RTD(\"cqg.rtd\",,\"StudyData\",$C$5,\"Bar\",,\"High\",\"5\",K27,,,,,\"T\")","v":2329.4},{"$f":"RTD(\"cqg.rtd\",,\"StudyData\",$C$5,\"Bar\",,\"Low\",\"5\",K27,,,,,\"T\")","v":2328.79},{"$f":"RTD(\"cqg.rtd\",,\"StudyData\",$C$5,\"Bar\",,\"Close\",\"5\",K27,,,,,\"T\")","v":2329.4},null,-14,{"$f":"RTD(\"cqg.rtd\",,\"StudyData\",$H$5,\"Bar\",,\"Time\",\"5\",R27,,,,,\"T\")","v":42779.569444444445},{"$f":"RTD(\"cqg.rtd\",,\"StudyData\",$H$5,\"Bar\",,\"Open\",\"5\",R27,,,,,\"T\")","v":5766.48},{"$f":"RTD(\"cqg.rtd\",,\"StudyData\",$H$5,\"Bar\",,\"High\",\"5\",R27,,,,,\"T\")","v":5767.36},{"$f":"RTD(\"cqg.rtd\",,\"StudyData\",$H$5,\"Bar\",,\"Low\",\"5\",R27,,,,,\"T\")","v":5765.76},{"$f":"RTD(\"cqg.rtd\",,\"StudyData\",$H$5,\"Bar\",,\"Close\",\"5\",R27,,,,,\"T\")","v":5767.36}]
[null,null,"Use all capital letters.",null,null,null,null,null,null,null,-13,{"$f":"RTD(\"cqg.rtd\",,\"StudyData\",$C$5,\"Bar\",,\"Time\",\"5\",K28,,,,,\"T\")","v":42779.572916666664},{"$f":"RTD(\"cqg.rtd\",,\"StudyData\",$C$5,\"Bar\",,\"Open\",\"5\",K28,,,,,\"T\")","v":2329.5},{"$f":"RTD(\"cqg.rtd\",,\"StudyData\",$C$5,\"Bar\",,\"High\",\"5\",K28,,,,,\"T\")","v":2329.8200000000002},{"$f":"RTD(\"cqg.rtd\",,\"StudyData\",$C$5,\"Bar\",,\"Low\",\"5\",K28,,,,,\"T\")","v":2328.98},{"$f":"RTD(\"cqg.rtd\",,\"StudyData\",$C$5,\"Bar\",,\"Close\",\"5\",K28,,,,,\"T\")","v":2329.12},null,-13,{"$f":"RTD(\"cqg.rtd\",,\"StudyData\",$H$5,\"Bar\",,\"Time\",\"5\",R28,,,,,\"T\")","v":42779.572916666664},{"$f":"RTD(\"cqg.rtd\",,\"StudyData\",$H$5,\"Bar\",,\"Open\",\"5\",R28,,,,,\"T\")","v":5767.41},{"$f":"RTD(\"cqg.rtd\",,\"StudyData\",$H$5,\"Bar\",,\"High\",\"5\",R28,,,,,\"T\")","v":5768.2},{"$f":"RTD(\"cqg.rtd\",,\"StudyData\",$H$5,\"Bar\",,\"Low\",\"5\",R28,,,,,\"T\")","v":5766.22},{"$f":"RTD(\"cqg.rtd\",,\"StudyData\",$H$5,\"Bar\",,\"Close\",\"5\",R28,,,,,\"T\")","v":5766.22}]
[null,null,null,null,null,null,null,null,null,null,-12,{"$f":"RTD(\"cqg.rtd\",,\"StudyData\",$C$5,\"Bar\",,\"Time\",\"5\",K29,,,,,\"T\")","v":42779.576388888891},{"$f":"RTD(\"cqg.rtd\",,\"StudyData\",$C$5,\"Bar\",,\"Open\",\"5\",K29,,,,,\"T\")","v":2329.1},{"$f":"RTD(\"cqg.rtd\",,\"StudyData\",$C$5,\"Bar\",,\"High\",\"5\",K29,,,,,\"T\")","v":2329.46},{"$f":"RTD(\"cqg.rtd\",,\"StudyData\",$C$5,\"Bar\",,\"Low\",\"5\",K29,,,,,\"T\")","v":2328.84},{"$f":"RTD(\"cqg.rtd\",,\"StudyData\",$C$5,\"Bar\",,\"Close\",\"5\",K29,,,,,\"T\")","v":2328.86},null,-12,{"$f":"RTD(\"cqg.rtd\",,\"StudyData\",$H$5,\"Bar\",,\"Time\",\"5\",R29,,,,,\"T\")","v":42779.576388888891},{"$f":"RTD(\"cqg.rtd\",,\"StudyData\",$H$5,\"Bar\",,\"Open\",\"5\",R29,,,,,\"T\")","v":5766.22},{"$f":"RTD(\"cqg.rtd\",,\"StudyData\",$H$5,\"Bar\",,\"High\",\"5\",R29,,,,,\"T\")","v":5766.98},{"$f":"RTD(\"cqg.rtd\",,\"StudyData\",$H$5,\"Bar\",,\"Low\",\"5\",R29,,,,,\"T\")","v":5765.95},{"$f":"RTD(\"cqg.rtd\",,\"StudyData\",$H$5,\"Bar\",,\"Close\",\"5\",R29,,,,,\"T\")","v":5765.95}]
[null,null,null,null,null,null,null,null,null,null,-11,{"$f":"RTD(\"cqg.rtd\",,\"StudyData\",$C$5,\"Bar\",,\"Time\",\"5\",K30,,,,,\"T\")","v":42779.579861111109},{"$f":"RTD(\"cqg.rtd\",,\"StudyData\",$C$5,\"Bar\",,\"Open\",\"5\",K30,,,,,\"T\")","v":2328.84},{"$f":"RTD(\"cqg.rtd\",,\"StudyData\",$C$5,\"Bar\",,\"High\",\"5\",K30,,,,,\"T\")","v":2329.3000000000002},{"$f":"RTD(\"cqg.rtd\",,\"StudyData\",$C$5,\"Bar\",,\"Low\",\"5\",K30,,,,,\"T\")","v":2328.38},{"$f":"RTD(\"cqg.rtd\",,\"StudyData\",$C$5,\"Bar\",,\"Close\",\"5\",K30,,,,,\"T\")","v":2328.48},null,-11,{"$f":"RTD(\"cqg.rtd\",,\"StudyData\",$H$5,\"Bar\",,\"Time\",\"5\",R30,,,,,\"T\")","v":42779.579861111109},{"$f":"RTD(\"cqg.rtd\",,\"StudyData\",$H$5,\"Bar\",,\"Open\",\"5\",R30,,,,,\"T\")","v":5765.99},{"$f":"RTD(\"cqg.rtd\",,\"StudyData\",$H$5,\"Bar\",,\"High\",\"5\",R30,,,,,\"T\")","v":5766.53},{"$f":"RTD(\"cqg.rtd\",,\"StudyData\",$H$5,\"Bar\",,\"Low\",\"5\",R30,,,,,\"T\")","v":5764.81},{"$f":"RTD(\"cqg.rtd\",,\"StudyData\",$H$5,\"Bar\",,\"Close\",\"5\",R30,,,,,\"T\")","v":5765.08}]
[null,null,null,null,null,null,null,null,null,null,-10,{"$f":"RTD(\"cqg.rtd\",,\"StudyData\",$C$5,\"Bar\",,\"Time\",\"5\",K31,,,,,\"T\")","v":42779.583333333336},{"$f":"RTD(\"cqg.rtd\",,\"StudyData\",$C$5,\"Bar\",,\"Open\",\"5\",K31,,,,,\"T\")","v":2328.48},{"$f":"RTD(\"cqg.rtd\",,\"StudyData\",$C$5,\"Bar\",,\"High\",\"5\",K31,,,,,\"T\")","v":2328.84},{"$f":"RTD(\"cqg.rtd\",,\"StudyData\",$C$5,\"Bar\",,\"Low\",\"5\",K31,,,,,\"T\")","v":2328.33},{"$f":"RTD(\"cqg.rtd\",,\"StudyData\",$C$5,\"Bar\",,\"Close\",\"5\",K31,,,,,\"T\")","v":2328.56},null,-10,{"$f":"RTD(\"cqg.rtd\",,\"StudyData\",$H$5,\"Bar\",,\"Time\",\"5\",R31,,,,,\"T\")","v":42779.583333333336},{"$f":"RTD(\"cqg.rtd\",,\"StudyData\",$H$5,\"Bar\",,\"Open\",\"5\",R31,,,,,\"T\")","v":5765.08},{"$f":"RTD(\"cqg.rtd\",,\"StudyData\",$H$5,\"Bar\",,\"High\",\"5\",R31,,,,,\"T\")","v":5765.54},{"$f":"RTD(\"cqg.rtd\",,\"StudyData\",$H$5,\"Bar\",,\"Low\",\"5\",R31,,,,,\"T\")","v":5764.59},{"$f":"RTD(\"cqg.rtd\",,\"StudyData\",$H$5,\"Bar\",,\"Close\",\"5\",R31,,,,,\"T\")","v":5764.64}]
[null,null,null,null,null,null,null,null,null,null,-9,{"$f":"RTD(\"cqg.rtd\",,\"StudyData\",$C$5,\"Bar\",,\"Time\",\"5\",K32,,,,,\"T\")","v":42779.586805555555},{"$f":"RTD(\"cqg.rtd\",,\"StudyData\",$C$5,\"Bar\",,\"Open\",\"5\",K32,,,,,\"T\")","v":2328.56},{"$f":"RTD(\"cqg.rtd\",,\"StudyData\",$C$5,\"Bar\",,\"High\",\"5\",K32,,,,,\"T\")","v":2329.15},{"$f":"RTD(\"cqg.rtd\",,\"StudyData\",$C$5,\"Bar\",,\"Low\",\"5\",K32,,,,,\"T\")","v":2328.5500000000002},{"$f":"RTD(\"cqg.rtd\",,\"StudyData\",$C$5,\"Bar\",,\"Close\",\"5\",K32,,,,,\"T\")","v":2329.04},null,-9,{"$f":"RTD(\"cqg.rtd\",,\"StudyData\",$H$5,\"Bar\",,\"Time\",\"5\",R32,,,,,\"T\")","v":42779.586805555555},{"$f":"RTD(\"cqg.rtd\",,\"StudyData\",$H$5,\"Bar\",,\"Open\",\"5\",R32,,,,,\"T\")","v":5764.63},{"$f":"RTD(\"cqg.rtd\",,\"StudyData\",$H$5,\"Bar\",,\"High\",\"5\",R32,,,,,\"T\")","v":5765.9},{"$f":"RTD(\"cqg.rtd\",,\"StudyData\",$H$5,\"Bar\",,\"Low\",\"5\",R32,,,,,\"T\")","v":5764.53},{"$f":"RTD(\"cqg.rtd\",,\"StudyData\",$H$5,\"Bar\",,\"Close\",\"5\",R32,,,,,\"T\")","v":5765.9}]
[null,null,null,null,null,null,null,null,null,null,-8,{"$f":"RTD(\"cqg.rtd\",,\"StudyData\",$C$5,\"Bar\",,\"Time\",\"5\",K33,,,,,\"T\")","v":42779.590277777781},{"$f":"RTD(\"cqg.rtd\",,\"StudyData\",$C$5,\"Bar\",,\"Open\",\"5\",K33,,,,,\"T\")","v":2329.0500000000002},{"$f":"RTD(\"cqg.rtd\",,\"StudyData\",$C$5,\"Bar\",,\"High\",\"5\",K33,,,,,\"T\")","v":2329.36},{"$f":"RTD(\"cqg.rtd\",,\"StudyData\",$C$5,\"Bar\",,\"Low\",\"5\",K33,,,,,\"T\")","v":2328.94},{"$f":"RTD(\"cqg.rtd\",,\"StudyData\",$C$5,\"Bar\",,\"Close\",\"5\",K33,,,,,\"T\")","v":2329.36},null,-8,{"$f":"RTD(\"cqg.rtd\",,\"StudyData\",$H$5,\"Bar\",,\"Time\",\"5\",R33,,,,,\"T\")","v":42779.590277777781},{"$f":"RTD(\"cqg.rtd\",,\"StudyData\",$H$5,\"Bar\",,\"Open\",\"5\",R33,,,,,\"T\")","v":5765.88},{"$f":"RTD(\"cqg.rtd\",,\"StudyData\",$H$5,\"Bar\",,\"High\",\"5\",R33,,,,,\"T\")","v":5767.42},{"$f":"RTD(\"cqg.rtd\",,\"StudyData\",$H$5,\"Bar\",,\"Low\",\"5\",R33,,,,,\"T\")","v":5765.85},{"$f":"RTD(\"cqg.rtd\",,\"StudyData\",$H$5,\"Bar\",,\"Close\",\"5\",R33,,,,,\"T\")","v":5767.42}]
[null,null,null,null,null,null,null,null,null,null,-7,{"$f":"RTD(\"cqg.rtd\",,\"StudyData\",$C$5,\"Bar\",,\"Time\",\"5\",K34,,,,,\"T\")","v":42779.59375},{"$f":"RTD(\"cqg.rtd\",,\"StudyData\",$C$5,\"Bar\",,\"Open\",\"5\",K34,,,,,\"T\")","v":2329.36},{"$f":"RTD(\"cqg.rtd\",,\"StudyData\",$C$5,\"Bar\",,\"High\",\"5\",K34,,,,,\"T\")","v":2329.39},{"$f":"RTD(\"cqg.rtd\",,\"StudyData\",$C$5,\"Bar\",,\"Low\",\"5\",K34,,,,,\"T\")","v":2328.83},{"$f":"RTD(\"cqg.rtd\",,\"StudyData\",$C$5,\"Bar\",,\"Close\",\"5\",K34,,,,,\"T\")","v":2328.83},null,-7,{"$f":"RTD(\"cqg.rtd\",,\"StudyData\",$H$5,\"Bar\",,\"Time\",\"5\",R34,,,,,\"T\")","v":42779.59375},{"$f":"RTD(\"cqg.rtd\",,\"StudyData\",$H$5,\"Bar\",,\"Open\",\"5\",R34,,,,,\"T\")","v":5767.4},{"$f":"RTD(\"cqg.rtd\",,\"StudyData\",$H$5,\"Bar\",,\"High\",\"5\",R34,,,,,\"T\")","v":5767.42},{"$f":"RTD(\"cqg.rtd\",,\"StudyData\",$H$5,\"Bar\",,\"Low\",\"5\",R34,,,,,\"T\")","v":5766.14},{"$f":"RTD(\"cqg.rtd\",,\"StudyData\",$H$5,\"Bar\",,\"Close\",\"5\",R34,,,,,\"T\")","v":5766.37}]
[null,null,null,null,null,null,null,null,null,null,-6,{"$f":"RTD(\"cqg.rtd\",,\"StudyData\",$C$5,\"Bar\",,\"Time\",\"5\",K35,,,,,\"T\")","v":42779.597222222219},{"$f":"RTD(\"cqg.rtd\",,\"StudyData\",$C$5,\"Bar\",,\"Open\",\"5\",K35,,,,,\"T\")","v":2328.8200000000002},{"$f":"RTD(\"cqg.rtd\",,\"StudyData\",$C$5,\"Bar\",,\"High\",\"5\",K35,,,,,\"T\")","v":2328.8200000000002},{"$f":"RTD(\"cqg.rtd\",,\"StudyData\",$C$5,\"Bar\",,\"Low\",\"5\",K35,,,,,\"T\")","v":2328.14},{"$f":"RTD(\"cqg.rtd\",,\"StudyData\",$C$5,\"Bar\",,\"Close\",\"5\",K35,,,,,\"T\")","v":2328.19},null,-6,{"$f":"RTD(\"cqg.rtd\",,\"StudyData\",$H$5,\"Bar\",,\"Time\",\"5\",R35,,,,,\"T\")","v":42779.597222222219},{"$f":"RTD(\"cqg.rtd\",,\"StudyData\",$H$5,\"Bar\",,\"Open\",\"5\",R35,,,,,\"T\")","v":5766.36},{"$f":"RTD(\"cqg.rtd\",,\"StudyData\",$H$5,\"Bar\",,\"High\",\"5\",R35,,,,,\"T\")","v":5766.36},{"$f":"RTD(\"cqg.rtd\",,\"StudyData\",$H$5,\"Bar\",,\"Low\",\"5\",R35,,,,,\"T\")","v":5764.4},{"$f":"RTD(\"cqg.rtd\",,\"StudyData\",$H$5,\"Bar\",,\"Close\",\"5\",R35,,,,,\"T\")","v":5764.4}]
[null,null,null,null,null,null,null,null,null,null,-5,{"$f":"RTD(\"cqg.rtd\",,\"StudyData\",$C$5,\"Bar\",,\"Time\",\"5\",K36,,,,,\"T\")","v":42779.600694444445},{"$f":"RTD(\"cqg.rtd\",,\"StudyData\",$C$5,\"Bar\",,\"Open\",\"5\",K36,,,,,\"T\")","v":2328.19},{"$f":"RTD(\"cqg.rtd\",,\"StudyData\",$C$5,\"Bar\",,\"High\",\"5\",K36,,,,,\"T\")","v":2328.64},{"$f":"RTD(\"cqg.rtd\",,\"StudyData\",$C$5,\"Bar\",,\"Low\",\"5\",K36,,,,,\"T\")","v":2327.9499999999998},{"$f":"RTD(\"cqg.rtd\",,\"StudyData\",$C$5,\"Bar\",,\"Close\",\"5\",K36,,,,,\"T\")","v":2328.58},null,-5,{"$f":"RTD(\"cqg.rtd\",,\"StudyData\",$H$5,\"Bar\",,\"Time\",\"5\",R36,,,,,\"T\")","v":42779.600694444445},{"$f":"RTD(\"cqg.rtd\",,\"StudyData\",$H$5,\"Bar\",,\"Open\",\"5\",R36,,,,,\"T\")","v":5764.56},{"$f":"RTD(\"cqg.rtd\",,\"StudyData\",$H$5,\"Bar\",,\"High\",\"5\",R36,,,,,\"T\")","v":5765.44},{"$f":"RTD(\"cqg.rtd\",,\"StudyData\",$H$5,\"Bar\",,\"Low\",\"5\",R36,,,,,\"T\")","v":5763.39},{"$f":"RTD(\"cqg.rtd\",,\"StudyData\",$H$5,\"Bar\",,\"Close\",\"5\",R36,,,,,\"T\")","v":5765.36}]
[null,null,null,null,null,null,null,null,null,null,-4,{"$f":"RTD(\"cqg.rtd\",,\"StudyData\",$C$5,\"Bar\",,\"Time\",\"5\",K37,,,,,\"T\")","v":42779.604166666664},{"$f":"RTD(\"cqg.rtd\",,\"StudyData\",$C$5,\"Bar\",,\"Open\",\"5\",K37,,,,,\"T\")","v":2328.64},{"$f":"RTD(\"cqg.rtd\",,\"StudyData\",$C$5,\"Bar\",,\"High\",\"5\",K37,,,,,\"T\")","v":2328.65},{"$f":"RTD(\"cqg.rtd\",,\"StudyData\",$C$5,\"Bar\",,\"Low\",\"5\",K37,,,,,\"T\")","v":2327.83},{"$f":"RTD(\"cqg.rtd\",,\"StudyData\",$C$5,\"Bar\",,\"Close\",\"5\",K37,,,,,\"T\")","v":2328.06},null,-4,{"$f":"RTD(\"cqg.rtd\",,\"StudyData\",$H$5,\"Bar\",,\"Time\",\"5\",R37,,,,,\"T\")","v":42779.604166666664},{"$f":"RTD(\"cqg.rtd\",,\"StudyData\",$H$5,\"Bar\",,\"Open\",\"5\",R37,,,,,\"T\")","v":5765.37},{"$f":"RTD(\"cqg.rtd\",,\"StudyData\",$H$5,\"Bar\",,\"High\",\"5\",R37,,,,,\"T\")","v":5765.37},{"$f":"RTD(\"cqg.rtd\",,\"StudyData\",$H$5,\"Bar\",,\"Low\",\"5\",R37,,,,,\"T\")","v":5762.36},{"$f":"RTD(\"cqg.rtd\",,\"StudyData\",$H$5,\"Bar\",,\"Close\",\"5\",R37,,,,,\"T\")","v":5762.57}]
[null,null,null,null,null,null,null,null,null,null,-3,{"$f":"RTD(\"cqg.rtd\",,\"StudyData\",$C$5,\"Bar\",,\"Time\",\"5\",K38,,,,,\"T\")","v":42779.607638888891},{"$f":"RTD(\"cqg.rtd\",,\"StudyData\",$C$5,\"Bar\",,\"Open\",\"5\",K38,,,,,\"T\")","v":2328.06},{"$f":"RTD(\"cqg.rtd\",,\"StudyData\",$C$5,\"Bar\",,\"High\",\"5\",K38,,,,,\"T\")","v":2329.21},{"$f":"RTD(\"cqg.rtd\",,\"StudyData\",$C$5,\"Bar\",,\"Low\",\"5\",K38,,,,,\"T\")","v":2327.85},{"$f":"RTD(\"cqg.rtd\",,\"StudyData\",$C$5,\"Bar\",,\"Close\",\"5\",K38,,,,,\"T\")","v":2329.16},null,-3,{"$f":"RTD(\"cqg.rtd\",,\"StudyData\",$H$5,\"Bar\",,\"Time\",\"5\",R38,,,,,\"T\")","v":42779.607638888891},{"$f":"RTD(\"cqg.rtd\",,\"StudyData\",$H$5,\"Bar\",,\"Open\",\"5\",R38,,,,,\"T\")","v":5762.58},{"$f":"RTD(\"cqg.rtd\",,\"StudyData\",$H$5,\"Bar\",,\"High\",\"5\",R38,,,,,\"T\")","v":5764.29},{"$f":"RTD(\"cqg.rtd\",,\"StudyData\",$H$5,\"Bar\",,\"Low\",\"5\",R38,,,,,\"T\")","v":5762.19},{"$f":"RTD(\"cqg.rtd\",,\"StudyData\",$H$5,\"Bar\",,\"Close\",\"5\",R38,,,,,\"T\")","v":5764.28}]
[null,null,null,null,null,null,null,null,null,null,-2,{"$f":"RTD(\"cqg.rtd\",,\"StudyData\",$C$5,\"Bar\",,\"Time\",\"5\",K39,,,,,\"T\")","v":42779.611111111109},{"$f":"RTD(\"cqg.rtd\",,\"StudyData\",$C$5,\"Bar\",,\"Open\",\"5\",K39,,,,,\"T\")","v":2329.14},{"$f":"RTD(\"cqg.rtd\",,\"StudyData\",$C$5,\"Bar\",,\"High\",\"5\",K39,,,,,\"T\")","v":2329.4},{"$f":"RTD(\"cqg.rtd\",,\"StudyData\",$C$5,\"Bar\",,\"Low\",\"5\",K39,,,,,\"T\")","v":2328.73},{"$f":"RTD(\"cqg.rtd\",,\"StudyData\",$C$5,\"Bar\",,\"Close\",\"5\",K39,,,,,\"T\")","v":2329.35},null,-2,{"$f":"RTD(\"cqg.rtd\",,\"StudyData\",$H$5,\"Bar\",,\"Time\",\"5\",R39,,,,,\"T\")","v":42779.611111111109},{"$f":"RTD(\"cqg.rtd\",,\"StudyData\",$H$5,\"Bar\",,\"Open\",\"5\",R39,,,,,\"T\")","v":5764.26},{"$f":"RTD(\"cqg.rtd\",,\"StudyData\",$H$5,\"Bar\",,\"High\",\"5\",R39,,,,,\"T\")","v":5764.51},{"$f":"RTD(\"cqg.rtd\",,\"StudyData\",$H$5,\"Bar\",,\"Low\",\"5\",R39,,,,,\"T\")","v":5763.79},{"$f":"RTD(\"cqg.rtd\",,\"StudyData\",$H$5,\"Bar\",,\"Close\",\"5\",R39,,,,,\"T\")","v":5764.27}]
[null,null,null,null,null,null,null,null,null,null,-1,{"$f":"RTD(\"cqg.rtd\",,\"StudyData\",$C$5,\"Bar\",,\"Time\",\"5\",K40,,,,,\"T\")","v":42779.614583333336},{"$f":"RTD(\"cqg.rtd\",,\"StudyData\",$C$5,\"Bar\",,\"Open\",\"5\",K40,,,,,\"T\")","v":2329.34},{"$f":"RTD(\"cqg.rtd\",,\"StudyData\",$C$5,\"Bar\",,\"High\",\"5\",K40,,,,,\"T\")","v":2329.42},{"$f":"RTD(\"cqg.rtd\",,\"StudyData\",$C$5,\"Bar\",,\"Low\",\"5\",K40,,,,,\"T\")","v":2328.7199999999998},{"$f":"RTD(\"cqg.rtd\",,\"StudyData\",$C$5,\"Bar\",,\"Close\",\"5\",K40,,,,,\"T\")","v":2329.0100000000002},null,-1,{"$f":"RTD(\"cqg.rtd\",,\"StudyData\",$H$5,\"Bar\",,\"Time\",\"5\",R40,,,,,\"T\")","v":42779.614583333336},{"$f":"RTD(\"cqg.rtd\",,\"StudyData\",$H$5,\"Bar\",,\"Open\",\"5\",R40,,,,,\"T\")","v":5764.3},{"$f":"RTD(\"cqg.rtd\",,\"StudyData\",$H$5,\"Bar\",,\"High\",\"5\",R40,,,,,\"T\")","v":5764.33},{"$f":"RTD(\"cqg.rtd\",,\"StudyData\",$H$5,\"Bar\",,\"Low\",\"5\",R40,,,,,\"T\")","v":5762.04},{"$f":"RTD(\"cqg.rtd\",,\"StudyData\",$H$5,\"Bar\",,\"Close\",\"5\",R40,,,,,\"T\")","v":5762.35}]
[null,null,null,null,null,null,null,null,null,null,0,{"$f":"RTD(\"cqg.rtd\",,\"StudyData\",$C$5,\"Bar\",,\"Time\",\"5\",K41,,,,,\"T\")","v":42779.618055555555},{"$f":"IF(RTD(\"cqg.rtd\",,\"StudyData\",$C$5,\"Bar\",,\"Open\",\"5\",K41,,,,,\"T\")=\"\",NA(),RTD(\"cqg.rtd\",,\"StudyData\",$C$5,\"Bar\",,\"Open\",\"5\",K41,,,,,\"T\"))","v":2329},{"$f":"IF(RTD(\"cqg.rtd\",,\"StudyData\",$C$5,\"Bar\",,\"High\",\"5\",K41,,,,,\"T\")=\"\",NA(),RTD(\"cqg.rtd\",,\"StudyData\",$C$5,\"Bar\",,\"High\",\"5\",K41,,,,,\"T\"))","v":2329.29},{"$f":"IF(RTD(\"cqg.rtd\",,\"StudyData\",$C$5,\"Bar\",,\"Low\",\"5\",K41,,,,,\"T\")=\"\",NA(),RTD(\"cqg.rtd\",,\"StudyData\",$C$5,\"Bar\",,\"Low\",\"5\",K41,,,,,\"T\"))","v":2328.94},{"$f":"IF(RTD(\"cqg.rtd\",,\"StudyData\",$C$5,\"Bar\",,\"Close\",\"5\",K41,,,,,\"T\")=\"\",NA(),RTD(\"cqg.rtd\",,\"StudyData\",$C$5,\"Bar\",,\"Close\",\"5\",K41,,,,,\"T\"))","v":2328.94},null,0,{"$f":"RTD(\"cqg.rtd\",,\"StudyData\",$H$5,\"Bar\",,\"Time\",\"5\",R41,,,,,\"T\")","v":42779.618055555555},{"$f":"IF(RTD(\"cqg.rtd\",,\"StudyData\",$H$5,\"Bar\",,\"Open\",\"5\",R41,,,,,\"T\")=\"\",NA(),RTD(\"cqg.rtd\",,\"StudyData\",$H$5,\"Bar\",,\"Open\",\"5\",R41,,,,,\"T\"))","v":5762.72},{"$f":"IF(RTD(\"cqg.rtd\",,\"StudyData\",$H$5,\"Bar\",,\"High\",\"5\",R41,,,,,\"T\")=\"\",NA(),RTD(\"cqg.rtd\",,\"StudyData\",$H$5,\"Bar\",,\"High\",\"5\",R41,,,,,\"T\"))","v":5764.73},{"$f":"IF(RTD(\"cqg.rtd\",,\"StudyData\",$H$5,\"Bar\",,\"Low\",\"5\",R41,,,,,\"T\")=\"\",NA(),RTD(\"cqg.rtd\",,\"StudyData\",$H$5,\"Bar\",,\"Low\",\"5\",R41,,,,,\"T\"))","v":5762.72},{"$f":"IF(RTD(\"cqg.rtd\",,\"StudyData\",$H$5,\"Bar\",,\"Close\",\"5\",R41,,,,,\"T\")=\"\",NA(),RTD(\"cqg.rtd\",,\"StudyData\",$H$5,\"Bar\",,\"Close\",\"5\",R41,,,,,\"T\"))","v":5764.32}]

{"sheet":"NASDAQ100","index":2,"n_rows":508,"n_cols":15,"rows_kept":508,"cut":false,"hidden":true,"merged":[]}
[null,null,"S.US.AAL",{"$f":"IFERROR(RTD(\"cqg.rtd\", ,\"ContractData\",C1, \"PerCentNetLastTrade\",, \"T\")/100,\"\")","v":2.3250807319698599E-2},6,{"$f":"IFERROR(E1,\"\")","v":6},{"$f":"C1","v":"S.US.AAL"},1,{"$f":"IFERROR(VLOOKUP(H1,$F$1:$G$107,2,FALSE),\"\")","v":"S.US.REGN"},{"$f":"IFERROR(RTD(\"cqg.rtd\", ,\"ContractData\",I1, \"PerCentNetLastTrade\",, \"T\")/100,\"\")","v":4.3182260260649682E-2},null,{"$f":"MIN(D1:D107)","v":-4.4446400281640555E-2},{"$f":"VLOOKUP(L1,$D$1:$G$107,2,FALSE)","v":107},{"$f":"VLOOKUP(M1,$F$1:$G$107,2,FALSE)","v":"S.US.NVDA"},{"$f":"IFERROR(RTD(\"cqg.rtd\", ,\"ContractData\",N1, \"PerCentNetLastTrade\",, \"T\")/100,\"\")","v":-4.4446400281640555E-2}]
[null,null,"S.US.AAPL",{"$f":"IFERROR(RTD(\"cqg.rtd\", ,\"ContractData\",C2, \"PerCentNetLastTrade\",, \"T\")/100,\"\")","v":9.9909173478655768E-3},27,{"$f":"IFERROR(E2,\"\")","v":27},{"$f":"C2","v":"S.US.AAPL"},{"$f":"H1+1","v":2},"S.US.TSLA",{"$f":"IFERROR(RTD(\"cqg.rtd\", ,\"ContractData\",I2, \"PerCentNetLastTrade\",, \"T\")/100,\"\")","v":4.2082977379935375E-2},null,null,{"$f":"M1-1","v":106},{"$f":"VLOOKUP(M2,$F$1:$G$107,2,FALSE)","v":"S.US.ATVI"},{"$f":"IFERROR(RTD(\"cqg.rtd\", ,\"ContractData\",N2, \"PerCentNetLastTrade\",, \"T\")/100,\"\")","v":-3.1547745077281392E-2}]
[null,null,"S.US.ADBE",{"$f":"IFERROR(RTD(\"cqg.rtd\", ,\"ContractData\",C3, \"PerCentNetLastTrade\",, \"T\")/100,\"\")","v":6.675224646983312E-3},37,37,{"$f":"C3","v":"S.US.ADBE"},{"$f":"H2+1","v":3},"S.US.STX",{"$f":"IFERROR(RTD(\"cqg.rtd\", ,\"ContractData\",I3, \"PerCentNetLastTrade\",, \"T\")/100,\"\")","v":2.8411536805854499E-2},null,null,{"$f":"M2-1","v":105},"S.US.TMUS",{"$f":"IFERROR(RTD(\"cqg.rtd\", ,\"ContractData\",N3, \"PerCentNetLastTrade\",, \"T\")/100,\"\")","v":-2.6286263824330823E-2}]
[null,null,"S.US.ADI",{"$f":"IFERROR(RTD(\"cqg.rtd\", ,\"ContractData\",C4, \"PerCentNetLastTrade\",, \"T\")/100,\"\")","v":1.8816150529204233E-2},10,10,"S.US.ADI",4,"S.US.XLNX",{"$f":"IFERROR(RTD(\"cqg.rtd\", ,\"ContractData\",I4, \"PerCentNetLastTrade\",, \"T\")/100,\"\")","v":2.6719531115324945E-2},null,null,104,"S.US.EXPE",{"$f":"IFERROR(RTD(\"cqg.rtd\", ,\"ContractData\",N4, \"PerCentNetLastTrade\",, \"T\")/100,\"\")","v":-2.6090501426824297E-2}]
[null,null,"S.US.ADP",{"$f":"IFERROR(RTD(\"cqg.rtd\", ,\"ContractData\",C5, \"PerCentNetLastTrade\",, \"T\")/100,\"\")","v":7.0537722347168265E-3},36,36,"S.US.ADP",5,"S.US.SBAC",{"$f":"IFERROR(RTD(\"cqg.rtd\", ,\"ContractData\",I5, \"PerCentNetLastTrade\",, \"T\")/100,\"\")","v":2.3466716529543755E-2},null,null,103,"S.US.LILA",{"$f":"IFERROR(RTD(\"cqg.rtd\", ,\"ContractData\",N5, \"PerCentNetLastTrade\",, \"T\")/100,\"\")","v":-2.3706896551724137E-2}]
[null,null,"S.US.ADSK",{"$f":"IFERROR(RTD(\"cqg.rtd\", ,\"ContractData\",C6, \"PerCentNetLastTrade\",, \"T\")/100,\"\")","v":1.6099963955304577E-2},16,16,"S.US.ADSK",6,"S.US.AAL",{"$f":"IFERROR(RTD(\"cqg.rtd\", ,\"ContractData\",I6, \"PerCentNetLastTrade\",, \"T\")/100,\"\")","v":2.3250807319698599E-2},null,null,102,"S.US.LILAK",{"$f":"IFERROR(RTD(\"cqg.rtd\", ,\"ContractData\",N6, \"PerCentNetLastTrade\",, \"T\")/100,\"\")","v":-2.1816562778272486E-2}]
[null,null,"S.US.AKAM",{"$f":"IFERROR(RTD(\"cqg.rtd\", ,\"ContractData\",C7, \"PerCentNetLastTrade\",, \"T\")/100,\"\")","v":-6.5676309616888194E-3},93,93,"S.US.AKAM",7,"S.US.DISCA",{"$f":"IFERROR(RTD(\"cqg.rtd\", ,\"ContractData\",I7, \"PerCentNetLastTrade\",, \"T\")/100,\"\")","v":2.0365168539325844E-2},null,null,101,"S.US.QVCA",{"$f":"IFERROR(RTD(\"cqg.rtd\", ,\"ContractData\",N7, \"PerCentNetLastTrade\",, \"T\")/100,\"\")","v":-1.6045548654244304E-2}]
[null,null,"S.US.ALXN",{"$f":"IFERROR(RTD(\"cqg.rtd\", ,\"ContractData\",C8, \"PerCentNetLastTrade\",, \"T\")/100,\"\")","v":9.0111453640028469E-3},32,32,"S.US.ALXN",8,"S.US.GILD",{"$f":"IFERROR(RTD(\"cqg.rtd\", ,\"ContractData\",I8, \"PerCentNetLastTrade\",, \"T\")/100,\"\")","v":1.8836648583484026E-2},null,null,100,"S.US.TSCO",{"$f":"IFERROR(RTD(\"cqg.rtd\", ,\"ContractData\",N8, \"PerCentNetLastTrade\",, \"T\")/100,\"\")","v":-1.4814814814814814E-2}]
[null,null,"S.US.AMAT",{"$f":"IFERROR(RTD(\"cqg.rtd\", ,\"ContractData\",C9, \"PerCentNetLastTrade\",, \"T\")/100,\"\")","v":3.6806342015855038E-3},56,56,"S.US.AMAT",9,"S.US.CERN",{"$f":"IFERROR(RTD(\"cqg.rtd\", ,\"ContractData\",I9, \"PerCentNetLastTrade\",, \"T\")/100,\"\")","v":1.8640776699029128E-2},null,null,99,"S.US.LVNTA",{"$f":"IFERROR(RTD(\"cqg.rtd\", ,\"ContractData\",N9, \"PerCentNetLastTrade\",, \"T\")/100,\"\")","v":-1.392945405526848E-2}]
[null,null,"S.US.AMGN",{"$f":"IFERROR(RTD(\"cqg.rtd\", ,\"ContractData\",C10, \"PerCentNetLastTrade\",, \"T\")/100,\"\")","v":-8.9344213473107389E-4},77,77,"S.US.AMGN",10,"S.US.ADI",{"$f":"IFERROR(RTD(\"cqg.rtd\", ,\"ContractData\",I10, \"PerCentNetLastTrade\",, \"T\")/100,\"\")","v":1.8816150529204233E-2},null,null,98,"S.US.ORLY",{"$f":"IFERROR(RTD(\"cqg.rtd\", ,\"ContractData\",N10, \"PerCentNetLastTrade\",, \"T\")/100,\"\")","v":-1.2693156732891833E-2}]
[null,null,"S.US.AMZN",{"$f":"IFERROR(RTD(\"cqg.rtd\", ,\"ContractData\",C11, \"PerCentNetLastTrade\",, \"T\")/100,\"\")","v":1.1843472796268097E-2},21,21,"S.US.AMZN",11,"S.US.QCOM"]
[null,null,"S.US.ATVI",{"$f":"IFERROR(RTD(\"cqg.rtd\", ,\"ContractData\",C12, \"PerCentNetLastTrade\",, \"T\")/100,\"\")","v":-3.1547745077281392E-2},106,106,"S.US.ATVI",12,"S.US.PCAR"]
[null,null,"S.US.AVGO",{"$f":"IFERROR(RTD(\"cqg.rtd\", ,\"ContractData\",C13, \"PerCentNetLastTrade\",, \"T\")/100,\"\")","v":4.9143635655897241E-3},49,49,"S.US.AVGO",13,"S.US.PYPL"]
[null,null,"S.US.BIDU",{"$f":"IFERROR(RTD(\"cqg.rtd\", ,\"ContractData\",C14, \"PerCentNetLastTrade\",, \"T\")/100,\"\")","v":1.6305233980107613E-3},68,68,"S.US.BIDU",14,"S.US.BIIB"]
[null,null,"S.US.BIIB",{"$f":"IFERROR(RTD(\"cqg.rtd\", ,\"ContractData\",C15, \"PerCentNetLastTrade\",, \"T\")/100,\"\")","v":1.6123162032319113E-2},14,14,"S.US.BIIB",15,"S.US.DISCK"]
[null,null,"S.US.BMRN",{"$f":"IFERROR(RTD(\"cqg.rtd\", ,\"ContractData\",C16, \"PerCentNetLastTrade\",, \"T\")/100,\"\")","v":7.8775102629535122E-3},34,34,"S.US.BMRN",16,"S.US.ADSK"]
[null,null,"S.US.CA",{"$f":"IFERROR(RTD(\"cqg.rtd\", ,\"ContractData\",C17, \"PerCentNetLastTrade\",, \"T\")/100,\"\")","v":2.8328611898016999E-3},61,61,"S.US.CA",17,"S.US.CSCO"]
[null,null,"S.US.CELG",{"$f":"IFERROR(RTD(\"cqg.rtd\", ,\"ContractData\",C18, \"PerCentNetLastTrade\",, \"T\")/100,\"\")","v":7.17930974829167E-3},38,38,"S.US.CELG",18,"S.US.WDC"]
[null,null,"S.US.CERN",{"$f":"IFERROR(RTD(\"cqg.rtd\", ,\"ContractData\",C19, \"PerCentNetLastTrade\",, \"T\")/100,\"\")","v":1.8640776699029128E-2},9,9,"S.US.CERN",19,"S.US.NTES"]
[null,null,"S.US.CHKP",{"$f":"IFERROR(RTD(\"cqg.rtd\", ,\"ContractData\",C20, \"PerCentNetLastTrade\",, \"T\")/100,\"\")","v":-3.8541357841683959E-3},83,83,"S.US.CHKP",20,"S.US.INTC"]
[null,null,"S.US.CHTR",{"$f":"IFERROR(RTD(\"cqg.rtd\", ,\"ContractData\",C21, \"PerCentNetLastTrade\",, \"T\")/100,\"\")","v":-5.2070495439980281E-3},88,88,"S.US.CHTR",21,"S.US.AMZN"]
[null,null,"S.US.CMCSA",{"$f":"IFERROR(RTD(\"cqg.rtd\", ,\"ContractData\",C22, \"PerCentNetLastTrade\",, \"T\")/100,\"\")","v":6.7864271457085826E-3},39,39,"S.US.CMCSA",22,"S.US.ESRX"]
[null,null,"S.US.COST",{"$f":"IFERROR(RTD(\"cqg.rtd\", ,\"ContractData\",C23, \"PerCentNetLastTrade\",, \"T\")/100,\"\")","v":-4.0697674418604653E-4},73,73,"S.US.COST",23,"S.US.CTRP"]
[null,null,"S.US.CSCO",{"$f":"IFERROR(RTD(\"cqg.rtd\", ,\"ContractData\",C24, \"PerCentNetLastTrade\",, \"T\")/100,\"\")","v":1.4915899714376388E-2},17,17,"S.US.CSCO",24,"S.US.DISH"]
[null,null,"S.US.CSX",{"$f":"IFERROR(RTD(\"cqg.rtd\", ,\"ContractData\",C25, \"PerCentNetLastTrade\",, \"T\")/100,\"\")","v":3.7680552648105504E-3},55,55,"S.US.CSX",25,"S.US.MYL"]
[null,null,"S.US.CTAS",{"$f":"IFERROR(RTD(\"cqg.rtd\", ,\"ContractData\",C26, \"PerCentNetLastTrade\",, \"T\")/100,\"\")","v":2.7416038382453733E-3},60,60,"S.US.CTAS",26,"S.US.MAR"]
[null,null,"S.US.CTRP",{"$f":"IFERROR(RTD(\"cqg.rtd\", ,\"ContractData\",C27, \"PerCentNetLastTrade\",, \"T\")/100,\"\")","v":1.0564171723982918E-2},23,23,"S.US.CTRP",27,"S.US.AAPL"]
[null,null,"S.US.CTSH",{"$f":"IFERROR(RTD(\"cqg.rtd\", ,\"ContractData\",C28, \"PerCentNetLastTrade\",, \"T\")/100,\"\")","v":5.4006968641114985E-3},46,46,"S.US.CTSH",28,"S.US.MSFT"]
[null,null,"S.US.CTXS",{"$f":"IFERROR(RTD(\"cqg.rtd\", ,\"ContractData\",C29, \"PerCentNetLastTrade\",, \"T\")/100,\"\")","v":2.546148949713558E-3},62,62,"S.US.CTXS",29,"S.US.FISV"]
[null,null,"S.US.DISCA",{"$f":"IFERROR(RTD(\"cqg.rtd\", ,\"ContractData\",C30, \"PerCentNetLastTrade\",, \"T\")/100,\"\")","v":2.0365168539325844E-2},7,7,"S.US.DISCA",30,"S.US.PAYX"]
[null,null,"S.US.DISCK",{"$f":"IFERROR(RTD(\"cqg.rtd\", ,\"ContractData\",C31, \"PerCentNetLastTrade\",, \"T\")/100,\"\")","v":1.6274864376130196E-2},15,15,"S.US.DISCK",31,"S.US.YHOO"]
[null,null,"S.US.DISH",{"$f":"IFERROR(RTD(\"cqg.rtd\", ,\"ContractData\",C32, \"PerCentNetLastTrade\",, \"T\")/100,\"\")","v":1.1120196238757154E-2},24,24,"S.US.DISH",32,"S.US.ALXN"]
[null,null,"S.US.DLTR",{"$f":"IFERROR(RTD(\"cqg.rtd\", ,\"ContractData\",C33, \"PerCentNetLastTrade\",, \"T\")/100,\"\")","v":-4.870546013842604E-3},86,86,"S.US.DLTR",33,{"$f":"IFERROR(VLOOKUP(H33,$F$1:$G$107,2,FALSE),\"\")","v":"S.US.XRAY"}]
[null,null,"S.US.EA",{"$f":"IFERROR(RTD(\"cqg.rtd\", ,\"ContractData\",C34, \"PerCentNetLastTrade\",, \"T\")/100,\"\")","v":8.1234768480909826E-4},70,70,"S.US.EA",34,"S.US.BMRN"]
[null,null,"S.US.EBAY",{"$f":"IFERROR(RTD(\"cqg.rtd\", ,\"ContractData\",C35, \"PerCentNetLastTrade\",, \"T\")/100,\"\")","v":5.947071067499257E-3},44,44,"S.US.EBAY",35,"S.US.MAT"]
[null,null,"S.US.ESRX",{"$f":"IFERROR(RTD(\"cqg.rtd\", ,\"ContractData\",C36, \"PerCentNetLastTrade\",, \"T\")/100,\"\")","v":1.1548019295424644E-2},22,22,"S.US.ESRX",36,"S.US.ADP"]
[null,null,"S.US.EXPE",{"$f":"IFERROR(RTD(\"cqg.rtd\", ,\"ContractData\",C37, \"PerCentNetLastTrade\",, \"T\")/100,\"\")","v":-2.6090501426824297E-2},104,104,"S.US.EXPE",37,"S.US.ADBE"]
[null,null,"S.US.FAST",{"$f":"IFERROR(RTD(\"cqg.rtd\", ,\"ContractData\",C38, \"PerCentNetLastTrade\",, \"T\")/100,\"\")","v":-3.3770361541517681E-3},81,81,"S.US.FAST",38,"S.US.CELG"]
[null,null,"S.US.FB",{"$f":"IFERROR(RTD(\"cqg.rtd\", ,\"ContractData\",C39, \"PerCentNetLastTrade\",, \"T\")/100,\"\")","v":-1.2668604217899993E-3},78,78,"S.US.FB",39,"S.US.CMCSA"]
[null,null,"S.US.FISV",{"$f":"IFERROR(RTD(\"cqg.rtd\", ,\"ContractData\",C40, \"PerCentNetLastTrade\",, \"T\")/100,\"\")","v":9.9935821032364532E-3},29,29,"S.US.FISV",40,"S.US.ISRG"]
[null,null,"S.US.FOX",{"$f":"IFERROR(RTD(\"cqg.rtd\", ,\"ContractData\",C41, \"PerCentNetLastTrade\",, \"T\")/100,\"\")","v":-6.4080944350758846E-3},91,91,"S.US.FOX",41,"S.US.KLAC"]
[null,null,"S.US.FOXA",{"$f":"IFERROR(RTD(\"cqg.rtd\", ,\"ContractData\",C42, \"PerCentNetLastTrade\",, \"T\")/100,\"\")","v":-6.3523905048478765E-3},90,90,"S.US.FOXA",42,"S.US.INTU"]
[null,null,"S.US.GILD",{"$f":"IFERROR(RTD(\"cqg.rtd\", ,\"ContractData\",C43, \"PerCentNetLastTrade\",, \"T\")/100,\"\")","v":1.8836648583484026E-2},8,8,"S.US.GILD",43,"S.US.GOOG"]
[null,null,"S.US.GOOG",{"$f":"IFERROR(RTD(\"cqg.rtd\", ,\"ContractData\",C44, \"PerCentNetLastTrade\",, \"T\")/100,\"\")","v":6.2801872995194609E-3},43,43,"S.US.GOOG",44,"S.US.EBAY"]
[null,null,"S.US.GOOGL",{"$f":"IFERROR(RTD(\"cqg.rtd\", ,\"ContractData\",C45, \"PerCentNetLastTrade\",, \"T\")/100,\"\")","v":4.443912080014374E-3},52,52,"S.US.GOOGL",45,"S.US.SWKS"]
[null,null,"S.US.HAS",{"$f":"IFERROR(RTD(\"cqg.rtd\", ,\"ContractData\",C46, \"PerCentNetLastTrade\",, \"T\")/100,\"\")","v":5.6335142886407867E-3},47,47,"S.US.HAS",46,"S.US.CTSH"]
[null,null,"S.US.HOLX",{"$f":"IFERROR(RTD(\"cqg.rtd\", ,\"ContractData\",C47, \"PerCentNetLastTrade\",, \"T\")/100,\"\")","v":1.2521913348359629E-3},72,72,"S.US.HOLX",47,"S.US.HAS"]
[null,null,"S.US.HSIC",{"$f":"IFERROR(RTD(\"cqg.rtd\", ,\"ContractData\",C48, \"PerCentNetLastTrade\",, \"T\")/100,\"\")","v":-4.2406251893136246E-4},75,75,"S.US.HSIC",48,"S.US.VRSK"]
[null,null,"S.US.ILMN",{"$f":"IFERROR(RTD(\"cqg.rtd\", ,\"ContractData\",C49, \"PerCentNetLastTrade\",, \"T\")/100,\"\")","v":2.8827281648675174E-3},59,59,"S.US.ILMN",49,"S.US.AVGO"]
[null,null,"S.US.INCY",{"$f":"IFERROR(RTD(\"cqg.rtd\", ,\"ContractData\",C50, \"PerCentNetLastTrade\",, \"T\")/100,\"\")","v":-4.3549712407559569E-3},85,85,"S.US.INCY",50,"S.US.JD"]
[null,null,"S.US.INTC",{"$f":"IFERROR(RTD(\"cqg.rtd\", ,\"ContractData\",C51, \"PerCentNetLastTrade\",, \"T\")/100,\"\")","v":1.21675155631013E-2},20,20,"S.US.INTC",51,"S.US.TXN"]
[null,null,"S.US.INTU",{"$f":"IFERROR(RTD(\"cqg.rtd\", ,\"ContractData\",C52, \"PerCentNetLastTrade\",, \"T\")/100,\"\")","v":6.6366034204033012E-3},42,42,"S.US.INTU",52,"S.US.GOOGL"]
[null,null,"S.US.ISRG",{"$f":"IFERROR(RTD(\"cqg.rtd\", ,\"ContractData\",C53, \"PerCentNetLastTrade\",, \"T\")/100,\"\")","v":6.7467966889670026E-3},40,40,"S.US.ISRG",53,"S.US.SIRI"]
[null,null,"S.US.JBHT",{"$f":"IFERROR(RTD(\"cqg.rtd\", ,\"ContractData\",C54, \"PerCentNetLastTrade\",, \"T\")/100,\"\")","v":9.9631363953372521E-4},71,71,"S.US.JBHT",54,"S.US.LBTYK"]
[null,null,"S.US.JD",{"$f":"IFERROR(RTD(\"cqg.rtd\", ,\"ContractData\",C55, \"PerCentNetLastTrade\",, \"T\")/100,\"\")","v":4.0844111640571815E-3},50,50,"S.US.JD",55,"S.US.CSX"]
[null,null,"S.US.KHC",{"$f":"IFERROR(RTD(\"cqg.rtd\", ,\"ContractData\",C56, \"PerCentNetLastTrade\",, \"T\")/100,\"\")","v":3.4368070953436809E-3},57,57,"S.US.KHC",56,"S.US.AMAT"]
[null,null,"S.US.KLAC",{"$f":"IFERROR(RTD(\"cqg.rtd\", ,\"ContractData\",C57, \"PerCentNetLastTrade\",, \"T\")/100,\"\")","v":6.9252077562326876E-3},41,41,"S.US.KLAC",57,"S.US.KHC"]
[null,null,"S.US.LBTYA",{"$f":"IFERROR(RTD(\"cqg.rtd\", ,\"ContractData\",C58, \"PerCentNetLastTrade\",, \"T\")/100,\"\")","v":2.5452488687782802E-3},63,63,"S.US.LBTYA",58,"S.US.LRCX"]
[null,null,"S.US.LBTYK",{"$f":"IFERROR(RTD(\"cqg.rtd\", ,\"ContractData\",C59, \"PerCentNetLastTrade\",, \"T\")/100,\"\")","v":3.7956204379562043E-3},54,54,"S.US.LBTYK",59,"S.US.ILMN"]
[null,null,"S.US.LILA",{"$f":"IFERROR(RTD(\"cqg.rtd\", ,\"ContractData\",C60, \"PerCentNetLastTrade\",, \"T\")/100,\"\")","v":-2.3706896551724137E-2},103,103,"S.US.LILA",60,"S.US.CTAS"]
[null,null,"S.US.LILAK",{"$f":"IFERROR(RTD(\"cqg.rtd\", ,\"ContractData\",C61, \"PerCentNetLastTrade\",, \"T\")/100,\"\")","v":-2.1816562778272486E-2},102,102,"S.US.LILAK",61,"S.US.CA"]
[null,null,"S.US.LRCX",{"$f":"IFERROR(RTD(\"cqg.rtd\", ,\"ContractData\",C62, \"PerCentNetLastTrade\",, \"T\")/100,\"\")","v":3.1899301663936546E-3},58,58,"S.US.LRCX",62,"S.US.CTXS"]
[null,null,"S.US.LVNTA",{"$f":"IFERROR(RTD(\"cqg.rtd\", ,\"ContractData\",C63, \"PerCentNetLastTrade\",, \"T\")/100,\"\")","v":-1.392945405526848E-2},99,99,"S.US.LVNTA",63,"S.US.LBTYA"]
[null,null,"S.US.MAR",{"$f":"IFERROR(RTD(\"cqg.rtd\", ,\"ContractData\",C64, \"PerCentNetLastTrade\",, \"T\")/100,\"\")","v":1.098901098901099E-2},26,26,"S.US.MAR",64,"S.US.MDLZ"]
[null,null,"S.US.MAT",{"$f":"IFERROR(RTD(\"cqg.rtd\", ,\"ContractData\",C65, \"PerCentNetLastTrade\",, \"T\")/100,\"\")","v":7.7730275942479599E-3},35,35,"S.US.MAT",65,{"$f":"IFERROR(VLOOKUP(H65,$F$1:$G$107,2,FALSE),\"\")","v":"S.US.NCLH"}]
[null,null,"S.US.MCHP",{"$f":"IFERROR(RTD(\"cqg.rtd\", ,\"ContractData\",C66, \"PerCentNetLastTrade\",, \"T\")/100,\"\")","v":-3.1029619181946405E-3},80,{"$f":"IFERROR(E66,\"\")","v":80},"S.US.MCHP",66,"S.US.PCLN"]
[null,null,"S.US.MDLZ",{"$f":"IFERROR(RTD(\"cqg.rtd\", ,\"ContractData\",C67, \"PerCentNetLastTrade\",, \"T\")/100,\"\")","v":2.4449877750611247E-3},64,64,{"$f":"C67","v":"S.US.MDLZ"},{"$f":"H66+1","v":67},"S.US.WBA"]
[null,null,"S.US.MNST",{"$f":"IFERROR(RTD(\"cqg.rtd\", ,\"ContractData\",C68, \"PerCentNetLastTrade\",, \"T\")/100,\"\")","v":-1.2724380822540331E-2},97,97,"S.US.MNST",68,"S.US.BIDU"]
[null,null,"S.US.MSFT",{"$f":"IFERROR(RTD(\"cqg.rtd\", ,\"ContractData\",C69, \"PerCentNetLastTrade\",, \"T\")/100,\"\")","v":0.01},28,28,"S.US.MSFT",69,"S.US.SYMC"]
[null,null,"S.US.MU",{"$f":"IFERROR(RTD(\"cqg.rtd\", ,\"ContractData\",C70, \"PerCentNetLastTrade\",, \"T\")/100,\"\")","v":-4.5738045738045741E-3},87,87,"S.US.MU",70,"S.US.EA"]
[null,null,"S.US.MXIM",{"$f":"IFERROR(RTD(\"cqg.rtd\", ,\"ContractData\",C71, \"PerCentNetLastTrade\",, \"T\")/100,\"\")","v":-1.1093854004881295E-3},76,76,"S.US.MXIM",71,"S.US.JBHT"]
[null,null,"S.US.MYL",{"$f":"IFERROR(RTD(\"cqg.rtd\", ,\"ContractData\",C72, \"PerCentNetLastTrade\",, \"T\")/100,\"\")","v":1.1193080641058254E-2},25,25,"S.US.MYL",72,"S.US.HOLX"]
[null,null,"S.US.NCLH",{"$f":"IFERROR(RTD(\"cqg.rtd\", ,\"ContractData\",C73, \"PerCentNetLastTrade\",, \"T\")/100,\"\")","v":2.3012552301255231E-3},65,65,"S.US.NCLH",73,"S.US.COST"]
[null,null,"S.US.NFLX",{"$f":"IFERROR(RTD(\"cqg.rtd\", ,\"ContractData\",C74, \"PerCentNetLastTrade\",, \"T\")/100,\"\")","v":-1.0564839110620082E-2},95,95,"S.US.NFLX",74,"S.US.VOD"]
[null,null,"S.US.NTES",{"$f":"IFERROR(RTD(\"cqg.rtd\", ,\"ContractData\",C75, \"PerCentNetLastTrade\",, \"T\")/100,\"\")","v":1.3557610131302928E-2},19,19,"S.US.NTES",75,"S.US.HSIC"]
[null,null,"S.US.NVDA",{"$f":"IFERROR(RTD(\"cqg.rtd\", ,\"ContractData\",C76, \"PerCentNetLastTrade\",, \"T\")/100,\"\")","v":-4.4446400281640555E-2},107,107,"S.US.NVDA",76,"S.US.MXIM"]
[null,null,"S.US.ORLY",{"$f":"IFERROR(RTD(\"cqg.rtd\", ,\"ContractData\",C77, \"PerCentNetLastTrade\",, \"T\")/100,\"\")","v":-1.2693156732891833E-2},98,98,"S.US.ORLY",77,"S.US.AMGN"]
[null,null,"S.US.PAYX",{"$f":"IFERROR(RTD(\"cqg.rtd\", ,\"ContractData\",C78, \"PerCentNetLastTrade\",, \"T\")/100,\"\")","v":1.0092370851864523E-2},30,30,"S.US.PAYX",78,"S.US.FB"]
[null,null,"S.US.PCAR",{"$f":"IFERROR(RTD(\"cqg.rtd\", ,\"ContractData\",C79, \"PerCentNetLastTrade\",, \"T\")/100,\"\")","v":1.6732140258984431E-2},12,12,"S.US.PCAR",79,"S.US.SBUX"]
[null,null,"S.US.PCLN",{"$f":"IFERROR(RTD(\"cqg.rtd\", ,\"ContractData\",C80, \"PerCentNetLastTrade\",, \"T\")/100,\"\")","v":1.8645498660803761E-3},66,66,"S.US.PCLN",80,"S.US.MCHP"]
[null,null,"S.US.PYPL",{"$f":"IFERROR(RTD(\"cqg.rtd\", ,\"ContractData\",C81, \"PerCentNetLastTrade\",, \"T\")/100,\"\")","v":1.5771315919172007E-2},13,13,"S.US.PYPL",81,"S.US.FAST"]
[null,null,"S.US.QCOM",{"$f":"IFERROR(RTD(\"cqg.rtd\", ,\"ContractData\",C82, \"PerCentNetLastTrade\",, \"T\")/100,\"\")","v":1.8148148148148149E-2},11,11,"S.US.QCOM",82,"S.US.VIAB"]
[null,null,"S.US.QVCA",{"$f":"IFERROR(RTD(\"cqg.rtd\", ,\"ContractData\",C83, \"PerCentNetLastTrade\",, \"T\")/100,\"\")","v":-1.6045548654244304E-2},101,101,"S.US.QVCA",83,"S.US.CHKP"]
[null,null,"S.US.REGN",{"$f":"IFERROR(RTD(\"cqg.rtd\", ,\"ContractData\",C84, \"PerCentNetLastTrade\",, \"T\")/100,\"\")","v":4.3182260260649682E-2},1,1,"S.US.REGN",84,"S.US.VRTX"]
[null,null,"S.US.ROST",{"$f":"IFERROR(RTD(\"cqg.rtd\", ,\"ContractData\",C85, \"PerCentNetLastTrade\",, \"T\")/100,\"\")","v":-1.003052769297863E-2},94,94,"S.US.ROST",85,"S.US.INCY"]
[null,null,"S.US.SBAC",{"$f":"IFERROR(RTD(\"cqg.rtd\", ,\"ContractData\",C86, \"PerCentNetLastTrade\",, \"T\")/100,\"\")","v":2.3466716529543755E-2},5,5,"S.US.SBAC",86,"S.US.DLTR"]
[null,null,"S.US.SBUX",{"$f":"IFERROR(RTD(\"cqg.rtd\", ,\"ContractData\",C87, \"PerCentNetLastTrade\",, \"T\")/100,\"\")","v":-2.1344717182497333E-3},79,79,"S.US.SBUX",87,"S.US.MU"]
[null,null,"S.US.SHPG",{"$f":"IFERROR(RTD(\"cqg.rtd\", ,\"ContractData\",C88, \"PerCentNetLastTrade\",, \"T\")/100,\"\")","v":-5.3021033618831205E-3},89,89,"S.US.SHPG",88,"S.US.CHTR"]
[null,null,"S.US.SIRI",{"$f":"IFERROR(RTD(\"cqg.rtd\", ,\"ContractData\",C89, \"PerCentNetLastTrade\",, \"T\")/100,\"\")","v":4.2283298097251587E-3},53,53,"S.US.SIRI",89,"S.US.SHPG"]
[null,null,"S.US.STX",{"$f":"IFERROR(RTD(\"cqg.rtd\", ,\"ContractData\",C90, \"PerCentNetLastTrade\",, \"T\")/100,\"\")","v":2.8411536805854499E-2},3,3,"S.US.STX",90,"S.US.FOXA"]
[null,null,"S.US.SWKS",{"$f":"IFERROR(RTD(\"cqg.rtd\", ,\"ContractData\",C91, \"PerCentNetLastTrade\",, \"T\")/100,\"\")","v":5.7477497017677038E-3},45,45,"S.US.SWKS",91,"S.US.FOX"]
[null,null,"S.US.SYMC",{"$f":"IFERROR(RTD(\"cqg.rtd\", ,\"ContractData\",C92, \"PerCentNetLastTrade\",, \"T\")/100,\"\")","v":1.7229496898690559E-3},69,69,"S.US.SYMC",92,"S.US.ULTA"]
[null,null,"S.US.TMUS",{"$f":"IFERROR(RTD(\"cqg.rtd\", ,\"ContractData\",C93, \"PerCentNetLastTrade\",, \"T\")/100,\"\")","v":-2.6286263824330823E-2},105,105,"S.US.TMUS",93,"S.US.AKAM"]
[null,null,"S.US.TRIP",{"$f":"IFERROR(RTD(\"cqg.rtd\", ,\"ContractData\",C94, \"PerCentNetLastTrade\",, \"T\")/100,\"\")","v":-1.0961538461538462E-2},96,96,"S.US.TRIP",94,"S.US.ROST"]
[null,null,"S.US.TSCO",{"$f":"IFERROR(RTD(\"cqg.rtd\", ,\"ContractData\",C95, \"PerCentNetLastTrade\",, \"T\")/100,\"\")","v":-1.4814814814814814E-2},100,100,"S.US.TSCO",95,"S.US.NFLX"]
[null,null,"S.US.TSLA",{"$f":"IFERROR(RTD(\"cqg.rtd\", ,\"ContractData\",C96, \"PerCentNetLastTrade\",, \"T\")/100,\"\")","v":4.2082977379935375E-2},2,2,"S.US.TSLA",96,"S.US.TRIP"]
[null,null,"S.US.TXN",{"$f":"IFERROR(RTD(\"cqg.rtd\", ,\"ContractData\",C97, \"PerCentNetLastTrade\",, \"T\")/100,\"\")","v":4.9228312932410858E-3},51,51,"S.US.TXN",97,{"$f":"IFERROR(VLOOKUP(H97,$F$1:$G$107,2,FALSE),\"\")","v":"S.US.MNST"}]
[null,null,"S.US.ULTA",{"$f":"IFERROR(RTD(\"cqg.rtd\", ,\"ContractData\",C98, \"PerCentNetLastTrade\",, \"T\")/100,\"\")","v":-6.1147346575748593E-3},92,92,"S.US.ULTA",98,"S.US.ORLY"]
[null,null,"S.US.VIAB",{"$f":"IFERROR(RTD(\"cqg.rtd\", ,\"ContractData\",C99, \"PerCentNetLastTrade\",, \"T\")/100,\"\")","v":-4.1237113402061857E-3},82,82,"S.US.VIAB",99,"S.US.LVNTA"]
[null,null,"S.US.VOD",{"$f":"IFERROR(RTD(\"cqg.rtd\", ,\"ContractData\",C100, \"PerCentNetLastTrade\",, \"T\")/100,\"\")","v":-4.0000000000000002E-4},74,74,"S.US.VOD",100,"S.US.TSCO"]
[null,null,"S.US.VRSK",{"$f":"IFERROR(RTD(\"cqg.rtd\", ,\"ContractData\",C101, \"PerCentNetLastTrade\",, \"T\")/100,\"\")","v":5.5608140085186943E-3},48,48,"S.US.VRSK",101,"S.US.QVCA"]
[null,null,"S.US.VRTX",{"$f":"IFERROR(RTD(\"cqg.rtd\", ,\"ContractData\",C102, \"PerCentNetLastTrade\",, \"T\")/100,\"\")","v":-3.9705048213272828E-3},84,84,"S.US.VRTX",102,"S.US.LILAK"]
[null,null,"S.US.WBA",{"$f":"IFERROR(RTD(\"cqg.rtd\", ,\"ContractData\",C103, \"PerCentNetLastTrade\",, \"T\")/100,\"\")","v":1.6804705317488896E-3},67,67,"S.US.WBA",103,"S.US.LILA"]
[null,null,"S.US.WDC",{"$f":"IFERROR(RTD(\"cqg.rtd\", ,\"ContractData\",C104, \"PerCentNetLastTrade\",, \"T\")/100,\"\")","v":1.4736297828335056E-2},18,18,"S.US.WDC",104,"S.US.EXPE"]
[null,null,"S.US.XLNX",{"$f":"IFERROR(RTD(\"cqg.rtd\", ,\"ContractData\",C105, \"PerCentNetLastTrade\",, \"T\")/100,\"\")","v":2.6719531115324945E-2},4,4,"S.US.XLNX",105,"S.US.TMUS"]
[null,null,"S.US.XRAY",{"$f":"IFERROR(RTD(\"cqg.rtd\", ,\"ContractData\",C106, \"PerCentNetLastTrade\",, \"T\")/100,\"\")","v":8.0493235143003945E-3},33,33,"S.US.XRAY",106,"S.US.ATVI"]
[null,null,"S.US.YHOO",{"$f":"IFERROR(RTD(\"cqg.rtd\", ,\"ContractData\",C107, \"PerCentNetLastTrade\",, \"T\")/100,\"\")","v":9.3271152564956689E-3},31,{"$f":"IFERROR(E107,\"\")","v":31},{"$f":"C107","v":"S.US.YHOO"},107]
[null,null,null,null,{"$error":"#N/A"}]
[null,null,null,null,{"$error":"#N/A"}]
[null,null,null,null,{"$error":"#N/A"}]
[null,null,null,null,{"$error":"#N/A"}]
[null,null,null,null,{"$error":"#N/A"}]
[null,null,null,null,{"$error":"#N/A"}]
[null,null,null,null,{"$error":"#N/A"}]
[null,null,null,null,{"$error":"#N/A"}]
[null,null,null,null,{"$error":"#N/A"}]
[null,null,null,null,{"$error":"#N/A"}]
[null,null,null,null,{"$error":"#N/A"}]
[null,null,null,null,{"$error":"#N/A"}]
[null,null,null,null,{"$error":"#N/A"}]
[null,null,null,null,{"$error":"#N/A"}]
[null,null,null,null,{"$error":"#N/A"}]
[null,null,null,null,{"$error":"#N/A"}]
[null,null,null,null,{"$error":"#N/A"}]
[null,null,null,null,{"$error":"#N/A"}]
[null,null,null,null,{"$error":"#N/A"}]
[null,null,null,null,{"$error":"#N/A"}]
[null,null,null,null,{"$error":"#N/A"}]
[null,null,null,null,{"$error":"#N/A"}]
[null,null,null,null,{"$error":"#N/A"}]
[null,null,null,null,{"$error":"#N/A"}]
[null,null,null,null,{"$error":"#N/A"}]
[null,null,null,null,{"$error":"#N/A"}]
[null,null,null,null,{"$error":"#N/A"}]
[null,null,null,null,{"$error":"#N/A"}]
[null,null,null,null,{"$error":"#N/A"}]
[null,null,null,null,{"$error":"#N/A"}]
[null,null,null,null,{"$error":"#N/A"}]
[null,null,null,null,{"$error":"#N/A"}]
[null,null,null,null,{"$error":"#N/A"}]
[null,null,null,null,{"$error":"#N/A"}]
[null,null,null,null,{"$error":"#N/A"}]
[null,null,null,null,{"$error":"#N/A"}]
[null,null,null,null,{"$error":"#N/A"}]
[null,null,null,null,{"$error":"#N/A"}]
[null,null,null,null,{"$error":"#N/A"}]
[null,null,null,null,{"$error":"#N/A"}]
[null,null,null,null,{"$error":"#N/A"}]
[null,null,null,null,{"$error":"#N/A"}]
[null,null,null,null,{"$error":"#N/A"}]
[null,null,null,null,{"$error":"#N/A"}]
[null,null,null,null,{"$error":"#N/A"}]
[null,null,null,null,{"$error":"#N/A"}]
[null,null,null,null,{"$error":"#N/A"}]
[null,null,null,null,{"$error":"#N/A"}]
[null,null,null,null,{"$error":"#N/A"}]
[null,null,null,null,{"$error":"#N/A"}]
[null,null,null,null,{"$error":"#N/A"}]
[null,null,null,null,{"$error":"#N/A"}]
[null,null,null,null,{"$error":"#N/A"}]
[null,null,null,null,{"$error":"#N/A"}]
[null,null,null,null,{"$error":"#N/A"}]
[null,null,null,null,{"$error":"#N/A"}]
[null,null,null,null,{"$error":"#N/A"}]
[null,null,null,null,{"$error":"#N/A"}]
[null,null,null,null,{"$error":"#N/A"}]
[null,null,null,null,{"$error":"#N/A"}]
[null,null,null,null,{"$error":"#N/A"}]
[null,null,null,null,{"$error":"#N/A"}]
[null,null,null,null,{"$error":"#N/A"}]
[null,null,null,null,{"$error":"#N/A"}]
[null,null,null,null,{"$error":"#N/A"}]
[null,null,null,null,{"$error":"#N/A"}]
[null,null,null,null,{"$error":"#N/A"}]
[null,null,null,null,{"$error":"#N/A"}]
[null,null,null,null,{"$error":"#N/A"}]
[null,null,null,null,{"$error":"#N/A"}]
[null,null,null,null,{"$error":"#N/A"}]
[null,null,null,null,{"$error":"#N/A"}]
[null,null,null,null,{"$error":"#N/A"}]
[null,null,null,null,{"$error":"#N/A"}]
[null,null,null,null,{"$error":"#N/A"}]
[null,null,null,null,{"$error":"#N/A"}]
[null,null,null,null,{"$error":"#N/A"}]
[null,null,null,null,{"$error":"#N/A"}]
[null,null,null,null,{"$error":"#N/A"}]
[null,null,null,null,{"$error":"#N/A"}]
[null,null,null,null,{"$error":"#N/A"}]
[null,null,null,null,{"$error":"#N/A"}]
[null,null,null,null,{"$error":"#N/A"}]
[null,null,null,null,{"$error":"#N/A"}]
[null,null,null,null,{"$error":"#N/A"}]
[null,null,null,null,{"$error":"#N/A"}]
[null,null,null,null,{"$error":"#N/A"}]
[null,null,null,null,{"$error":"#N/A"}]
[null,null,null,null,{"$error":"#N/A"}]
[null,null,null,null,{"$error":"#N/A"}]
[null,null,null,null,{"$error":"#N/A"}]
[null,null,null,null,{"$error":"#N/A"}]
[null,null,null,null,{"$error":"#N/A"}]
[null,null,null,null,{"$error":"#N/A"}]
[null,null,null,null,{"$error":"#N/A"}]
[null,null,null,null,{"$error":"#N/A"}]
[null,null,null,null,{"$error":"#N/A"}]
[null,null,null,null,{"$error":"#N/A"}]
[null,null,null,null,{"$error":"#N/A"}]
[null,null,null,null,{"$error":"#N/A"}]
[null,null,null,null,{"$error":"#N/A"}]
[null,null,null,null,{"$error":"#N/A"}]
[null,null,null,null,{"$error":"#N/A"}]
[null,null,null,null,{"$error":"#N/A"}]
[null,null,null,null,{"$error":"#N/A"}]
[null,null,null,null,{"$error":"#N/A"}]
[null,null,null,null,{"$error":"#N/A"}]
[null,null,null,null,{"$error":"#N/A"}]
[null,null,null,null,{"$error":"#N/A"}]
[null,null,null,null,{"$error":"#N/A"}]
[null,null,null,null,{"$error":"#N/A"}]
[null,null,null,null,{"$error":"#N/A"}]
[null,null,null,null,{"$error":"#N/A"}]
[null,null,null,null,{"$error":"#N/A"}]
[null,null,null,null,{"$error":"#N/A"}]
[null,null,null,null,{"$error":"#N/A"}]
[null,null,null,null,{"$error":"#N/A"}]
[null,null,null,null,{"$error":"#N/A"}]
[null,null,null,null,{"$error":"#N/A"}]
[null,null,null,null,{"$error":"#N/A"}]
[null,null,null,null,{"$error":"#N/A"}]
[null,null,null,null,{"$error":"#N/A"}]
[null,null,null,null,{"$error":"#N/A"}]
[null,null,null,null,{"$error":"#N/A"}]
[null,null,null,null,{"$error":"#N/A"}]
[null,null,null,null,{"$error":"#N/A"}]
[null,null,null,null,{"$error":"#N/A"}]
[null,null,null,null,{"$error":"#N/A"}]
[null,null,null,null,{"$error":"#N/A"}]
[null,null,null,null,{"$error":"#N/A"}]
[null,null,null,null,{"$error":"#N/A"}]
[null,null,null,null,{"$error":"#N/A"}]
[null,null,null,null,{"$error":"#N/A"}]
[null,null,null,null,{"$error":"#N/A"}]
[null,null,null,null,{"$error":"#N/A"}]
[null,null,null,null,{"$error":"#N/A"}]
[null,null,null,null,{"$error":"#N/A"}]
[null,null,null,null,{"$error":"#N/A"}]
[null,null,null,null,{"$error":"#N/A"}]
[null,null,null,null,{"$error":"#N/A"}]
[null,null,null,null,{"$error":"#N/A"}]
[null,null,null,null,{"$error":"#N/A"}]
[null,null,null,null,{"$error":"#N/A"}]
[null,null,null,null,{"$error":"#N/A"}]
[null,null,null,null,{"$error":"#N/A"}]
[null,null,null,null,{"$error":"#N/A"}]
[null,null,null,null,{"$error":"#N/A"}]
[null,null,null,null,{"$error":"#N/A"}]
[null,null,null,null,{"$error":"#N/A"}]
[null,null,null,null,{"$error":"#N/A"}]
[null,null,null,null,{"$error":"#N/A"}]
[null,null,null,null,{"$error":"#N/A"}]
[null,null,null,null,{"$error":"#N/A"}]
[null,null,null,null,{"$error":"#N/A"}]
[null,null,null,null,{"$error":"#N/A"}]
[null,null,null,null,{"$error":"#N/A"}]
[null,null,null,null,{"$error":"#N/A"}]
[null,null,null,null,{"$error":"#N/A"}]
[null,null,null,null,{"$error":"#N/A"}]
[null,null,null,null,{"$error":"#N/A"}]
[null,null,null,null,{"$error":"#N/A"}]
[null,null,null,null,{"$error":"#N/A"}]
[null,null,null,null,{"$error":"#N/A"}]
[null,null,null,null,{"$error":"#N/A"}]
[null,null,null,null,{"$error":"#N/A"}]
[null,null,null,null,{"$error":"#N/A"}]
[null,null,null,null,{"$error":"#N/A"}]
[null,null,null,null,{"$error":"#N/A"}]
[null,null,null,null,{"$error":"#N/A"}]
[null,null,null,null,{"$error":"#N/A"}]
[null,null,null,null,{"$error":"#N/A"}]
[null,null,null,null,{"$error":"#N/A"}]
[null,null,null,null,{"$error":"#N/A"}]
[null,null,null,null,{"$error":"#N/A"}]
[null,null,null,null,{"$error":"#N/A"}]
[null,null,null,null,{"$error":"#N/A"}]
[null,null,null,null,{"$error":"#N/A"}]
[null,null,null,null,{"$error":"#N/A"}]
[null,null,null,null,{"$error":"#N/A"}]
[null,null,null,null,{"$error":"#N/A"}]
[null,null,null,null,{"$error":"#N/A"}]
[null,null,null,null,{"$error":"#N/A"}]
[null,null,null,null,{"$error":"#N/A"}]
[null,null,null,null,{"$error":"#N/A"}]
[null,null,null,null,{"$error":"#N/A"}]
[null,null,null,null,{"$error":"#N/A"}]
[null,null,null,null,{"$error":"#N/A"}]
[null,null,null,null,{"$error":"#N/A"}]
[null,null,null,null,{"$error":"#N/A"}]
[null,null,null,null,{"$error":"#N/A"}]
[null,null,null,null,{"$error":"#N/A"}]
[null,null,null,null,{"$error":"#N/A"}]
[null,null,null,null,{"$error":"#N/A"}]
[null,null,null,null,{"$error":"#N/A"}]
[null,null,null,null,{"$error":"#N/A"}]
[null,null,null,null,{"$error":"#N/A"}]
[null,null,null,null,{"$error":"#N/A"}]
[null,null,null,null,{"$error":"#N/A"}]
[null,null,null,null,{"$error":"#N/A"}]
[null,null,null,null,{"$error":"#N/A"}]
[null,null,null,null,{"$error":"#N/A"}]
[null,null,null,null,{"$error":"#N/A"}]
[null,null,null,null,{"$error":"#N/A"}]
[null,null,null,null,{"$error":"#N/A"}]
[null,null,null,null,{"$error":"#N/A"}]
[null,null,null,null,{"$error":"#N/A"}]
[null,null,null,null,{"$error":"#N/A"}]
[null,null,null,null,{"$error":"#N/A"}]
[null,null,null,null,{"$error":"#N/A"}]
[null,null,null,null,{"$error":"#N/A"}]
[null,null,null,null,{"$error":"#N/A"}]
[null,null,null,null,{"$error":"#N/A"}]
[null,null,null,null,{"$error":"#N/A"}]
[null,null,null,null,{"$error":"#N/A"}]
[null,null,null,null,{"$error":"#N/A"}]
[null,null,null,null,{"$error":"#N/A"}]
[null,null,null,null,{"$error":"#N/A"}]
[null,null,null,null,{"$error":"#N/A"}]
[null,null,null,null,{"$error":"#N/A"}]
[null,null,null,null,{"$error":"#N/A"}]
[null,null,null,null,{"$error":"#N/A"}]
[null,null,null,null,{"$error":"#N/A"}]
[null,null,null,null,{"$error":"#N/A"}]
[null,null,null,null,{"$error":"#N/A"}]
[null,null,null,null,{"$error":"#N/A"}]
[null,null,null,null,{"$error":"#N/A"}]
[null,null,null,null,{"$error":"#N/A"}]
[null,null,null,null,{"$error":"#N/A"}]
[null,null,null,null,{"$error":"#N/A"}]
[null,null,null,null,{"$error":"#N/A"}]
[null,null,null,null,{"$error":"#N/A"}]
[null,null,null,null,{"$error":"#N/A"}]
[null,null,null,null,{"$error":"#N/A"}]
[null,null,null,null,{"$error":"#N/A"}]
[null,null,null,null,{"$error":"#N/A"}]
[null,null,null,null,{"$error":"#N/A"}]
[null,null,null,null,{"$error":"#N/A"}]
[null,null,null,null,{"$error":"#N/A"}]
[null,null,null,null,{"$error":"#N/A"}]
[null,null,null,null,{"$error":"#N/A"}]
[null,null,null,null,{"$error":"#N/A"}]
[null,null,null,null,{"$error":"#N/A"}]
[null,null,null,null,{"$error":"#N/A"}]
[null,null,null,null,{"$error":"#N/A"}]
[null,null,null,null,{"$error":"#N/A"}]
[null,null,null,null,{"$error":"#N/A"}]
[null,null,null,null,{"$error":"#N/A"}]
[null,null,null,null,{"$error":"#N/A"}]
[null,null,null,null,{"$error":"#N/A"}]
[null,null,null,null,{"$error":"#N/A"}]
[null,null,null,null,{"$error":"#N/A"}]
[null,null,null,null,{"$error":"#N/A"}]
[null,null,null,null,{"$error":"#N/A"}]
[null,null,null,null,{"$error":"#N/A"}]
[null,null,null,null,{"$error":"#N/A"}]
[null,null,null,null,{"$error":"#N/A"}]
[null,null,null,null,{"$error":"#N/A"}]
[null,null,null,null,{"$error":"#N/A"}]
[null,null,null,null,{"$error":"#N/A"}]
[null,null,null,null,{"$error":"#N/A"}]
[null,null,null,null,{"$error":"#N/A"}]
[null,null,null,null,{"$error":"#N/A"}]
[null,null,null,null,{"$error":"#N/A"}]
[null,null,null,null,{"$error":"#N/A"}]
[null,null,null,null,{"$error":"#N/A"}]
[null,null,null,null,{"$error":"#N/A"}]
[null,null,null,null,{"$error":"#N/A"}]
[null,null,null,null,{"$error":"#N/A"}]
[null,null,null,null,{"$error":"#N/A"}]
[null,null,null,null,{"$error":"#N/A"}]
[null,null,null,null,{"$error":"#N/A"}]
[null,null,null,null,{"$error":"#N/A"}]
[null,null,null,null,{"$error":"#N/A"}]
[null,null,null,null,{"$error":"#N/A"}]
[null,null,null,null,{"$error":"#N/A"}]
[null,null,null,null,{"$error":"#N/A"}]
[null,null,null,null,{"$error":"#N/A"}]
[null,null,null,null,{"$error":"#N/A"}]
[null,null,null,null,{"$error":"#N/A"}]
[null,null,null,null,{"$error":"#N/A"}]
[null,null,null,null,{"$error":"#N/A"}]
[null,null,null,null,{"$error":"#N/A"}]
[null,null,null,null,{"$error":"#N/A"}]
[null,null,null,null,{"$error":"#N/A"}]
[null,null,null,null,{"$error":"#N/A"}]
[null,null,null,null,{"$error":"#N/A"}]
[null,null,null,null,{"$error":"#N/A"}]
[null,null,null,null,{"$error":"#N/A"}]
[null,null,null,null,{"$error":"#N/A"}]
[null,null,null,null,{"$error":"#N/A"}]
[null,null,null,null,{"$error":"#N/A"}]
[null,null,null,null,{"$error":"#N/A"}]
[null,null,null,null,{"$error":"#N/A"}]
[null,null,null,null,{"$error":"#N/A"}]
[null,null,null,null,{"$error":"#N/A"}]
[null,null,null,null,{"$error":"#N/A"}]
[null,null,null,null,{"$error":"#N/A"}]
[null,null,null,null,{"$error":"#N/A"}]
[null,null,null,null,{"$error":"#N/A"}]
[null,null,null,null,{"$error":"#N/A"}]
[null,null,null,null,{"$error":"#N/A"}]
[null,null,null,null,{"$error":"#N/A"}]
[null,null,null,null,{"$error":"#N/A"}]
[null,null,null,null,{"$error":"#N/A"}]
[null,null,null,null,{"$error":"#N/A"}]
[null,null,null,null,{"$error":"#N/A"}]
[null,null,null,null,{"$error":"#N/A"}]
[null,null,null,null,{"$error":"#N/A"}]
[null,null,null,null,{"$error":"#N/A"}]
[null,null,null,null,{"$error":"#N/A"}]
[null,null,null,null,{"$error":"#N/A"}]
[null,null,null,null,{"$error":"#N/A"}]
[null,null,null,null,{"$error":"#N/A"}]
[null,null,null,null,{"$error":"#N/A"}]
[null,null,null,null,{"$error":"#N/A"}]
[null,null,null,null,{"$error":"#N/A"}]
[null,null,null,null,{"$error":"#N/A"}]
[null,null,null,null,{"$error":"#N/A"}]
[null,null,null,null,{"$error":"#N/A"}]
[null,null,null,null,{"$error":"#N/A"}]
[null,null,null,null,{"$error":"#N/A"}]
[null,null,null,null,{"$error":"#N/A"}]
[null,null,null,null,{"$error":"#N/A"}]
[null,null,null,null,{"$error":"#N/A"}]
[null,null,null,null,{"$error":"#N/A"}]
[null,null,null,null,{"$error":"#N/A"}]
[null,null,null,null,{"$error":"#N/A"}]
[null,null,null,null,{"$error":"#N/A"}]
[null,null,null,null,{"$error":"#N/A"}]
[null,null,null,null,{"$error":"#N/A"}]
[null,null,null,null,{"$error":"#N/A"}]
[null,null,null,null,{"$error":"#N/A"}]
[null,null,null,null,{"$error":"#N/A"}]
[null,null,null,null,{"$error":"#N/A"}]
[null,null,null,null,{"$error":"#N/A"}]
[null,null,null,null,{"$error":"#N/A"}]
[null,null,null,null,{"$error":"#N/A"}]
[null,null,null,null,{"$error":"#N/A"}]
[null,null,null,null,{"$error":"#N/A"}]
[null,null,null,null,{"$error":"#N/A"}]
[null,null,null,null,{"$error":"#N/A"}]
[null,null,null,null,{"$error":"#N/A"}]
[null,null,null,null,{"$error":"#N/A"}]
[null,null,null,null,{"$error":"#N/A"}]
[null,null,null,null,{"$error":"#N/A"}]
[null,null,null,null,{"$error":"#N/A"}]
[null,null,null,null,{"$error":"#N/A"}]
[null,null,null,null,{"$error":"#N/A"}]
[null,null,null,null,{"$error":"#N/A"}]
[null,null,null,null,{"$error":"#N/A"}]
[null,null,null,null,{"$error":"#N/A"}]
[null,null,null,null,{"$error":"#N/A"}]
[null,null,null,null,{"$error":"#N/A"}]
[null,null,null,null,{"$error":"#N/A"}]
[null,null,null,null,{"$error":"#N/A"}]
[null,null,null,null,{"$error":"#N/A"}]
[null,null,null,null,{"$error":"#N/A"}]
[null,null,null,null,{"$error":"#N/A"}]
[null,null,null,null,{"$error":"#N/A"}]
[null,null,null,null,{"$error":"#N/A"}]
[null,null,null,null,{"$error":"#N/A"}]
[null,null,null,null,{"$error":"#N/A"}]
[null,null,null,null,{"$error":"#N/A"}]
[null,null,null,null,{"$error":"#N/A"}]
[null,null,null,null,{"$error":"#N/A"}]
[null,null,null,null,{"$error":"#N/A"}]
[null,null,null,null,{"$error":"#N/A"}]
[null,null,null,null,{"$error":"#N/A"}]
[null,null,null,null,{"$error":"#N/A"}]
[null,null,null,null,{"$error":"#N/A"}]
[null,null,null,null,{"$error":"#N/A"}]
[null,null,null,null,{"$error":"#N/A"}]
[null,null,null,null,{"$error":"#N/A"}]
[null,null,null,null,{"$error":"#N/A"}]
[null,null,null,null,{"$error":"#N/A"}]
[null,null,null,null,{"$error":"#N/A"}]
[null,null,null,null,{"$error":"#N/A"}]
[null,null,null,null,{"$error":"#N/A"}]
[null,null,null,null,{"$error":"#N/A"}]
[null,null,null,null,{"$error":"#N/A"}]
[null,null,null,null,{"$error":"#N/A"}]
[null,null,null,null,{"$error":"#N/A"}]
[null,null,null,null,{"$error":"#N/A"}]
[null,null,null,null,{"$error":"#N/A"}]
[null,null,null,null,{"$error":"#N/A"}]
[null,null,null,null,{"$error":"#N/A"}]
[null,null,null,null,{"$error":"#N/A"}]
[null,null,null,null,{"$error":"#N/A"}]
[null,null,null,null,{"$error":"#N/A"}]
[null,null,null,null,{"$error":"#N/A"}]
[null,null,null,null,{"$error":"#N/A"}]
[null,null,null,null,{"$error":"#N/A"}]
[null,null,null,null,{"$error":"#N/A"}]
[null,null,null,null,{"$error":"#N/A"}]
[null,null,null,null,{"$error":"#N/A"}]
[null,null,null,null,{"$error":"#N/A"}]
[null,null,null,null,{"$error":"#N/A"}]
[null,null,null,null,{"$error":"#N/A"}]
[null,null,null,null,{"$error":"#N/A"}]
[null,null,null,null,{"$error":"#N/A"}]
[null,null,null,null,{"$error":"#N/A"}]

{"sheet":"S&P500","index":3,"n_rows":3044,"n_cols":15,"rows_kept":3044,"cut":false,"hidden":true,"merged":[]}
[null,null,"S.US.A         ",{"$f":"IFERROR(RTD(\"cqg.rtd\", ,\"ContractData\",C1, \"PerCentNetLastTrade\",, \"T\")/100,\"\")","v":3.9714058776806989E-3},265,{"$f":"IFERROR(E1,\"\")","v":265},{"$f":"C1","v":"S.US.A         "},1,{"$f":"IFERROR(VLOOKUP(H1,$F$1:$G$506,2,FALSE),\"\")","v":"S.US.GT        "},{"$f":"IFERROR(RTD(\"cqg.rtd\", ,\"ContractData\",I1, \"PerCentNetLastTrade\",, \"T\")/100,\"\")","v":5.7532621589561093E-2},null,{"$f":"MIN(D1:D506)","v":-4.4446400281640555E-2},{"$f":"VLOOKUP(L1,D1:G506,3,FALSE)","v":506},{"$f":"VLOOKUP(M1,$H$1:$I$506,2,FALSE)","v":"S.US.NVDA      "},{"$f":"IFERROR(RTD(\"cqg.rtd\", ,\"ContractData\",N1, \"PerCentNetLastTrade\",, \"T\")/100,\"\")","v":-4.4446400281640555E-2}]
[null,null,"S.US.AAL",{"$f":"IFERROR(RTD(\"cqg.rtd\", ,\"ContractData\",C2, \"PerCentNetLastTrade\",, \"T\")/100,\"\")","v":2.3250807319698599E-2},13,{"$f":"IFERROR(E2,\"\")","v":13},{"$f":"C2","v":"S.US.AAL"},{"$f":"H1+1","v":2},"S.US.NUE       ",{"$f":"IFERROR(RTD(\"cqg.rtd\", ,\"ContractData\",I2, \"PerCentNetLastTrade\",, \"T\")/100,\"\")","v":4.5581242826692903E-2},null,null,{"$f":"M1-1","v":505},"S.US.ATVI      ",{"$f":"IFERROR(RTD(\"cqg.rtd\", ,\"ContractData\",N2, \"PerCentNetLastTrade\",, \"T\")/100,\"\")","v":-3.1547745077281392E-2}]
[null,null,"S.US.AAP       ",{"$f":"IFERROR(RTD(\"cqg.rtd\", ,\"ContractData\",C3, \"PerCentNetLastTrade\",, \"T\")/100,\"\")","v":-9.8140810728436449E-3},465,465,"S.US.AAP       ",{"$f":"H2+1","v":3},"S.US.REGN      ",{"$f":"IFERROR(RTD(\"cqg.rtd\", ,\"ContractData\",I3, \"PerCentNetLastTrade\",, \"T\")/100,\"\")","v":4.3182260260649682E-2},null,null,{"$f":"M2-1","v":504},"S.US.EQT       ",{"$f":"IFERROR(RTD(\"cqg.rtd\", ,\"ContractData\",N3, \"PerCentNetLastTrade\",, \"T\")/100,\"\")","v":-2.735042735042735E-2}]
[null,null,"S.US.AAPL      ",{"$f":"IFERROR(RTD(\"cqg.rtd\", ,\"ContractData\",C4, \"PerCentNetLastTrade\",, \"T\")/100,\"\")","v":9.9909173478655768E-3},119,119,"S.US.AAPL      ",4,"S.US.CCI",{"$f":"IFERROR(RTD(\"cqg.rtd\", ,\"ContractData\",I4, \"PerCentNetLastTrade\",, \"T\")/100,\"\")","v":2.9922338967565097E-2},null,null,503,"S.US.GPS       ",{"$f":"IFERROR(RTD(\"cqg.rtd\", ,\"ContractData\",N4, \"PerCentNetLastTrade\",, \"T\")/100,\"\")","v":-2.7504105090311984E-2}]
[null,null,"S.US.ABBV",{"$f":"IFERROR(RTD(\"cqg.rtd\", ,\"ContractData\",C5, \"PerCentNetLastTrade\",, \"T\")/100,\"\")","v":1.1585567692816948E-3},345,345,"S.US.ABBV",5,"S.US.STX       ",{"$f":"IFERROR(RTD(\"cqg.rtd\", ,\"ContractData\",I5, \"PerCentNetLastTrade\",, \"T\")/100,\"\")","v":2.8411536805854499E-2},null,null,502,"S.US.EXPE",{"$f":"IFERROR(RTD(\"cqg.rtd\", ,\"ContractData\",N5, \"PerCentNetLastTrade\",, \"T\")/100,\"\")","v":-2.6090501426824297E-2}]
[null,null,"S.US.ABC       ",{"$f":"IFERROR(RTD(\"cqg.rtd\", ,\"ContractData\",C6, \"PerCentNetLastTrade\",, \"T\")/100,\"\")","v":-7.7876494460897231E-3},458,458,"S.US.ABC       ",6,"S.US.XLNX      ",{"$f":"IFERROR(RTD(\"cqg.rtd\", ,\"ContractData\",I6, \"PerCentNetLastTrade\",, \"T\")/100,\"\")","v":2.6719531115324945E-2},null,null,501,"S.US.UA",{"$f":"IFERROR(RTD(\"cqg.rtd\", ,\"ContractData\",N6, \"PerCentNetLastTrade\",, \"T\")/100,\"\")","v":-2.1533613445378151E-2}]
[null,null,"S.US.ABT       ",{"$f":"IFERROR(RTD(\"cqg.rtd\", ,\"ContractData\",C7, \"PerCentNetLastTrade\",, \"T\")/100,\"\")","v":1.0060832943378568E-2},125,125,"S.US.ABT       ",7,"S.US.MOS",{"$f":"IFERROR(RTD(\"cqg.rtd\", ,\"ContractData\",I7, \"PerCentNetLastTrade\",, \"T\")/100,\"\")","v":2.5867315885575167E-2},null,null,500,"S.US.SWN       ",{"$f":"IFERROR(RTD(\"cqg.rtd\", ,\"ContractData\",N7, \"PerCentNetLastTrade\",, \"T\")/100,\"\")","v":-1.8867924528301886E-2}]
[null,null,"S.US.ACN       ",{"$f":"IFERROR(RTD(\"cqg.rtd\", ,\"ContractData\",C8, \"PerCentNetLastTrade\",, \"T\")/100,\"\")","v":8.5884353741496593E-3},152,152,"S.US.ACN       ",8,"S.US.CF        ",{"$f":"IFERROR(RTD(\"cqg.rtd\", ,\"ContractData\",I8, \"PerCentNetLastTrade\",, \"T\")/100,\"\")","v":2.5390625E-2},null,null,499,"S.US.HBI       ",{"$f":"IFERROR(RTD(\"cqg.rtd\", ,\"ContractData\",N8, \"PerCentNetLastTrade\",, \"T\")/100,\"\")","v":-1.870503597122302E-2}]
[null,null,"S.US.ADBE      ",{"$f":"IFERROR(RTD(\"cqg.rtd\", ,\"ContractData\",C9, \"PerCentNetLastTrade\",, \"T\")/100,\"\")","v":6.675224646983312E-3},186,186,"S.US.ADBE      ",9,"S.US.ICE",{"$f":"IFERROR(RTD(\"cqg.rtd\", ,\"ContractData\",I9, \"PerCentNetLastTrade\",, \"T\")/100,\"\")","v":2.4631396357328708E-2},null,null,498,"S.US.T         ",{"$f":"IFERROR(RTD(\"cqg.rtd\", ,\"ContractData\",N9, \"PerCentNetLastTrade\",, \"T\")/100,\"\")","v":-1.8849685838569358E-2}]
[null,null,"S.US.ADI       ",{"$f":"IFERROR(RTD(\"cqg.rtd\", ,\"ContractData\",C10, \"PerCentNetLastTrade\",, \"T\")/100,\"\")","v":1.8816150529204233E-2},28,28,"S.US.ADI       ",10,"S.US.C",{"$f":"IFERROR(RTD(\"cqg.rtd\", ,\"ContractData\",I10, \"PerCentNetLastTrade\",, \"T\")/100,\"\")","v":2.4813465209092486E-2},null,null,497,"S.US.KORS",{"$f":"IFERROR(RTD(\"cqg.rtd\", ,\"ContractData\",N10, \"PerCentNetLastTrade\",, \"T\")/100,\"\")","v":-1.7457008858780612E-2}]
[null,null,"S.US.ADM       ",{"$f":"IFERROR(RTD(\"cqg.rtd\", ,\"ContractData\",C11, \"PerCentNetLastTrade\",, \"T\")/100,\"\")","v":-2.9660050193931098E-3},411,411,"S.US.ADM       ",11,"S.US.CAT       "]
[null,null,"S.US.ADP       ",{"$f":"IFERROR(RTD(\"cqg.rtd\", ,\"ContractData\",C12, \"PerCentNetLastTrade\",, \"T\")/100,\"\")","v":7.0537722347168265E-3},184,184,"S.US.ADP       ",12,"S.US.DLPH"]
[null,null,"S.US.ADS       ",{"$f":"IFERROR(RTD(\"cqg.rtd\", ,\"ContractData\",C13, \"PerCentNetLastTrade\",, \"T\")/100,\"\")","v":3.9201867594591024E-3},270,270,"S.US.ADS       ",13,"S.US.AAL"]
[null,null,"S.US.ADSK      ",{"$f":"IFERROR(RTD(\"cqg.rtd\", ,\"ContractData\",C14, \"PerCentNetLastTrade\",, \"T\")/100,\"\")","v":1.6099963955304577E-2},49,49,"S.US.ADSK      ",14,"S.US.SWK       "]
[null,null,"S.US.AEE       ",{"$f":"IFERROR(RTD(\"cqg.rtd\", ,\"ContractData\",C15, \"PerCentNetLastTrade\",, \"T\")/100,\"\")","v":1.3225014169658039E-3},342,342,"S.US.AEE       ",15,"S.US.HPQ"]
[null,null,"S.US.AEP       ",{"$f":"IFERROR(RTD(\"cqg.rtd\", ,\"ContractData\",C16, \"PerCentNetLastTrade\",, \"T\")/100,\"\")","v":-2.3455824863174352E-3},407,407,"S.US.AEP       ",16,"S.US.CME       "]
[null,null,"S.US.AES       ",{"$f":"IFERROR(RTD(\"cqg.rtd\", ,\"ContractData\",C17, \"PerCentNetLastTrade\",, \"T\")/100,\"\")","v":4.3066322136089581E-3},260,260,"S.US.AES       ",17,"S.US.SCHW      "]
[null,null,"S.US.AET       ",{"$f":"IFERROR(RTD(\"cqg.rtd\", ,\"ContractData\",C18, \"PerCentNetLastTrade\",, \"T\")/100,\"\")","v":3.8622729887418852E-3},274,274,"S.US.AET       ",18,"S.US.PFG       "]
[null,null,"S.US.AFL       ",{"$f":"IFERROR(RTD(\"cqg.rtd\", ,\"ContractData\",C19, \"PerCentNetLastTrade\",, \"T\")/100,\"\")","v":1.4432695055730209E-2},67,67,"S.US.AFL       ",19,"S.US.IPG       "]
[null,null,"S.US.AGN",{"$f":"IFERROR(RTD(\"cqg.rtd\", ,\"ContractData\",C20, \"PerCentNetLastTrade\",, \"T\")/100,\"\")","v":2.2325052768306544E-3},305,305,"S.US.AGN",20,"S.US.LUV       "]
[null,null,"S.US.AIG       ",{"$f":"IFERROR(RTD(\"cqg.rtd\", ,\"ContractData\",C21, \"PerCentNetLastTrade\",, \"T\")/100,\"\")","v":8.23045267489712E-3},157,157,"S.US.AIG       ",21,"S.US.DISCA     "]
[null,null,"S.US.AIV       ",{"$f":"IFERROR(RTD(\"cqg.rtd\", ,\"ContractData\",C22, \"PerCentNetLastTrade\",, \"T\")/100,\"\")","v":-4.3744531933508314E-3},430,430,"S.US.AIV       ",22,"S.US.AMT"]
[null,null,"S.US.AIZ       ",{"$f":"IFERROR(RTD(\"cqg.rtd\", ,\"ContractData\",C23, \"PerCentNetLastTrade\",, \"T\")/100,\"\")","v":1.5495534273108791E-2},54,54,"S.US.AIZ       ",23,"S.US.ETFC      "]
[null,null,"S.US.AJG       ",{"$f":"IFERROR(RTD(\"cqg.rtd\", ,\"ContractData\",C24, \"PerCentNetLastTrade\",, \"T\")/100,\"\")","v":8.1566068515497563E-3},163,163,"S.US.AJG       ",24,"S.US.SRCL      "]
[null,null,"S.US.AKAM      ",{"$f":"IFERROR(RTD(\"cqg.rtd\", ,\"ContractData\",C25, \"PerCentNetLastTrade\",, \"T\")/100,\"\")","v":-6.5676309616888194E-3},449,449,"S.US.AKAM      ",25,"S.US.UAL       "]
[null,null,"S.US.ALB       ",{"$f":"IFERROR(RTD(\"cqg.rtd\", ,\"ContractData\",C26, \"PerCentNetLastTrade\",, \"T\")/100,\"\")","v":1.2059765208110994E-2},94,94,"S.US.ALB       ",26,"S.US.GILD      "]
[null,null,"S.US.ALK       ",{"$f":"IFERROR(RTD(\"cqg.rtd\", ,\"ContractData\",C27, \"PerCentNetLastTrade\",, \"T\")/100,\"\")","v":8.0123266563944529E-3},164,164,"S.US.ALK       ",27,"S.US.CERN      "]
[null,null,"S.US.ALL       ",{"$f":"IFERROR(RTD(\"cqg.rtd\", ,\"ContractData\",C28, \"PerCentNetLastTrade\",, \"T\")/100,\"\")","v":9.381338742393509E-3},135,135,"S.US.ALL       ",28,"S.US.ADI       "]
[null,null,"S.US.ALLE",{"$f":"IFERROR(RTD(\"cqg.rtd\", ,\"ContractData\",C29, \"PerCentNetLastTrade\",, \"T\")/100,\"\")","v":-5.8398220244716345E-3},437,437,"S.US.ALLE",29,"S.US.M         "]
[null,null,"S.US.ALXN      ",{"$f":"IFERROR(RTD(\"cqg.rtd\", ,\"ContractData\",C30, \"PerCentNetLastTrade\",, \"T\")/100,\"\")","v":9.0111453640028469E-3},144,144,"S.US.ALXN      ",30,"S.US.QCOM      "]
[null,null,"S.US.AMAT      ",{"$f":"IFERROR(RTD(\"cqg.rtd\", ,\"ContractData\",C31, \"PerCentNetLastTrade\",, \"T\")/100,\"\")","v":3.6806342015855038E-3},280,280,"S.US.AMAT      ",31,"S.US.FMC       "]
[null,null,"S.US.AME       ",{"$f":"IFERROR(RTD(\"cqg.rtd\", ,\"ContractData\",C32, \"PerCentNetLastTrade\",, \"T\")/100,\"\")","v":3.5500747384155456E-3},293,293,"S.US.AME       ",32,"S.US.UNM       "]
[null,null,"S.US.AMG       ",{"$f":"IFERROR(RTD(\"cqg.rtd\", ,\"ContractData\",C33, \"PerCentNetLastTrade\",, \"T\")/100,\"\")","v":-8.352225271447321E-4},375,375,"S.US.AMG       ",33,"S.US.WMB       "]
[null,null,"S.US.AMGN      ",{"$f":"IFERROR(RTD(\"cqg.rtd\", ,\"ContractData\",C34, \"PerCentNetLastTrade\",, \"T\")/100,\"\")","v":-8.9344213473107389E-4},379,379,"S.US.AMGN      ",34,"S.US.WY        "]
[null,null,"S.US.AMP       ",{"$f":"IFERROR(RTD(\"cqg.rtd\", ,\"ContractData\",C35, \"PerCentNetLastTrade\",, \"T\")/100,\"\")","v":1.6410586437132973E-2},44,44,"S.US.AMP       ",35,"S.US.ETN"]
[null,null,"S.US.AMT",{"$f":"IFERROR(RTD(\"cqg.rtd\", ,\"ContractData\",C36, \"PerCentNetLastTrade\",, \"T\")/100,\"\")","v":2.0286283060005687E-2},22,22,"S.US.AMT",36,"S.US.FLR       "]
[null,null,"S.US.AMZN      ",{"$f":"IFERROR(RTD(\"cqg.rtd\", ,\"ContractData\",C37, \"PerCentNetLastTrade\",, \"T\")/100,\"\")","v":1.1843472796268097E-2},98,98,"S.US.AMZN      ",37,"S.US.IFF       "]
[null,null,"S.US.AN        ",{"$f":"IFERROR(RTD(\"cqg.rtd\", ,\"ContractData\",C38, \"PerCentNetLastTrade\",, \"T\")/100,\"\")","v":-1.4202172096908938E-2},487,487,"S.US.AN        ",38,"S.US.STT       "]
[null,null,"S.US.ANTM",{"$f":"IFERROR(RTD(\"cqg.rtd\", ,\"ContractData\",C39, \"PerCentNetLastTrade\",, \"T\")/100,\"\")","v":8.5017249876786598E-3},156,156,"S.US.ANTM",39,"S.US.GS        "]
[null,null,"S.US.AON",{"$f":"IFERROR(RTD(\"cqg.rtd\", ,\"ContractData\",C40, \"PerCentNetLastTrade\",, \"T\")/100,\"\")","v":2.6818928973094559E-3},306,306,"S.US.AON",40,"S.US.BEN       "]
[null,null,"S.US.APA       ",{"$f":"IFERROR(RTD(\"cqg.rtd\", ,\"ContractData\",C41, \"PerCentNetLastTrade\",, \"T\")/100,\"\")","v":-1.7427675148135237E-3},390,390,"S.US.APA       ",41,"S.US.DAL       "]
[null,null,"S.US.APC       ",{"$f":"IFERROR(RTD(\"cqg.rtd\", ,\"ContractData\",C42, \"PerCentNetLastTrade\",, \"T\")/100,\"\")","v":-1.5719642342082493E-2},491,491,"S.US.APC       ",42,"S.US.PCAR      "]
[null,null,"S.US.APD       ",{"$f":"IFERROR(RTD(\"cqg.rtd\", ,\"ContractData\",C43, \"PerCentNetLastTrade\",, \"T\")/100,\"\")","v":2.9972168700492401E-3},301,301,"S.US.APD       ",43,"S.US.PYPL"]
[null,null,"S.US.APH       ",{"$f":"IFERROR(RTD(\"cqg.rtd\", ,\"ContractData\",C44, \"PerCentNetLastTrade\",, \"T\")/100,\"\")","v":3.780718336483932E-3},275,275,"S.US.APH       ",44,"S.US.AMP       "]
[null,null,"S.US.ARNC",{"$f":"IFERROR(RTD(\"cqg.rtd\", ,\"ContractData\",C45, \"PerCentNetLastTrade\",, \"T\")/100,\"\")","v":1.012829169480081E-3},331,331,"S.US.ARNC",45,"S.US.BIIB      "]
[null,null,"S.US.ATVI      ",{"$f":"IFERROR(RTD(\"cqg.rtd\", ,\"ContractData\",C46, \"PerCentNetLastTrade\",, \"T\")/100,\"\")","v":-3.1547745077281392E-2},505,505,"S.US.ATVI      ",46,"S.US.DISCK"]
[null,null,"S.US.AVB       ",{"$f":"IFERROR(RTD(\"cqg.rtd\", ,\"ContractData\",C47, \"PerCentNetLastTrade\",, \"T\")/100,\"\")","v":-6.7826763773836665E-3},452,452,"S.US.AVB       ",47,"S.US.HBAN      "]
[null,null,"S.US.AVGO",{"$f":"IFERROR(RTD(\"cqg.rtd\", ,\"ContractData\",C48, \"PerCentNetLastTrade\",, \"T\")/100,\"\")","v":4.9143635655897241E-3},239,239,"S.US.AVGO",48,"S.US.MS        "]
[null,null,"S.US.AVY       ",{"$f":"IFERROR(RTD(\"cqg.rtd\", ,\"ContractData\",C49, \"PerCentNetLastTrade\",, \"T\")/100,\"\")","v":2.0184180648416803E-3},322,322,"S.US.AVY       ",49,"S.US.ADSK      "]
[null,null,"S.US.AWK       ",{"$f":"IFERROR(RTD(\"cqg.rtd\", ,\"ContractData\",C50, \"PerCentNetLastTrade\",, \"T\")/100,\"\")","v":-3.8115981486523277E-3},422,422,"S.US.AWK       ",50,"S.US.BAC       "]
[null,null,"S.US.AXP       ",{"$f":"IFERROR(RTD(\"cqg.rtd\", ,\"ContractData\",C51, \"PerCentNetLastTrade\",, \"T\")/100,\"\")","v":6.2436289500509678E-3},205,205,"S.US.AXP       ",51,"S.US.PH        "]
[null,null,"S.US.AYI       ",{"$f":"IFERROR(RTD(\"cqg.rtd\", ,\"ContractData\",C52, \"PerCentNetLastTrade\",, \"T\")/100,\"\")","v":1.1265082956259427E-2},104,104,"S.US.AYI       ",52,"S.US.DNB       "]
[null,null,"S.US.AZO       ",{"$f":"IFERROR(RTD(\"cqg.rtd\", ,\"ContractData\",C53, \"PerCentNetLastTrade\",, \"T\")/100,\"\")","v":-5.8597178154323904E-3},441,441,"S.US.AZO       ",53,"S.US.FSLR      "]
[null,null,"S.US.BA        ",{"$f":"IFERROR(RTD(\"cqg.rtd\", ,\"ContractData\",C54, \"PerCentNetLastTrade\",, \"T\")/100,\"\")","v":1.1129158394994888E-2},108,108,"S.US.BA        ",54,"S.US.AIZ       "]
[null,null,"S.US.BAC       ",{"$f":"IFERROR(RTD(\"cqg.rtd\", ,\"ContractData\",C55, \"PerCentNetLastTrade\",, \"T\")/100,\"\")","v":1.6031195840554593E-2},50,50,"S.US.BAC       ",55,"S.US.VTR       "]
[null,null,"S.US.BAX       ",{"$f":"IFERROR(RTD(\"cqg.rtd\", ,\"ContractData\",C56, \"PerCentNetLastTrade\",, \"T\")/100,\"\")","v":4.8979591836734691E-3},247,247,"S.US.BAX       ",56,"S.US.LOGM      "]
[null,null,"S.US.BBBY      ",{"$f":"IFERROR(RTD(\"cqg.rtd\", ,\"ContractData\",C57, \"PerCentNetLastTrade\",, \"T\")/100,\"\")","v":-1.2422360248447205E-3},394,394,"S.US.BBBY      ",57,"S.US.CSCO      "]
[null,null,"S.US.BBT       ",{"$f":"IFERROR(RTD(\"cqg.rtd\", ,\"ContractData\",C58, \"PerCentNetLastTrade\",, \"T\")/100,\"\")","v":9.4359854171134454E-3},138,138,"S.US.BBT       ",58,"S.US.CMI       "]
[null,null,"S.US.BBY       ",{"$f":"IFERROR(RTD(\"cqg.rtd\", ,\"ContractData\",C59, \"PerCentNetLastTrade\",, \"T\")/100,\"\")","v":-1.3205013428827215E-2},485,485,"S.US.BBY       ",59,"S.US.CFG"]
[null,null,"S.US.BCR       ",{"$f":"IFERROR(RTD(\"cqg.rtd\", ,\"ContractData\",C60, \"PerCentNetLastTrade\",, \"T\")/100,\"\")","v":9.5717674476674026E-4},346,346,"S.US.BCR       ",60,"S.US.HON       "]
[null,null,"S.US.BDX       ",{"$f":"IFERROR(RTD(\"cqg.rtd\", ,\"ContractData\",C61, \"PerCentNetLastTrade\",, \"T\")/100,\"\")","v":3.0893669606246138E-3},295,295,"S.US.BDX       ",61,"S.US.WDC       "]
[null,null,"S.US.BEN       ",{"$f":"IFERROR(RTD(\"cqg.rtd\", ,\"ContractData\",C62, \"PerCentNetLastTrade\",, \"T\")/100,\"\")","v":1.6878669275929549E-2},40,40,"S.US.BEN       ",62,"S.US.NDAQ      "]
[null,null,"S.US.BFB",{"$f":"IFERROR(RTD(\"cqg.rtd\", ,\"ContractData\",C63, \"PerCentNetLastTrade\",, \"T\")/100,\"\")","v":-3.4071550255536627E-3},418,418,"S.US.BFB",63,"S.US.NLSN"]
[null,null,"S.US.BHI       ",{"$f":"IFERROR(RTD(\"cqg.rtd\", ,\"ContractData\",C64, \"PerCentNetLastTrade\",, \"T\")/100,\"\")","v":-2.4529844644317253E-3},406,406,"S.US.BHI       ",64,"S.US.SYF"]
[null,null,"S.US.BIIB      ",{"$f":"IFERROR(RTD(\"cqg.rtd\", ,\"ContractData\",C65, \"PerCentNetLastTrade\",, \"T\")/100,\"\")","v":1.6123162032319113E-2},45,45,"S.US.BIIB      ",65,{"$f":"IFERROR(VLOOKUP(H65,$F$1:$G$506,2,FALSE),\"\")","v":"S.US.CMA       "}]
[null,null,"S.US.BK        ",{"$f":"IFERROR(RTD(\"cqg.rtd\", ,\"ContractData\",C66, \"PerCentNetLastTrade\",, \"T\")/100,\"\")","v":1.4266900790166813E-2},66,{"$f":"IFERROR(E66,\"\")","v":66},{"$f":"C66","v":"S.US.BK        "},66,"S.US.BK        "]
[null,null,"S.US.BLK       ",{"$f":"IFERROR(RTD(\"cqg.rtd\", ,\"ContractData\",C67, \"PerCentNetLastTrade\",, \"T\")/100,\"\")","v":9.3499438481025893E-3},142,142,"S.US.BLK       ",{"$f":"H66+1","v":67},"S.US.AFL       "]
[null,null,"S.US.BLL       ",{"$f":"IFERROR(RTD(\"cqg.rtd\", ,\"ContractData\",C68, \"PerCentNetLastTrade\",, \"T\")/100,\"\")","v":-5.650477599892372E-3},438,438,"S.US.BLL       ",68,"S.US.ZION      "]
[null,null,"S.US.BMY       ",{"$f":"IFERROR(RTD(\"cqg.rtd\", ,\"ContractData\",C69, \"PerCentNetLastTrade\",, \"T\")/100,\"\")","v":7.7444336882865443E-3},168,168,"S.US.BMY       ",69,"S.US.CBG"]
[null,null,"S.US.BRKB",{"$f":"IFERROR(RTD(\"cqg.rtd\", ,\"ContractData\",C70, \"PerCentNetLastTrade\",, \"T\")/100,\"\")","v":1.2133406499603682E-2},92,92,"S.US.BRKB",70,"S.US.EMR       "]
[null,null,"S.US.BSX       ",{"$f":"IFERROR(RTD(\"cqg.rtd\", ,\"ContractData\",C71, \"PerCentNetLastTrade\",, \"T\")/100,\"\")","v":3.968253968253968E-3},273,273,"S.US.BSX       ",71,"S.US.RF        "]
[null,null,"S.US.BWA       ",{"$f":"IFERROR(RTD(\"cqg.rtd\", ,\"ContractData\",C72, \"PerCentNetLastTrade\",, \"T\")/100,\"\")","v":2.4021138601969731E-3},317,317,"S.US.BWA       ",72,"S.US.PXD       "]
[null,null,"S.US.BXP       ",{"$f":"IFERROR(RTD(\"cqg.rtd\", ,\"ContractData\",C73, \"PerCentNetLastTrade\",, \"T\")/100,\"\")","v":5.0746268656716416E-3},234,234,"S.US.BXP       ",73,"S.US.LLL"]
[null,null,"S.US.C",{"$f":"IFERROR(RTD(\"cqg.rtd\", ,\"ContractData\",C74, \"PerCentNetLastTrade\",, \"T\")/100,\"\")","v":2.4813465209092486E-2},10,10,"S.US.C",74,"S.US.JPM       "]
[null,null,"S.US.CA        ",{"$f":"IFERROR(RTD(\"cqg.rtd\", ,\"ContractData\",C75, \"PerCentNetLastTrade\",, \"T\")/100,\"\")","v":2.8328611898016999E-3},307,307,"S.US.CA        ",75,"S.US.TMK       "]
[null,null,"S.US.CAG       ",{"$f":"IFERROR(RTD(\"cqg.rtd\", ,\"ContractData\",C76, \"PerCentNetLastTrade\",, \"T\")/100,\"\")","v":-1.5060240963855422E-3},395,395,"S.US.CAG       ",76,"S.US.DFS       "]
[null,null,"S.US.CAH       ",{"$f":"IFERROR(RTD(\"cqg.rtd\", ,\"ContractData\",C77, \"PerCentNetLastTrade\",, \"T\")/100,\"\")","v":8.7855297157622744E-3},149,149,"S.US.CAH       ",77,"S.US.MET       "]
[null,null,"S.US.CAT       ",{"$f":"IFERROR(RTD(\"cqg.rtd\", ,\"ContractData\",C78, \"PerCentNetLastTrade\",, \"T\")/100,\"\")","v":2.3465891392378774E-2},11,11,"S.US.CAT       ",78,"S.US.CBS       "]
[null,null,"S.US.CB",{"$f":"IFERROR(RTD(\"cqg.rtd\", ,\"ContractData\",C79, \"PerCentNetLastTrade\",, \"T\")/100,\"\")","v":8.5869237722205477E-3},154,154,"S.US.CB",79,"S.US.KEY       "]
[null,null,"S.US.CBG",{"$f":"IFERROR(RTD(\"cqg.rtd\", ,\"ContractData\",C80, \"PerCentNetLastTrade\",, \"T\")/100,\"\")","v":1.411764705882353E-2},69,69,"S.US.CBG",80,"S.US.PNR"]
[null,null,"S.US.CBS       ",{"$f":"IFERROR(RTD(\"cqg.rtd\", ,\"ContractData\",C81, \"PerCentNetLastTrade\",, \"T\")/100,\"\")","v":1.3043478260869566E-2},78,78,"S.US.CBS       ",81,"S.US.RTN       "]
[null,null,"S.US.CCI",{"$f":"IFERROR(RTD(\"cqg.rtd\", ,\"ContractData\",C82, \"PerCentNetLastTrade\",, \"T\")/100,\"\")","v":2.9922338967565097E-2},4,4,"S.US.CCI",82,"S.US.LUK       "]
[null,null,"S.US.CCL       ",{"$f":"IFERROR(RTD(\"cqg.rtd\", ,\"ContractData\",C83, \"PerCentNetLastTrade\",, \"T\")/100,\"\")","v":5.6888888888888892E-3},215,215,"S.US.CCL       ",83,"S.US.NOC       "]
[null,null,"S.US.CELG      ",{"$f":"IFERROR(RTD(\"cqg.rtd\", ,\"ContractData\",C84, \"PerCentNetLastTrade\",, \"T\")/100,\"\")","v":7.17930974829167E-3},187,187,"S.US.CELG      ",84,"S.US.NTRS      "]
[null,null,"S.US.CERN      ",{"$f":"IFERROR(RTD(\"cqg.rtd\", ,\"ContractData\",C85, \"PerCentNetLastTrade\",, \"T\")/100,\"\")","v":1.8640776699029128E-2},27,27,"S.US.CERN      ",85,"S.US.JNPR      "]
[null,null,"S.US.CF        ",{"$f":"IFERROR(RTD(\"cqg.rtd\", ,\"ContractData\",C86, \"PerCentNetLastTrade\",, \"T\")/100,\"\")","v":2.5390625E-2},8,8,"S.US.CF        ",86,"S.US.HST       "]
[null,null,"S.US.CFG",{"$f":"IFERROR(RTD(\"cqg.rtd\", ,\"ContractData\",C87, \"PerCentNetLastTrade\",, \"T\")/100,\"\")","v":1.4827018121911038E-2},59,59,"S.US.CFG",87,"S.US.GD        "]
[null,null,"S.US.CHD       ",{"$f":"IFERROR(RTD(\"cqg.rtd\", ,\"ContractData\",C88, \"PerCentNetLastTrade\",, \"T\")/100,\"\")","v":3.7313432835820899E-3},290,290,"S.US.CHD       ",88,"S.US.SNA       "]
[null,null,"S.US.CHK       ",{"$f":"IFERROR(RTD(\"cqg.rtd\", ,\"ContractData\",C89, \"PerCentNetLastTrade\",, \"T\")/100,\"\")","v":-6.2695924764890288E-3},447,447,"S.US.CHK       ",89,"S.US.GRMN      "]
[null,null,"S.US.CHRW      ",{"$f":"IFERROR(RTD(\"cqg.rtd\", ,\"ContractData\",C90, \"PerCentNetLastTrade\",, \"T\")/100,\"\")","v":7.9676071055381405E-3},171,171,"S.US.CHRW      ",90,"S.US.UHS       "]
[null,null,"S.US.CHTR",{"$f":"IFERROR(RTD(\"cqg.rtd\", ,\"ContractData\",C91, \"PerCentNetLastTrade\",, \"T\")/100,\"\")","v":-5.2070495439980281E-3},435,435,"S.US.CHTR",91,"S.US.INTC      "]
[null,null,"S.US.CI        ",{"$f":"IFERROR(RTD(\"cqg.rtd\", ,\"ContractData\",C92, \"PerCentNetLastTrade\",, \"T\")/100,\"\")","v":2.6107866712469941E-3},320,320,"S.US.CI        ",92,"S.US.BRKB"]
[null,null,"S.US.CINF      ",{"$f":"IFERROR(RTD(\"cqg.rtd\", ,\"ContractData\",C93, \"PerCentNetLastTrade\",, \"T\")/100,\"\")","v":1.0554461018857304E-2},113,113,"S.US.CINF      ",93,"S.US.HRS       "]
[null,null,"S.US.CL        ",{"$f":"IFERROR(RTD(\"cqg.rtd\", ,\"ContractData\",C94, \"PerCentNetLastTrade\",, \"T\")/100,\"\")","v":1.0336680448907265E-3},353,353,"S.US.CL        ",94,"S.US.ALB       "]
[null,null,"S.US.CLX       ",{"$f":"IFERROR(RTD(\"cqg.rtd\", ,\"ContractData\",C95, \"PerCentNetLastTrade\",, \"T\")/100,\"\")","v":1.4957096748799495E-3},334,334,"S.US.CLX       ",95,"S.US.FCX       "]
[null,null,"S.US.CMA       ",{"$f":"IFERROR(RTD(\"cqg.rtd\", ,\"ContractData\",C96, \"PerCentNetLastTrade\",, \"T\")/100,\"\")","v":1.4639802869981157E-2},65,65,"S.US.CMA       ",96,"S.US.PNC       "]
[null,null,"S.US.CMCSA     ",{"$f":"IFERROR(RTD(\"cqg.rtd\", ,\"ContractData\",C97, \"PerCentNetLastTrade\",, \"T\")/100,\"\")","v":6.7864271457085826E-3},192,192,"S.US.CMCSA     ",97,"S.US.LNC       "]
[null,null,"S.US.CME       ",{"$f":"IFERROR(RTD(\"cqg.rtd\", ,\"ContractData\",C98, \"PerCentNetLastTrade\",, \"T\")/100,\"\")","v":2.151622121364935E-2},16,16,"S.US.CME       ",98,"S.US.AMZN      "]
[null,null,"S.US.CMG       ",{"$f":"IFERROR(RTD(\"cqg.rtd\", ,\"ContractData\",C99, \"PerCentNetLastTrade\",, \"T\")/100,\"\")","v":1.3305593187536288E-3},335,335,"S.US.CMG       ",99,"S.US.PRU       "]
[null,null,"S.US.CMI       ",{"$f":"IFERROR(RTD(\"cqg.rtd\", ,\"ContractData\",C100, \"PerCentNetLastTrade\",, \"T\")/100,\"\")","v":1.5276301806588734E-2},58,58,"S.US.CMI       ",100,"S.US.FLS       "]
[null,null,"S.US.CMS       ",{"$f":"IFERROR(RTD(\"cqg.rtd\", ,\"ContractData\",C101, \"PerCentNetLastTrade\",, \"T\")/100,\"\")","v":3.2611227579781039E-3},291,291,"S.US.CMS       ",101,"S.US.ITW       "]
[null,null,"S.US.CNC       ",{"$f":"IFERROR(RTD(\"cqg.rtd\", ,\"ContractData\",C102, \"PerCentNetLastTrade\",, \"T\")/100,\"\")","v":8.933717579250721E-3},148,148,"S.US.CNC       ",102,"S.US.ESRX"]
[null,null,"S.US.CNP       ",{"$f":"IFERROR(RTD(\"cqg.rtd\", ,\"ContractData\",C103, \"PerCentNetLastTrade\",, \"T\")/100,\"\")","v":5.2850132125330318E-3},229,229,"S.US.CNP       ",103,"S.US.MMM       "]
[null,null,"S.US.COF       ",{"$f":"IFERROR(RTD(\"cqg.rtd\", ,\"ContractData\",C104, \"PerCentNetLastTrade\",, \"T\")/100,\"\")","v":9.3891402714932123E-3},131,131,"S.US.COF       ",104,"S.US.AYI       "]
[null,null,"S.US.COG       ",{"$f":"IFERROR(RTD(\"cqg.rtd\", ,\"ContractData\",C105, \"PerCentNetLastTrade\",, \"T\")/100,\"\")","v":-6.6472787702534274E-3},451,451,"S.US.COG       ",105,"S.US.MYL"]
[null,null,"S.US.COH       ",{"$f":"IFERROR(RTD(\"cqg.rtd\", ,\"ContractData\",C106, \"PerCentNetLastTrade\",, \"T\")/100,\"\")","v":2.1013921723141583E-3},310,310,"S.US.COH       ",106,"S.US.USB       "]
[null,null,"S.US.COL       ",{"$f":"IFERROR(RTD(\"cqg.rtd\", ,\"ContractData\",C107, \"PerCentNetLastTrade\",, \"T\")/100,\"\")","v":8.7748162772841934E-3},153,153,"S.US.COL       ",107,"S.US.MTB       "]
[null,null,"S.US.COO       ",{"$f":"IFERROR(RTD(\"cqg.rtd\", ,\"ContractData\",C108, \"PerCentNetLastTrade\",, \"T\")/100,\"\")","v":1.099476439790576E-3},350,350,"S.US.COO       ",108,"S.US.BA        "]
[null,null,"S.US.COP       ",{"$f":"IFERROR(RTD(\"cqg.rtd\", ,\"ContractData\",C109, \"PerCentNetLastTrade\",, \"T\")/100,\"\")","v":-8.7754287993617869E-3},460,460,"S.US.COP       ",109,"S.US.KSU       "]
[null,null,"S.US.COST      ",{"$f":"IFERROR(RTD(\"cqg.rtd\", ,\"ContractData\",C110, \"PerCentNetLastTrade\",, \"T\")/100,\"\")","v":-4.0697674418604653E-4},374,374,"S.US.COST      ",110,"S.US.MAR       "]
[null,null,"S.US.COTY",{"$f":"IFERROR(RTD(\"cqg.rtd\", ,\"ContractData\",C111, \"PerCentNetLastTrade\",, \"T\")/100,\"\")","v":6.0175054704595188E-3},209,209,"S.US.COTY",111,"S.US.NSC       "]
[null,null,"S.US.CPB       ",{"$f":"IFERROR(RTD(\"cqg.rtd\", ,\"ContractData\",C112, \"PerCentNetLastTrade\",, \"T\")/100,\"\")","v":1.7385806859491072E-3},328,328,"S.US.CPB       ",112,"S.US.PX        "]
[null,null,"S.US.CRM       ",{"$f":"IFERROR(RTD(\"cqg.rtd\", ,\"ContractData\",C113, \"PerCentNetLastTrade\",, \"T\")/100,\"\")","v":3.7202380952380955E-3},279,279,"S.US.CRM       ",113,"S.US.CINF      "]
[null,null,"S.US.CSCO      ",{"$f":"IFERROR(RTD(\"cqg.rtd\", ,\"ContractData\",C114, \"PerCentNetLastTrade\",, \"T\")/100,\"\")","v":1.4915899714376388E-2},57,57,"S.US.CSCO      ",114,"S.US.UPS       "]
[null,null,"S.US.CSRA",{"$f":"IFERROR(RTD(\"cqg.rtd\", ,\"ContractData\",C115, \"PerCentNetLastTrade\",, \"T\")/100,\"\")","v":-1.0960670535138621E-2},472,472,"S.US.CSRA",115,"S.US.R         "]
[null,null,"S.US.CSX       ",{"$f":"IFERROR(RTD(\"cqg.rtd\", ,\"ContractData\",C116, \"PerCentNetLastTrade\",, \"T\")/100,\"\")","v":3.7680552648105504E-3},272,272,"S.US.CSX       ",116,"S.US.XEC       "]
[null,null,"S.US.CTAS      ",{"$f":"IFERROR(RTD(\"cqg.rtd\", ,\"ContractData\",C117, \"PerCentNetLastTrade\",, \"T\")/100,\"\")","v":2.7416038382453733E-3},304,304,"S.US.CTAS      ",117,"S.US.SHW       "]
[null,null,"S.US.CTL       ",{"$f":"IFERROR(RTD(\"cqg.rtd\", ,\"ContractData\",C118, \"PerCentNetLastTrade\",, \"T\")/100,\"\")","v":4.8999591670069419E-3},246,246,"S.US.CTL       ",118,"S.US.GM        "]
[null,null,"S.US.CTSH      ",{"$f":"IFERROR(RTD(\"cqg.rtd\", ,\"ContractData\",C119, \"PerCentNetLastTrade\",, \"T\")/100,\"\")","v":5.4006968641114985E-3},221,221,"S.US.CTSH      ",119,"S.US.AAPL      "]
[null,null,"S.US.CTXS      ",{"$f":"IFERROR(RTD(\"cqg.rtd\", ,\"ContractData\",C120, \"PerCentNetLastTrade\",, \"T\")/100,\"\")","v":2.546148949713558E-3},308,308,"S.US.CTXS      ",120,"S.US.MCO       "]
[null,null,"S.US.CVS       ",{"$f":"IFERROR(RTD(\"cqg.rtd\", ,\"ContractData\",C121, \"PerCentNetLastTrade\",, \"T\")/100,\"\")","v":2.5467974022666496E-3},312,312,"S.US.CVS       ",121,"S.US.FITB      "]
[null,null,"S.US.CVX       ",{"$f":"IFERROR(RTD(\"cqg.rtd\", ,\"ContractData\",C122, \"PerCentNetLastTrade\",, \"T\")/100,\"\")","v":7.6072534276868638E-3},173,173,"S.US.CVX       ",122,"S.US.MSFT      "]
[null,null,"S.US.CXO       ",{"$f":"IFERROR(RTD(\"cqg.rtd\", ,\"ContractData\",C123, \"PerCentNetLastTrade\",, \"T\")/100,\"\")","v":-4.6118370484242886E-3},426,426,"S.US.CXO       ",123,"S.US.MNK"]
[null,null,"S.US.D         ",{"$f":"IFERROR(RTD(\"cqg.rtd\", ,\"ContractData\",C124, \"PerCentNetLastTrade\",, \"T\")/100,\"\")","v":5.3155240561537408E-3},236,236,"S.US.D         ",124,"S.US.FISV      "]
[null,null,"S.US.DAL       ",{"$f":"IFERROR(RTD(\"cqg.rtd\", ,\"ContractData\",C125, \"PerCentNetLastTrade\",, \"T\")/100,\"\")","v":1.6849370686155097E-2},41,41,"S.US.DAL       ",125,"S.US.ABT       "]
[null,null,"S.US.DD        ",{"$f":"IFERROR(RTD(\"cqg.rtd\", ,\"ContractData\",C126, \"PerCentNetLastTrade\",, \"T\")/100,\"\")","v":6.864395803652377E-3},182,182,"S.US.DD        ",126,"S.US.PAYX      "]
[null,null,"S.US.DE        ",{"$f":"IFERROR(RTD(\"cqg.rtd\", ,\"ContractData\",C127, \"PerCentNetLastTrade\",, \"T\")/100,\"\")","v":4.6262699564586359E-3},249,249,"S.US.DE        ",127,"S.US.IR        "]
[null,null,"S.US.DFS       ",{"$f":"IFERROR(RTD(\"cqg.rtd\", ,\"ContractData\",C128, \"PerCentNetLastTrade\",, \"T\")/100,\"\")","v":1.3222900319674514E-2},76,76,"S.US.DFS       ",128,"S.US.IVZ"]
[null,null,"S.US.DG        ",{"$f":"IFERROR(RTD(\"cqg.rtd\", ,\"ContractData\",C129, \"PerCentNetLastTrade\",, \"T\")/100,\"\")","v":-9.6366714415939587E-3},469,469,"S.US.DG        ",129,{"$f":"IFERROR(VLOOKUP(H129,$F$1:$G$506,2,FALSE),\"\")","v":"S.US.STI       "}]
[null,null,"S.US.DGX       ",{"$f":"IFERROR(RTD(\"cqg.rtd\", ,\"ContractData\",C130, \"PerCentNetLastTrade\",, \"T\")/100,\"\")","v":4.4890979050876446E-3},255,{"$f":"IFERROR(E130,\"\")","v":255},{"$f":"C130","v":"S.US.DGX       "},130,"S.US.MRK       "]
[null,null,"S.US.DHI       ",{"$f":"IFERROR(RTD(\"cqg.rtd\", ,\"ContractData\",C131, \"PerCentNetLastTrade\",, \"T\")/100,\"\")","v":-1.2329656067488643E-2},480,480,"S.US.DHI       ",{"$f":"H130+1","v":131},"S.US.COF       "]
[null,null,"S.US.DHR       ",{"$f":"IFERROR(RTD(\"cqg.rtd\", ,\"ContractData\",C132, \"PerCentNetLastTrade\",, \"T\")/100,\"\")","v":2.6196713503215054E-3},314,314,"S.US.DHR       ",132,"S.US.MDT"]
[null,null,"S.US.DIS       ",{"$f":"IFERROR(RTD(\"cqg.rtd\", ,\"ContractData\",C133, \"PerCentNetLastTrade\",, \"T\")/100,\"\")","v":3.5694673256452497E-3},283,283,"S.US.DIS       ",133,"S.US.TMO       "]
[null,null,"S.US.DISCA     ",{"$f":"IFERROR(RTD(\"cqg.rtd\", ,\"ContractData\",C134, \"PerCentNetLastTrade\",, \"T\")/100,\"\")","v":2.0365168539325844E-2},21,21,"S.US.DISCA     ",134,"S.US.SCG       "]
[null,null,"S.US.DISCK",{"$f":"IFERROR(RTD(\"cqg.rtd\", ,\"ContractData\",C135, \"PerCentNetLastTrade\",, \"T\")/100,\"\")","v":1.6274864376130196E-2},46,46,"S.US.DISCK",135,"S.US.ALL       "]
[null,null,"S.US.DLPH",{"$f":"IFERROR(RTD(\"cqg.rtd\", ,\"ContractData\",C136, \"PerCentNetLastTrade\",, \"T\")/100,\"\")","v":2.3546824542518836E-2},12,12,"S.US.DLPH",136,"S.US.RSG       "]
[null,null,"S.US.DLR       ",{"$f":"IFERROR(RTD(\"cqg.rtd\", ,\"ContractData\",C137, \"PerCentNetLastTrade\",, \"T\")/100,\"\")","v":1.3992537313432835E-3},332,332,"S.US.DLR       ",137,"S.US.PRGO"]
[null,null,"S.US.DLTR",{"$f":"IFERROR(RTD(\"cqg.rtd\", ,\"ContractData\",C138, \"PerCentNetLastTrade\",, \"T\")/100,\"\")","v":-4.870546013842604E-3},431,431,"S.US.DLTR",138,"S.US.BBT       "]
[null,null,"S.US.DNB       ",{"$f":"IFERROR(RTD(\"cqg.rtd\", ,\"ContractData\",C139, \"PerCentNetLastTrade\",, \"T\")/100,\"\")","v":1.5285359801488834E-2},52,52,"S.US.DNB       ",139,"S.US.GE        "]
[null,null,"S.US.DOV       ",{"$f":"IFERROR(RTD(\"cqg.rtd\", ,\"ContractData\",C140, \"PerCentNetLastTrade\",, \"T\")/100,\"\")","v":5.4238143289606459E-3},233,233,"S.US.DOV       ",140,"S.US.YHOO      "]
[null,null,"S.US.DOW       ",{"$f":"IFERROR(RTD(\"cqg.rtd\", ,\"ContractData\",C141, \"PerCentNetLastTrade\",, \"T\")/100,\"\")","v":6.5370158522634414E-3},193,193,"S.US.DOW       ",141,"S.US.EMN       "]
[null,null,"S.US.DPS       ",{"$f":"IFERROR(RTD(\"cqg.rtd\", ,\"ContractData\",C142, \"PerCentNetLastTrade\",, \"T\")/100,\"\")","v":-1.7101325352714837E-3},400,400,"S.US.DPS       ",142,"S.US.BLK       "]
[null,null,"S.US.DRI       ",{"$f":"IFERROR(RTD(\"cqg.rtd\", ,\"ContractData\",C143, \"PerCentNetLastTrade\",, \"T\")/100,\"\")","v":-1.5731515469323545E-3},398,398,"S.US.DRI       ",143,"S.US.MA        "]
[null,null,"S.US.DTE       ",{"$f":"IFERROR(RTD(\"cqg.rtd\", ,\"ContractData\",C144, \"PerCentNetLastTrade\",, \"T\")/100,\"\")","v":6.5735414954806899E-3},207,207,"S.US.DTE       ",144,"S.US.ALXN      "]
[null,null,"S.US.DUK",{"$f":"IFERROR(RTD(\"cqg.rtd\", ,\"ContractData\",C145, \"PerCentNetLastTrade\",, \"T\")/100,\"\")","v":6.5300896286811785E-3},197,197,"S.US.DUK",145,"S.US.FDX       "]
[null,null,"S.US.DVA       ",{"$f":"IFERROR(RTD(\"cqg.rtd\", ,\"ContractData\",C146, \"PerCentNetLastTrade\",, \"T\")/100,\"\")","v":1.3899613899613899E-3},341,341,"S.US.DVA       ",146,"S.US.XYL"]
[null,null,"S.US.DVN       ",{"$f":"IFERROR(RTD(\"cqg.rtd\", ,\"ContractData\",C147, \"PerCentNetLastTrade\",, \"T\")/100,\"\")","v":-1.3212948689715924E-3},384,384,"S.US.DVN       ",147,"S.US.UTX       "]
[null,null,"S.US.EA",{"$f":"IFERROR(RTD(\"cqg.rtd\", ,\"ContractData\",C148, \"PerCentNetLastTrade\",, \"T\")/100,\"\")","v":8.1234768480909826E-4},344,344,"S.US.EA",148,"S.US.CNC       "]
[null,null,"S.US.EBAY      ",{"$f":"IFERROR(RTD(\"cqg.rtd\", ,\"ContractData\",C149, \"PerCentNetLastTrade\",, \"T\")/100,\"\")","v":5.947071067499257E-3},212,212,"S.US.EBAY      ",149,"S.US.CAH       "]
[null,null,"S.US.ECL       ",{"$f":"IFERROR(RTD(\"cqg.rtd\", ,\"ContractData\",C150, \"PerCentNetLastTrade\",, \"T\")/100,\"\")","v":5.7755775577557752E-3},216,216,"S.US.ECL       ",150,"S.US.MCK       "]
[null,null,"S.US.ED        ",{"$f":"IFERROR(RTD(\"cqg.rtd\", ,\"ContractData\",C151, \"PerCentNetLastTrade\",, \"T\")/100,\"\")","v":-5.8862876254180607E-3},442,442,"S.US.ED        ",151,"S.US.WLTW"]
[null,null,"S.US.EFX       ",{"$f":"IFERROR(RTD(\"cqg.rtd\", ,\"ContractData\",C152, \"PerCentNetLastTrade\",, \"T\")/100,\"\")","v":-1.3786764705882354E-3},391,391,"S.US.EFX       ",152,"S.US.ACN       "]
[null,null,"S.US.EIX       ",{"$f":"IFERROR(RTD(\"cqg.rtd\", ,\"ContractData\",C153, \"PerCentNetLastTrade\",, \"T\")/100,\"\")","v":4.3877143996808934E-3},258,258,"S.US.EIX       ",153,"S.US.COL       "]
[null,null,"S.US.EL        ",{"$f":"IFERROR(RTD(\"cqg.rtd\", ,\"ContractData\",C154, \"PerCentNetLastTrade\",, \"T\")/100,\"\")","v":1.6951204746337328E-3},326,326,"S.US.EL        ",154,"S.US.CB"]
[null,null,"S.US.EMN       ",{"$f":"IFERROR(RTD(\"cqg.rtd\", ,\"ContractData\",C155, \"PerCentNetLastTrade\",, \"T\")/100,\"\")","v":9.1985887096774181E-3},141,141,"S.US.EMN       ",155,"S.US.MMC       "]
[null,null,"S.US.EMR       ",{"$f":"IFERROR(RTD(\"cqg.rtd\", ,\"ContractData\",C156, \"PerCentNetLastTrade\",, \"T\")/100,\"\")","v":1.4068921909579512E-2},70,70,"S.US.EMR       ",156,"S.US.ANTM"]
[null,null,"S.US.ENDP",{"$f":"IFERROR(RTD(\"cqg.rtd\", ,\"ContractData\",C157, \"PerCentNetLastTrade\",, \"T\")/100,\"\")","v":4.9751243781094526E-3},267,267,"S.US.ENDP",157,"S.US.AIG       "]
[null,null,"S.US.EOG       ",{"$f":"IFERROR(RTD(\"cqg.rtd\", ,\"ContractData\",C158, \"PerCentNetLastTrade\",, \"T\")/100,\"\")","v":-9.956624605678234E-3},467,467,"S.US.EOG       ",158,"S.US.SYK       "]
[null,null,"S.US.EQIX",{"$f":"IFERROR(RTD(\"cqg.rtd\", ,\"ContractData\",C159, \"PerCentNetLastTrade\",, \"T\")/100,\"\")","v":9.31556475611334E-4},348,348,"S.US.EQIX",159,"S.US.XRAY"]
[null,null,"S.US.EQR       ",{"$f":"IFERROR(RTD(\"cqg.rtd\", ,\"ContractData\",C160, \"PerCentNetLastTrade\",, \"T\")/100,\"\")","v":3.0679799773938314E-3},299,299,"S.US.EQR       ",160,"S.US.TSS       "]
[null,null,"S.US.EQT       ",{"$f":"IFERROR(RTD(\"cqg.rtd\", ,\"ContractData\",C161, \"PerCentNetLastTrade\",, \"T\")/100,\"\")","v":-2.735042735042735E-2},504,504,"S.US.EQT       ",161,"S.US.OMC       "]
[null,null,"S.US.ES",{"$f":"IFERROR(RTD(\"cqg.rtd\", ,\"ContractData\",C162, \"PerCentNetLastTrade\",, \"T\")/100,\"\")","v":8.8621056362991847E-4},347,347,"S.US.ES",162,"S.US.PDCO      "]
[null,null,"S.US.ESRX",{"$f":"IFERROR(RTD(\"cqg.rtd\", ,\"ContractData\",C163, \"PerCentNetLastTrade\",, \"T\")/100,\"\")","v":1.1548019295424644E-2},102,102,"S.US.ESRX",163,"S.US.AJG       "]
[null,null,"S.US.ESS       ",{"$f":"IFERROR(RTD(\"cqg.rtd\", ,\"ContractData\",C164, \"PerCentNetLastTrade\",, \"T\")/100,\"\")","v":-7.4875207986688855E-3},453,453,"S.US.ESS       ",164,"S.US.ALK       "]
[null,null,"S.US.ETFC      ",{"$f":"IFERROR(RTD(\"cqg.rtd\", ,\"ContractData\",C165, \"PerCentNetLastTrade\",, \"T\")/100,\"\")","v":1.968503937007874E-2},23,23,"S.US.ETFC      ",165,"S.US.PFE       "]
[null,null,"S.US.ETN",{"$f":"IFERROR(RTD(\"cqg.rtd\", ,\"ContractData\",C166, \"PerCentNetLastTrade\",, \"T\")/100,\"\")","v":1.7464788732394366E-2},35,35,"S.US.ETN",166,"S.US.TGNA"]
[null,null,"S.US.ETR       ",{"$f":"IFERROR(RTD(\"cqg.rtd\", ,\"ContractData\",C167, \"PerCentNetLastTrade\",, \"T\")/100,\"\")","v":3.9089766857461957E-3},276,276,"S.US.ETR       ",167,"S.US.PKI       "]
[null,null,"S.US.EVHC",{"$f":"IFERROR(RTD(\"cqg.rtd\", ,\"ContractData\",C168, \"PerCentNetLastTrade\",, \"T\")/100,\"\")","v":-1.0227936879018119E-2},474,474,"S.US.EVHC",168,"S.US.BMY       "]
[null,null,"S.US.EW        ",{"$f":"IFERROR(RTD(\"cqg.rtd\", ,\"ContractData\",C169, \"PerCentNetLastTrade\",, \"T\")/100,\"\")","v":-4.4277175116227583E-3},428,428,"S.US.EW        ",169,"S.US.RCL       "]
[null,null,"S.US.EXC       ",{"$f":"IFERROR(RTD(\"cqg.rtd\", ,\"ContractData\",C170, \"PerCentNetLastTrade\",, \"T\")/100,\"\")","v":2.8555111364934324E-4},361,361,"S.US.EXC       ",170,"S.US.ORCL      "]
[null,null,"S.US.EXPD      ",{"$f":"IFERROR(RTD(\"cqg.rtd\", ,\"ContractData\",C171, \"PerCentNetLastTrade\",, \"T\")/100,\"\")","v":6.7604604421706562E-3},201,201,"S.US.EXPD      ",171,"S.US.CHRW      "]
[null,null,"S.US.EXPE",{"$f":"IFERROR(RTD(\"cqg.rtd\", ,\"ContractData\",C172, \"PerCentNetLastTrade\",, \"T\")/100,\"\")","v":-2.6090501426824297E-2},502,502,"S.US.EXPE",172,"S.US.NAVI"]
[null,null,"S.US.EXR       ",{"$f":"IFERROR(RTD(\"cqg.rtd\", ,\"ContractData\",C173, \"PerCentNetLastTrade\",, \"T\")/100,\"\")","v":-1.3333333333333333E-3},392,392,"S.US.EXR       ",173,"S.US.CVX       "]
[null,null,"S.US.F         ",{"$f":"IFERROR(RTD(\"cqg.rtd\", ,\"ContractData\",C174, \"PerCentNetLastTrade\",, \"T\")/100,\"\")","v":4.796163069544365E-3},271,271,"S.US.F         ",174,"S.US.TROW      "]
[null,null,"S.US.FAST      ",{"$f":"IFERROR(RTD(\"cqg.rtd\", ,\"ContractData\",C175, \"PerCentNetLastTrade\",, \"T\")/100,\"\")","v":-3.3770361541517681E-3},417,417,"S.US.FAST      ",175,"S.US.PEG       "]
[null,null,"S.US.FB",{"$f":"IFERROR(RTD(\"cqg.rtd\", ,\"ContractData\",C176, \"PerCentNetLastTrade\",, \"T\")/100,\"\")","v":-1.2668604217899993E-3},386,386,"S.US.FB",176,"S.US.LMT       "]
[null,null,"S.US.FBHS",{"$f":"IFERROR(RTD(\"cqg.rtd\", ,\"ContractData\",C177, \"PerCentNetLastTrade\",, \"T\")/100,\"\")","v":0},363,363,"S.US.FBHS",177,"S.US.UNH       "]
[null,null,"S.US.FCX       ",{"$f":"IFERROR(RTD(\"cqg.rtd\", ,\"ContractData\",C178, \"PerCentNetLastTrade\",, \"T\")/100,\"\")","v":1.1392405063291139E-2},95,95,"S.US.FCX       ",178,"S.US.L         "]
[null,null,"S.US.FDX       ",{"$f":"IFERROR(RTD(\"cqg.rtd\", ,\"ContractData\",C179, \"PerCentNetLastTrade\",, \"T\")/100,\"\")","v":9.1166299905690029E-3},145,145,"S.US.FDX       ",179,"S.US.MAT       "]
[null,null,"S.US.FE        ",{"$f":"IFERROR(RTD(\"cqg.rtd\", ,\"ContractData\",C180, \"PerCentNetLastTrade\",, \"T\")/100,\"\")","v":2.2988505747126436E-3},318,318,"S.US.FE        ",180,"S.US.FTV"]
[null,null,"S.US.FFIV      ",{"$f":"IFERROR(RTD(\"cqg.rtd\", ,\"ContractData\",C181, \"PerCentNetLastTrade\",, \"T\")/100,\"\")","v":6.6575989691459656E-3},190,190,"S.US.FFIV      ",181,"S.US.FLIR      "]
[null,null,"S.US.FIS       ",{"$f":"IFERROR(RTD(\"cqg.rtd\", ,\"ContractData\",C182, \"PerCentNetLastTrade\",, \"T\")/100,\"\")","v":6.8356947551578432E-3},189,189,"S.US.FIS       ",182,"S.US.DD        "]
[null,null,"S.US.FISV      ",{"$f":"IFERROR(RTD(\"cqg.rtd\", ,\"ContractData\",C183, \"PerCentNetLastTrade\",, \"T\")/100,\"\")","v":9.9935821032364532E-3},124,124,"S.US.FISV      ",183,"S.US.V         "]
[null,null,"S.US.FITB      ",{"$f":"IFERROR(RTD(\"cqg.rtd\", ,\"ContractData\",C184, \"PerCentNetLastTrade\",, \"T\")/100,\"\")","v":1.018483591097699E-2},121,121,"S.US.FITB      ",184,"S.US.ADP       "]
[null,null,"S.US.FL        ",{"$f":"IFERROR(RTD(\"cqg.rtd\", ,\"ContractData\",C185, \"PerCentNetLastTrade\",, \"T\")/100,\"\")","v":-9.547879809042403E-3},464,464,"S.US.FL        ",185,"S.US.XL"]
[null,null,"S.US.FLIR      ",{"$f":"IFERROR(RTD(\"cqg.rtd\", ,\"ContractData\",C186, \"PerCentNetLastTrade\",, \"T\")/100,\"\")","v":7.7455048409405258E-3},181,181,"S.US.FLIR      ",186,"S.US.ADBE      "]
[null,null,"S.US.FLR       ",{"$f":"IFERROR(RTD(\"cqg.rtd\", ,\"ContractData\",C187, \"PerCentNetLastTrade\",, \"T\")/100,\"\")","v":1.7309064953604566E-2},36,36,"S.US.FLR       ",187,"S.US.CELG      "]
[null,null,"S.US.FLS       ",{"$f":"IFERROR(RTD(\"cqg.rtd\", ,\"ContractData\",C188, \"PerCentNetLastTrade\",, \"T\")/100,\"\")","v":1.1773940345368916E-2},100,100,"S.US.FLS       ",188,"S.US.SRE       "]
[null,null,"S.US.FMC       ",{"$f":"IFERROR(RTD(\"cqg.rtd\", ,\"ContractData\",C189, \"PerCentNetLastTrade\",, \"T\")/100,\"\")","v":1.8153526970954358E-2},31,31,"S.US.FMC       ",189,"S.US.FIS       "]
[null,null,"S.US.FOX",{"$f":"IFERROR(RTD(\"cqg.rtd\", ,\"ContractData\",C190, \"PerCentNetLastTrade\",, \"T\")/100,\"\")","v":-6.4080944350758846E-3},444,444,"S.US.FOX",190,"S.US.FFIV      "]
[null,null,"S.US.FOXA",{"$f":"IFERROR(RTD(\"cqg.rtd\", ,\"ContractData\",C191, \"PerCentNetLastTrade\",, \"T\")/100,\"\")","v":-6.3523905048478765E-3},443,443,"S.US.FOXA",191,"S.US.PBCT      "]
[null,null,"S.US.FRT       ",{"$f":"IFERROR(RTD(\"cqg.rtd\", ,\"ContractData\",C192, \"PerCentNetLastTrade\",, \"T\")/100,\"\")","v":-2.2383883603805262E-3},397,397,"S.US.FRT       ",192,"S.US.CMCSA     "]
[null,null,"S.US.FSLR      ",{"$f":"IFERROR(RTD(\"cqg.rtd\", ,\"ContractData\",C193, \"PerCentNetLastTrade\",, \"T\")/100,\"\")","v":1.5525114155251141E-2},53,53,"S.US.FSLR      ",193,{"$f":"IFERROR(VLOOKUP(H193,$F$1:$G$506,2,FALSE),\"\")","v":"S.US.DOW       "}]
[null,null,"S.US.FTI",{"$f":"IFERROR(RTD(\"cqg.rtd\", ,\"ContractData\",C194, \"PerCentNetLastTrade\",, \"T\")/100,\"\")","v":2.5188916876574307E-3},313,{"$f":"IFERROR(E194,\"\")","v":313},{"$f":"C194","v":"S.US.FTI"},194,"S.US.ISRG      "]
[null,null,"S.US.FTR",{"$f":"IFERROR(RTD(\"cqg.rtd\", ,\"ContractData\",C195, \"PerCentNetLastTrade\",, \"T\")/100,\"\")","v":-9.0634441087613302E-3},462,462,"S.US.FTR",{"$f":"H194+1","v":195},"S.US.RHT       "]
[null,null,"S.US.FTV",{"$f":"IFERROR(RTD(\"cqg.rtd\", ,\"ContractData\",C196, \"PerCentNetLastTrade\",, \"T\")/100,\"\")","v":7.5240594925634298E-3},180,180,"S.US.FTV",196,"S.US.KLAC      "]
[null,null,"S.US.GD        ",{"$f":"IFERROR(RTD(\"cqg.rtd\", ,\"ContractData\",C197, \"PerCentNetLastTrade\",, \"T\")/100,\"\")","v":1.2472885032537961E-2},87,87,"S.US.GD        ",197,"S.US.DUK"]
[null,null,"S.US.GE        ",{"$f":"IFERROR(RTD(\"cqg.rtd\", ,\"ContractData\",C198, \"PerCentNetLastTrade\",, \"T\")/100,\"\")","v":9.4212651413189772E-3},139,139,"S.US.GE        ",198,"S.US.URI       "]
[null,null,"S.US.GGP",{"$f":"IFERROR(RTD(\"cqg.rtd\", ,\"ContractData\",C199, \"PerCentNetLastTrade\",, \"T\")/100,\"\")","v":-6.6718995290423865E-3},448,448,"S.US.GGP",199,"S.US.HPE"]
[null,null,"S.US.GILD      ",{"$f":"IFERROR(RTD(\"cqg.rtd\", ,\"ContractData\",C200, \"PerCentNetLastTrade\",, \"T\")/100,\"\")","v":1.8836648583484026E-2},26,26,"S.US.GILD      ",200,"S.US.ROP       "]
[null,null,"S.US.GIS       ",{"$f":"IFERROR(RTD(\"cqg.rtd\", ,\"ContractData\",C201, \"PerCentNetLastTrade\",, \"T\")/100,\"\")","v":3.0274059910771187E-3},294,294,"S.US.GIS       ",201,"S.US.EXPD      "]
[null,null,"S.US.GLW       ",{"$f":"IFERROR(RTD(\"cqg.rtd\", ,\"ContractData\",C202, \"PerCentNetLastTrade\",, \"T\")/100,\"\")","v":2.2471910112359548E-3},319,319,"S.US.GLW       ",202,"S.US.INTU      "]
[null,null,"S.US.GM        ",{"$f":"IFERROR(RTD(\"cqg.rtd\", ,\"ContractData\",C203, \"PerCentNetLastTrade\",, \"T\")/100,\"\")","v":1.0235996588001138E-2},118,118,"S.US.GM        ",203,"S.US.HCN"]
[null,null,"S.US.GOOG",{"$f":"IFERROR(RTD(\"cqg.rtd\", ,\"ContractData\",C204, \"PerCentNetLastTrade\",, \"T\")/100,\"\")","v":6.2801872995194609E-3},204,204,"S.US.GOOG",204,"S.US.GOOG"]
[null,null,"S.US.GOOGL",{"$f":"IFERROR(RTD(\"cqg.rtd\", ,\"ContractData\",C205, \"PerCentNetLastTrade\",, \"T\")/100,\"\")","v":4.443912080014374E-3},253,253,"S.US.GOOGL",205,"S.US.AXP       "]
[null,null,"S.US.GPC       ",{"$f":"IFERROR(RTD(\"cqg.rtd\", ,\"ContractData\",C206, \"PerCentNetLastTrade\",, \"T\")/100,\"\")","v":1.9041892162758067E-3},324,324,"S.US.GPC       ",206,"S.US.RHI       "]
[null,null,"S.US.GPN       ",{"$f":"IFERROR(RTD(\"cqg.rtd\", ,\"ContractData\",C207, \"PerCentNetLastTrade\",, \"T\")/100,\"\")","v":-1.9115585574104755E-3},403,403,"S.US.GPN       ",207,"S.US.DTE       "]
[null,null,"S.US.GPS       ",{"$f":"IFERROR(RTD(\"cqg.rtd\", ,\"ContractData\",C208, \"PerCentNetLastTrade\",, \"T\")/100,\"\")","v":-2.7504105090311984E-2},503,503,"S.US.GPS       ",208,"S.US.IRM"]
[null,null,"S.US.GRMN      ",{"$f":"IFERROR(RTD(\"cqg.rtd\", ,\"ContractData\",C209, \"PerCentNetLastTrade\",, \"T\")/100,\"\")","v":1.2454801124949779E-2},89,89,"S.US.GRMN      ",209,"S.US.COTY"]
[null,null,"S.US.GS        ",{"$f":"IFERROR(RTD(\"cqg.rtd\", ,\"ContractData\",C210, \"PerCentNetLastTrade\",, \"T\")/100,\"\")","v":1.6809492419248517E-2},39,39,"S.US.GS        ",210,"S.US.NFX       "]
[null,null,"S.US.GT        ",{"$f":"IFERROR(RTD(\"cqg.rtd\", ,\"ContractData\",C211, \"PerCentNetLastTrade\",, \"T\")/100,\"\")","v":5.7532621589561093E-2},1,1,"S.US.GT        ",211,"S.US.PWR       "]
[null,null,"S.US.GWW       ",{"$f":"IFERROR(RTD(\"cqg.rtd\", ,\"ContractData\",C212, \"PerCentNetLastTrade\",, \"T\")/100,\"\")","v":-1.9211166000156826E-3},393,393,"S.US.GWW       ",212,"S.US.EBAY      "]
[null,null,"S.US.HAL       ",{"$f":"IFERROR(RTD(\"cqg.rtd\", ,\"ContractData\",C213, \"PerCentNetLastTrade\",, \"T\")/100,\"\")","v":3.7413148049171567E-3},278,278,"S.US.HAL       ",213,"S.US.HSY       "]
[null,null,"S.US.HAR       ",{"$f":"IFERROR(RTD(\"cqg.rtd\", ,\"ContractData\",C214, \"PerCentNetLastTrade\",, \"T\")/100,\"\")","v":-9.0090090090090081E-4},380,380,"S.US.HAR       ",214,"S.US.TXT       "]
[null,null,"S.US.HAS       ",{"$f":"IFERROR(RTD(\"cqg.rtd\", ,\"ContractData\",C215, \"PerCentNetLastTrade\",, \"T\")/100,\"\")","v":5.6335142886407867E-3},230,230,"S.US.HAS       ",215,"S.US.CCL       "]
[null,null,"S.US.HBAN      ",{"$f":"IFERROR(RTD(\"cqg.rtd\", ,\"ContractData\",C216, \"PerCentNetLastTrade\",, \"T\")/100,\"\")","v":1.6152716593245228E-2},47,47,"S.US.HBAN      ",216,"S.US.ECL       "]
[null,null,"S.US.HBI       ",{"$f":"IFERROR(RTD(\"cqg.rtd\", ,\"ContractData\",C217, \"PerCentNetLastTrade\",, \"T\")/100,\"\")","v":-1.870503597122302E-2},499,499,"S.US.HBI       ",217,"S.US.SWKS      "]
[null,null,"S.US.HCA",{"$f":"IFERROR(RTD(\"cqg.rtd\", ,\"ContractData\",C218, \"PerCentNetLastTrade\",, \"T\")/100,\"\")","v":2.6306349396149706E-3},309,309,"S.US.HCA",218,"S.US.HIG       "]
[null,null,"S.US.HCN",{"$f":"IFERROR(RTD(\"cqg.rtd\", ,\"ContractData\",C219, \"PerCentNetLastTrade\",, \"T\")/100,\"\")","v":6.376195536663124E-3},203,203,"S.US.HCN",219,"S.US.NOV       "]
[null,null,"S.US.HCP       ",{"$f":"IFERROR(RTD(\"cqg.rtd\", ,\"ContractData\",C220, \"PerCentNetLastTrade\",, \"T\")/100,\"\")","v":4.2345276872964169E-3},262,262,"S.US.HCP       ",220,"S.US.MJN       "]
[null,null,"S.US.HD        ",{"$f":"IFERROR(RTD(\"cqg.rtd\", ,\"ContractData\",C221, \"PerCentNetLastTrade\",, \"T\")/100,\"\")","v":-4.2903110475509475E-4},372,372,"S.US.HD        ",221,"S.US.CTSH      "]
[null,null,"S.US.HES       ",{"$f":"IFERROR(RTD(\"cqg.rtd\", ,\"ContractData\",C222, \"PerCentNetLastTrade\",, \"T\")/100,\"\")","v":-1.0855075223766901E-2},476,476,"S.US.HES       ",222,"S.US.ROK       "]
[null,null,"S.US.HIG       ",{"$f":"IFERROR(RTD(\"cqg.rtd\", ,\"ContractData\",C223, \"PerCentNetLastTrade\",, \"T\")/100,\"\")","v":5.641454241537819E-3},218,218,"S.US.HIG       ",223,"S.US.SLG       "]
[null,null,"S.US.HOG       ",{"$f":"IFERROR(RTD(\"cqg.rtd\", ,\"ContractData\",C224, \"PerCentNetLastTrade\",, \"T\")/100,\"\")","v":-3.3135681897453785E-3},416,416,"S.US.HOG       ",224,"S.US.QRVO"]
[null,null,"S.US.HOLX      ",{"$f":"IFERROR(RTD(\"cqg.rtd\", ,\"ContractData\",C225, \"PerCentNetLastTrade\",, \"T\")/100,\"\")","v":1.2521913348359629E-3},358,358,"S.US.HOLX      ",225,"S.US.SJM       "]
[null,null,"S.US.HON       ",{"$f":"IFERROR(RTD(\"cqg.rtd\", ,\"ContractData\",C226, \"PerCentNetLastTrade\",, \"T\")/100,\"\")","v":1.510053344275749E-2},60,60,"S.US.HON       ",226,"S.US.O         "]
[null,null,"S.US.HP        ",{"$f":"IFERROR(RTD(\"cqg.rtd\", ,\"ContractData\",C227, \"PerCentNetLastTrade\",, \"T\")/100,\"\")","v":1.0111223458038423E-3},349,349,"S.US.HP        ",227,"S.US.XOM       "]
[null,null,"S.US.HPE",{"$f":"IFERROR(RTD(\"cqg.rtd\", ,\"ContractData\",C228, \"PerCentNetLastTrade\",, \"T\")/100,\"\")","v":6.2526052521884121E-3},199,199,"S.US.HPE",228,"S.US.TDC"]
[null,null,"S.US.HPQ",{"$f":"IFERROR(RTD(\"cqg.rtd\", ,\"ContractData\",C229, \"PerCentNetLastTrade\",, \"T\")/100,\"\")","v":2.2264631043256999E-2},15,15,"S.US.HPQ",229,"S.US.CNP       "]
[null,null,"S.US.HRB       ",{"$f":"IFERROR(RTD(\"cqg.rtd\", ,\"ContractData\",C230, \"PerCentNetLastTrade\",, \"T\")/100,\"\")","v":-7.6009501187648456E-3},455,455,"S.US.HRB       ",230,"S.US.HAS       "]
[null,null,"S.US.HRL       ",{"$f":"IFERROR(RTD(\"cqg.rtd\", ,\"ContractData\",C231, \"PerCentNetLastTrade\",, \"T\")/100,\"\")","v":2.9625639644492324E-3},303,303,"S.US.HRL       ",231,"S.US.LLTC      "]
[null,null,"S.US.HRS       ",{"$f":"IFERROR(RTD(\"cqg.rtd\", ,\"ContractData\",C232, \"PerCentNetLastTrade\",, \"T\")/100,\"\")","v":1.2010592018157747E-2},93,93,"S.US.HRS       ",232,"S.US.VRSK      "]
[null,null,"S.US.HSIC      ",{"$f":"IFERROR(RTD(\"cqg.rtd\", ,\"ContractData\",C233, \"PerCentNetLastTrade\",, \"T\")/100,\"\")","v":-4.2406251893136246E-4},376,376,"S.US.HSIC      ",233,"S.US.DOV       "]
[null,null,"S.US.HST       ",{"$f":"IFERROR(RTD(\"cqg.rtd\", ,\"ContractData\",C234, \"PerCentNetLastTrade\",, \"T\")/100,\"\")","v":1.1982570806100219E-2},86,86,"S.US.HST       ",234,"S.US.BXP       "]
[null,null,"S.US.HSY       ",{"$f":"IFERROR(RTD(\"cqg.rtd\", ,\"ContractData\",C235, \"PerCentNetLastTrade\",, \"T\")/100,\"\")","v":5.7610109645047395E-3},213,213,"S.US.HSY       ",235,"S.US.TEL"]
[null,null,"S.US.HUM       ",{"$f":"IFERROR(RTD(\"cqg.rtd\", ,\"ContractData\",C236, \"PerCentNetLastTrade\",, \"T\")/100,\"\")","v":5.0625517207808016E-3},251,251,"S.US.HUM       ",236,"S.US.D         "]
[null,null,"S.US.IBM       ",{"$f":"IFERROR(RTD(\"cqg.rtd\", ,\"ContractData\",C237, \"PerCentNetLastTrade\",, \"T\")/100,\"\")","v":3.3019923886277143E-3},288,288,"S.US.IBM       ",237,"S.US.WHR       "]
[null,null,"S.US.ICE",{"$f":"IFERROR(RTD(\"cqg.rtd\", ,\"ContractData\",C238, \"PerCentNetLastTrade\",, \"T\")/100,\"\")","v":2.4631396357328708E-2},9,9,"S.US.ICE",238,"S.US.MHK       "]
[null,null,"S.US.IDXX      ",{"$f":"IFERROR(RTD(\"cqg.rtd\", ,\"ContractData\",C239, \"PerCentNetLastTrade\",, \"T\")/100,\"\")","v":-1.2691250088133683E-3},388,388,"S.US.IDXX      ",239,"S.US.AVGO"]
[null,null,"S.US.IFF       ",{"$f":"IFERROR(RTD(\"cqg.rtd\", ,\"ContractData\",C240, \"PerCentNetLastTrade\",, \"T\")/100,\"\")","v":1.7386141972691036E-2},37,37,"S.US.IFF       ",240,"S.US.PEP       "]
[null,null,"S.US.ILMN      ",{"$f":"IFERROR(RTD(\"cqg.rtd\", ,\"ContractData\",C241, \"PerCentNetLastTrade\",, \"T\")/100,\"\")","v":2.8827281648675174E-3},298,298,"S.US.ILMN      ",241,"S.US.PPL       "]
[null,null,"S.US.INTC      ",{"$f":"IFERROR(RTD(\"cqg.rtd\", ,\"ContractData\",C242, \"PerCentNetLastTrade\",, \"T\")/100,\"\")","v":1.21675155631013E-2},91,91,"S.US.INTC      ",242,"S.US.PCG       "]
[null,null,"S.US.INTU      ",{"$f":"IFERROR(RTD(\"cqg.rtd\", ,\"ContractData\",C243, \"PerCentNetLastTrade\",, \"T\")/100,\"\")","v":6.6366034204033012E-3},202,202,"S.US.INTU      ",243,"S.US.WEC"]
[null,null,"S.US.IP        ",{"$f":"IFERROR(RTD(\"cqg.rtd\", ,\"ContractData\",C244, \"PerCentNetLastTrade\",, \"T\")/100,\"\")","v":-1.7016449234259785E-3},396,396,"S.US.IP        ",244,"S.US.JNJ       "]
[null,null,"S.US.IPG       ",{"$f":"IFERROR(RTD(\"cqg.rtd\", ,\"ContractData\",C245, \"PerCentNetLastTrade\",, \"T\")/100,\"\")","v":2.1048287247214196E-2},19,19,"S.US.IPG       ",245,"S.US.WFC       "]
[null,null,"S.US.IR        ",{"$f":"IFERROR(RTD(\"cqg.rtd\", ,\"ContractData\",C246, \"PerCentNetLastTrade\",, \"T\")/100,\"\")","v":9.8534302253972163E-3},127,127,"S.US.IR        ",246,"S.US.CTL       "]
[null,null,"S.US.IRM",{"$f":"IFERROR(RTD(\"cqg.rtd\", ,\"ContractData\",C247, \"PerCentNetLastTrade\",, \"T\")/100,\"\")","v":6.1513773736293128E-3},208,208,"S.US.IRM",247,"S.US.BAX       "]
[null,null,"S.US.ISRG      ",{"$f":"IFERROR(RTD(\"cqg.rtd\", ,\"ContractData\",C248, \"PerCentNetLastTrade\",, \"T\")/100,\"\")","v":6.7467966889670026E-3},194,194,"S.US.ISRG      ",248,"S.US.WAT       "]
[null,null,"S.US.ITW       ",{"$f":"IFERROR(RTD(\"cqg.rtd\", ,\"ContractData\",C249, \"PerCentNetLastTrade\",, \"T\")/100,\"\")","v":1.15625E-2},101,101,"S.US.ITW       ",249,"S.US.DE        "]
[null,null,"S.US.IVZ",{"$f":"IFERROR(RTD(\"cqg.rtd\", ,\"ContractData\",C250, \"PerCentNetLastTrade\",, \"T\")/100,\"\")","v":9.7361809045226136E-3},128,128,"S.US.IVZ",250,"S.US.TXN       "]
[null,null,"S.US.JBHT      ",{"$f":"IFERROR(RTD(\"cqg.rtd\", ,\"ContractData\",C251, \"PerCentNetLastTrade\",, \"T\")/100,\"\")","v":9.9631363953372521E-4},351,351,"S.US.JBHT      ",251,"S.US.HUM       "]
[null,null,"S.US.JCI",{"$f":"IFERROR(RTD(\"cqg.rtd\", ,\"ContractData\",C252, \"PerCentNetLastTrade\",, \"T\")/100,\"\")","v":-1.4336917562724014E-3},387,387,"S.US.JCI",252,"S.US.WRK"]
[null,null,"S.US.JEC       ",{"$f":"IFERROR(RTD(\"cqg.rtd\", ,\"ContractData\",C253, \"PerCentNetLastTrade\",, \"T\")/100,\"\")","v":2.6132404181184671E-3},311,311,"S.US.JEC       ",253,"S.US.GOOGL"]
[null,null,"S.US.JNJ       ",{"$f":"IFERROR(RTD(\"cqg.rtd\", ,\"ContractData\",C254, \"PerCentNetLastTrade\",, \"T\")/100,\"\")","v":4.9461992363762581E-3},244,244,"S.US.JNJ       ",254,"S.US.RIG       "]
[null,null,"S.US.JNPR      ",{"$f":"IFERROR(RTD(\"cqg.rtd\", ,\"ContractData\",C255, \"PerCentNetLastTrade\",, \"T\")/100,\"\")","v":1.2662807525325614E-2},85,85,"S.US.JNPR      ",255,"S.US.DGX       "]
[null,null,"S.US.JPM       ",{"$f":"IFERROR(RTD(\"cqg.rtd\", ,\"ContractData\",C256, \"PerCentNetLastTrade\",, \"T\")/100,\"\")","v":1.3793103448275864E-2},74,74,"S.US.JPM       ",256,"S.US.NI        "]
[null,null,"S.US.JWN       ",{"$f":"IFERROR(RTD(\"cqg.rtd\", ,\"ContractData\",C257, \"PerCentNetLastTrade\",, \"T\")/100,\"\")","v":-1.2666666666666666E-2},482,{"$f":"IFERROR(E257,\"\")","v":482},{"$f":"C257","v":"S.US.JWN       "},257,{"$f":"IFERROR(VLOOKUP(H257,$F$1:$G$506,2,FALSE),\"\")","v":"S.US.SIG"}]
[null,null,"S.US.K         ",{"$f":"IFERROR(RTD(\"cqg.rtd\", ,\"ContractData\",C258, \"PerCentNetLastTrade\",, \"T\")/100,\"\")","v":-5.131578947368421E-3},432,432,"S.US.K         ",{"$f":"H257+1","v":258},"S.US.EIX       "]
[null,null,"S.US.KEY       ",{"$f":"IFERROR(RTD(\"cqg.rtd\", ,\"ContractData\",C259, \"PerCentNetLastTrade\",, \"T\")/100,\"\")","v":1.3691128148959475E-2},79,79,"S.US.KEY       ",259,"S.US.UNP       "]
[null,null,"S.US.KHC",{"$f":"IFERROR(RTD(\"cqg.rtd\", ,\"ContractData\",C260, \"PerCentNetLastTrade\",, \"T\")/100,\"\")","v":3.4368070953436809E-3},289,289,"S.US.KHC",260,"S.US.AES       "]
[null,null,"S.US.KIM       ",{"$f":"IFERROR(RTD(\"cqg.rtd\", ,\"ContractData\",C261, \"PerCentNetLastTrade\",, \"T\")/100,\"\")","v":-5.5910543130990422E-3},436,436,"S.US.KIM       ",261,"S.US.TSN       "]
[null,null,"S.US.KLAC      ",{"$f":"IFERROR(RTD(\"cqg.rtd\", ,\"ContractData\",C262, \"PerCentNetLastTrade\",, \"T\")/100,\"\")","v":6.9252077562326876E-3},196,196,"S.US.KLAC      ",262,"S.US.HCP       "]
[null,null,"S.US.KMB       ",{"$f":"IFERROR(RTD(\"cqg.rtd\", ,\"ContractData\",C263, \"PerCentNetLastTrade\",, \"T\")/100,\"\")","v":-5.6657223796033991E-4},377,377,"S.US.KMB       ",263,"S.US.MPC"]
[null,null,"S.US.KMI",{"$f":"IFERROR(RTD(\"cqg.rtd\", ,\"ContractData\",C264, \"PerCentNetLastTrade\",, \"T\")/100,\"\")","v":1.3345195729537365E-3},352,352,"S.US.KMI",264,"S.US.TIF       "]
[null,null,"S.US.KMX       ",{"$f":"IFERROR(RTD(\"cqg.rtd\", ,\"ContractData\",C265, \"PerCentNetLastTrade\",, \"T\")/100,\"\")","v":-2.9612081729345571E-4},373,373,"S.US.KMX       ",265,"S.US.A         "]
[null,null,"S.US.KO        ",{"$f":"IFERROR(RTD(\"cqg.rtd\", ,\"ContractData\",C266, \"PerCentNetLastTrade\",, \"T\")/100,\"\")","v":-2.4642681123706261E-4},365,365,"S.US.KO        ",266,"S.US.LKQ"]
[null,null,"S.US.KORS",{"$f":"IFERROR(RTD(\"cqg.rtd\", ,\"ContractData\",C267, \"PerCentNetLastTrade\",, \"T\")/100,\"\")","v":-1.7457008858780612E-2},497,497,"S.US.KORS",267,"S.US.ENDP"]
[null,null,"S.US.KR        ",{"$f":"IFERROR(RTD(\"cqg.rtd\", ,\"ContractData\",C268, \"PerCentNetLastTrade\",, \"T\")/100,\"\")","v":-7.7658303464755076E-3},457,457,"S.US.KR        ",268,"S.US.WM        "]
[null,null,"S.US.KSS       ",{"$f":"IFERROR(RTD(\"cqg.rtd\", ,\"ContractData\",C269, \"PerCentNetLastTrade\",, \"T\")/100,\"\")","v":-1.4985727878211228E-2},489,489,"S.US.KSS       ",269,"S.US.ZBH"]
[null,null,"S.US.KSU       ",{"$f":"IFERROR(RTD(\"cqg.rtd\", ,\"ContractData\",C270, \"PerCentNetLastTrade\",, \"T\")/100,\"\")","v":1.0722610722610723E-2},109,109,"S.US.KSU       ",270,"S.US.ADS       "]
[null,null,"S.US.L         ",{"$f":"IFERROR(RTD(\"cqg.rtd\", ,\"ContractData\",C271, \"PerCentNetLastTrade\",, \"T\")/100,\"\")","v":7.5301204819277108E-3},178,178,"S.US.L         ",271,"S.US.F         "]
[null,null,"S.US.LB",{"$f":"IFERROR(RTD(\"cqg.rtd\", ,\"ContractData\",C272, \"PerCentNetLastTrade\",, \"T\")/100,\"\")","v":-1.680244399185336E-2},494,494,"S.US.LB",272,"S.US.CSX       "]
[null,null,"S.US.LEG       ",{"$f":"IFERROR(RTD(\"cqg.rtd\", ,\"ContractData\",C273, \"PerCentNetLastTrade\",, \"T\")/100,\"\")","v":-4.4971381847914967E-3},427,427,"S.US.LEG       ",273,"S.US.BSX       "]
[null,null,"S.US.LEN       ",{"$f":"IFERROR(RTD(\"cqg.rtd\", ,\"ContractData\",C274, \"PerCentNetLastTrade\",, \"T\")/100,\"\")","v":-2.1362956633198035E-4},366,366,"S.US.LEN       ",274,"S.US.AET       "]
[null,null,"S.US.LH        ",{"$f":"IFERROR(RTD(\"cqg.rtd\", ,\"ContractData\",C275, \"PerCentNetLastTrade\",, \"T\")/100,\"\")","v":-7.4068587512036142E-5},368,368,"S.US.LH        ",275,"S.US.APH       "]
[null,null,"S.US.LKQ",{"$f":"IFERROR(RTD(\"cqg.rtd\", ,\"ContractData\",C276, \"PerCentNetLastTrade\",, \"T\")/100,\"\")","v":4.1666666666666666E-3},266,266,"S.US.LKQ",276,"S.US.ETR       "]
[null,null,"S.US.LLL",{"$f":"IFERROR(RTD(\"cqg.rtd\", ,\"ContractData\",C277, \"PerCentNetLastTrade\",, \"T\")/100,\"\")","v":1.3733063576727362E-2},73,73,"S.US.LLL",277,"S.US.SYY       "]
[null,null,"S.US.LLTC      ",{"$f":"IFERROR(RTD(\"cqg.rtd\", ,\"ContractData\",C278, \"PerCentNetLastTrade\",, \"T\")/100,\"\")","v":5.6701842809891321E-3},231,231,"S.US.LLTC      ",278,"S.US.HAL       "]
[null,null,"S.US.LLY       ",{"$f":"IFERROR(RTD(\"cqg.rtd\", ,\"ContractData\",C279, \"PerCentNetLastTrade\",, \"T\")/100,\"\")","v":-1.2855122766422419E-4},367,367,"S.US.LLY       ",279,"S.US.CRM       "]
[null,null,"S.US.LMT       ",{"$f":"IFERROR(RTD(\"cqg.rtd\", ,\"ContractData\",C280, \"PerCentNetLastTrade\",, \"T\")/100,\"\")","v":7.4841681059297635E-3},176,176,"S.US.LMT       ",280,"S.US.AMAT      "]
[null,null,"S.US.LNC       ",{"$f":"IFERROR(RTD(\"cqg.rtd\", ,\"ContractData\",C281, \"PerCentNetLastTrade\",, \"T\")/100,\"\")","v":1.1652692908910047E-2},97,97,"S.US.LNC       ",281,"S.US.SO        "]
[null,null,"S.US.LNT       ",{"$f":"IFERROR(RTD(\"cqg.rtd\", ,\"ContractData\",C282, \"PerCentNetLastTrade\",, \"T\")/100,\"\")","v":1.5847860538827257E-3},333,333,"S.US.LNT       ",282,"S.US.NEE       "]
[null,null,"S.US.LOGM      ",{"$f":"IFERROR(RTD(\"cqg.rtd\", ,\"ContractData\",C283, \"PerCentNetLastTrade\",, \"T\")/100,\"\")","v":1.5429975429975431E-2},56,56,"S.US.LOGM      ",283,"S.US.DIS       "]
[null,null,"S.US.LOW       ",{"$f":"IFERROR(RTD(\"cqg.rtd\", ,\"ContractData\",C284, \"PerCentNetLastTrade\",, \"T\")/100,\"\")","v":-1.35189941868325E-4},371,371,"S.US.LOW       ",284,"S.US.PG        "]
[null,null,"S.US.LRCX      ",{"$f":"IFERROR(RTD(\"cqg.rtd\", ,\"ContractData\",C285, \"PerCentNetLastTrade\",, \"T\")/100,\"\")","v":3.1899301663936546E-3},297,297,"S.US.LRCX      ",285,"S.US.LVLT"]
[null,null,"S.US.LUK       ",{"$f":"IFERROR(RTD(\"cqg.rtd\", ,\"ContractData\",C286, \"PerCentNetLastTrade\",, \"T\")/100,\"\")","v":1.2911286963765098E-2},82,82,"S.US.LUK       ",286,"S.US.NRG       "]
[null,null,"S.US.LUV       ",{"$f":"IFERROR(RTD(\"cqg.rtd\", ,\"ContractData\",C287, \"PerCentNetLastTrade\",, \"T\")/100,\"\")","v":2.101992323158472E-2},20,20,"S.US.LUV       ",287,"S.US.LYB       "]
[null,null,"S.US.LVLT",{"$f":"IFERROR(RTD(\"cqg.rtd\", ,\"ContractData\",C288, \"PerCentNetLastTrade\",, \"T\")/100,\"\")","v":3.4638032559750607E-3},285,285,"S.US.LVLT",288,"S.US.IBM       "]
[null,null,"S.US.LYB       ",{"$f":"IFERROR(RTD(\"cqg.rtd\", ,\"ContractData\",C289, \"PerCentNetLastTrade\",, \"T\")/100,\"\")","v":3.4835619420857827E-3},287,287,"S.US.LYB       ",289,"S.US.KHC"]
[null,null,"S.US.M         ",{"$f":"IFERROR(RTD(\"cqg.rtd\", ,\"ContractData\",C290, \"PerCentNetLastTrade\",, \"T\")/100,\"\")","v":1.8443263519849953E-2},29,29,"S.US.M         ",290,"S.US.CHD       "]
[null,null,"S.US.MA        ",{"$f":"IFERROR(RTD(\"cqg.rtd\", ,\"ContractData\",C291, \"PerCentNetLastTrade\",, \"T\")/100,\"\")","v":9.2290481961405796E-3},143,143,"S.US.MA        ",291,"S.US.CMS       "]
[null,null,"S.US.MAA       ",{"$f":"IFERROR(RTD(\"cqg.rtd\", ,\"ContractData\",C292, \"PerCentNetLastTrade\",, \"T\")/100,\"\")","v":-8.1210029438635672E-4},381,381,"S.US.MAA       ",292,"S.US.PPG       "]
[null,null,"S.US.MAC       ",{"$f":"IFERROR(RTD(\"cqg.rtd\", ,\"ContractData\",C293, \"PerCentNetLastTrade\",, \"T\")/100,\"\")","v":-9.6533567354102675E-3},466,466,"S.US.MAC       ",293,"S.US.AME       "]
[null,null,"S.US.MAR       ",{"$f":"IFERROR(RTD(\"cqg.rtd\", ,\"ContractData\",C294, \"PerCentNetLastTrade\",, \"T\")/100,\"\")","v":1.098901098901099E-2},110,110,"S.US.MAR       ",294,"S.US.GIS       "]
[null,null,"S.US.MAS       ",{"$f":"IFERROR(RTD(\"cqg.rtd\", ,\"ContractData\",C295, \"PerCentNetLastTrade\",, \"T\")/100,\"\")","v":-7.7037037037037039E-3},456,456,"S.US.MAS       ",295,"S.US.BDX       "]
[null,null,"S.US.MAT       ",{"$f":"IFERROR(RTD(\"cqg.rtd\", ,\"ContractData\",C296, \"PerCentNetLastTrade\",, \"T\")/100,\"\")","v":7.7730275942479599E-3},179,179,"S.US.MAT       ",296,"S.US.SPLS      "]
[null,null,"S.US.MCD       ",{"$f":"IFERROR(RTD(\"cqg.rtd\", ,\"ContractData\",C297, \"PerCentNetLastTrade\",, \"T\")/100,\"\")","v":-1.8280082657765062E-3},401,401,"S.US.MCD       ",297,"S.US.LRCX      "]
[null,null,"S.US.MCHP      ",{"$f":"IFERROR(RTD(\"cqg.rtd\", ,\"ContractData\",C298, \"PerCentNetLastTrade\",, \"T\")/100,\"\")","v":-3.1029619181946405E-3},414,414,"S.US.MCHP      ",298,"S.US.ILMN      "]
[null,null,"S.US.MCK       ",{"$f":"IFERROR(RTD(\"cqg.rtd\", ,\"ContractData\",C299, \"PerCentNetLastTrade\",, \"T\")/100,\"\")","v":8.7411334814071796E-3},150,150,"S.US.MCK       ",299,"S.US.EQR       "]
[null,null,"S.US.MCO       ",{"$f":"IFERROR(RTD(\"cqg.rtd\", ,\"ContractData\",C300, \"PerCentNetLastTrade\",, \"T\")/100,\"\")","v":1.0092592592592592E-2},120,120,"S.US.MCO       ",300,"S.US.MLM       "]
[null,null,"S.US.MDLZ",{"$f":"IFERROR(RTD(\"cqg.rtd\", ,\"ContractData\",C301, \"PerCentNetLastTrade\",, \"T\")/100,\"\")","v":2.4449877750611247E-3},316,316,"S.US.MDLZ",301,"S.US.APD       "]
[null,null,"S.US.MDT",{"$f":"IFERROR(RTD(\"cqg.rtd\", ,\"ContractData\",C302, \"PerCentNetLastTrade\",, \"T\")/100,\"\")","v":9.3237032173342088E-3},132,132,"S.US.MDT",302,"S.US.NTAP"]
[null,null,"S.US.MET       ",{"$f":"IFERROR(RTD(\"cqg.rtd\", ,\"ContractData\",C303, \"PerCentNetLastTrade\",, \"T\")/100,\"\")","v":1.3041013041013041E-2},77,77,"S.US.MET       ",303,"S.US.HRL       "]
[null,null,"S.US.MHK       ",{"$f":"IFERROR(RTD(\"cqg.rtd\", ,\"ContractData\",C304, \"PerCentNetLastTrade\",, \"T\")/100,\"\")","v":4.8491379310344829E-3},238,238,"S.US.MHK       ",304,"S.US.CTAS      "]
[null,null,"S.US.MJN       ",{"$f":"IFERROR(RTD(\"cqg.rtd\", ,\"ContractData\",C305, \"PerCentNetLastTrade\",, \"T\")/100,\"\")","v":5.8139534883720929E-3},220,220,"S.US.MJN       ",305,"S.US.AGN"]
[null,null,"S.US.MKC       ",{"$f":"IFERROR(RTD(\"cqg.rtd\", ,\"ContractData\",C306, \"PerCentNetLastTrade\",, \"T\")/100,\"\")","v":-4.1131105398457579E-4},370,370,"S.US.MKC       ",306,"S.US.AON"]
[null,null,"S.US.MLM       ",{"$f":"IFERROR(RTD(\"cqg.rtd\", ,\"ContractData\",C307, \"PerCentNetLastTrade\",, \"T\")/100,\"\")","v":2.5616533518582839E-3},300,300,"S.US.MLM       ",307,"S.US.CA        "]
[null,null,"S.US.MMC       ",{"$f":"IFERROR(RTD(\"cqg.rtd\", ,\"ContractData\",C308, \"PerCentNetLastTrade\",, \"T\")/100,\"\")","v":8.4411930219471017E-3},155,155,"S.US.MMC       ",308,"S.US.CTXS      "]
[null,null,"S.US.MMM       ",{"$f":"IFERROR(RTD(\"cqg.rtd\", ,\"ContractData\",C309, \"PerCentNetLastTrade\",, \"T\")/100,\"\")","v":1.1340782122905029E-2},103,103,"S.US.MMM       ",309,"S.US.HCA"]
[null,null,"S.US.MNK",{"$f":"IFERROR(RTD(\"cqg.rtd\", ,\"ContractData\",C310, \"PerCentNetLastTrade\",, \"T\")/100,\"\")","v":1.0148163182463974E-2},123,123,"S.US.MNK",310,"S.US.COH       "]
[null,null,"S.US.MNST",{"$f":"IFERROR(RTD(\"cqg.rtd\", ,\"ContractData\",C311, \"PerCentNetLastTrade\",, \"T\")/100,\"\")","v":-1.2724380822540331E-2},481,481,"S.US.MNST",311,"S.US.JEC       "]
[null,null,"S.US.MO        ",{"$f":"IFERROR(RTD(\"cqg.rtd\", ,\"ContractData\",C312, \"PerCentNetLastTrade\",, \"T\")/100,\"\")","v":-4.5567522783761397E-3},429,429,"S.US.MO        ",312,"S.US.CVS       "]
[null,null,"S.US.MON       ",{"$f":"IFERROR(RTD(\"cqg.rtd\", ,\"ContractData\",C313, \"PerCentNetLastTrade\",, \"T\")/100,\"\")","v":-5.577763316909919E-4},378,378,"S.US.MON       ",313,"S.US.FTI"]
[null,null,"S.US.MOS",{"$f":"IFERROR(RTD(\"cqg.rtd\", ,\"ContractData\",C314, \"PerCentNetLastTrade\",, \"T\")/100,\"\")","v":2.5867315885575167E-2},7,7,"S.US.MOS",314,"S.US.DHR       "]
[null,null,"S.US.MPC",{"$f":"IFERROR(RTD(\"cqg.rtd\", ,\"ContractData\",C315, \"PerCentNetLastTrade\",, \"T\")/100,\"\")","v":3.9888312724371761E-3},263,263,"S.US.MPC",315,"S.US.SPGI"]
[null,null,"S.US.MRK       ",{"$f":"IFERROR(RTD(\"cqg.rtd\", ,\"ContractData\",C316, \"PerCentNetLastTrade\",, \"T\")/100,\"\")","v":9.508963367108339E-3},130,130,"S.US.MRK       ",316,"S.US.MDLZ"]
[null,null,"S.US.MRO       ",{"$f":"IFERROR(RTD(\"cqg.rtd\", ,\"ContractData\",C317, \"PerCentNetLastTrade\",, \"T\")/100,\"\")","v":-8.0296479308214954E-3},454,454,"S.US.MRO       ",317,"S.US.BWA       "]
[null,null,"S.US.MS        ",{"$f":"IFERROR(RTD(\"cqg.rtd\", ,\"ContractData\",C318, \"PerCentNetLastTrade\",, \"T\")/100,\"\")","v":1.6107382550335569E-2},48,48,"S.US.MS        ",318,"S.US.FE        "]
[null,null,"S.US.MSFT      ",{"$f":"IFERROR(RTD(\"cqg.rtd\", ,\"ContractData\",C319, \"PerCentNetLastTrade\",, \"T\")/100,\"\")","v":0.01},122,122,"S.US.MSFT      ",319,"S.US.GLW       "]
[null,null,"S.US.MSI",{"$f":"IFERROR(RTD(\"cqg.rtd\", ,\"ContractData\",C320, \"PerCentNetLastTrade\",, \"T\")/100,\"\")","v":1.0207987750414701E-3},321,321,"S.US.MSI",320,"S.US.CI        "]
[null,null,"S.US.MTB       ",{"$f":"IFERROR(RTD(\"cqg.rtd\", ,\"ContractData\",C321, \"PerCentNetLastTrade\",, \"T\")/100,\"\")","v":1.1070110701107012E-2},107,{"$f":"IFERROR(E321,\"\")","v":107},{"$f":"C321","v":"S.US.MTB       "},321,{"$f":"IFERROR(VLOOKUP(H321,$F$1:$G$506,2,FALSE),\"\")","v":"S.US.MSI"}]
[null,null,"S.US.MTD       ",{"$f":"IFERROR(RTD(\"cqg.rtd\", ,\"ContractData\",C322, \"PerCentNetLastTrade\",, \"T\")/100,\"\")","v":-2.4495058014611087E-3},408,408,"S.US.MTD       ",{"$f":"H321+1","v":322},"S.US.AVY       "]
[null,null,"S.US.MU        ",{"$f":"IFERROR(RTD(\"cqg.rtd\", ,\"ContractData\",C323, \"PerCentNetLastTrade\",, \"T\")/100,\"\")","v":-4.5738045738045741E-3},434,434,"S.US.MU        ",323,"S.US.VFC       "]
[null,null,"S.US.MUR       ",{"$f":"IFERROR(RTD(\"cqg.rtd\", ,\"ContractData\",C324, \"PerCentNetLastTrade\",, \"T\")/100,\"\")","v":-1.0533707865168539E-3},383,383,"S.US.MUR       ",324,"S.US.GPC       "]
[null,null,"S.US.MYL",{"$f":"IFERROR(RTD(\"cqg.rtd\", ,\"ContractData\",C325, \"PerCentNetLastTrade\",, \"T\")/100,\"\")","v":1.1193080641058254E-2},105,105,"S.US.MYL",325,"S.US.PCLN      "]
[null,null,"S.US.NAVI",{"$f":"IFERROR(RTD(\"cqg.rtd\", ,\"ContractData\",C326, \"PerCentNetLastTrade\",, \"T\")/100,\"\")","v":7.702182284980744E-3},172,172,"S.US.NAVI",326,"S.US.EL        "]
[null,null,"S.US.NBL       ",{"$f":"IFERROR(RTD(\"cqg.rtd\", ,\"ContractData\",C327, \"PerCentNetLastTrade\",, \"T\")/100,\"\")","v":-1.1577051710830975E-2},478,478,"S.US.NBL       ",327,"S.US.WBA"]
[null,null,"S.US.NDAQ      ",{"$f":"IFERROR(RTD(\"cqg.rtd\", ,\"ContractData\",C328, \"PerCentNetLastTrade\",, \"T\")/100,\"\")","v":1.4476135875017917E-2},62,62,"S.US.NDAQ      ",328,"S.US.CPB       "]
[null,null,"S.US.NEE       ",{"$f":"IFERROR(RTD(\"cqg.rtd\", ,\"ContractData\",C329, \"PerCentNetLastTrade\",, \"T\")/100,\"\")","v":3.5865147047102891E-3},282,282,"S.US.NEE       ",329,"S.US.SYMC      "]
[null,null,"S.US.NEM       ",{"$f":"IFERROR(RTD(\"cqg.rtd\", ,\"ContractData\",C330, \"PerCentNetLastTrade\",, \"T\")/100,\"\")","v":-6.905710491367862E-3},450,450,"S.US.NEM       ",330,"S.US.TSO       "]
[null,null,"S.US.NFLX      ",{"$f":"IFERROR(RTD(\"cqg.rtd\", ,\"ContractData\",C331, \"PerCentNetLastTrade\",, \"T\")/100,\"\")","v":-1.0564839110620082E-2},473,473,"S.US.NFLX      ",331,"S.US.ARNC"]
[null,null,"S.US.NFX       ",{"$f":"IFERROR(RTD(\"cqg.rtd\", ,\"ContractData\",C332, \"PerCentNetLastTrade\",, \"T\")/100,\"\")","v":5.9851568111084505E-3},210,210,"S.US.NFX       ",332,"S.US.DLR       "]
[null,null,"S.US.NI        ",{"$f":"IFERROR(RTD(\"cqg.rtd\", ,\"ContractData\",C333, \"PerCentNetLastTrade\",, \"T\")/100,\"\")","v":4.4622936189201252E-3},256,256,"S.US.NI        ",333,"S.US.LNT       "]
[null,null,"S.US.NKE       ",{"$f":"IFERROR(RTD(\"cqg.rtd\", ,\"ContractData\",C334, \"PerCentNetLastTrade\",, \"T\")/100,\"\")","v":-2.8459622909996441E-3},412,412,"S.US.NKE       ",334,"S.US.CLX       "]
[null,null,"S.US.NLSN",{"$f":"IFERROR(RTD(\"cqg.rtd\", ,\"ContractData\",C335, \"PerCentNetLastTrade\",, \"T\")/100,\"\")","v":1.3992326788535318E-2},63,63,"S.US.NLSN",335,"S.US.CMG       "]
[null,null,"S.US.NOC       ",{"$f":"IFERROR(RTD(\"cqg.rtd\", ,\"ContractData\",C336, \"PerCentNetLastTrade\",, \"T\")/100,\"\")","v":1.2825396825396827E-2},83,83,"S.US.NOC       ",336,"S.US.PBI       "]
[null,null,"S.US.NOV       ",{"$f":"IFERROR(RTD(\"cqg.rtd\", ,\"ContractData\",C337, \"PerCentNetLastTrade\",, \"T\")/100,\"\")","v":5.8346017250126836E-3},219,219,"S.US.NOV       ",337,"S.US.NWL       "]
[null,null,"S.US.NRG       ",{"$f":"IFERROR(RTD(\"cqg.rtd\", ,\"ContractData\",C338, \"PerCentNetLastTrade\",, \"T\")/100,\"\")","v":3.0012004801920765E-3},286,286,"S.US.NRG       ",338,"S.US.TAP       "]
[null,null,"S.US.NSC       ",{"$f":"IFERROR(RTD(\"cqg.rtd\", ,\"ContractData\",C339, \"PerCentNetLastTrade\",, \"T\")/100,\"\")","v":1.1063408190224571E-2},111,111,"S.US.NSC       ",339,"S.US.XEL       "]
[null,null,"S.US.NTAP",{"$f":"IFERROR(RTD(\"cqg.rtd\", ,\"ContractData\",C340, \"PerCentNetLastTrade\",, \"T\")/100,\"\")","v":3.041825095057034E-3},302,302,"S.US.NTAP",340,"S.US.WYNN      "]
[null,null,"S.US.NTRS      ",{"$f":"IFERROR(RTD(\"cqg.rtd\", ,\"ContractData\",C341, \"PerCentNetLastTrade\",, \"T\")/100,\"\")","v":1.276795127093827E-2},84,84,"S.US.NTRS      ",341,"S.US.DVA       "]
[null,null,"S.US.NUE       ",{"$f":"IFERROR(RTD(\"cqg.rtd\", ,\"ContractData\",C342, \"PerCentNetLastTrade\",, \"T\")/100,\"\")","v":4.5581242826692903E-2},2,2,"S.US.NUE       ",342,"S.US.AEE       "]
[null,null,"S.US.NVDA      ",{"$f":"IFERROR(RTD(\"cqg.rtd\", ,\"ContractData\",C343, \"PerCentNetLastTrade\",, \"T\")/100,\"\")","v":-4.4446400281640555E-2},506,506,"S.US.NVDA      ",343,"S.US.PM"]
[null,null,"S.US.NWL       ",{"$f":"IFERROR(RTD(\"cqg.rtd\", ,\"ContractData\",C344, \"PerCentNetLastTrade\",, \"T\")/100,\"\")","v":1.7024898914662695E-3},337,337,"S.US.NWL       ",344,"S.US.EA"]
[null,null,"S.US.NWS",{"$f":"IFERROR(RTD(\"cqg.rtd\", ,\"ContractData\",C345, \"PerCentNetLastTrade\",, \"T\")/100,\"\")","v":-1.4705882352941178E-2},490,490,"S.US.NWS",345,"S.US.ABBV"]
[null,null,"S.US.NWSA",{"$f":"IFERROR(RTD(\"cqg.rtd\", ,\"ContractData\",C346, \"PerCentNetLastTrade\",, \"T\")/100,\"\")","v":-1.580135440180587E-2},493,493,"S.US.NWSA",346,"S.US.BCR       "]
[null,null,"S.US.O         ",{"$f":"IFERROR(RTD(\"cqg.rtd\", ,\"ContractData\",C347, \"PerCentNetLastTrade\",, \"T\")/100,\"\")","v":5.548302872062664E-3},226,226,"S.US.O         ",347,"S.US.ES"]
[null,null,"S.US.OKE       ",{"$f":"IFERROR(RTD(\"cqg.rtd\", ,\"ContractData\",C348, \"PerCentNetLastTrade\",, \"T\")/100,\"\")","v":-5.604773097089134E-3},440,440,"S.US.OKE       ",348,"S.US.EQIX"]
[null,null,"S.US.OMC       ",{"$f":"IFERROR(RTD(\"cqg.rtd\", ,\"ContractData\",C349, \"PerCentNetLastTrade\",, \"T\")/100,\"\")","v":7.8518692136411578E-3},161,161,"S.US.OMC       ",349,"S.US.HP        "]
[null,null,"S.US.ORCL      ",{"$f":"IFERROR(RTD(\"cqg.rtd\", ,\"ContractData\",C350, \"PerCentNetLastTrade\",, \"T\")/100,\"\")","v":7.8450600637411123E-3},170,170,"S.US.ORCL      ",350,"S.US.COO       "]
[null,null,"S.US.ORLY",{"$f":"IFERROR(RTD(\"cqg.rtd\", ,\"ContractData\",C351, \"PerCentNetLastTrade\",, \"T\")/100,\"\")","v":-1.2693156732891833E-2},483,483,"S.US.ORLY",351,"S.US.JBHT      "]
[null,null,"S.US.OXY       ",{"$f":"IFERROR(RTD(\"cqg.rtd\", ,\"ContractData\",C352, \"PerCentNetLastTrade\",, \"T\")/100,\"\")","v":-1.5627282021323206E-2},492,492,"S.US.OXY       ",352,"S.US.KMI"]
[null,null,"S.US.PAYX      ",{"$f":"IFERROR(RTD(\"cqg.rtd\", ,\"ContractData\",C353, \"PerCentNetLastTrade\",, \"T\")/100,\"\")","v":1.0092370851864523E-2},126,126,"S.US.PAYX      ",353,"S.US.CL        "]
[null,null,"S.US.PBCT      ",{"$f":"IFERROR(RTD(\"cqg.rtd\", ,\"ContractData\",C354, \"PerCentNetLastTrade\",, \"T\")/100,\"\")","v":6.9370330843116328E-3},191,191,"S.US.PBCT      ",354,"S.US.VNO       "]
[null,null,"S.US.PBI       ",{"$f":"IFERROR(RTD(\"cqg.rtd\", ,\"ContractData\",C355, \"PerCentNetLastTrade\",, \"T\")/100,\"\")","v":1.5163002274450341E-3},336,336,"S.US.PBI       ",355,"S.US.TRV       "]
[null,null,"S.US.PCAR      ",{"$f":"IFERROR(RTD(\"cqg.rtd\", ,\"ContractData\",C356, \"PerCentNetLastTrade\",, \"T\")/100,\"\")","v":1.6732140258984431E-2},42,42,"S.US.PCAR      ",356,"S.US.YUM       "]
[null,null,"S.US.PCG       ",{"$f":"IFERROR(RTD(\"cqg.rtd\", ,\"ContractData\",C357, \"PerCentNetLastTrade\",, \"T\")/100,\"\")","v":5.0513022888713502E-3},242,242,"S.US.PCG       ",357,"S.US.PSA       "]
[null,null,"S.US.PCLN      ",{"$f":"IFERROR(RTD(\"cqg.rtd\", ,\"ContractData\",C358, \"PerCentNetLastTrade\",, \"T\")/100,\"\")","v":1.8645498660803761E-3},325,325,"S.US.PCLN      ",358,"S.US.HOLX      "]
[null,null,"S.US.PDCO      ",{"$f":"IFERROR(RTD(\"cqg.rtd\", ,\"ContractData\",C359, \"PerCentNetLastTrade\",, \"T\")/100,\"\")","v":8.1718421667055802E-3},162,162,"S.US.PDCO      ",359,"S.US.PSX"]
[null,null,"S.US.PEG       ",{"$f":"IFERROR(RTD(\"cqg.rtd\", ,\"ContractData\",C360, \"PerCentNetLastTrade\",, \"T\")/100,\"\")","v":7.6054390412537455E-3},175,175,"S.US.PEG       ",360,"S.US.STZ       "]
[null,null,"S.US.PEP       ",{"$f":"IFERROR(RTD(\"cqg.rtd\", ,\"ContractData\",C361, \"PerCentNetLastTrade\",, \"T\")/100,\"\")","v":4.7125353440150806E-3},240,240,"S.US.PEP       ",361,"S.US.EXC       "]
[null,null,"S.US.PFE       ",{"$f":"IFERROR(RTD(\"cqg.rtd\", ,\"ContractData\",C362, \"PerCentNetLastTrade\",, \"T\")/100,\"\")","v":7.4188562596599695E-3},165,165,"S.US.PFE       ",362,"S.US.WYN       "]
[null,null,"S.US.PFG       ",{"$f":"IFERROR(RTD(\"cqg.rtd\", ,\"ContractData\",C363, \"PerCentNetLastTrade\",, \"T\")/100,\"\")","v":2.1360499507065395E-2},18,18,"S.US.PFG       ",363,"S.US.FBHS"]
[null,null,"S.US.PG        ",{"$f":"IFERROR(RTD(\"cqg.rtd\", ,\"ContractData\",C364, \"PerCentNetLastTrade\",, \"T\")/100,\"\")","v":3.4102534955098331E-3},284,284,"S.US.PG        ",364,"S.US.PNW       "]
[null,null,"S.US.PGR       ",{"$f":"IFERROR(RTD(\"cqg.rtd\", ,\"ContractData\",C365, \"PerCentNetLastTrade\",, \"T\")/100,\"\")","v":-1.5932023366967605E-3},399,399,"S.US.PGR       ",365,"S.US.KO        "]
[null,null,"S.US.PH        ",{"$f":"IFERROR(RTD(\"cqg.rtd\", ,\"ContractData\",C366, \"PerCentNetLastTrade\",, \"T\")/100,\"\")","v":1.5840266222961731E-2},51,51,"S.US.PH        ",366,"S.US.LEN       "]
[null,null,"S.US.PHM       ",{"$f":"IFERROR(RTD(\"cqg.rtd\", ,\"ContractData\",C367, \"PerCentNetLastTrade\",, \"T\")/100,\"\")","v":-2.3126734505087882E-3},402,402,"S.US.PHM       ",367,"S.US.LLY       "]
[null,null,"S.US.PKI       ",{"$f":"IFERROR(RTD(\"cqg.rtd\", ,\"ContractData\",C368, \"PerCentNetLastTrade\",, \"T\")/100,\"\")","v":7.5968130442838613E-3},167,167,"S.US.PKI       ",368,"S.US.LH        "]
[null,null,"S.US.PLD",{"$f":"IFERROR(RTD(\"cqg.rtd\", ,\"ContractData\",C369, \"PerCentNetLastTrade\",, \"T\")/100,\"\")","v":-2.9934144881261227E-3},413,413,"S.US.PLD",369,"S.US.VMC       "]
[null,null,"S.US.PM",{"$f":"IFERROR(RTD(\"cqg.rtd\", ,\"ContractData\",C370, \"PerCentNetLastTrade\",, \"T\")/100,\"\")","v":9.7437396472766251E-4},343,343,"S.US.PM",370,"S.US.MKC       "]
[null,null,"S.US.PNC       ",{"$f":"IFERROR(RTD(\"cqg.rtd\", ,\"ContractData\",C371, \"PerCentNetLastTrade\",, \"T\")/100,\"\")","v":1.1860276198212836E-2},96,96,"S.US.PNC       ",371,"S.US.LOW       "]
[null,null,"S.US.PNR",{"$f":"IFERROR(RTD(\"cqg.rtd\", ,\"ContractData\",C372, \"PerCentNetLastTrade\",, \"T\")/100,\"\")","v":1.3283378746594006E-2},80,80,"S.US.PNR",372,"S.US.HD        "]
[null,null,"S.US.PNW       ",{"$f":"IFERROR(RTD(\"cqg.rtd\", ,\"ContractData\",C373, \"PerCentNetLastTrade\",, \"T\")/100,\"\")","v":-1.2711325791280029E-4},364,364,"S.US.PNW       ",373,"S.US.KMX       "]
[null,null,"S.US.PPG       ",{"$f":"IFERROR(RTD(\"cqg.rtd\", ,\"ContractData\",C374, \"PerCentNetLastTrade\",, \"T\")/100,\"\")","v":2.983887010145216E-3},292,292,"S.US.PPG       ",374,"S.US.COST      "]
[null,null,"S.US.PPL       ",{"$f":"IFERROR(RTD(\"cqg.rtd\", ,\"ContractData\",C375, \"PerCentNetLastTrade\",, \"T\")/100,\"\")","v":5.0704225352112674E-3},241,241,"S.US.PPL       ",375,"S.US.AMG       "]
[null,null,"S.US.PRGO",{"$f":"IFERROR(RTD(\"cqg.rtd\", ,\"ContractData\",C376, \"PerCentNetLastTrade\",, \"T\")/100,\"\")","v":9.319899244332493E-3},137,137,"S.US.PRGO",376,"S.US.HSIC      "]
[null,null,"S.US.PRU       ",{"$f":"IFERROR(RTD(\"cqg.rtd\", ,\"ContractData\",C377, \"PerCentNetLastTrade\",, \"T\")/100,\"\")","v":1.1402298850574713E-2},99,99,"S.US.PRU       ",377,"S.US.KMB       "]
[null,null,"S.US.PSA       ",{"$f":"IFERROR(RTD(\"cqg.rtd\", ,\"ContractData\",C378, \"PerCentNetLastTrade\",, \"T\")/100,\"\")","v":8.1896355612175262E-4},357,357,"S.US.PSA       ",378,"S.US.MON       "]
[null,null,"S.US.PSX",{"$f":"IFERROR(RTD(\"cqg.rtd\", ,\"ContractData\",C379, \"PerCentNetLastTrade\",, \"T\")/100,\"\")","v":7.5131480090157769E-4},359,359,"S.US.PSX",379,"S.US.AMGN      "]
[null,null,"S.US.PVH",{"$f":"IFERROR(RTD(\"cqg.rtd\", ,\"ContractData\",C380, \"PerCentNetLastTrade\",, \"T\")/100,\"\")","v":-1.1762094984465156E-2},479,479,"S.US.PVH",380,"S.US.HAR       "]
[null,null,"S.US.PWR       ",{"$f":"IFERROR(RTD(\"cqg.rtd\", ,\"ContractData\",C381, \"PerCentNetLastTrade\",, \"T\")/100,\"\")","v":6.2229437229437239E-3},211,211,"S.US.PWR       ",381,"S.US.MAA       "]
[null,null,"S.US.PX        ",{"$f":"IFERROR(RTD(\"cqg.rtd\", ,\"ContractData\",C382, \"PerCentNetLastTrade\",, \"T\")/100,\"\")","v":1.0754538415211219E-2},112,112,"S.US.PX        ",382,"S.US.SE        "]
[null,null,"S.US.PXD       ",{"$f":"IFERROR(RTD(\"cqg.rtd\", ,\"ContractData\",C383, \"PerCentNetLastTrade\",, \"T\")/100,\"\")","v":1.4244574719736707E-2},72,72,"S.US.PXD       ",383,"S.US.MUR       "]
[null,null,"S.US.PYPL",{"$f":"IFERROR(RTD(\"cqg.rtd\", ,\"ContractData\",C384, \"PerCentNetLastTrade\",, \"T\")/100,\"\")","v":1.5771315919172007E-2},43,43,"S.US.PYPL",384,"S.US.DVN       "]
[null,null,"S.US.QCOM      ",{"$f":"IFERROR(RTD(\"cqg.rtd\", ,\"ContractData\",C385, \"PerCentNetLastTrade\",, \"T\")/100,\"\")","v":1.8148148148148149E-2},30,{"$f":"IFERROR(E385,\"\")","v":30},{"$f":"C385","v":"S.US.QCOM      "},385,{"$f":"IFERROR(VLOOKUP(H385,$F$1:$G$506,2,FALSE),\"\")","v":"S.US.TJX       "}]
[null,null,"S.US.QRVO",{"$f":"IFERROR(RTD(\"cqg.rtd\", ,\"ContractData\",C386, \"PerCentNetLastTrade\",, \"T\")/100,\"\")","v":5.2814244756299988E-3},224,224,"S.US.QRVO",{"$f":"H385+1","v":386},"S.US.FB"]
[null,null,"S.US.R         ",{"$f":"IFERROR(RTD(\"cqg.rtd\", ,\"ContractData\",C387, \"PerCentNetLastTrade\",, \"T\")/100,\"\")","v":1.0589619558112171E-2},115,115,"S.US.R         ",387,"S.US.JCI"]
[null,null,"S.US.RAI       ",{"$f":"IFERROR(RTD(\"cqg.rtd\", ,\"ContractData\",C388, \"PerCentNetLastTrade\",, \"T\")/100,\"\")","v":-6.4388311045071823E-3},445,445,"S.US.RAI       ",388,"S.US.IDXX      "]
[null,null,"S.US.RCL       ",{"$f":"IFERROR(RTD(\"cqg.rtd\", ,\"ContractData\",C389, \"PerCentNetLastTrade\",, \"T\")/100,\"\")","v":7.9298831385642751E-3},169,169,"S.US.RCL       ",389,"S.US.SPG       "]
[null,null,"S.US.REGN      ",{"$f":"IFERROR(RTD(\"cqg.rtd\", ,\"ContractData\",C390, \"PerCentNetLastTrade\",, \"T\")/100,\"\")","v":4.3182260260649682E-2},3,3,"S.US.REGN      ",390,"S.US.APA       "]
[null,null,"S.US.RF        ",{"$f":"IFERROR(RTD(\"cqg.rtd\", ,\"ContractData\",C391, \"PerCentNetLastTrade\",, \"T\")/100,\"\")","v":1.4009339559706471E-2},71,71,"S.US.RF        ",391,"S.US.EFX       "]
[null,null,"S.US.RHI       ",{"$f":"IFERROR(RTD(\"cqg.rtd\", ,\"ContractData\",C392, \"PerCentNetLastTrade\",, \"T\")/100,\"\")","v":6.3545858928193179E-3},206,206,"S.US.RHI       ",392,"S.US.EXR       "]
[null,null,"S.US.RHT       ",{"$f":"IFERROR(RTD(\"cqg.rtd\", ,\"ContractData\",C393, \"PerCentNetLastTrade\",, \"T\")/100,\"\")","v":6.8138801261829647E-3},195,195,"S.US.RHT       ",393,"S.US.GWW       "]
[null,null,"S.US.RIG       ",{"$f":"IFERROR(RTD(\"cqg.rtd\", ,\"ContractData\",C394, \"PerCentNetLastTrade\",, \"T\")/100,\"\")","v":4.4943820224719096E-3},254,254,"S.US.RIG       ",394,"S.US.BBBY      "]
[null,null,"S.US.RL",{"$f":"IFERROR(RTD(\"cqg.rtd\", ,\"ContractData\",C395, \"PerCentNetLastTrade\",, \"T\")/100,\"\")","v":-3.7683708076874768E-3},415,415,"S.US.RL",395,"S.US.CAG       "]
[null,null,"S.US.ROK       ",{"$f":"IFERROR(RTD(\"cqg.rtd\", ,\"ContractData\",C396, \"PerCentNetLastTrade\",, \"T\")/100,\"\")","v":5.7444701221525249E-3},222,222,"S.US.ROK       ",396,"S.US.IP        "]
[null,null,"S.US.ROP       ",{"$f":"IFERROR(RTD(\"cqg.rtd\", ,\"ContractData\",C397, \"PerCentNetLastTrade\",, \"T\")/100,\"\")","v":6.4528744622604616E-3},200,200,"S.US.ROP       ",397,"S.US.FRT       "]
[null,null,"S.US.ROST      ",{"$f":"IFERROR(RTD(\"cqg.rtd\", ,\"ContractData\",C398, \"PerCentNetLastTrade\",, \"T\")/100,\"\")","v":-1.003052769297863E-2},470,470,"S.US.ROST      ",398,"S.US.DRI       "]
[null,null,"S.US.RRC       ",{"$f":"IFERROR(RTD(\"cqg.rtd\", ,\"ContractData\",C399, \"PerCentNetLastTrade\",, \"T\")/100,\"\")","v":-1.7199758599879302E-2},495,495,"S.US.RRC       ",399,"S.US.PGR       "]
[null,null,"S.US.RSG       ",{"$f":"IFERROR(RTD(\"cqg.rtd\", ,\"ContractData\",C400, \"PerCentNetLastTrade\",, \"T\")/100,\"\")","v":9.6618357487922701E-3},136,136,"S.US.RSG       ",400,"S.US.DPS       "]
[null,null,"S.US.RTN       ",{"$f":"IFERROR(RTD(\"cqg.rtd\", ,\"ContractData\",C401, \"PerCentNetLastTrade\",, \"T\")/100,\"\")","v":1.2930747183896554E-2},81,81,"S.US.RTN       ",401,"S.US.MCD       "]
[null,null,"S.US.SBUX      ",{"$f":"IFERROR(RTD(\"cqg.rtd\", ,\"ContractData\",C402, \"PerCentNetLastTrade\",, \"T\")/100,\"\")","v":-2.1344717182497333E-3},405,405,"S.US.SBUX      ",402,"S.US.PHM       "]
[null,null,"S.US.SCG       ",{"$f":"IFERROR(RTD(\"cqg.rtd\", ,\"ContractData\",C403, \"PerCentNetLastTrade\",, \"T\")/100,\"\")","v":9.5279341706366386E-3},134,134,"S.US.SCG       ",403,"S.US.GPN       "]
[null,null,"S.US.SCHW      ",{"$f":"IFERROR(RTD(\"cqg.rtd\", ,\"ContractData\",C404, \"PerCentNetLastTrade\",, \"T\")/100,\"\")","v":2.1532298447671506E-2},17,17,"S.US.SCHW      ",404,"S.US.VRSN      "]
[null,null,"S.US.SE        ",{"$f":"IFERROR(RTD(\"cqg.rtd\", ,\"ContractData\",C405, \"PerCentNetLastTrade\",, \"T\")/100,\"\")","v":-7.1225071225071229E-4},382,382,"S.US.SE        ",405,"S.US.SBUX      "]
[null,null,"S.US.SEE       ",{"$f":"IFERROR(RTD(\"cqg.rtd\", ,\"ContractData\",C406, \"PerCentNetLastTrade\",, \"T\")/100,\"\")","v":-1.7144051850303158E-2},496,496,"S.US.SEE       ",406,"S.US.BHI       "]
[null,null,"S.US.SHW       ",{"$f":"IFERROR(RTD(\"cqg.rtd\", ,\"ContractData\",C407, \"PerCentNetLastTrade\",, \"T\")/100,\"\")","v":1.0278330668580938E-2},117,117,"S.US.SHW       ",407,"S.US.AEP       "]
[null,null,"S.US.SIG",{"$f":"IFERROR(RTD(\"cqg.rtd\", ,\"ContractData\",C408, \"PerCentNetLastTrade\",, \"T\")/100,\"\")","v":4.3901769790094664E-3},257,257,"S.US.SIG",408,"S.US.MTD       "]
[null,null,"S.US.SJM       ",{"$f":"IFERROR(RTD(\"cqg.rtd\", ,\"ContractData\",C409, \"PerCentNetLastTrade\",, \"T\")/100,\"\")","v":5.7238081437472835E-3},225,225,"S.US.SJM       ",409,"S.US.VAR       "]
[null,null,"S.US.SLB       ",{"$f":"IFERROR(RTD(\"cqg.rtd\", ,\"ContractData\",C410, \"PerCentNetLastTrade\",, \"T\")/100,\"\")","v":-2.7994157740993185E-3},410,410,"S.US.SLB       ",410,"S.US.SLB       "]
[null,null,"S.US.SLG       ",{"$f":"IFERROR(RTD(\"cqg.rtd\", ,\"ContractData\",C411, \"PerCentNetLastTrade\",, \"T\")/100,\"\")","v":5.4649785955005019E-3},223,223,"S.US.SLG       ",411,"S.US.ADM       "]
[null,null,"S.US.SNA       ",{"$f":"IFERROR(RTD(\"cqg.rtd\", ,\"ContractData\",C412, \"PerCentNetLastTrade\",, \"T\")/100,\"\")","v":1.2360939431396788E-2},88,88,"S.US.SNA       ",412,"S.US.NKE       "]
[null,null,"S.US.SNI",{"$f":"IFERROR(RTD(\"cqg.rtd\", ,\"ContractData\",C413, \"PerCentNetLastTrade\",, \"T\")/100,\"\")","v":-3.4690993190286522E-3},420,420,"S.US.SNI",413,"S.US.PLD"]
[null,null,"S.US.SO        ",{"$f":"IFERROR(RTD(\"cqg.rtd\", ,\"ContractData\",C414, \"PerCentNetLastTrade\",, \"T\")/100,\"\")","v":3.4658511722731903E-3},281,281,"S.US.SO        ",414,"S.US.MCHP      "]
[null,null,"S.US.SPG       ",{"$f":"IFERROR(RTD(\"cqg.rtd\", ,\"ContractData\",C415, \"PerCentNetLastTrade\",, \"T\")/100,\"\")","v":-1.5925315760571116E-3},389,389,"S.US.SPG       ",415,"S.US.RL"]
[null,null,"S.US.SPGI",{"$f":"IFERROR(RTD(\"cqg.rtd\", ,\"ContractData\",C416, \"PerCentNetLastTrade\",, \"T\")/100,\"\")","v":2.3754849948531159E-3},315,315,"S.US.SPGI",416,"S.US.HOG       "]
[null,null,"S.US.SPLS      ",{"$f":"IFERROR(RTD(\"cqg.rtd\", ,\"ContractData\",C417, \"PerCentNetLastTrade\",, \"T\")/100,\"\")","v":3.2786885245901635E-3},296,296,"S.US.SPLS      ",417,"S.US.FAST      "]
[null,null,"S.US.SRCL      ",{"$f":"IFERROR(RTD(\"cqg.rtd\", ,\"ContractData\",C418, \"PerCentNetLastTrade\",, \"T\")/100,\"\")","v":1.9408623160088578E-2},24,24,"S.US.SRCL      ",418,"S.US.BFB"]
[null,null,"S.US.SRE       ",{"$f":"IFERROR(RTD(\"cqg.rtd\", ,\"ContractData\",C419, \"PerCentNetLastTrade\",, \"T\")/100,\"\")","v":6.8040249161475811E-3},188,188,"S.US.SRE       ",419,"S.US.VIAB"]
[null,null,"S.US.STI       ",{"$f":"IFERROR(RTD(\"cqg.rtd\", ,\"ContractData\",C420, \"PerCentNetLastTrade\",, \"T\")/100,\"\")","v":9.8684210526315784E-3},129,129,"S.US.STI       ",420,"S.US.SNI"]
[null,null,"S.US.STT       ",{"$f":"IFERROR(RTD(\"cqg.rtd\", ,\"ContractData\",C421, \"PerCentNetLastTrade\",, \"T\")/100,\"\")","v":1.728331839713225E-2},38,38,"S.US.STT       ",421,"S.US.VRTX      "]
[null,null,"S.US.STX       ",{"$f":"IFERROR(RTD(\"cqg.rtd\", ,\"ContractData\",C422, \"PerCentNetLastTrade\",, \"T\")/100,\"\")","v":2.8411536805854499E-2},5,5,"S.US.STX       ",422,"S.US.AWK       "]
[null,null,"S.US.STZ       ",{"$f":"IFERROR(RTD(\"cqg.rtd\", ,\"ContractData\",C423, \"PerCentNetLastTrade\",, \"T\")/100,\"\")","v":2.5731746542296559E-4},360,360,"S.US.STZ       ",423,"S.US.WMT       "]
[null,null,"S.US.SWK       ",{"$f":"IFERROR(RTD(\"cqg.rtd\", ,\"ContractData\",C424, \"PerCentNetLastTrade\",, \"T\")/100,\"\")","v":2.2953204558312453E-2},14,14,"S.US.SWK       ",424,"S.US.XRX       "]
[null,null,"S.US.SWKS      ",{"$f":"IFERROR(RTD(\"cqg.rtd\", ,\"ContractData\",C425, \"PerCentNetLastTrade\",, \"T\")/100,\"\")","v":5.7477497017677038E-3},217,217,"S.US.SWKS      ",425,"S.US.TDG       "]
[null,null,"S.US.SWN       ",{"$f":"IFERROR(RTD(\"cqg.rtd\", ,\"ContractData\",C426, \"PerCentNetLastTrade\",, \"T\")/100,\"\")","v":-1.8867924528301886E-2},500,500,"S.US.SWN       ",426,"S.US.CXO       "]
[null,null,"S.US.SYF",{"$f":"IFERROR(RTD(\"cqg.rtd\", ,\"ContractData\",C427, \"PerCentNetLastTrade\",, \"T\")/100,\"\")","v":1.4632799558255107E-2},64,64,"S.US.SYF",427,"S.US.LEG       "]
[null,null,"S.US.SYK       ",{"$f":"IFERROR(RTD(\"cqg.rtd\", ,\"ContractData\",C428, \"PerCentNetLastTrade\",, \"T\")/100,\"\")","v":8.2718352120671485E-3},158,158,"S.US.SYK       ",428,"S.US.EW        "]
[null,null,"S.US.SYMC      ",{"$f":"IFERROR(RTD(\"cqg.rtd\", ,\"ContractData\",C429, \"PerCentNetLastTrade\",, \"T\")/100,\"\")","v":1.7229496898690559E-3},329,329,"S.US.SYMC      ",429,"S.US.MO        "]
[null,null,"S.US.SYY       ",{"$f":"IFERROR(RTD(\"cqg.rtd\", ,\"ContractData\",C430, \"PerCentNetLastTrade\",, \"T\")/100,\"\")","v":3.8008361839604716E-3},277,277,"S.US.SYY       ",430,"S.US.AIV       "]
[null,null,"S.US.T         ",{"$f":"IFERROR(RTD(\"cqg.rtd\", ,\"ContractData\",C431, \"PerCentNetLastTrade\",, \"T\")/100,\"\")","v":-1.8849685838569358E-2},498,498,"S.US.T         ",431,"S.US.DLTR"]
[null,null,"S.US.TAP       ",{"$f":"IFERROR(RTD(\"cqg.rtd\", ,\"ContractData\",C432, \"PerCentNetLastTrade\",, \"T\")/100,\"\")","v":1.2506513809275666E-3},338,338,"S.US.TAP       ",432,"S.US.K         "]
[null,null,"S.US.TDC",{"$f":"IFERROR(RTD(\"cqg.rtd\", ,\"ContractData\",C433, \"PerCentNetLastTrade\",, \"T\")/100,\"\")","v":5.681818181818182E-3},228,228,"S.US.TDC",433,"S.US.VLO       "]
[null,null,"S.US.TDG       ",{"$f":"IFERROR(RTD(\"cqg.rtd\", ,\"ContractData\",C434, \"PerCentNetLastTrade\",, \"T\")/100,\"\")","v":-4.3062579013906453E-3},425,425,"S.US.TDG       ",434,"S.US.MU        "]
[null,null,"S.US.TEL",{"$f":"IFERROR(RTD(\"cqg.rtd\", ,\"ContractData\",C435, \"PerCentNetLastTrade\",, \"T\")/100,\"\")","v":5.3255225669018771E-3},235,235,"S.US.TEL",435,"S.US.CHTR"]
[null,null,"S.US.TGNA",{"$f":"IFERROR(RTD(\"cqg.rtd\", ,\"ContractData\",C436, \"PerCentNetLastTrade\",, \"T\")/100,\"\")","v":8.0304311073541839E-3},166,166,"S.US.TGNA",436,"S.US.KIM       "]
[null,null,"S.US.TGT       ",{"$f":"IFERROR(RTD(\"cqg.rtd\", ,\"ContractData\",C437, \"PerCentNetLastTrade\",, \"T\")/100,\"\")","v":-1.3388102844971854E-2},486,486,"S.US.TGT       ",437,"S.US.ALLE"]
[null,null,"S.US.TIF       ",{"$f":"IFERROR(RTD(\"cqg.rtd\", ,\"ContractData\",C438, \"PerCentNetLastTrade\",, \"T\")/100,\"\")","v":4.0555487280324442E-3},264,264,"S.US.TIF       ",438,"S.US.BLL       "]
[null,null,"S.US.TJX       ",{"$f":"IFERROR(RTD(\"cqg.rtd\", ,\"ContractData\",C439, \"PerCentNetLastTrade\",, \"T\")/100,\"\")","v":-1.1680726800778714E-3},385,385,"S.US.TJX       ",439,"S.US.TWX       "]
[null,null,"S.US.TMK       ",{"$f":"IFERROR(RTD(\"cqg.rtd\", ,\"ContractData\",C440, \"PerCentNetLastTrade\",, \"T\")/100,\"\")","v":1.3614522156967433E-2},75,75,"S.US.TMK       ",440,"S.US.OKE       "]
[null,null,"S.US.TMO       ",{"$f":"IFERROR(RTD(\"cqg.rtd\", ,\"ContractData\",C441, \"PerCentNetLastTrade\",, \"T\")/100,\"\")","v":9.4260442894957708E-3},133,133,"S.US.TMO       ",441,"S.US.AZO       "]
[null,null,"S.US.TRIP",{"$f":"IFERROR(RTD(\"cqg.rtd\", ,\"ContractData\",C442, \"PerCentNetLastTrade\",, \"T\")/100,\"\")","v":-1.0961538461538462E-2},475,475,"S.US.TRIP",442,"S.US.ED        "]
[null,null,"S.US.TROW      ",{"$f":"IFERROR(RTD(\"cqg.rtd\", ,\"ContractData\",C443, \"PerCentNetLastTrade\",, \"T\")/100,\"\")","v":7.6368876080691638E-3},174,174,"S.US.TROW      ",443,"S.US.FOXA"]
[null,null,"S.US.TRV       ",{"$f":"IFERROR(RTD(\"cqg.rtd\", ,\"ContractData\",C444, \"PerCentNetLastTrade\",, \"T\")/100,\"\")","v":5.0112753695815586E-4},355,355,"S.US.TRV       ",444,"S.US.FOX"]
[null,null,"S.US.TSCO      ",{"$f":"IFERROR(RTD(\"cqg.rtd\", ,\"ContractData\",C445, \"PerCentNetLastTrade\",, \"T\")/100,\"\")","v":-1.4814814814814814E-2},488,488,"S.US.TSCO      ",445,"S.US.RAI       "]
[null,null,"S.US.TSN       ",{"$f":"IFERROR(RTD(\"cqg.rtd\", ,\"ContractData\",C446, \"PerCentNetLastTrade\",, \"T\")/100,\"\")","v":4.3037196434060863E-3},261,261,"S.US.TSN       ",446,"S.US.ULTA      "]
[null,null,"S.US.TSO       ",{"$f":"IFERROR(RTD(\"cqg.rtd\", ,\"ContractData\",C447, \"PerCentNetLastTrade\",, \"T\")/100,\"\")","v":1.4886064353601283E-3},330,330,"S.US.TSO       ",447,"S.US.CHK       "]
[null,null,"S.US.TSS       ",{"$f":"IFERROR(RTD(\"cqg.rtd\", ,\"ContractData\",C448, \"PerCentNetLastTrade\",, \"T\")/100,\"\")","v":8.2104870311625298E-3},160,160,"S.US.TSS       ",448,"S.US.GGP"]
[null,null,"S.US.TWX       ",{"$f":"IFERROR(RTD(\"cqg.rtd\", ,\"ContractData\",C449, \"PerCentNetLastTrade\",, \"T\")/100,\"\")","v":-5.6947608200455576E-3},439,{"$f":"IFERROR(E449,\"\")","v":439},{"$f":"C449","v":"S.US.TWX       "},449,{"$f":"IFERROR(VLOOKUP(H449,$F$1:$G$506,2,FALSE),\"\")","v":"S.US.AKAM      "}]
[null,null,"S.US.TXN       ",{"$f":"IFERROR(RTD(\"cqg.rtd\", ,\"ContractData\",C450, \"PerCentNetLastTrade\",, \"T\")/100,\"\")","v":4.9228312932410858E-3},250,250,"S.US.TXN       ",{"$f":"H449+1","v":450},"S.US.NEM       "]
[null,null,"S.US.TXT       ",{"$f":"IFERROR(RTD(\"cqg.rtd\", ,\"ContractData\",C451, \"PerCentNetLastTrade\",, \"T\")/100,\"\")","v":5.9304703476482619E-3},214,214,"S.US.TXT       ",451,"S.US.COG       "]
[null,null,"S.US.UA",{"$f":"IFERROR(RTD(\"cqg.rtd\", ,\"ContractData\",C452, \"PerCentNetLastTrade\",, \"T\")/100,\"\")","v":-2.1533613445378151E-2},501,501,"S.US.UA",452,"S.US.AVB       "]
[null,null,"S.US.UAA",{"$f":"IFERROR(RTD(\"cqg.rtd\", ,\"ContractData\",C453, \"PerCentNetLastTrade\",, \"T\")/100,\"\")","v":-1.3425925925925926E-2},484,484,"S.US.UAA",453,"S.US.ESS       "]
[null,null,"S.US.UAL       ",{"$f":"IFERROR(RTD(\"cqg.rtd\", ,\"ContractData\",C454, \"PerCentNetLastTrade\",, \"T\")/100,\"\")","v":1.859504132231405E-2},25,25,"S.US.UAL       ",454,"S.US.MRO       "]
[null,null,"S.US.UDR       ",{"$f":"IFERROR(RTD(\"cqg.rtd\", ,\"ContractData\",C455, \"PerCentNetLastTrade\",, \"T\")/100,\"\")","v":-1.0924369747899159E-2},477,477,"S.US.UDR       ",455,"S.US.HRB       "]
[null,null,"S.US.UHS       ",{"$f":"IFERROR(RTD(\"cqg.rtd\", ,\"ContractData\",C456, \"PerCentNetLastTrade\",, \"T\")/100,\"\")","v":1.2365822241305282E-2},90,90,"S.US.UHS       ",456,"S.US.MAS       "]
[null,null,"S.US.ULTA      ",{"$f":"IFERROR(RTD(\"cqg.rtd\", ,\"ContractData\",C457, \"PerCentNetLastTrade\",, \"T\")/100,\"\")","v":-6.1147346575748593E-3},446,446,"S.US.ULTA      ",457,"S.US.KR        "]
[null,null,"S.US.UNH       ",{"$f":"IFERROR(RTD(\"cqg.rtd\", ,\"ContractData\",C458, \"PerCentNetLastTrade\",, \"T\")/100,\"\")","v":7.5272161741835155E-3},177,177,"S.US.UNH       ",458,"S.US.ABC       "]
[null,null,"S.US.UNM       ",{"$f":"IFERROR(RTD(\"cqg.rtd\", ,\"ContractData\",C459, \"PerCentNetLastTrade\",, \"T\")/100,\"\")","v":1.8147288457480482E-2},32,32,"S.US.UNM       ",459,"S.US.WU        "]
[null,null,"S.US.UNP       ",{"$f":"IFERROR(RTD(\"cqg.rtd\", ,\"ContractData\",C460, \"PerCentNetLastTrade\",, \"T\")/100,\"\")","v":4.2643923240938165E-3},259,259,"S.US.UNP       ",460,"S.US.COP       "]
[null,null,"S.US.UPS       ",{"$f":"IFERROR(RTD(\"cqg.rtd\", ,\"ContractData\",C461, \"PerCentNetLastTrade\",, \"T\")/100,\"\")","v":1.0806782187441775E-2},114,114,"S.US.UPS       ",461,"S.US.VZ        "]
[null,null,"S.US.URBN      ",{"$f":"IFERROR(RTD(\"cqg.rtd\", ,\"ContractData\",C462, \"PerCentNetLastTrade\",, \"T\")/100,\"\")","v":-9.1107871720116623E-3},463,463,"S.US.URBN      ",462,"S.US.FTR"]
[null,null,"S.US.URI       ",{"$f":"IFERROR(RTD(\"cqg.rtd\", ,\"ContractData\",C463, \"PerCentNetLastTrade\",, \"T\")/100,\"\")","v":6.8439269981120203E-3},198,198,"S.US.URI       ",463,"S.US.URBN      "]
[null,null,"S.US.USB       ",{"$f":"IFERROR(RTD(\"cqg.rtd\", ,\"ContractData\",C464, \"PerCentNetLastTrade\",, \"T\")/100,\"\")","v":1.1005409438537585E-2},106,106,"S.US.USB       ",464,"S.US.FL        "]
[null,null,"S.US.UTX       ",{"$f":"IFERROR(RTD(\"cqg.rtd\", ,\"ContractData\",C465, \"PerCentNetLastTrade\",, \"T\")/100,\"\")","v":9.1850517784781635E-3},147,147,"S.US.UTX       ",465,"S.US.AAP       "]
[null,null,"S.US.V         ",{"$f":"IFERROR(RTD(\"cqg.rtd\", ,\"ContractData\",C466, \"PerCentNetLastTrade\",, \"T\")/100,\"\")","v":6.868451688009313E-3},183,183,"S.US.V         ",466,"S.US.MAC       "]
[null,null,"S.US.VAR       ",{"$f":"IFERROR(RTD(\"cqg.rtd\", ,\"ContractData\",C467, \"PerCentNetLastTrade\",, \"T\")/100,\"\")","v":-2.7363184079601988E-3},409,409,"S.US.VAR       ",467,"S.US.EOG       "]
[null,null,"S.US.VFC       ",{"$f":"IFERROR(RTD(\"cqg.rtd\", ,\"ContractData\",C468, \"PerCentNetLastTrade\",, \"T\")/100,\"\")","v":2.1860095389507153E-3},323,323,"S.US.VFC       ",468,"S.US.WFM"]
[null,null,"S.US.VIAB",{"$f":"IFERROR(RTD(\"cqg.rtd\", ,\"ContractData\",C469, \"PerCentNetLastTrade\",, \"T\")/100,\"\")","v":-4.1237113402061857E-3},419,419,"S.US.VIAB",469,"S.US.DG        "]
[null,null,"S.US.VLO       ",{"$f":"IFERROR(RTD(\"cqg.rtd\", ,\"ContractData\",C470, \"PerCentNetLastTrade\",, \"T\")/100,\"\")","v":-4.7428486734845112E-3},433,433,"S.US.VLO       ",470,"S.US.ROST      "]
[null,null,"S.US.VMC       ",{"$f":"IFERROR(RTD(\"cqg.rtd\", ,\"ContractData\",C471, \"PerCentNetLastTrade\",, \"T\")/100,\"\")","v":-4.0783034257748778E-4},369,369,"S.US.VMC       ",471,"S.US.ZTS"]
[null,null,"S.US.VNO       ",{"$f":"IFERROR(RTD(\"cqg.rtd\", ,\"ContractData\",C472, \"PerCentNetLastTrade\",, \"T\")/100,\"\")","v":9.3940817285110374E-4},354,354,"S.US.VNO       ",472,"S.US.CSRA"]
[null,null,"S.US.VRSK      ",{"$f":"IFERROR(RTD(\"cqg.rtd\", ,\"ContractData\",C473, \"PerCentNetLastTrade\",, \"T\")/100,\"\")","v":5.5608140085186943E-3},232,232,"S.US.VRSK      ",473,"S.US.NFLX      "]
[null,null,"S.US.VRSN      ",{"$f":"IFERROR(RTD(\"cqg.rtd\", ,\"ContractData\",C474, \"PerCentNetLastTrade\",, \"T\")/100,\"\")","v":-2.0447438056290595E-3},404,404,"S.US.VRSN      ",474,"S.US.EVHC"]
[null,null,"S.US.VRTX      ",{"$f":"IFERROR(RTD(\"cqg.rtd\", ,\"ContractData\",C475, \"PerCentNetLastTrade\",, \"T\")/100,\"\")","v":-3.9705048213272828E-3},421,421,"S.US.VRTX      ",475,"S.US.TRIP"]
[null,null,"S.US.VTR       ",{"$f":"IFERROR(RTD(\"cqg.rtd\", ,\"ContractData\",C476, \"PerCentNetLastTrade\",, \"T\")/100,\"\")","v":1.5703415897684959E-2},55,55,"S.US.VTR       ",476,"S.US.HES       "]
[null,null,"S.US.VZ        ",{"$f":"IFERROR(RTD(\"cqg.rtd\", ,\"ContractData\",C477, \"PerCentNetLastTrade\",, \"T\")/100,\"\")","v":-8.9832584728460601E-3},461,461,"S.US.VZ        ",477,"S.US.UDR       "]
[null,null,"S.US.WAT       ",{"$f":"IFERROR(RTD(\"cqg.rtd\", ,\"ContractData\",C478, \"PerCentNetLastTrade\",, \"T\")/100,\"\")","v":4.2895442359249334E-3},248,248,"S.US.WAT       ",478,"S.US.NBL       "]
[null,null,"S.US.WBA",{"$f":"IFERROR(RTD(\"cqg.rtd\", ,\"ContractData\",C479, \"PerCentNetLastTrade\",, \"T\")/100,\"\")","v":1.6804705317488896E-3},327,327,"S.US.WBA",479,"S.US.PVH"]
[null,null,"S.US.WDC       ",{"$f":"IFERROR(RTD(\"cqg.rtd\", ,\"ContractData\",C480, \"PerCentNetLastTrade\",, \"T\")/100,\"\")","v":1.4736297828335056E-2},61,61,"S.US.WDC       ",480,"S.US.DHI       "]
[null,null,"S.US.WEC",{"$f":"IFERROR(RTD(\"cqg.rtd\", ,\"ContractData\",C481, \"PerCentNetLastTrade\",, \"T\")/100,\"\")","v":4.6923879040667357E-3},243,243,"S.US.WEC",481,"S.US.MNST"]
[null,null,"S.US.WFC       ",{"$f":"IFERROR(RTD(\"cqg.rtd\", ,\"ContractData\",C482, \"PerCentNetLastTrade\",, \"T\")/100,\"\")","v":4.5726345409778405E-3},245,245,"S.US.WFC       ",482,"S.US.JWN       "]
[null,null,"S.US.WFM",{"$f":"IFERROR(RTD(\"cqg.rtd\", ,\"ContractData\",C483, \"PerCentNetLastTrade\",, \"T\")/100,\"\")","v":-1.0217534607778512E-2},468,468,"S.US.WFM",483,"S.US.ORLY"]
[null,null,"S.US.WHR       ",{"$f":"IFERROR(RTD(\"cqg.rtd\", ,\"ContractData\",C484, \"PerCentNetLastTrade\",, \"T\")/100,\"\")","v":5.0435580009170096E-3},237,237,"S.US.WHR       ",484,"S.US.UAA"]
[null,null,"S.US.WLTW",{"$f":"IFERROR(RTD(\"cqg.rtd\", ,\"ContractData\",C485, \"PerCentNetLastTrade\",, \"T\")/100,\"\")","v":8.9465624244378164E-3},151,151,"S.US.WLTW",485,"S.US.BBY       "]
[null,null,"S.US.WM        ",{"$f":"IFERROR(RTD(\"cqg.rtd\", ,\"ContractData\",C486, \"PerCentNetLastTrade\",, \"T\")/100,\"\")","v":4.1111426141196483E-3},268,268,"S.US.WM        ",486,"S.US.TGT       "]
[null,null,"S.US.WMB       ",{"$f":"IFERROR(RTD(\"cqg.rtd\", ,\"ContractData\",C487, \"PerCentNetLastTrade\",, \"T\")/100,\"\")","v":1.8987341772151899E-2},33,33,"S.US.WMB       ",487,"S.US.AN        "]
[null,null,"S.US.WMT       ",{"$f":"IFERROR(RTD(\"cqg.rtd\", ,\"ContractData\",C488, \"PerCentNetLastTrade\",, \"T\")/100,\"\")","v":-4.1164363422522788E-3},423,423,"S.US.WMT       ",488,"S.US.TSCO      "]
[null,null,"S.US.WRK",{"$f":"IFERROR(RTD(\"cqg.rtd\", ,\"ContractData\",C489, \"PerCentNetLastTrade\",, \"T\")/100,\"\")","v":4.7637195121951218E-3},252,252,"S.US.WRK",489,"S.US.KSS       "]
[null,null,"S.US.WU        ",{"$f":"IFERROR(RTD(\"cqg.rtd\", ,\"ContractData\",C490, \"PerCentNetLastTrade\",, \"T\")/100,\"\")","v":-9.11854103343465E-3},459,459,"S.US.WU        ",490,"S.US.NWS"]
[null,null,"S.US.WY        ",{"$f":"IFERROR(RTD(\"cqg.rtd\", ,\"ContractData\",C491, \"PerCentNetLastTrade\",, \"T\")/100,\"\")","v":1.7792521109770809E-2},34,34,"S.US.WY        ",491,"S.US.APC       "]
[null,null,"S.US.WYN       ",{"$f":"IFERROR(RTD(\"cqg.rtd\", ,\"ContractData\",C492, \"PerCentNetLastTrade\",, \"T\")/100,\"\")","v":1.2229423994129877E-4},362,362,"S.US.WYN       ",492,"S.US.OXY       "]
[null,null,"S.US.WYNN      ",{"$f":"IFERROR(RTD(\"cqg.rtd\", ,\"ContractData\",C493, \"PerCentNetLastTrade\",, \"T\")/100,\"\")","v":1.5166835187057635E-3},340,340,"S.US.WYNN      ",493,"S.US.NWSA"]
[null,null,"S.US.XEC       ",{"$f":"IFERROR(RTD(\"cqg.rtd\", ,\"ContractData\",C494, \"PerCentNetLastTrade\",, \"T\")/100,\"\")","v":1.0555893074119076E-2},116,116,"S.US.XEC       ",494,"S.US.LB"]
[null,null,"S.US.XEL       ",{"$f":"IFERROR(RTD(\"cqg.rtd\", ,\"ContractData\",C495, \"PerCentNetLastTrade\",, \"T\")/100,\"\")","v":1.4306151645207441E-3},339,339,"S.US.XEL       ",495,"S.US.RRC       "]
[null,null,"S.US.XL",{"$f":"IFERROR(RTD(\"cqg.rtd\", ,\"ContractData\",C496, \"PerCentNetLastTrade\",, \"T\")/100,\"\")","v":6.7754077791718943E-3},185,185,"S.US.XL",496,"S.US.SEE       "]
[null,null,"S.US.XLNX      ",{"$f":"IFERROR(RTD(\"cqg.rtd\", ,\"ContractData\",C497, \"PerCentNetLastTrade\",, \"T\")/100,\"\")","v":2.6719531115324945E-2},6,6,"S.US.XLNX      ",497,"S.US.KORS"]
[null,null,"S.US.XOM       ",{"$f":"IFERROR(RTD(\"cqg.rtd\", ,\"ContractData\",C498, \"PerCentNetLastTrade\",, \"T\")/100,\"\")","v":5.6955889481337865E-3},227,227,"S.US.XOM       ",498,"S.US.T         "]
[null,null,"S.US.XRAY",{"$f":"IFERROR(RTD(\"cqg.rtd\", ,\"ContractData\",C499, \"PerCentNetLastTrade\",, \"T\")/100,\"\")","v":8.0493235143003945E-3},159,159,"S.US.XRAY",499,"S.US.HBI       "]
[null,null,"S.US.XRX       ",{"$f":"IFERROR(RTD(\"cqg.rtd\", ,\"ContractData\",C500, \"PerCentNetLastTrade\",, \"T\")/100,\"\")","v":-4.10958904109589E-3},424,424,"S.US.XRX       ",500,"S.US.SWN       "]
[null,null,"S.US.XYL",{"$f":"IFERROR(RTD(\"cqg.rtd\", ,\"ContractData\",C501, \"PerCentNetLastTrade\",, \"T\")/100,\"\")","v":8.9807852965747698E-3},146,146,"S.US.XYL",501,"S.US.UA"]
[null,null,"S.US.YHOO      ",{"$f":"IFERROR(RTD(\"cqg.rtd\", ,\"ContractData\",C502, \"PerCentNetLastTrade\",, \"T\")/100,\"\")","v":9.3271152564956689E-3},140,140,"S.US.YHOO      ",502,"S.US.EXPE"]
[null,null,"S.US.YUM       ",{"$f":"IFERROR(RTD(\"cqg.rtd\", ,\"ContractData\",C503, \"PerCentNetLastTrade\",, \"T\")/100,\"\")","v":7.3529411764705881E-4},356,356,"S.US.YUM       ",503,"S.US.GPS       "]
[null,null,"S.US.ZBH",{"$f":"IFERROR(RTD(\"cqg.rtd\", ,\"ContractData\",C504, \"PerCentNetLastTrade\",, \"T\")/100,\"\")","v":4.0910253132191259E-3},269,269,"S.US.ZBH",504,"S.US.EQT       "]
[null,null,"S.US.ZION      ",{"$f":"IFERROR(RTD(\"cqg.rtd\", ,\"ContractData\",C505, \"PerCentNetLastTrade\",, \"T\")/100,\"\")","v":1.42299747532706E-2},68,68,"S.US.ZION      ",505,"S.US.ATVI      "]
[null,null,"S.US.ZTS",{"$f":"IFERROR(RTD(\"cqg.rtd\", ,\"ContractData\",C506, \"PerCentNetLastTrade\",, \"T\")/100,\"\")","v":-1.0227884442849453E-2},471,{"$f":"IFERROR(E506,\"\")","v":471},{"$f":"C506","v":"S.US.ZTS"},506,"S.US.NVDA      "]
[]
[]
[]
[]
[]
[]
[]
[]
[]
[]
[]
[]
[]
[]
[]
[]
[]
[]
[]
[]
[]
[]
[]
[]
[]
[]
[]
[]
[]
[]
[]
[]
[]
[]
[]
[]
[]
[]
[]
[]
[]
[]
[]
[]
[]
[]
[]
[]
[]
[]
[]
[]
[]
[]
[]
[]
[]
[]
[]
[]
[]
[]
[]
[]
[]
[]
[]
[]
[]
[]
[]
[]
[]
[]
[]
[]
[]
[]
[]
[]
[]
[]
[]
[]
[]
[]
[]
[]
[]
[]
[]
[]
[]
[]
[]
[]
[]
[]
[]
[]
[]
[]
[]
[]
[]
[]
[]
[]
[]
[]
[]
[]
[]
[]
[]
[]
[]
[]
[]
[]
[]
[]
[]
[]
[]
[]
[]
[]
[]
[]
[]
[]
[]
[]
[]
[]
[]
[]
[]
[]
[]
[]
[]
[]
[]
[]
[]
[]
[]
[]
[]
[]
[]
[]
[]
[]
[]
[]
[]
[]
[]
[]
[]
[]
[]
[]
[]
[]
[]
[]
[]
[]
[]
[]
[]
[]
[]
[]
[]
[]
[]
[]
[]
[]
[]
[]
[]
[]
[]
[]
[]
[]
[]
[]
[]
[]
[]
[]
[]
[]
[]
[]
[]
[]
[]
[]
[]
[]
[]
[]
[]
[]
[]
[]
[]
[]
[]
[]
[]
[]
[]
[]
[]
[]
[]
[]
[]
[]
[]
[]
[]
[]
[]
[]
[]
[]
[]
[]
[]
[]
[]
[]
[]
[]
[]
[]
[]
[]
[]
[]
[]
[]
[]
[]
[]
[]
[]
[]
[]
[]
[]
[]
[]
[]
[]
[]
[]
[]
[]
[]
[]
[]
[]
[]
[]
[]
[]
[]
[]
[]
[]
[]
[]
[]
[]
[]
[]
[]
[]
[]
[]
[]
[]
[]
[]
[]
[]
[]
[]
[]
[]
[]
[]
[]
[]
[]
[]
[]
[]
[]
[]
[]
[]
[]
[]
[]
[]
[]
[]
[]
[]
[]
[]
[]
[]
[]
[]
[]
[]
[]
[]
[]
[]
[]
[]
[]
[]
[]
[]
[]
[]
[]
[]
[]
[]
[]
[]
[]
[]
[]
[]
[]
[]
[]
[]
[]
[]
[]
[]
[]
[]
[]
[]
[]
[]
[]
[]
[]
[]
[]
[]
[]
[]
[]
[]
[]
[]
[]
[]
[]
[]
[]
[]
[]
[]
[]
[]
[]
[]
[]
[]
[]
[]
[]
[]
[]
[]
[]
[]
[]
[]
[]
[]
[]
[]
[]
[]
[]
[]
[]
[]
[]
[]
[]
[]
[]
[]
[]
[]
[]
[]
[]
[]
[]
[]
[]
[]
[]
[]
[]
[]
[]
[]
[]
[]
[]
[]
[]
[]
[]
[]
[]
[]
[]
[]
[]
[]
[]
[]
[]
[]
[]
[]
[]
[]
[]
[]
[]
[]
[]
[]
[]
[]
[]
[]
[]
[]
[]
[]
[]
[]
[]
[]
[]
[]
[]
[]
[]
[]
[]
[]
[]
[]
[]
[]
[]
[]
[]
[]
[]
[]
[]
[]
[]
[]
[]
[]
[]
[]
[]
[]
[]
[]
[]
[]
[]
[]
[]
[]
[]
[]
[]
[]
[]
[]
[]
[]
[]
[]
[]
[]
[]
[]
[]
[]
[]
[]
[]
[]
[]
[]
[]
[]
[]
[]
[]
[]
[]
[]
[]
[]
[]
[]
[]
[]
[]
[]
[]
[]
[]
[]
[]
[]
[]
[]
[]
[]
[]
[]
[]
[]
[]
[]
[]
[]
[]
[]
[]
[]
[]
[]
[]
[]
[]
[]
[]
[]
[]
[]
[]
[]
[]
[]
[]
[]
[]
[]
[]
[]
[]
[]
[]
[]
[]
[]
[]
[]
[]
[]
[]
[]
[]
[]
[]
[]
[]
[]
[]
[]
[]
[]
[]
[]
[]
[]
[]
[]
[]
[]
[]
[]
[]
[]
[]
[]
[]
[]
[]
[]
[]
[]
[]
[]
[]
[]
[]
[]
[]
[]
[]
[]
[]
[]
[]
[]
[]
[]
[]
[]
[]
[]
[]
[]
[]
[]
[]
[]
[]
[]
[]
[]
[]
[]
[]
[]
[]
[]
[]
[]
[]
[]
[]
[]
[]
[]
[]
[]
[]
[]
[]
[]
[]
[]
[]
[]
[]
[]
[]
[]
[]
[]
[]
[]
[]
[]
[]
[]
[]
[]
[]
[]
[]
[]
[]
[]
[]
[]
[]
[]
[]
[]
[]
[]
[]
[]
[]
[]
[]
[]
[]
[]
[]
[]
[]
[]
[]
[]
[]
[]
[]
[]
[]
[]
[]
[]
[]
[]
[]
[]
[]
[]
[]
[]
[]
[]
[]
[]
[]
[]
[]
[]
[]
[]
[]
[]
[]
[]
[]
[]
[]
[]
[]
[]
[]
[]
[]
[]
[]
[]
[]
[]
[]
[]
[]
[]
[]
[]
[]
[]
[]
[]
[]
[]
[]
[]
[]
[]
[]
[]
[]
[]
[]
[]
[]
[]
[]
[]
[]
[]
[]
[]
[]
[]
[]
[]
[]
[]
[]
[]
[]
[]
[]
[]
[]
[]
[]
[]
[]
[]
[]
[]
[]
[]
[]
[]
[]
[]
[]
[]
[]
[]
[]
[]
[]
[]
[]
[]
[]
[]
[]
[]
[]
[]
[]
[]
[]
[]
[]
[]
[]
[]
[]
[]
[]
[]
[]
[]
[]
[]
[]
[]
[]
[]
[]
[]
[]
[]
[]
[]
[]
[]
[]
[]
[]
[]
[]
[]
[]
[]
[]
[]
[]
[]
[]
[]
[]
[]
[]
[]
[]
[]
[]
[]
[]
[]
[]
[]
[]
[]
[]
[]
[]
[]
[]
[]
[]
[]
[]
[]
[]
[]
[]
[]
[]
[]
[]
[]
[]
[]
[]
[]
[]
[]
[]
[]
[]
[]
[]
[]
[]
[]
[]
[]
[]
[]
[]
[]
[]
[]
[]
[]
[]
[]
[]
[]
[]
[]
[]
[]
[]
[]
[]
[]
[]
[]
[]
[]
[]
[]
[]
[]
[]
[]
[]
[]
[]
[]
[]
[]
[]
[]
[]
[]
[]
[]
[]
[]
[]
[]
[]
[]
[]
[]
[]
[]
[]
[]
[]
[]
[]
[]
[]
[]
[]
[]
[]
[]
[]
[]
[]
[]
[]
[]
[]
[]
[]
[]
[]
[]
[]
[]
[]
[]
[]
[]
[]
[]
[]
[]
[]
[]
[]
[]
[]
[]
[]
[]
[]
[]
[]
[]
[]
[]
[]
[]
[]
[]
[]
[]
[]
[]
[]
[]
[]
[]
[]
[]
[]
[]
[]
[]
[]
[]
[]
[]
[]
[]
[]
[]
[]
[]
[]
[]
[]
[]
[]
[]
[]
[]
[]
[]
[]
[]
[]
[]
[]
[]
[]
[]
[]
[]
[]
[]
[]
[]
[]
[]
[]
[]
[]
[]
[]
[]
[]
[]
[]
[]
[]
[]
[]
[]
[]
[]
[]
[]
[]
[]
[]
[]
[]
[]
[]
[]
[]
[]
[]
[]
[]
[]
[]
[]
[]
[]
[]
[]
[]
[]
[]
[]
[]
[]
[]
[]
[]
[]
[]
[]
[]
[]
[]
[]
[]
[]
[]
[]
[]
[]
[]
[]
[]
[]
[]
[]
[]
[]
[]
[]
[]
[]
[]
[]
[]
[]
[]
[]
[]
[]
[]
[]
[]
[]
[]
[]
[]
[]
[]
[]
[]
[]
[]
[]
[]
[]
[]
[]
[]
[]
[]
[]
[]
[]
[]
[]
[]
[]
[]
[]
[]
[]
[]
[]
[]
[]
[]
[]
[]
[]
[]
[]
[]
[]
[]
[]
[]
[]
[]
[]
[]
[]
[]
[]
[]
[]
[]
[]
[]
[]
[]
[]
[]
[]
[]
[]
[]
[]
[]
[]
[]
[]
[]
[]
[]
[]
[]
[]
[]
[]
[]
[]
[]
[]
[]
[]
[]
[]
[]
[]
[]
[]
[]
[]
[]
[]
[]
[]
[]
[]
[]
[]
[]
[]
[]
[]
[]
[]
[]
[]
[]
[]
[]
[]
[]
[]
[]
[]
[]
[]
[]
[]
[]
[]
[]
[]
[]
[]
[]
[]
[]
[]
[]
[]
[]
[]
[]
[]
[]
[]
[]
[]
[]
[]
[]
[]
[]
[]
[]
[]
[]
[]
[]
[]
[]
[]
[]
[]
[]
[]
[]
[]
[]
[]
[]
[]
[]
[]
[]
[]
[]
[]
[]
[]
[]
[]
[]
[]
[]
[]
[]
[]
[]
[]
[]
[]
[]
[]
[]
[]
[]
[]
[]
[]
[]
[]
[]
[]
[]
[]
[]
[]
[]
[]
[]
[]
[]
[]
[]
[]
[]
[]
[]
[]
[]
[]
[]
[]
[]
[]
[]
[]
[]
[]
[]
[]
[]
[]
[]
[]
[]
[]
[]
[]
[]
[]
[]
[]
[]
[]
[]
[]
[]
[]
[]
[]
[]
[]
[]
[]
[]
[]
[]
[]
[]
[]
[]
[]
[]
[]
[]
[]
[]
[]
[]
[]
[]
[]
[]
[]
[]
[]
[]
[]
[]
[]
[]
[]
[]
[]
[]
[]
[]
[]
[]
[]
[]
[]
[]
[]
[]
[]
[]
[]
[]
[]
[]
[]
[]
[]
[]
[]
[]
[]
[]
[]
[]
[]
[]
[]
[]
[]
[]
[]
[]
[]
[]
[]
[]
[]
[]
[]
[]
[]
[]
[]
[]
[]
[]
[]
[]
[]
[]
[]
[]
[]
[]
[]
[]
[]
[]
[]
[]
[]
[]
[]
[]
[]
[]
[]
[]
[]
[]
[]
[]
[]
[]
[]
[]
[]
[]
[]
[]
[]
[]
[]
[]
[]
[]
[]
[]
[]
[]
[]
[]
[]
[]
[]
[]
[]
[]
[]
[]
[]
[]
[]
[]
[]
[]
[]
[]
[]
[]
[]
[]
[]
[]
[]
[]
[]
[]
[]
[]
[]
[]
[]
[]
[]
[]
[]
[]
[]
[]
[]
[]
[]
[]
[]
[]
[]
[]
[]
[]
[]
[]
[]
[]
[]
[]
[]
[]
[]
[]
[]
[]
[]
[]
[]
[]
[]
[]
[]
[]
[]
[]
[]
[]
[]
[]
[]
[]
[]
[]
[]
[]
[]
[]
[]
[]
[]
[]
[]
[]
[]
[]
[]
[]
[]
[]
[]
[]
[]
[]
[]
[]
[]
[]
[]
[]
[]
[]
[]
[]
[]
[]
[]
[]
[]
[]
[]
[]
[]
[]
[]
[]
[]
[]
[]
[]
[]
[]
[]
[]
[]
[]
[]
[]
[]
[]
[]
[]
[]
[]
[]
[]
[]
[]
[]
[]
[]
[]
[]
[]
[]
[]
[]
[]
[]
[]
[]
[]
[]
[]
[]
[]
[]
[]
[]
[]
[]
[]
[]
[]
[]
[]
[]
[]
[]
[]
[]
[]
[]
[]
[]
[]
[]
[]
[]
[]
[]
[]
[]
[]
[]
[]
[]
[]
[]
[]
[]
[]
[]
[]
[]
[]
[]
[]
[]
[]
[]
[]
[]
[]
[]
[]
[]
[]
[]
[]
[]
[]
[]
[]
[]
[]
[]
[]
[]
[]
[]
[]
[]
[]
[]
[]
[]
[]
[]
[]
[]
[]
[]
[]
[]
[]
[]
[]
[]
[]
[]
[]
[]
[]
[]
[]
[]
[]
[]
[]
[]
[]
[]
[]
[]
[]
[]
[]
[]
[]
[]
[]
[]
[]
[]
[]
[]
[]
[]
[]
[]
[]
[]
[]
[]
[]
[]
[]
[]
[]
[]
[]
[]
[]
[]
[]
[]
[]
[]
[]
[]
[]
[]
[]
[]
[]
[]
[]
[]
[]
[]
[]
[]
[]
[]
[]
[]
[]
[]
[]
[]
[]
[]
[]
[]
[]
[]
[]
[]
[]
[]
[]
[]
[]
[]
[]
[]
[]
[]
[]
[]
[]
[]
[]
[]
[]
[]
[]
[]
[]
[]
[]
[]
[]
[]
[]
[]
[]
[]
[]
[]
[]
[]
[]
[]
[]
[]
[]
[]
[]
[]
[]
[]
[]
[]
[]
[]
[]
[]
[]
[]
[]
[]
[]
[]
[]
[]
[]
[]
[]
[]
[]
[]
[]
[]
[]
[]
[]
[]
[]
[]
[]
[]
[]
[]
[]
[]
[]
[]
[]
[]
[]
[]
[]
[]
[]
[]
[]
[]
[]
[]
[]
[]
[]
[]
[]
[]
[]
[]
[]
[]
[]
[]
[]
[]
[]
[]
[]
[]
[]
[]
[]
[]
[]
[]
[]
[]
[]
[]
[]
[]
[]
[]
[]
[]
[]
[]
[]
[]
[]
[]
[]
[]
[]
[]
[]
[]
[]
[]
[]
[]
[]
[]
[]
[]
[]
[]
[]
[]
[]
[]
[]
[]
[]
[]
[]
[]
[]
[]
[]
[]
[]
[]
[]
[]
[]
[]
[]
[]
[]
[]
[]
[]
[]
[]
[]
[]
[]
[]
[]
[]
[]
[]
[]
[]
[]
[]
[]
[]
[]
[]
[]
[]
[]
[]
[]
[]
[]
[]
[]
[]
[]
[]
[]
[]
[]
[]
[]
[]
[]
[]
[]
[]
[]
[]
[]
[]
[]
[]
[]
[]
[]
[]
[]
[]
[]
[]
[]
[]
[]
[]
[]
[]
[]
[]
[]
[]
[]
[]
[]
[]
[]
[]
[]
[]
[]
[]
[]
[]
[]
[]
[]
[]
[]
[]
[]
[]
[]
[]
[]
[]
[]
[]
[]
[]
[]
[]
[]
[]
[]
[]
[]
[]
[]
[]
[]
[]
[]
[]
[]
[]
[]
[]
[]
[]
[]
[]
[]
[]
[]
[]
[]
[]
[]
[]
[]
[]
[]
[]
[]
[]
[]
[]
[]
[]
[]
[]
[]
[]
[]
[]
[]
[]
[]
[]
[]
[]
[]
[]
[]
[]
[]
[]
[]
[]
[]
[]
[]
[]
[]
[]
[]
[]
[]
[]
[]
[]
[]
[]
[]
[]
[]
[]
[]
[]
[]
[]
[]
[]
[]
[]
[]
[]
[]
[]
[]
[]
[]
[]
[]
[]
[]
[]
[]
[]
[]
[]
[]
[]
[]
[]
[]
[]
[]
[]
[]
[]
[]
[]
[]
[]
[]
[]
[]
[]
[]
[]
[]
[]
[]
[]
[]
[]
[]
[]
[]
[]
[]
[]
[]
[]
[]
[]
[]
[]
[]
[]
[]
[]
[]
[]
[]
[]
[]
[]
[]
[]
[]
[]
[]
[]
[]
[]
[]
[]
[]
[]
[]
[]
[]
[]
[]
[]
[]
[]
[]
[]
[]
[]
[]
[]
[]
[]
[]
[]
[]
[]
[]
[]
[]
[]
[]
[]
[]
[]
[]
[]
[]
[]
[]
[]
[]
[]
[]
[]
[]
[]
[]
[]
[]
[]
[]
[]
[]
[]
[]
[]
[]
[]
[]
[]
[]
[]
[]
[]
[]
[]
[]
[]
[]
[]
[]
[]
[]
[]
[]
[]
[]
[]
[]
[]
[]
[]
[]
[]
[]
[]
[]
[]
[]
[]
[]
[]
[]
[]
[]
[]
[]
[]
[]
[]
[]
[]
[]
[]
[]
[]
[]
[]
[]
[]
[]
[]
[]
[]
[]
[]
[]
[]
[]
[]
[]
[]
[]
[]
[]
[]
[]
[]
[]
[]
[]
[]
[]
[]
[]
[]
[]
[]
[]
[]
[]
[]
[]
[]
[]
[]
[]
[]
[]
[]
[]
[]
[]
[]
[]
[]
[]
[]
[]
[]
[]
[]
[]
[]
[]
[]
[]
[]
[]
[]
[]
[]
[]
[]
[]
[]
[]
[]
[]
[]
[]
[]
[]
[]
[]
[]
[]
[]
[]
[]
[]
[]
[]
[]
[]
[]
[]
[]
[]
[]
[]
[]
[]
[]
[]
[]
[]
[]
[]
[]
[]
[]
[]
[]
[]
[]
[]
[]
[]
[]
[]
[]
[]
[]
[]
[]
[null,null,null,null,1945]
[null,null,null,null,1945]
[null,null,null,null,1945]
[null,null,null,null,1945]
[null,null,null,null,1945]
[null,null,null,null,1945]
[null,null,null,null,1945]
[null,null,null,null,1945]
[null,null,null,null,1945]
[null,null,null,null,1945]
[null,null,null,null,1945]
[null,null,null,null,1945]
[null,null,null,null,1945]
[null,null,null,null,1945]
[null,null,null,null,1945]
[null,null,null,null,1945]
[null,null,null,null,1945]
[null,null,null,null,1945]
[null,null,null,null,1945]
[null,null,null,null,1945]
[null,null,null,null,1945]
[null,null,null,null,1945]
[null,null,null,null,1945]
[null,null,null,null,1945]
[null,null,null,null,1945]