{"text_format":"1","workbook":"xlsx","n_sheets":3,"sheets":["Main","Symbols","IUSG"],"not_rendered":{"charts":2,"images":3,"macros":1,"external_links":0,"defined_names":0,"comments":0,"pivot_tables":0},"unopened":[],"bounds":{"document_bytes":16777216,"sheet_cells":100000,"rows_first":2000,"rows_last":500,"rows_between":2000,"halvings":0,"cell_chars":16384,"cell_head_chars":4096},"cells_cut":0,"cells_raw":0,"read":"whole","date_system":"1900"}

{"sheet":"Main","index":0,"n_rows":49,"n_cols":28,"rows_kept":49,"cut":false,"hidden":false,"merged":[[48,9,48,21],[45,2,45,6],[45,14,45,15],[46,2,46,6],[46,14,46,15],[47,2,47,6],[47,14,47,15],[42,2,42,6],[42,14,42,15],[43,2,43,6],[43,14,43,15],[44,2,44,6],[44,14,44,15],[39,2,39,6],[39,14,39,15],[40,2,40,6],[40,14,40,15],[41,2,41,6],[41,14,41,15],[36,2,36,6],[36,14,36,15],[37,2,37,6],[37,14,37,15],[38,2,38,6],[38,14,38,15],[33,2,33,6],[33,14,33,15],[34,2,34,6],[34,14,34,15],[35,2,35,6],[35,14,35,15],[30,2,30,6],[30,14,30,15],[31,2,31,6],[31,14,31,15],[32,2,32,6],[32,14,32,15],[26,18,26,30],[27,2,27,6],[27,14,27,15],[28,2,28,6],[28,14,28,15],[29,2,29,6],[29,14,29,15],[24,2,24,6],[24,14,24,15],[25,2,25,6],[25,14,25,15],[26,2,26,6],[26,14,26,15],[21,2,21,6],[21,14,21,15],[22,2,22,6],[22,14,22,15],[23,2,23,6],[23,14,23,15],[18,2,18,6],[18,14,18,15],[19,2,19,6],[19,14,19,15],[20,2,20,6],[20,14,20,15],[15,2,15,6],[15,14,15,15],[16,2,16,6],[16,14,16,15],[17,2,17,6],[17,14,17,15],[12,2,12,6],[12,14,12,15],[13,2,13,6],[13,14,13,15],[14,2,14,6],[14,14,14,15],[9,2,9,6],[9,14,9,15],[10,2,10,6],[10,14,10,15],[11,2,11,6],[11,14,11,15],[6,2,6,6],[6,14,6,15],[7,2,7,6],[7,14,7,15],[8,2,8,6],[8,14,8,15],[5,2,5,6],[5,14,5,15],[1,1,2,4],[1,5,2,26],[1,27,2,30],[4,1,4,16],[4,18,4,30]]}
[]
[null,null,null,null,null,"CQG iShares Core S&P U.S. Growth ETF Performance",null,null,null,null,null,null,null,null,null,null,null,null,null,null,null,null,null,null,null,null,null,{"$f":"RTD(\"cqg.rtd\", ,\"SystemInfo\", \"Linetime\")","v":42863.39571759259}]
[]
[]
[null,"Exchange Traded Funds Performance",null,null,null,null,null,null,null,null,null,null,null,null,null,null,null,null,"Top 15 Performing Companies "]
[null,"Symbol","Description",null,null,null,null,"Last","NC","%NC","NC/ATR","Open","High","Low","Volume",null,"Ratio"]
[null,"IUSG",{"$f":"RTD(\"cqg.rtd\", ,\"ContractData\",B7, \"LongDescription\",, \"T\")","v":"iShares Core U.S. Growth ETF"},null,null,null,null,{"$f":"RTD(\"cqg.rtd\", ,\"ContractData\",B7, \"LastTradeToday\",, \"T\")","v":47.58},{"$f":"RTD(\"cqg.rtd\", ,\"ContractData\",B7, \"NetLastTradeToday\",, \"T\")","v":-0.05},{"$f":"RTD(\"cqg.rtd\", ,\"ContractData\",B7, \"PerCentNetLastTrade\",, \"T\")/100","v":-1.0497585555322275E-3},{"$f":" I7/RTD(\"cqg.rtd\",,\"StudyData\",B7, \"ATR\", \"MaType=Sim,Period=10\", \"ATR\",\"D\",\"-1\",\"ALL\",,,\"FALSE\",\"T\")/100","v":-2E-3},{"$f":"RTD(\"cqg.rtd\", ,\"ContractData\",B7, \"OPen\",, \"T\")","v":47.7},{"$f":"RTD(\"cqg.rtd\", ,\"ContractData\", B7, \"HIgh\",, \"T\")","v":47.7},{"$f":"RTD(\"cqg.rtd\", ,\"ContractData\",B7, \"LOw\",, \"T\")","v":47.58},{"$f":"RTD(\"cqg.rtd\", ,\"ContractData\",B7, \"T_CVol\",, \"T\")","v":27412},null,{"$f":" IFERROR(O7/RTD(\"cqg.rtd\",,\"StudyData\",B7, \"MA\", \"InputChoice=Vol,MAType=Sim,Period=21\", \"MA\",\"D\",\"-1\",\"all\",,,,\"T\"),\"\")","v":3.7433079620758147E-2}]
[null,"SPY",{"$f":"RTD(\"cqg.rtd\", ,\"ContractData\",B8, \"LongDescription\",, \"T\")","v":"SPDR S&P 500"},null,null,null,null,{"$f":"RTD(\"cqg.rtd\", ,\"ContractData\",B8, \"LastTradeToday\",, \"T\")","v":239.45000000000002},{"$f":"RTD(\"cqg.rtd\", ,\"ContractData\",B8, \"NetLastTradeToday\",, \"T\")","v":-0.25},{"$f":"RTD(\"cqg.rtd\", ,\"ContractData\",B8, \"PerCentNetLastTrade\",, \"T\")/100","v":-1.0429703796412183E-3},{"$f":" I8/RTD(\"cqg.rtd\",,\"StudyData\",B8, \"ATR\", \"MaType=Sim,Period=10\", \"ATR\",\"D\",\"-1\",\"ALL\",,,\"FALSE\",\"T\")/100","v":-1.9305019305019305E-3},{"$f":"RTD(\"cqg.rtd\", ,\"ContractData\",B8, \"OPen\",, \"T\")","v":239.75},{"$f":"RTD(\"cqg.rtd\", ,\"ContractData\", B8, \"HIgh\",, \"T\")","v":239.92000000000002},{"$f":"RTD(\"cqg.rtd\", ,\"ContractData\",B8, \"LOw\",, \"T\")","v":239.39000000000001},{"$f":"RTD(\"cqg.rtd\", ,\"ContractData\",B8, \"T_CVol\",, \"T\")","v":8140309},null,{"$f":" IFERROR(O8/RTD(\"cqg.rtd\",,\"StudyData\",B8, \"MA\", \"InputChoice=Vol,MAType=Sim,Period=21\", \"MA\",\"D\",\"-1\",\"all\",,,,\"T\"),\"\")","v":0.10565950973701242}]
[null,"XLF",{"$f":"RTD(\"cqg.rtd\", ,\"ContractData\",B9, \"LongDescription\",, \"T\")","v":"Financial Select Sector SPDR"},null,null,null,null,{"$f":"RTD(\"cqg.rtd\", ,\"ContractData\",B9, \"LastTradeToday\",, \"T\")","v":23.84},{"$f":"RTD(\"cqg.rtd\", ,\"ContractData\",B9, \"NetLastTradeToday\",, \"T\")","v":0},{"$f":"RTD(\"cqg.rtd\", ,\"ContractData\",B9, \"PerCentNetLastTrade\",, \"T\")/100","v":0},{"$f":" I9/RTD(\"cqg.rtd\",,\"StudyData\",B9, \"ATR\", \"MaType=Sim,Period=10\", \"ATR\",\"D\",\"-1\",\"ALL\",,,\"FALSE\",\"T\")/100","v":0},{"$f":"RTD(\"cqg.rtd\", ,\"ContractData\",B9, \"OPen\",, \"T\")","v":23.87},{"$f":"RTD(\"cqg.rtd\", ,\"ContractData\", B9, \"HIgh\",, \"T\")","v":23.91},{"$f":"RTD(\"cqg.rtd\", ,\"ContractData\",B9, \"LOw\",, \"T\")","v":23.8},{"$f":"RTD(\"cqg.rtd\", ,\"ContractData\",B9, \"T_CVol\",, \"T\")","v":11758488},null,{"$f":" IFERROR(O9/RTD(\"cqg.rtd\",,\"StudyData\",B9, \"MA\", \"InputChoice=Vol,MAType=Sim,Period=21\", \"MA\",\"D\",\"-1\",\"all\",,,,\"T\"),\"\")","v":0.15552351227949349}]
[null,"GDX",{"$f":"RTD(\"cqg.rtd\", ,\"ContractData\",B10, \"LongDescription\",, \"T\")","v":"Market Vectors Gold Miners ETF"},null,null,null,null,{"$f":"RTD(\"cqg.rtd\", ,\"ContractData\",B10, \"LastTradeToday\",, \"T\")","v":21.41},{"$f":"RTD(\"cqg.rtd\", ,\"ContractData\",B10, \"NetLastTradeToday\",, \"T\")","v":-0.14000000000000001},{"$f":"RTD(\"cqg.rtd\", ,\"ContractData\",B10, \"PerCentNetLastTrade\",, \"T\")/100","v":-6.4965197215777256E-3},{"$f":" I10/RTD(\"cqg.rtd\",,\"StudyData\",B10, \"ATR\", \"MaType=Sim,Period=10\", \"ATR\",\"D\",\"-1\",\"ALL\",,,\"FALSE\",\"T\")/100","v":-2.0378457059679767E-3},{"$f":"RTD(\"cqg.rtd\", ,\"ContractData\",B10, \"OPen\",, \"T\")","v":21.580000000000002},{"$f":"RTD(\"cqg.rtd\", ,\"ContractData\", B10, \"HIgh\",, \"T\")","v":21.59},{"$f":"RTD(\"cqg.rtd\", ,\"ContractData\",B10, \"LOw\",, \"T\")","v":21.36},{"$f":"RTD(\"cqg.rtd\", ,\"ContractData\",B10, \"T_CVol\",, \"T\")","v":5967400},null,{"$f":" IFERROR(O10/RTD(\"cqg.rtd\",,\"StudyData\",B10, \"MA\", \"InputChoice=Vol,MAType=Sim,Period=21\", \"MA\",\"D\",\"-1\",\"all\",,,,\"T\"),\"\")","v":9.0936550068847183E-2}]
[null,"FXI",{"$f":"RTD(\"cqg.rtd\", ,\"ContractData\",B11, \"LongDescription\",, \"T\")","v":"iShares China Large-Cap ETF"},null,null,null,null,{"$f":"RTD(\"cqg.rtd\", ,\"ContractData\",B11, \"LastTradeToday\",, \"T\")","v":37.78},{"$f":"RTD(\"cqg.rtd\", ,\"ContractData\",B11, \"NetLastTradeToday\",, \"T\")","v":0.01},{"$f":"RTD(\"cqg.rtd\", ,\"ContractData\",B11, \"PerCentNetLastTrade\",, \"T\")/100","v":2.6476039184537993E-4},{"$f":" I11/RTD(\"cqg.rtd\",,\"StudyData\",B11, \"ATR\", \"MaType=Sim,Period=10\", \"ATR\",\"D\",\"-1\",\"ALL\",,,\"FALSE\",\"T\")/100","v":3.0769230769230765E-4},{"$f":"RTD(\"cqg.rtd\", ,\"ContractData\",B11, \"OPen\",, \"T\")","v":37.78},{"$f":"RTD(\"cqg.rtd\", ,\"ContractData\", B11, \"HIgh\",, \"T\")","v":37.840000000000003},{"$f":"RTD(\"cqg.rtd\", ,\"ContractData\",B11, \"LOw\",, \"T\")","v":37.730000000000004},{"$f":"RTD(\"cqg.rtd\", ,\"ContractData\",B11, \"T_CVol\",, \"T\")","v":3356454},null,{"$f":" IFERROR(O11/RTD(\"cqg.rtd\",,\"StudyData\",B11, \"MA\", \"InputChoice=Vol,MAType=Sim,Period=21\", \"MA\",\"D\",\"-1\",\"all\",,,,\"T\"),\"\")","v":0.23440044748879638}]
[null,"IWM",{"$f":"RTD(\"cqg.rtd\", ,\"ContractData\",B12, \"LongDescription\",, \"T\")","v":"iShares Russell 2000 ETF"},null,null,null,null,{"$f":"RTD(\"cqg.rtd\", ,\"ContractData\",B12, \"LastTradeToday\",, \"T\")","v":138.35},{"$f":"RTD(\"cqg.rtd\", ,\"ContractData\",B12, \"NetLastTradeToday\",, \"T\")","v":-0.66},{"$f":"RTD(\"cqg.rtd\", ,\"ContractData\",B12, \"PerCentNetLastTrade\",, \"T\")/100","v":-4.7478598661966761E-3},{"$f":" I12/RTD(\"cqg.rtd\",,\"StudyData\",B12, \"ATR\", \"MaType=Sim,Period=10\", \"ATR\",\"D\",\"-1\",\"ALL\",,,\"FALSE\",\"T\")/100","v":-3.900709219858156E-3},{"$f":"RTD(\"cqg.rtd\", ,\"ContractData\",B12, \"OPen\",, \"T\")","v":138.66},{"$f":"RTD(\"cqg.rtd\", ,\"ContractData\", B12, \"HIgh\",, \"T\")","v":138.97999999999999},{"$f":"RTD(\"cqg.rtd\", ,\"ContractData\",B12, \"LOw\",, \"T\")","v":138.24},{"$f":"RTD(\"cqg.rtd\", ,\"ContractData\",B12, \"T_CVol\",, \"T\")","v":3156698},null,{"$f":" IFERROR(O12/RTD(\"cqg.rtd\",,\"StudyData\",B12, \"MA\", \"InputChoice=Vol,MAType=Sim,Period=21\", \"MA\",\"D\",\"-1\",\"all\",,,,\"T\"),\"\")","v":0.11174936652443244}]
[null,"IWO",{"$f":"RTD(\"cqg.rtd\", ,\"ContractData\",B13, \"LongDescription\",, \"T\")","v":"iShares Russell 2000 Growth ETF"},null,null,null,null,{"$f":"RTD(\"cqg.rtd\", ,\"ContractData\",B13, \"LastTradeToday\",, \"T\")","v":164.04},{"$f":"RTD(\"cqg.rtd\", ,\"ContractData\",B13, \"NetLastTradeToday\",, \"T\")","v":-0.98},{"$f":"RTD(\"cqg.rtd\", ,\"ContractData\",B13, \"PerCentNetLastTrade\",, \"T\")/100","v":-5.9386741001090778E-3},{"$f":" I13/RTD(\"cqg.rtd\",,\"StudyData\",B13, \"ATR\", \"MaType=Sim,Period=10\", \"ATR\",\"D\",\"-1\",\"ALL\",,,\"FALSE\",\"T\")/100","v":-5.2155401809473121E-3},{"$f":"RTD(\"cqg.rtd\", ,\"ContractData\",B13, \"OPen\",, \"T\")","v":164.62},{"$f":"RTD(\"cqg.rtd\", ,\"ContractData\", B13, \"HIgh\",, \"T\")","v":164.78},{"$f":"RTD(\"cqg.rtd\", ,\"ContractData\",B13, \"LOw\",, \"T\")","v":163.95000000000002},{"$f":"RTD(\"cqg.rtd\", ,\"ContractData\",B13, \"T_CVol\",, \"T\")","v":30979},null,{"$f":" IFERROR(O13/RTD(\"cqg.rtd\",,\"StudyData\",B13, \"MA\", \"InputChoice=Vol,MAType=Sim,Period=21\", \"MA\",\"D\",\"-1\",\"all\",,,,\"T\"),\"\")","v":6.1740368142315399E-2}]
[null,"QQQ",{"$f":"RTD(\"cqg.rtd\", ,\"ContractData\",B14, \"LongDescription\",, \"T\")","v":"Powershares QQQ Trust"},null,null,null,null,{"$f":"RTD(\"cqg.rtd\", ,\"ContractData\",B14, \"LastTradeToday\",, \"T\")","v":137.5},{"$f":"RTD(\"cqg.rtd\", ,\"ContractData\",B14, \"NetLastTradeToday\",, \"T\")","v":-0.04},{"$f":"RTD(\"cqg.rtd\", ,\"ContractData\",B14, \"PerCentNetLastTrade\",, \"T\")/100","v":-2.9082448742184092E-4},{"$f":" I14/RTD(\"cqg.rtd\",,\"StudyData\",B14, \"ATR\", \"MaType=Sim,Period=10\", \"ATR\",\"D\",\"-1\",\"ALL\",,,\"FALSE\",\"T\")/100","v":-4.032258064516129E-4},{"$f":"RTD(\"cqg.rtd\", ,\"ContractData\",B14, \"OPen\",, \"T\")","v":137.61000000000001},{"$f":"RTD(\"cqg.rtd\", ,\"ContractData\", B14, \"HIgh\",, \"T\")","v":137.72999999999999},{"$f":"RTD(\"cqg.rtd\", ,\"ContractData\",B14, \"LOw\",, \"T\")","v":137.4},{"$f":"RTD(\"cqg.rtd\", ,\"ContractData\",B14, \"T_CVol\",, \"T\")","v":2658283},null,{"$f":" IFERROR(O14/RTD(\"cqg.rtd\",,\"StudyData\",B14, \"MA\", \"InputChoice=Vol,MAType=Sim,Period=21\", \"MA\",\"D\",\"-1\",\"all\",,,,\"T\"),\"\")","v":0.1328870631869537}]
[null,"XLE",{"$f":"RTD(\"cqg.rtd\", ,\"ContractData\",B15, \"LongDescription\",, \"T\")","v":"Energy Select Sector SPDR"},null,null,null,null,{"$f":"RTD(\"cqg.rtd\", ,\"ContractData\",B15, \"LastTradeToday\",, \"T\")","v":67.63},{"$f":"RTD(\"cqg.rtd\", ,\"ContractData\",B15, \"NetLastTradeToday\",, \"T\")","v":0.32},{"$f":"RTD(\"cqg.rtd\", ,\"ContractData\",B15, \"PerCentNetLastTrade\",, \"T\")/100","v":4.7541227157926018E-3},{"$f":" I15/RTD(\"cqg.rtd\",,\"StudyData\",B15, \"ATR\", \"MaType=Sim,Period=10\", \"ATR\",\"D\",\"-1\",\"ALL\",,,\"FALSE\",\"T\")/100","v":3.2454361054766734E-3},{"$f":"RTD(\"cqg.rtd\", ,\"ContractData\",B15, \"OPen\",, \"T\")","v":67.3},{"$f":"RTD(\"cqg.rtd\", ,\"ContractData\", B15, \"HIgh\",, \"T\")","v":67.8},{"$f":"RTD(\"cqg.rtd\", ,\"ContractData\",B15, \"LOw\",, \"T\")","v":67.290000000000006},{"$f":"RTD(\"cqg.rtd\", ,\"ContractData\",B15, \"T_CVol\",, \"T\")","v":2947163},null,{"$f":" IFERROR(O15/RTD(\"cqg.rtd\",,\"StudyData\",B15, \"MA\", \"InputChoice=Vol,MAType=Sim,Period=21\", \"MA\",\"D\",\"-1\",\"all\",,,,\"T\"),\"\")","v":0.18819259967900015}]
[null,"USO",{"$f":"RTD(\"cqg.rtd\", ,\"ContractData\",B16, \"LongDescription\",, \"T\")","v":"United States Oil Fund"},null,null,null,null,{"$f":"RTD(\"cqg.rtd\", ,\"ContractData\",B16, \"LastTradeToday\",, \"T\")","v":9.69},{"$f":"RTD(\"cqg.rtd\", ,\"ContractData\",B16, \"NetLastTradeToday\",, \"T\")","v":0.03},{"$f":"RTD(\"cqg.rtd\", ,\"ContractData\",B16, \"PerCentNetLastTrade\",, \"T\")/100","v":3.105590062111801E-3},{"$f":" I16/RTD(\"cqg.rtd\",,\"StudyData\",B16, \"ATR\", \"MaType=Sim,Period=10\", \"ATR\",\"D\",\"-1\",\"ALL\",,,\"FALSE\",\"T\")/100","v":1.2931034482758618E-3},{"$f":"RTD(\"cqg.rtd\", ,\"ContractData\",B16, \"OPen\",, \"T\")","v":9.58},{"$f":"RTD(\"cqg.rtd\", ,\"ContractData\", B16, \"HIgh\",, \"T\")","v":9.7200000000000006},{"$f":"RTD(\"cqg.rtd\", ,\"ContractData\",B16, \"LOw\",, \"T\")","v":9.56},{"$f":"RTD(\"cqg.rtd\", ,\"ContractData\",B16, \"T_CVol\",, \"T\")","v":6150092},null,{"$f":" IFERROR(O16/RTD(\"cqg.rtd\",,\"StudyData\",B16, \"MA\", \"InputChoice=Vol,MAType=Sim,Period=21\", \"MA\",\"D\",\"-1\",\"all\",,,,\"T\"),\"\")","v":0.21194021680452563}]
[null,null,"Top 15 Description",null,null,null,null,"Last","NC","%NC","NC/ATR","Open","High","Low","Volume",null,"Ratio"]
[{"$f":"TRIM(IUSG!I1)","v":"S.US.NWL"},"News",{"$f":"RTD(\"cqg.rtd\", ,\"ContractData\",A18, \"LongDescription\",, \"T\")&\" (\"&RIGHT(A18,LEN(A18)-5)&\")\"","v":"Newell Brands Inc. (NWL)"},null,null,null,null,{"$f":"RTD(\"cqg.rtd\", ,\"ContractData\",A18, \"LastTradeToday\",, \"T\")","v":52.72},{"$f":"RTD(\"cqg.rtd\", ,\"ContractData\",A18, \"NetLastTradeToday\",, \"T\")","v":6.33},{"$f":"RTD(\"cqg.rtd\", ,\"ContractData\",A18, \"PerCentNetLastTrade\",, \"T\")/100","v":0.13645182151325716},{"$f":" I18/RTD(\"cqg.rtd\",,\"StudyData\",A18, \"ATR\", \"MaType=Sim,Period=10\", \"ATR\",\"D\",\"-1\",\"ALL\",,,\"FALSE\",\"T\")/100","v":6.7628205128205124E-2},{"$f":"RTD(\"cqg.rtd\", ,\"ContractData\",A18, \"OPen\",, \"T\")","v":51.2},{"$f":"RTD(\"cqg.rtd\", ,\"ContractData\", A18, \"HIgh\",, \"T\")","v":52.870000000000005},{"$f":"RTD(\"cqg.rtd\", ,\"ContractData\",A18, \"LOw\",, \"T\")","v":50.85},{"$f":"RTD(\"cqg.rtd\", ,\"ContractData\",A18, \"T_CVol\",, \"T\")","v":5099670},null,{"$f":" IFERROR(O18/RTD(\"cqg.rtd\",,\"StudyData\",A18, \"MA\", \"InputChoice=Vol,MAType=Sim,Period=21\", \"MA\",\"D\",\"-1\",\"all\",,,,\"T\"),\"\")","v":""},{"$f":"IUSG!Q1","v":"https://finance.yahoo.com/quote/NWL"}]
[{"$f":"TRIM(IUSG!I2)","v":"S.US.KATE"},"News",{"$f":"RTD(\"cqg.rtd\", ,\"ContractData\",A19, \"LongDescription\",, \"T\")&\" (\"&RIGHT(A19,LEN(A19)-5)&\")\"","v":"Kate Spade Company (KATE)"},null,null,null,null,{"$f":"RTD(\"cqg.rtd\", ,\"ContractData\",A19, \"LastTradeToday\",, \"T\")","v":18.36},{"$f":"RTD(\"cqg.rtd\", ,\"ContractData\",A19, \"NetLastTradeToday\",, \"T\")","v":1.3900000000000001},{"$f":"RTD(\"cqg.rtd\", ,\"ContractData\",A19, \"PerCentNetLastTrade\",, \"T\")/100","v":8.1909251620506773E-2},{"$f":" I19/RTD(\"cqg.rtd\",,\"StudyData\",A19, \"ATR\", \"MaType=Sim,Period=10\", \"ATR\",\"D\",\"-1\",\"ALL\",,,\"FALSE\",\"T\")/100","v":2.6029962546816478E-2},{"$f":"RTD(\"cqg.rtd\", ,\"ContractData\",A19, \"OPen\",, \"T\")","v":18.39},{"$f":"RTD(\"cqg.rtd\", ,\"ContractData\", A19, \"HIgh\",, \"T\")","v":18.39},{"$f":"RTD(\"cqg.rtd\", ,\"ContractData\",A19, \"LOw\",, \"T\")","v":18.34},{"$f":"RTD(\"cqg.rtd\", ,\"ContractData\",A19, \"T_CVol\",, \"T\")","v":25910688},null,{"$f":" IFERROR(O19/RTD(\"cqg.rtd\",,\"StudyData\",A19, \"MA\", \"InputChoice=Vol,MAType=Sim,Period=21\", \"MA\",\"D\",\"-1\",\"all\",,,,\"T\"),\"\")","v":""},{"$f":"IUSG!Q2","v":"https://finance.yahoo.com/quote/KATE"}]
[{"$f":"TRIM(IUSG!I3)","v":"S.US.COH"},"News",{"$f":"RTD(\"cqg.rtd\", ,\"ContractData\",A20, \"LongDescription\",, \"T\")&\" (\"&RIGHT(A20,LEN(A20)-5)&\")\"","v":"COACH INC (COH)"},null,null,null,null,{"$f":"RTD(\"cqg.rtd\", ,\"ContractData\",A20, \"LastTradeToday\",, \"T\")","v":45.17},{"$f":"RTD(\"cqg.rtd\", ,\"ContractData\",A20, \"NetLastTradeToday\",, \"T\")","v":2.5100000000000002},{"$f":"RTD(\"cqg.rtd\", ,\"ContractData\",A20, \"PerCentNetLastTrade\",, \"T\")/100","v":5.8837318330989215E-2},{"$f":" I20/RTD(\"cqg.rtd\",,\"StudyData\",A20, \"ATR\", \"MaType=Sim,Period=10\", \"ATR\",\"D\",\"-1\",\"ALL\",,,\"FALSE\",\"T\")/100","v":2.2251773049645394E-2},{"$f":"RTD(\"cqg.rtd\", ,\"ContractData\",A20, \"OPen\",, \"T\")","v":45.61},{"$f":"RTD(\"cqg.rtd\", ,\"ContractData\", A20, \"HIgh\",, \"T\")","v":46.56},{"$f":"RTD(\"cqg.rtd\", ,\"ContractData\",A20, \"LOw\",, \"T\")","v":45},{"$f":"RTD(\"cqg.rtd\", ,\"ContractData\",A20, \"T_CVol\",, \"T\")","v":4989030},null,{"$f":" IFERROR(O20/RTD(\"cqg.rtd\",,\"StudyData\",A20, \"MA\", \"InputChoice=Vol,MAType=Sim,Period=21\", \"MA\",\"D\",\"-1\",\"all\",,,,\"T\"),\"\")","v":""},{"$f":"IUSG!Q3","v":"https://finance.yahoo.com/quote/COH"}]
[{"$f":"TRIM(IUSG!I4)","v":"S.US.VAR"},"News",{"$f":"RTD(\"cqg.rtd\", ,\"ContractData\",A21, \"LongDescription\",, \"T\")&\" (\"&RIGHT(A21,LEN(A21)-5)&\")\"","v":"Varian Medical Systems Inc (VAR)"},null,null,null,null,{"$f":"RTD(\"cqg.rtd\", ,\"ContractData\",A21, \"LastTradeToday\",, \"T\")","v":95.95},{"$f":"RTD(\"cqg.rtd\", ,\"ContractData\",A21, \"NetLastTradeToday\",, \"T\")","v":3.8200000000000003},{"$f":"RTD(\"cqg.rtd\", ,\"ContractData\",A21, \"PerCentNetLastTrade\",, \"T\")/100","v":4.1463149896884835E-2},{"$f":" I21/RTD(\"cqg.rtd\",,\"StudyData\",A21, \"ATR\", \"MaType=Sim,Period=10\", \"ATR\",\"D\",\"-1\",\"ALL\",,,\"FALSE\",\"T\")/100","v":2.3904881101376722E-2},{"$f":"RTD(\"cqg.rtd\", ,\"ContractData\",A21, \"OPen\",, \"T\")","v":96.45},{"$f":"RTD(\"cqg.rtd\", ,\"ContractData\", A21, \"HIgh\",, \"T\")","v":96.94},{"$f":"RTD(\"cqg.rtd\", ,\"ContractData\",A21, \"LOw\",, \"T\")","v":95.51},{"$f":"RTD(\"cqg.rtd\", ,\"ContractData\",A21, \"T_CVol\",, \"T\")","v":385656},null,{"$f":" IFERROR(O21/RTD(\"cqg.rtd\",,\"StudyData\",A21, \"MA\", \"InputChoice=Vol,MAType=Sim,Period=21\", \"MA\",\"D\",\"-1\",\"all\",,,,\"T\"),\"\")","v":""},{"$f":"IUSG!Q4","v":"https://finance.yahoo.com/quote/VAR"}]
[{"$f":"TRIM(IUSG!I5)","v":"S.US.URI"},"News",{"$f":"RTD(\"cqg.rtd\", ,\"ContractData\",A22, \"LongDescription\",, \"T\")&\" (\"&RIGHT(A22,LEN(A22)-5)&\")\"","v":"United Rentals Inc (URI)"},null,null,null,null,{"$f":"RTD(\"cqg.rtd\", ,\"ContractData\",A22, \"LastTradeToday\",, \"T\")","v":111.61},{"$f":"RTD(\"cqg.rtd\", ,\"ContractData\",A22, \"NetLastTradeToday\",, \"T\")","v":2.65},{"$f":"RTD(\"cqg.rtd\", ,\"ContractData\",A22, \"PerCentNetLastTrade\",, \"T\")/100","v":2.43208516886931E-2},{"$f":" I22/RTD(\"cqg.rtd\",,\"StudyData\",A22, \"ATR\", \"MaType=Sim,Period=10\", \"ATR\",\"D\",\"-1\",\"ALL\",,,\"FALSE\",\"T\")/100","v":9.3178621659634319E-3},{"$f":"RTD(\"cqg.rtd\", ,\"ContractData\",A22, \"OPen\",, \"T\")","v":110.74000000000001},{"$f":"RTD(\"cqg.rtd\", ,\"ContractData\", A22, \"HIgh\",, \"T\")","v":111.98},{"$f":"RTD(\"cqg.rtd\", ,\"ContractData\",A22, \"LOw\",, \"T\")","v":110.68},{"$f":"RTD(\"cqg.rtd\", ,\"ContractData\",A22, \"T_CVol\",, \"T\")","v":373076},null,{"$f":" IFERROR(O22/RTD(\"cqg.rtd\",,\"StudyData\",A22, \"MA\", \"InputChoice=Vol,MAType=Sim,Period=21\", \"MA\",\"D\",\"-1\",\"all\",,,,\"T\"),\"\")","v":""},{"$f":"IUSG!Q5","v":"https://finance.yahoo.com/quote/URI"}]
[{"$f":"TRIM(IUSG!I6)","v":"S.US.TCBI"},"News",{"$f":"RTD(\"cqg.rtd\", ,\"ContractData\",A23, \"LongDescription\",, \"T\")&\" (\"&RIGHT(A23,LEN(A23)-5)&\")\"","v":"Texas Capital Bancshares Inc (TCBI)"},null,null,null,null,{"$f":"RTD(\"cqg.rtd\", ,\"ContractData\",A23, \"LastTradeToday\",, \"T\")","v":77.64},{"$f":"RTD(\"cqg.rtd\", ,\"ContractData\",A23, \"NetLastTradeToday\",, \"T\")","v":1.54},{"$f":"RTD(\"cqg.rtd\", ,\"ContractData\",A23, \"PerCentNetLastTrade\",, \"T\")/100","v":2.0236530880420499E-2},{"$f":" I23/RTD(\"cqg.rtd\",,\"StudyData\",A23, \"ATR\", \"MaType=Sim,Period=10\", \"ATR\",\"D\",\"-1\",\"ALL\",,,\"FALSE\",\"T\")/100","v":6.2171982236576507E-3},{"$f":"RTD(\"cqg.rtd\", ,\"ContractData\",A23, \"OPen\",, \"T\")","v":77.650000000000006},{"$f":"RTD(\"cqg.rtd\", ,\"ContractData\", A23, \"HIgh\",, \"T\")","v":78},{"$f":"RTD(\"cqg.rtd\", ,\"ContractData\",A23, \"LOw\",, \"T\")","v":77.100000000000009},{"$f":"RTD(\"cqg.rtd\", ,\"ContractData\",A23, \"T_CVol\",, \"T\")","v":60583},null,{"$f":" IFERROR(O23/RTD(\"cqg.rtd\",,\"StudyData\",A23, \"MA\", \"InputChoice=Vol,MAType=Sim,Period=21\", \"MA\",\"D\",\"-1\",\"all\",,,,\"T\"),\"\")","v":8.4978486247803534E-2},{"$f":"IUSG!Q6","v":"https://finance.yahoo.com/quote/TCBI"}]
[{"$f":"TRIM(IUSG!I7)","v":"S.US.TRIP"},"News",{"$f":"RTD(\"cqg.rtd\", ,\"ContractData\",A24, \"LongDescription\",, \"T\")&\" (\"&RIGHT(A24,LEN(A24)-5)&\")\"","v":"TripAdvisor, Inc. (TRIP)"},null,null,null,null,{"$f":"RTD(\"cqg.rtd\", ,\"ContractData\",A24, \"LastTradeToday\",, \"T\")","v":47.04},{"$f":"RTD(\"cqg.rtd\", ,\"ContractData\",A24, \"NetLastTradeToday\",, \"T\")","v":0.87},{"$f":"RTD(\"cqg.rtd\", ,\"ContractData\",A24, \"PerCentNetLastTrade\",, \"T\")/100","v":1.8843404808317088E-2},{"$f":" I24/RTD(\"cqg.rtd\",,\"StudyData\",A24, \"ATR\", \"MaType=Sim,Period=10\", \"ATR\",\"D\",\"-1\",\"ALL\",,,\"FALSE\",\"T\")/100","v":7.6315789473684215E-3},{"$f":"RTD(\"cqg.rtd\", ,\"ContractData\",A24, \"OPen\",, \"T\")","v":46.18},{"$f":"RTD(\"cqg.rtd\", ,\"ContractData\", A24, \"HIgh\",, \"T\")","v":47.38},{"$f":"RTD(\"cqg.rtd\", ,\"ContractData\",A24, \"LOw\",, \"T\")","v":46.03},{"$f":"RTD(\"cqg.rtd\", ,\"ContractData\",A24, \"T_CVol\",, \"T\")","v":956867},null,{"$f":" IFERROR(O24/RTD(\"cqg.rtd\",,\"StudyData\",A24, \"MA\", \"InputChoice=Vol,MAType=Sim,Period=21\", \"MA\",\"D\",\"-1\",\"all\",,,,\"T\"),\"\")","v":""},{"$f":"IUSG!Q7","v":"https://finance.yahoo.com/quote/TRIP"}]
[{"$f":"TRIM(IUSG!I8)","v":"S.US.XLNX"},"News",{"$f":"RTD(\"cqg.rtd\", ,\"ContractData\",A25, \"LongDescription\",, \"T\")&\" (\"&RIGHT(A25,LEN(A25)-5)&\")\"","v":"Xilinx Inc (XLNX)"},null,null,null,null,{"$f":"RTD(\"cqg.rtd\", ,\"ContractData\",A25, \"LastTradeToday\",, \"T\")","v":64.430000000000007},{"$f":"RTD(\"cqg.rtd\", ,\"ContractData\",A25, \"NetLastTradeToday\",, \"T\")","v":1.04},{"$f":"RTD(\"cqg.rtd\", ,\"ContractData\",A25, \"PerCentNetLastTrade\",, \"T\")/100","v":1.6406373244991324E-2},{"$f":" I25/RTD(\"cqg.rtd\",,\"StudyData\",A25, \"ATR\", \"MaType=Sim,Period=10\", \"ATR\",\"D\",\"-1\",\"ALL\",,,\"FALSE\",\"T\")/100","v":6.675224646983312E-3},{"$f":"RTD(\"cqg.rtd\", ,\"ContractData\",A25, \"OPen\",, \"T\")","v":63.59},{"$f":"RTD(\"cqg.rtd\", ,\"ContractData\", A25, \"HIgh\",, \"T\")","v":64.55},{"$f":"RTD(\"cqg.rtd\", ,\"ContractData\",A25, \"LOw\",, \"T\")","v":63.49},{"$f":"RTD(\"cqg.rtd\", ,\"ContractData\",A25, \"T_CVol\",, \"T\")","v":1087626},null,{"$f":" IFERROR(O25/RTD(\"cqg.rtd\",,\"StudyData\",A25, \"MA\", \"InputChoice=Vol,MAType=Sim,Period=21\", \"MA\",\"D\",\"-1\",\"all\",,,,\"T\"),\"\")","v":0.31041533700730994},{"$f":"IUSG!Q8","v":"https://finance.yahoo.com/quote/XLNX"}]
[{"$f":"TRIM(IUSG!I9)","v":"S.US.LB"},"News",{"$f":"RTD(\"cqg.rtd\", ,\"ContractData\",A26, \"LongDescription\",, \"T\")&\" (\"&RIGHT(A26,LEN(A26)-5)&\")\"","v":"L Brands, Inc. (LB)"},null,null,null,null,{"$f":"RTD(\"cqg.rtd\", ,\"ContractData\",A26, \"LastTradeToday\",, \"T\")","v":51.89},{"$f":"RTD(\"cqg.rtd\", ,\"ContractData\",A26, \"NetLastTradeToday\",, \"T\")","v":0.81},{"$f":"RTD(\"cqg.rtd\", ,\"ContractData\",A26, \"PerCentNetLastTrade\",, \"T\")/100","v":1.5857478465152702E-2},{"$f":" I26/RTD(\"cqg.rtd\",,\"StudyData\",A26, \"ATR\", \"MaType=Sim,Period=10\", \"ATR\",\"D\",\"-1\",\"ALL\",,,\"FALSE\",\"T\")/100","v":5.6289089645587221E-3},{"$f":"RTD(\"cqg.rtd\", ,\"ContractData\",A26, \"OPen\",, \"T\")","v":51.21},{"$f":"RTD(\"cqg.rtd\", ,\"ContractData\", A26, \"HIgh\",, \"T\")","v":51.95},{"$f":"RTD(\"cqg.rtd\", ,\"ContractData\",A26, \"LOw\",, \"T\")","v":51},{"$f":"RTD(\"cqg.rtd\", ,\"ContractData\",A26, \"T_CVol\",, \"T\")","v":560238},null,{"$f":" IFERROR(O26/RTD(\"cqg.rtd\",,\"StudyData\",A26, \"MA\", \"InputChoice=Vol,MAType=Sim,Period=21\", \"MA\",\"D\",\"-1\",\"all\",,,,\"T\"),\"\")","v":0.12503160196860247},{"$f":"IUSG!Q9","v":"https://finance.yahoo.com/quote/LB"}]
[{"$f":"TRIM(IUSG!I10)","v":"S.US.MUR"},"News",{"$f":"RTD(\"cqg.rtd\", ,\"ContractData\",A27, \"LongDescription\",, \"T\")&\" (\"&RIGHT(A27,LEN(A27)-5)&\")\"","v":"Murphy Oil Corp (MUR)"},null,null,null,null,{"$f":"RTD(\"cqg.rtd\", ,\"ContractData\",A27, \"LastTradeToday\",, \"T\")","v":26.55},{"$f":"RTD(\"cqg.rtd\", ,\"ContractData\",A27, \"NetLastTradeToday\",, \"T\")","v":0.37},{"$f":"RTD(\"cqg.rtd\", ,\"ContractData\",A27, \"PerCentNetLastTrade\",, \"T\")/100","v":1.4132925897631781E-2},{"$f":" I27/RTD(\"cqg.rtd\",,\"StudyData\",A27, \"ATR\", \"MaType=Sim,Period=10\", \"ATR\",\"D\",\"-1\",\"ALL\",,,\"FALSE\",\"T\")/100","v":3.957219251336898E-3},{"$f":"RTD(\"cqg.rtd\", ,\"ContractData\",A27, \"OPen\",, \"T\")","v":26.11},{"$f":"RTD(\"cqg.rtd\", ,\"ContractData\", A27, \"HIgh\",, \"T\")","v":26.68},{"$f":"RTD(\"cqg.rtd\", ,\"ContractData\",A27, \"LOw\",, \"T\")","v":25.98},{"$f":"RTD(\"cqg.rtd\", ,\"ContractData\",A27, \"T_CVol\",, \"T\")","v":415613},null,{"$f":" IFERROR(O27/RTD(\"cqg.rtd\",,\"StudyData\",A27, \"MA\", \"InputChoice=Vol,MAType=Sim,Period=21\", \"MA\",\"D\",\"-1\",\"all\",,,,\"T\"),\"\")","v":0.14113696144259358},{"$f":"IUSG!Q10","v":"https://finance.yahoo.com/quote/MUR"},"Bottom 15 Performing Companies "]
[{"$f":"TRIM(IUSG!I11)","v":"S.US.CTSH"},"News",{"$f":"RTD(\"cqg.rtd\", ,\"ContractData\",A28, \"LongDescription\",, \"T\")&\" (\"&RIGHT(A28,LEN(A28)-5)&\")\"","v":"Cognizant Tech Solutions Corp (CTSH)"},null,null,null,null,{"$f":"RTD(\"cqg.rtd\", ,\"ContractData\",A28, \"LastTradeToday\",, \"T\")","v":64.09},{"$f":"RTD(\"cqg.rtd\", ,\"ContractData\",A28, \"NetLastTradeToday\",, \"T\")","v":0.87},{"$f":"RTD(\"cqg.rtd\", ,\"ContractData\",A28, \"PerCentNetLastTrade\",, \"T\")/100","v":1.3761467889908256E-2},{"$f":" I28/RTD(\"cqg.rtd\",,\"StudyData\",A28, \"ATR\", \"MaType=Sim,Period=10\", \"ATR\",\"D\",\"-1\",\"ALL\",,,\"FALSE\",\"T\")/100","v":9.6989966555183944E-3},{"$f":"RTD(\"cqg.rtd\", ,\"ContractData\",A28, \"OPen\",, \"T\")","v":63.190000000000005},{"$f":"RTD(\"cqg.rtd\", ,\"ContractData\", A28, \"HIgh\",, \"T\")","v":64.180000000000007},{"$f":"RTD(\"cqg.rtd\", ,\"ContractData\",A28, \"LOw\",, \"T\")","v":63},{"$f":"RTD(\"cqg.rtd\", ,\"ContractData\",A28, \"T_CVol\",, \"T\")","v":1576957},null,{"$f":" IFERROR(O28/RTD(\"cqg.rtd\",,\"StudyData\",A28, \"MA\", \"InputChoice=Vol,MAType=Sim,Period=21\", \"MA\",\"D\",\"-1\",\"all\",,,,\"T\"),\"\")","v":0.37349811278326467},{"$f":"IUSG!Q11","v":"https://finance.yahoo.com/quote/CTSH"}]
[{"$f":"TRIM(IUSG!I12)","v":"S.US.CSL"},"News",{"$f":"RTD(\"cqg.rtd\", ,\"ContractData\",A29, \"LongDescription\",, \"T\")&\" (\"&RIGHT(A29,LEN(A29)-5)&\")\"","v":"Carlisle Cos Inc (CSL)"},null,null,null,null,{"$f":"RTD(\"cqg.rtd\", ,\"ContractData\",A29, \"LastTradeToday\",, \"T\")","v":104.96000000000001},{"$f":"RTD(\"cqg.rtd\", ,\"ContractData\",A29, \"NetLastTradeToday\",, \"T\")","v":1.41},{"$f":"RTD(\"cqg.rtd\", ,\"ContractData\",A29, \"PerCentNetLastTrade\",, \"T\")/100","v":1.3616610333172382E-2},{"$f":" I29/RTD(\"cqg.rtd\",,\"StudyData\",A29, \"ATR\", \"MaType=Sim,Period=10\", \"ATR\",\"D\",\"-1\",\"ALL\",,,\"FALSE\",\"T\")/100","v":5.845771144278606E-3},{"$f":"RTD(\"cqg.rtd\", ,\"ContractData\",A29, \"OPen\",, \"T\")","v":103.21000000000001},{"$f":"RTD(\"cqg.rtd\", ,\"ContractData\", A29, \"HIgh\",, \"T\")","v":105.24000000000001},{"$f":"RTD(\"cqg.rtd\", ,\"ContractData\",A29, \"LOw\",, \"T\")","v":103.21000000000001},{"$f":"RTD(\"cqg.rtd\", ,\"ContractData\",A29, \"T_CVol\",, \"T\")","v":93202},null,{"$f":" IFERROR(O29/RTD(\"cqg.rtd\",,\"StudyData\",A29, \"MA\", \"InputChoice=Vol,MAType=Sim,Period=21\", \"MA\",\"D\",\"-1\",\"all\",,,,\"T\"),\"\")","v":0.15403182154224052},{"$f":"IUSG!Q12","v":"https://finance.yahoo.com/quote/CSL"}]
[{"$f":"TRIM(IUSG!I13)","v":"S.US.GPOR"},"News",{"$f":"RTD(\"cqg.rtd\", ,\"ContractData\",A30, \"LongDescription\",, \"T\")&\" (\"&RIGHT(A30,LEN(A30)-5)&\")\"","v":"Gulfport Energy (GPOR)"},null,null,null,null,{"$f":"RTD(\"cqg.rtd\", ,\"ContractData\",A30, \"LastTradeToday\",, \"T\")","v":15.9},{"$f":"RTD(\"cqg.rtd\", ,\"ContractData\",A30, \"NetLastTradeToday\",, \"T\")","v":0.21},{"$f":"RTD(\"cqg.rtd\", ,\"ContractData\",A30, \"PerCentNetLastTrade\",, \"T\")/100","v":1.338432122370937E-2},{"$f":" I30/RTD(\"cqg.rtd\",,\"StudyData\",A30, \"ATR\", \"MaType=Sim,Period=10\", \"ATR\",\"D\",\"-1\",\"ALL\",,,\"FALSE\",\"T\")/100","v":3.7769784172661863E-3},{"$f":"RTD(\"cqg.rtd\", ,\"ContractData\",A30, \"OPen\",, \"T\")","v":15.65},{"$f":"RTD(\"cqg.rtd\", ,\"ContractData\", A30, \"HIgh\",, \"T\")","v":15.950000000000001},{"$f":"RTD(\"cqg.rtd\", ,\"ContractData\",A30, \"LOw\",, \"T\")","v":15.540000000000001},{"$f":"RTD(\"cqg.rtd\", ,\"ContractData\",A30, \"T_CVol\",, \"T\")","v":616980},null,{"$f":" IFERROR(O30/RTD(\"cqg.rtd\",,\"StudyData\",A30, \"MA\", \"InputChoice=Vol,MAType=Sim,Period=21\", \"MA\",\"D\",\"-1\",\"all\",,,,\"T\"),\"\")","v":0.16487714174167409},{"$f":"IUSG!Q13","v":"https://finance.yahoo.com/quote/GPOR"}]
[{"$f":"TRIM(IUSG!I14)","v":"S.US.CHS"},"News",{"$f":"RTD(\"cqg.rtd\", ,\"ContractData\",A31, \"LongDescription\",, \"T\")&\" (\"&RIGHT(A31,LEN(A31)-5)&\")\"","v":"Chicos FAS Inc (CHS)"},null,null,null,null,{"$f":"RTD(\"cqg.rtd\", ,\"ContractData\",A31, \"LastTradeToday\",, \"T\")","v":13.85},{"$f":"RTD(\"cqg.rtd\", ,\"ContractData\",A31, \"NetLastTradeToday\",, \"T\")","v":0.18},{"$f":"RTD(\"cqg.rtd\", ,\"ContractData\",A31, \"PerCentNetLastTrade\",, \"T\")/100","v":1.3167520117044624E-2},{"$f":" I31/RTD(\"cqg.rtd\",,\"StudyData\",A31, \"ATR\", \"MaType=Sim,Period=10\", \"ATR\",\"D\",\"-1\",\"ALL\",,,\"FALSE\",\"T\")/100","v":4.6391752577319588E-3},{"$f":"RTD(\"cqg.rtd\", ,\"ContractData\",A31, \"OPen\",, \"T\")","v":13.69},{"$f":"RTD(\"cqg.rtd\", ,\"ContractData\", A31, \"HIgh\",, \"T\")","v":13.85},{"$f":"RTD(\"cqg.rtd\", ,\"ContractData\",A31, \"LOw\",, \"T\")","v":13.620000000000001},{"$f":"RTD(\"cqg.rtd\", ,\"ContractData\",A31, \"T_CVol\",, \"T\")","v":183945},null,{"$f":" IFERROR(O31/RTD(\"cqg.rtd\",,\"StudyData\",A31, \"MA\", \"InputChoice=Vol,MAType=Sim,Period=21\", \"MA\",\"D\",\"-1\",\"all\",,,,\"T\"),\"\")","v":8.0596775573978374E-2},{"$f":"IUSG!Q14","v":"https://finance.yahoo.com/quote/CHS"}]
[{"$f":"TRIM(IUSG!I15)","v":"S.US.AAPL"},"News",{"$f":"RTD(\"cqg.rtd\", ,\"ContractData\",A32, \"LongDescription\",, \"T\")&\" (\"&RIGHT(A32,LEN(A32)-5)&\")\"","v":"Apple Inc (AAPL)"},null,null,null,null,{"$f":"RTD(\"cqg.rtd\", ,\"ContractData\",A32, \"LastTradeToday\",, \"T\")","v":150.86000000000001},{"$f":"RTD(\"cqg.rtd\", ,\"ContractData\",A32, \"NetLastTradeToday\",, \"T\")","v":1.9000000000000001},{"$f":"RTD(\"cqg.rtd\", ,\"ContractData\",A32, \"PerCentNetLastTrade\",, \"T\")/100","v":1.2755102040816327E-2},{"$f":" I32/RTD(\"cqg.rtd\",,\"StudyData\",A32, \"ATR\", \"MaType=Sim,Period=10\", \"ATR\",\"D\",\"-1\",\"ALL\",,,\"FALSE\",\"T\")/100","v":1.0479867622724766E-2},{"$f":"RTD(\"cqg.rtd\", ,\"ContractData\",A32, \"OPen\",, \"T\")","v":149.03},{"$f":"RTD(\"cqg.rtd\", ,\"ContractData\", A32, \"HIgh\",, \"T\")","v":150.95000000000002},{"$f":"RTD(\"cqg.rtd\", ,\"ContractData\",A32, \"LOw\",, \"T\")","v":149.03},{"$f":"RTD(\"cqg.rtd\", ,\"ContractData\",A32, \"T_CVol\",, \"T\")","v":11274697},null,{"$f":" IFERROR(O32/RTD(\"cqg.rtd\",,\"StudyData\",A32, \"MA\", \"InputChoice=Vol,MAType=Sim,Period=21\", \"MA\",\"D\",\"-1\",\"all\",,,,\"T\"),\"\")","v":0.49218013619796391},{"$f":"IUSG!Q15","v":"https://finance.yahoo.com/quote/AAPL"}]
[null,null,"Bottom 15 Description",null,null,null,null,"Last","NC","%NC","NC/ATR","Open","High","Low","Volume",null,"Ratio"]
[{"$f":"TRIM(IUSG!N15)","v":"S.US.KMT"},"News",{"$f":"RTD(\"cqg.rtd\", ,\"ContractData\",A34, \"LongDescription\",, \"T\")&\" (\"&RIGHT(A34,LEN(A34)-5)&\")\"","v":"Kennametal Inc (KMT)"},null,null,null,null,{"$f":"RTD(\"cqg.rtd\", ,\"ContractData\",A34, \"LastTradeToday\",, \"T\")","v":39.36},{"$f":"RTD(\"cqg.rtd\", ,\"ContractData\",A34, \"NetLastTradeToday\",, \"T\")","v":-0.76},{"$f":"RTD(\"cqg.rtd\", ,\"ContractData\",A34, \"PerCentNetLastTrade\",, \"T\")/100","v":-1.8943170488534399E-2},{"$f":" I34/RTD(\"cqg.rtd\",,\"StudyData\",A34, \"ATR\", \"MaType=Sim,Period=10\", \"ATR\",\"D\",\"-1\",\"ALL\",,,\"FALSE\",\"T\")/100","v":-6.003159557661928E-3},{"$f":"RTD(\"cqg.rtd\", ,\"ContractData\",A34, \"OPen\",, \"T\")","v":39.880000000000003},{"$f":"RTD(\"cqg.rtd\", ,\"ContractData\", A34, \"HIgh\",, \"T\")","v":40.01},{"$f":"RTD(\"cqg.rtd\", ,\"ContractData\",A34, \"LOw\",, \"T\")","v":39.36},{"$f":"RTD(\"cqg.rtd\", ,\"ContractData\",A34, \"T_CVol\",, \"T\")","v":141230},null,{"$f":" IFERROR(O34/RTD(\"cqg.rtd\",,\"StudyData\",A34, \"MA\", \"InputChoice=Vol,MAType=Sim,Period=21\", \"MA\",\"D\",\"-1\",\"all\",,,,\"T\"),\"\")","v":0.1396310515828362},{"$f":"IUSG!AB1","v":"https://finance.yahoo.com/quote/KMT"}]
[{"$f":"TRIM(IUSG!N14)","v":"S.US.MTX"},"News",{"$f":"RTD(\"cqg.rtd\", ,\"ContractData\",A35, \"LongDescription\",, \"T\")&\" (\"&RIGHT(A35,LEN(A35)-5)&\")\"","v":"Minerals Technologies Inc (MTX)"},null,null,null,null,{"$f":"RTD(\"cqg.rtd\", ,\"ContractData\",A35, \"LastTradeToday\",, \"T\")","v":76.25},{"$f":"RTD(\"cqg.rtd\", ,\"ContractData\",A35, \"NetLastTradeToday\",, \"T\")","v":-1.5},{"$f":"RTD(\"cqg.rtd\", ,\"ContractData\",A35, \"PerCentNetLastTrade\",, \"T\")/100","v":-1.9292604501607719E-2},{"$f":" I35/RTD(\"cqg.rtd\",,\"StudyData\",A35, \"ATR\", \"MaType=Sim,Period=10\", \"ATR\",\"D\",\"-1\",\"ALL\",,,\"FALSE\",\"T\")/100","v":-9.3867334167709645E-3},{"$f":"RTD(\"cqg.rtd\", ,\"ContractData\",A35, \"OPen\",, \"T\")","v":77},{"$f":"RTD(\"cqg.rtd\", ,\"ContractData\", A35, \"HIgh\",, \"T\")","v":77},{"$f":"RTD(\"cqg.rtd\", ,\"ContractData\",A35, \"LOw\",, \"T\")","v":76.150000000000006},{"$f":"RTD(\"cqg.rtd\", ,\"ContractData\",A35, \"T_CVol\",, \"T\")","v":13367},null,{"$f":" IFERROR(O35/RTD(\"cqg.rtd\",,\"StudyData\",A35, \"MA\", \"InputChoice=Vol,MAType=Sim,Period=21\", \"MA\",\"D\",\"-1\",\"all\",,,,\"T\"),\"\")","v":0.10377925257879497},{"$f":"IUSG!AB2","v":"https://finance.yahoo.com/quote/MTX"}]
[{"$f":"TRIM(IUSG!N13)","v":"S.US.TFX"},"News",{"$f":"RTD(\"cqg.rtd\", ,\"ContractData\",A36, \"LongDescription\",, \"T\")&\" (\"&RIGHT(A36,LEN(A36)-5)&\")\"","v":"Teleflex Inc (TFX)"},null,null,null,null,{"$f":"RTD(\"cqg.rtd\", ,\"ContractData\",A36, \"LastTradeToday\",, \"T\")","v":196.31},{"$f":"RTD(\"cqg.rtd\", ,\"ContractData\",A36, \"NetLastTradeToday\",, \"T\")","v":-4.03},{"$f":"RTD(\"cqg.rtd\", ,\"ContractData\",A36, \"PerCentNetLastTrade\",, \"T\")/100","v":-2.0115803134671061E-2},{"$f":" I36/RTD(\"cqg.rtd\",,\"StudyData\",A36, \"ATR\", \"MaType=Sim,Period=10\", \"ATR\",\"D\",\"-1\",\"ALL\",,,\"FALSE\",\"T\")/100","v":-9.4556546222430808E-3},{"$f":"RTD(\"cqg.rtd\", ,\"ContractData\",A36, \"OPen\",, \"T\")","v":199.95000000000002},{"$f":"RTD(\"cqg.rtd\", ,\"ContractData\", A36, \"HIgh\",, \"T\")","v":199.95000000000002},{"$f":"RTD(\"cqg.rtd\", ,\"ContractData\",A36, \"LOw\",, \"T\")","v":195.53},{"$f":"RTD(\"cqg.rtd\", ,\"ContractData\",A36, \"T_CVol\",, \"T\")","v":39045},null,{"$f":" IFERROR(O36/RTD(\"cqg.rtd\",,\"StudyData\",A36, \"MA\", \"InputChoice=Vol,MAType=Sim,Period=21\", \"MA\",\"D\",\"-1\",\"all\",,,,\"T\"),\"\")","v":0.11531916790795368},{"$f":"IUSG!AB3","v":"https://finance.yahoo.com/quote/TFX"}]
[{"$f":"TRIM(IUSG!N12)","v":"S.US.GVA"},"News",{"$f":"RTD(\"cqg.rtd\", ,\"ContractData\",A37, \"LongDescription\",, \"T\")&\" (\"&RIGHT(A37,LEN(A37)-5)&\")\"","v":"Granite Constr Inc (GVA)"},null,null,null,null,{"$f":"RTD(\"cqg.rtd\", ,\"ContractData\",A37, \"LastTradeToday\",, \"T\")","v":51.6},{"$f":"RTD(\"cqg.rtd\", ,\"ContractData\",A37, \"NetLastTradeToday\",, \"T\")","v":-1.07},{"$f":"RTD(\"cqg.rtd\", ,\"ContractData\",A37, \"PerCentNetLastTrade\",, \"T\")/100","v":-2.0315169925954054E-2},{"$f":" I37/RTD(\"cqg.rtd\",,\"StudyData\",A37, \"ATR\", \"MaType=Sim,Period=10\", \"ATR\",\"D\",\"-1\",\"ALL\",,,\"FALSE\",\"T\")/100","v":-6.8196303377947741E-3},{"$f":"RTD(\"cqg.rtd\", ,\"ContractData\",A37, \"OPen\",, \"T\")","v":52.660000000000004},{"$f":"RTD(\"cqg.rtd\", ,\"ContractData\", A37, \"HIgh\",, \"T\")","v":52.83},{"$f":"RTD(\"cqg.rtd\", ,\"ContractData\",A37, \"LOw\",, \"T\")","v":51.42},{"$f":"RTD(\"cqg.rtd\", ,\"ContractData\",A37, \"T_CVol\",, \"T\")","v":30489},null,{"$f":" IFERROR(O37/RTD(\"cqg.rtd\",,\"StudyData\",A37, \"MA\", \"InputChoice=Vol,MAType=Sim,Period=21\", \"MA\",\"D\",\"-1\",\"all\",,,,\"T\"),\"\")","v":5.8925278981403817E-2},{"$f":"IUSG!AB4","v":"https://finance.yahoo.com/quote/GVA"}]
[{"$f":"TRIM(IUSG!N11)","v":"S.US.KIM"},"News",{"$f":"RTD(\"cqg.rtd\", ,\"ContractData\",A38, \"LongDescription\",, \"T\")&\" (\"&RIGHT(A38,LEN(A38)-5)&\")\"","v":"Kimco Realty Corp (KIM)"},null,null,null,null,{"$f":"RTD(\"cqg.rtd\", ,\"ContractData\",A38, \"LastTradeToday\",, \"T\")","v":19.510000000000002},{"$f":"RTD(\"cqg.rtd\", ,\"ContractData\",A38, \"NetLastTradeToday\",, \"T\")","v":-0.43},{"$f":"RTD(\"cqg.rtd\", ,\"ContractData\",A38, \"PerCentNetLastTrade\",, \"T\")/100","v":-2.156469408224674E-2},{"$f":" I38/RTD(\"cqg.rtd\",,\"StudyData\",A38, \"ATR\", \"MaType=Sim,Period=10\", \"ATR\",\"D\",\"-1\",\"ALL\",,,\"FALSE\",\"T\")/100","v":-6.8037974683544302E-3},{"$f":"RTD(\"cqg.rtd\", ,\"ContractData\",A38, \"OPen\",, \"T\")","v":19.96},{"$f":"RTD(\"cqg.rtd\", ,\"ContractData\", A38, \"HIgh\",, \"T\")","v":20.010000000000002},{"$f":"RTD(\"cqg.rtd\", ,\"ContractData\",A38, \"LOw\",, \"T\")","v":19.47},{"$f":"RTD(\"cqg.rtd\", ,\"ContractData\",A38, \"T_CVol\",, \"T\")","v":420911},null,{"$f":" IFERROR(O38/RTD(\"cqg.rtd\",,\"StudyData\",A38, \"MA\", \"InputChoice=Vol,MAType=Sim,Period=21\", \"MA\",\"D\",\"-1\",\"all\",,,,\"T\"),\"\")","v":9.9830611230428259E-2},{"$f":"IUSG!AB5","v":"https://finance.yahoo.com/quote/KIM"}]
[{"$f":"TRIM(IUSG!N10)","v":"S.US.SKT"},"News",{"$f":"RTD(\"cqg.rtd\", ,\"ContractData\",A39, \"LongDescription\",, \"T\")&\" (\"&RIGHT(A39,LEN(A39)-5)&\")\"","v":"Tanger Factory Outlet Centers, Inc. (SKT)"},null,null,null,null,{"$f":"RTD(\"cqg.rtd\", ,\"ContractData\",A39, \"LastTradeToday\",, \"T\")","v":28},{"$f":"RTD(\"cqg.rtd\", ,\"ContractData\",A39, \"NetLastTradeToday\",, \"T\")","v":-0.63},{"$f":"RTD(\"cqg.rtd\", ,\"ContractData\",A39, \"PerCentNetLastTrade\",, \"T\")/100","v":-2.2004889975550123E-2},{"$f":" I39/RTD(\"cqg.rtd\",,\"StudyData\",A39, \"ATR\", \"MaType=Sim,Period=10\", \"ATR\",\"D\",\"-1\",\"ALL\",,,\"FALSE\",\"T\")/100","v":-6.5015479876160999E-3},{"$f":"RTD(\"cqg.rtd\", ,\"ContractData\",A39, \"OPen\",, \"T\")","v":28.75},{"$f":"RTD(\"cqg.rtd\", ,\"ContractData\", A39, \"HIgh\",, \"T\")","v":29},{"$f":"RTD(\"cqg.rtd\", ,\"ContractData\",A39, \"LOw\",, \"T\")","v":27.89},{"$f":"RTD(\"cqg.rtd\", ,\"ContractData\",A39, \"T_CVol\",, \"T\")","v":443481},null,{"$f":" IFERROR(O39/RTD(\"cqg.rtd\",,\"StudyData\",A39, \"MA\", \"InputChoice=Vol,MAType=Sim,Period=21\", \"MA\",\"D\",\"-1\",\"all\",,,,\"T\"),\"\")","v":0.23759005325602459},{"$f":"IUSG!AB6","v":"https://finance.yahoo.com/quote/SKT"}]
[{"$f":"TRIM(IUSG!N9)","v":"S.US.TCO"},"News",{"$f":"RTD(\"cqg.rtd\", ,\"ContractData\",A40, \"LongDescription\",, \"T\")&\" (\"&RIGHT(A40,LEN(A40)-5)&\")\"","v":"Taubman Centers Inc (TCO)"},null,null,null,null,{"$f":"RTD(\"cqg.rtd\", ,\"ContractData\",A40, \"LastTradeToday\",, \"T\")","v":59.81},{"$f":"RTD(\"cqg.rtd\", ,\"ContractData\",A40, \"NetLastTradeToday\",, \"T\")","v":-1.3800000000000001},{"$f":"RTD(\"cqg.rtd\", ,\"ContractData\",A40, \"PerCentNetLastTrade\",, \"T\")/100","v":-2.2552704690308872E-2},{"$f":" I40/RTD(\"cqg.rtd\",,\"StudyData\",A40, \"ATR\", \"MaType=Sim,Period=10\", \"ATR\",\"D\",\"-1\",\"ALL\",,,\"FALSE\",\"T\")/100","v":-7.9861111111111122E-3},{"$f":"RTD(\"cqg.rtd\", ,\"ContractData\",A40, \"OPen\",, \"T\")","v":61.17},{"$f":"RTD(\"cqg.rtd\", ,\"ContractData\", A40, \"HIgh\",, \"T\")","v":61.24},{"$f":"RTD(\"cqg.rtd\", ,\"ContractData\",A40, \"LOw\",, \"T\")","v":59.68},{"$f":"RTD(\"cqg.rtd\", ,\"ContractData\",A40, \"T_CVol\",, \"T\")","v":85593},null,{"$f":" IFERROR(O40/RTD(\"cqg.rtd\",,\"StudyData\",A40, \"MA\", \"InputChoice=Vol,MAType=Sim,Period=21\", \"MA\",\"D\",\"-1\",\"all\",,,,\"T\"),\"\")","v":0.20501333733599622},{"$f":"IUSG!AB7","v":"https://finance.yahoo.com/quote/TCO"}]
[{"$f":"TRIM(IUSG!N8)","v":"S.US.SLM"},"News",{"$f":"RTD(\"cqg.rtd\", ,\"ContractData\",A41, \"LongDescription\",, \"T\")&\" (\"&RIGHT(A41,LEN(A41)-5)&\")\"","v":"SLM Corporation (SLM)"},null,null,null,null,{"$f":"RTD(\"cqg.rtd\", ,\"ContractData\",A41, \"LastTradeToday\",, \"T\")","v":11.65},{"$f":"RTD(\"cqg.rtd\", ,\"ContractData\",A41, \"NetLastTradeToday\",, \"T\")","v":-0.28000000000000003},{"$f":"RTD(\"cqg.rtd\", ,\"ContractData\",A41, \"PerCentNetLastTrade\",, \"T\")/100","v":-2.347024308466052E-2},{"$f":" I41/RTD(\"cqg.rtd\",,\"StudyData\",A41, \"ATR\", \"MaType=Sim,Period=10\", \"ATR\",\"D\",\"-1\",\"ALL\",,,\"FALSE\",\"T\")/100","v":-7.9545454545454555E-3},{"$f":"RTD(\"cqg.rtd\", ,\"ContractData\",A41, \"OPen\",, \"T\")","v":11.97},{"$f":"RTD(\"cqg.rtd\", ,\"ContractData\", A41, \"HIgh\",, \"T\")","v":12.05},{"$f":"RTD(\"cqg.rtd\", ,\"ContractData\",A41, \"LOw\",, \"T\")","v":11.44},{"$f":"RTD(\"cqg.rtd\", ,\"ContractData\",A41, \"T_CVol\",, \"T\")","v":2842162},null,{"$f":" IFERROR(O41/RTD(\"cqg.rtd\",,\"StudyData\",A41, \"MA\", \"InputChoice=Vol,MAType=Sim,Period=21\", \"MA\",\"D\",\"-1\",\"all\",,,,\"T\"),\"\")","v":0.72987259189677234},{"$f":"IUSG!AB8","v":"https://finance.yahoo.com/quote/SLM"}]
[{"$f":"TRIM(IUSG!N7)","v":"S.US.WRI"},"News",{"$f":"RTD(\"cqg.rtd\", ,\"ContractData\",A42, \"LongDescription\",, \"T\")&\" (\"&RIGHT(A42,LEN(A42)-5)&\")\"","v":"Weingarten Realty Investors (WRI)"},null,null,null,null,{"$f":"RTD(\"cqg.rtd\", ,\"ContractData\",A42, \"LastTradeToday\",, \"T\")","v":32.21},{"$f":"RTD(\"cqg.rtd\", ,\"ContractData\",A42, \"NetLastTradeToday\",, \"T\")","v":-0.78},{"$f":"RTD(\"cqg.rtd\", ,\"ContractData\",A42, \"PerCentNetLastTrade\",, \"T\")/100","v":-2.3643528341921797E-2},{"$f":" I42/RTD(\"cqg.rtd\",,\"StudyData\",A42, \"ATR\", \"MaType=Sim,Period=10\", \"ATR\",\"D\",\"-1\",\"ALL\",,,\"FALSE\",\"T\")/100","v":-1.0317460317460319E-2},{"$f":"RTD(\"cqg.rtd\", ,\"ContractData\",A42, \"OPen\",, \"T\")","v":32.99},{"$f":"RTD(\"cqg.rtd\", ,\"ContractData\", A42, \"HIgh\",, \"T\")","v":33.020000000000003},{"$f":"RTD(\"cqg.rtd\", ,\"ContractData\",A42, \"LOw\",, \"T\")","v":32.19},{"$f":"RTD(\"cqg.rtd\", ,\"ContractData\",A42, \"T_CVol\",, \"T\")","v":108498},null,{"$f":" IFERROR(O42/RTD(\"cqg.rtd\",,\"StudyData\",A42, \"MA\", \"InputChoice=Vol,MAType=Sim,Period=21\", \"MA\",\"D\",\"-1\",\"all\",,,,\"T\"),\"\")","v":0.10418386520897076},{"$f":"IUSG!AB9","v":"https://finance.yahoo.com/quote/WRI"}]
[{"$f":"TRIM(IUSG!N6)","v":"S.US.JWA"},"News",{"$f":"RTD(\"cqg.rtd\", ,\"ContractData\",A43, \"LongDescription\",, \"T\")&\" (\"&RIGHT(A43,LEN(A43)-5)&\")\"","v":"John Wiley/Sons Inc (JWA)"},null,null,null,null,{"$f":"RTD(\"cqg.rtd\", ,\"ContractData\",A43, \"LastTradeToday\",, \"T\")","v":52.25},{"$f":"RTD(\"cqg.rtd\", ,\"ContractData\",A43, \"NetLastTradeToday\",, \"T\")","v":-1.5},{"$f":"RTD(\"cqg.rtd\", ,\"ContractData\",A43, \"PerCentNetLastTrade\",, \"T\")/100","v":-2.7906976744186046E-2},{"$f":" I43/RTD(\"cqg.rtd\",,\"StudyData\",A43, \"ATR\", \"MaType=Sim,Period=10\", \"ATR\",\"D\",\"-1\",\"ALL\",,,\"FALSE\",\"T\")/100","v":-1.4150943396226414E-2},{"$f":"RTD(\"cqg.rtd\", ,\"ContractData\",A43, \"OPen\",, \"T\")","v":53.35},{"$f":"RTD(\"cqg.rtd\", ,\"ContractData\", A43, \"HIgh\",, \"T\")","v":53.5},{"$f":"RTD(\"cqg.rtd\", ,\"ContractData\",A43, \"LOw\",, \"T\")","v":52.25},{"$f":"RTD(\"cqg.rtd\", ,\"ContractData\",A43, \"T_CVol\",, \"T\")","v":28825},null,{"$f":" IFERROR(O43/RTD(\"cqg.rtd\",,\"StudyData\",A43, \"MA\", \"InputChoice=Vol,MAType=Sim,Period=21\", \"MA\",\"D\",\"-1\",\"all\",,,,\"T\"),\"\")","v":0.15468461918823073},{"$f":"IUSG!AB10","v":"https://finance.yahoo.com/quote/JWA"}]
[{"$f":"TRIM(IUSG!N5)","v":"S.US.INCY"},"News",{"$f":"RTD(\"cqg.rtd\", ,\"ContractData\",A44, \"LongDescription\",, \"T\")&\" (\"&RIGHT(A44,LEN(A44)-5)&\")\"","v":"Incyte Corporation (INCY)"},null,null,null,null,{"$f":"RTD(\"cqg.rtd\", ,\"ContractData\",A44, \"LastTradeToday\",, \"T\")","v":118.98},{"$f":"RTD(\"cqg.rtd\", ,\"ContractData\",A44, \"NetLastTradeToday\",, \"T\")","v":-3.43},{"$f":"RTD(\"cqg.rtd\", ,\"ContractData\",A44, \"PerCentNetLastTrade\",, \"T\")/100","v":-2.802058655338616E-2},{"$f":" I44/RTD(\"cqg.rtd\",,\"StudyData\",A44, \"ATR\", \"MaType=Sim,Period=10\", \"ATR\",\"D\",\"-1\",\"ALL\",,,\"FALSE\",\"T\")/100","v":-1.2899586310643101E-2},{"$f":"RTD(\"cqg.rtd\", ,\"ContractData\",A44, \"OPen\",, \"T\")","v":121.72},{"$f":"RTD(\"cqg.rtd\", ,\"ContractData\", A44, \"HIgh\",, \"T\")","v":121.8},{"$f":"RTD(\"cqg.rtd\", ,\"ContractData\",A44, \"LOw\",, \"T\")","v":118.38},{"$f":"RTD(\"cqg.rtd\", ,\"ContractData\",A44, \"T_CVol\",, \"T\")","v":411599},null,{"$f":" IFERROR(O44/RTD(\"cqg.rtd\",,\"StudyData\",A44, \"MA\", \"InputChoice=Vol,MAType=Sim,Period=21\", \"MA\",\"D\",\"-1\",\"all\",,,,\"T\"),\"\")","v":""},{"$f":"IUSG!AB11","v":"https://finance.yahoo.com/quote/INCY"}]
[{"$f":"TRIM(IUSG!N4)","v":"S.US.CHTR"},"News",{"$f":"RTD(\"cqg.rtd\", ,\"ContractData\",A45, \"LongDescription\",, \"T\")&\" (\"&RIGHT(A45,LEN(A45)-5)&\")\"","v":"Charter Communications, Inc. Class A (CHTR)"},null,null,null,null,{"$f":"RTD(\"cqg.rtd\", ,\"ContractData\",A45, \"LastTradeToday\",, \"T\")","v":325.13},{"$f":"RTD(\"cqg.rtd\", ,\"ContractData\",A45, \"NetLastTradeToday\",, \"T\")","v":-9.65},{"$f":"RTD(\"cqg.rtd\", ,\"ContractData\",A45, \"PerCentNetLastTrade\",, \"T\")/100","v":-2.8824899934285206E-2},{"$f":" I45/RTD(\"cqg.rtd\",,\"StudyData\",A45, \"ATR\", \"MaType=Sim,Period=10\", \"ATR\",\"D\",\"-1\",\"ALL\",,,\"FALSE\",\"T\")/100","v":-1.259133611691023E-2},{"$f":"RTD(\"cqg.rtd\", ,\"ContractData\",A45, \"OPen\",, \"T\")","v":329.52},{"$f":"RTD(\"cqg.rtd\", ,\"ContractData\", A45, \"HIgh\",, \"T\")","v":331},{"$f":"RTD(\"cqg.rtd\", ,\"ContractData\",A45, \"LOw\",, \"T\")","v":325},{"$f":"RTD(\"cqg.rtd\", ,\"ContractData\",A45, \"T_CVol\",, \"T\")","v":623779},null,{"$f":" IFERROR(O45/RTD(\"cqg.rtd\",,\"StudyData\",A45, \"MA\", \"InputChoice=Vol,MAType=Sim,Period=21\", \"MA\",\"D\",\"-1\",\"all\",,,,\"T\"),\"\")","v":0.43770189779120311},{"$f":"IUSG!AB12","v":"https://finance.yahoo.com/quote/CHTR"}]
[{"$f":"TRIM(IUSG!N3)","v":"S.US.MIK"},"News",{"$f":"RTD(\"cqg.rtd\", ,\"ContractData\",A46, \"LongDescription\",, \"T\")&\" (\"&RIGHT(A46,LEN(A46)-5)&\")\"","v":"The Michaels Companies, Inc. (MIK)"},null,null,null,null,{"$f":"RTD(\"cqg.rtd\", ,\"ContractData\",A46, \"LastTradeToday\",, \"T\")","v":21.78},{"$f":"RTD(\"cqg.rtd\", ,\"ContractData\",A46, \"NetLastTradeToday\",, \"T\")","v":-0.73},{"$f":"RTD(\"cqg.rtd\", ,\"ContractData\",A46, \"PerCentNetLastTrade\",, \"T\")/100","v":-3.2430031097290091E-2},{"$f":" I46/RTD(\"cqg.rtd\",,\"StudyData\",A46, \"ATR\", \"MaType=Sim,Period=10\", \"ATR\",\"D\",\"-1\",\"ALL\",,,\"FALSE\",\"T\")/100","v":-1.3984674329501914E-2},{"$f":"RTD(\"cqg.rtd\", ,\"ContractData\",A46, \"OPen\",, \"T\")","v":22.5},{"$f":"RTD(\"cqg.rtd\", ,\"ContractData\", A46, \"HIgh\",, \"T\")","v":22.5},{"$f":"RTD(\"cqg.rtd\", ,\"ContractData\",A46, \"LOw\",, \"T\")","v":21.77},{"$f":"RTD(\"cqg.rtd\", ,\"ContractData\",A46, \"T_CVol\",, \"T\")","v":445241},null,{"$f":" IFERROR(O46/RTD(\"cqg.rtd\",,\"StudyData\",A46, \"MA\", \"InputChoice=Vol,MAType=Sim,Period=21\", \"MA\",\"D\",\"-1\",\"all\",,,,\"T\"),\"\")","v":0.27062221923012125},{"$f":"IUSG!AB13","v":"https://finance.yahoo.com/quote/MIK"}]
[{"$f":"TRIM(IUSG!N2)","v":"S.US.LOGM"},"News",{"$f":"RTD(\"cqg.rtd\", ,\"ContractData\",A47, \"LongDescription\",, \"T\")&\" (\"&RIGHT(A47,LEN(A47)-5)&\")\"","v":"LogMein, Inc (LOGM)"},null,null,null,null,{"$f":"RTD(\"cqg.rtd\", ,\"ContractData\",A47, \"LastTradeToday\",, \"T\")","v":116.3},{"$f":"RTD(\"cqg.rtd\", ,\"ContractData\",A47, \"NetLastTradeToday\",, \"T\")","v":-4.6500000000000004},{"$f":"RTD(\"cqg.rtd\", ,\"ContractData\",A47, \"PerCentNetLastTrade\",, \"T\")/100","v":-3.8445638693675073E-2},{"$f":" I47/RTD(\"cqg.rtd\",,\"StudyData\",A47, \"ATR\", \"MaType=Sim,Period=10\", \"ATR\",\"D\",\"-1\",\"ALL\",,,\"FALSE\",\"T\")/100","v":-1.3859910581222056E-2},{"$f":"RTD(\"cqg.rtd\", ,\"ContractData\",A47, \"OPen\",, \"T\")","v":120.45},{"$f":"RTD(\"cqg.rtd\", ,\"ContractData\", A47, \"HIgh\",, \"T\")","v":120.45},{"$f":"RTD(\"cqg.rtd\", ,\"ContractData\",A47, \"LOw\",, \"T\")","v":115.95},{"$f":"RTD(\"cqg.rtd\", ,\"ContractData\",A47, \"T_CVol\",, \"T\")","v":229300},null,{"$f":" IFERROR(O47/RTD(\"cqg.rtd\",,\"StudyData\",A47, \"MA\", \"InputChoice=Vol,MAType=Sim,Period=21\", \"MA\",\"D\",\"-1\",\"all\",,,,\"T\"),\"\")","v":0.33753495529745337},{"$f":"IUSG!AB14","v":"https://finance.yahoo.com/quote/LOGM"}]
[{"$f":"TRIM(IUSG!N1)","v":"S.US.CAR"},"News",{"$f":"RTD(\"cqg.rtd\", ,\"ContractData\",A48, \"LongDescription\",, \"T\")&\" (\"&RIGHT(A48,LEN(A48)-5)&\")\"","v":"AVIS Budget Group Inc (CAR)"},null,null,null,null,{"$f":"RTD(\"cqg.rtd\", ,\"ContractData\",A48, \"LastTradeToday\",, \"T\")","v":27.810000000000002},{"$f":"RTD(\"cqg.rtd\", ,\"ContractData\",A48, \"NetLastTradeToday\",, \"T\")","v":-1.81},{"$f":"RTD(\"cqg.rtd\", ,\"ContractData\",A48, \"PerCentNetLastTrade\",, \"T\")/100","v":-6.1107359891964891E-2},{"$f":" I48/RTD(\"cqg.rtd\",,\"StudyData\",A48, \"ATR\", \"MaType=Sim,Period=10\", \"ATR\",\"D\",\"-1\",\"ALL\",,,\"FALSE\",\"T\")/100","v":-1.3397483345669875E-2},{"$f":"RTD(\"cqg.rtd\", ,\"ContractData\",A48, \"OPen\",, \"T\")","v":29.060000000000002},{"$f":"RTD(\"cqg.rtd\", ,\"ContractData\", A48, \"HIgh\",, \"T\")","v":29.47},{"$f":"RTD(\"cqg.rtd\", ,\"ContractData\",A48, \"LOw\",, \"T\")","v":27.8},{"$f":"RTD(\"cqg.rtd\", ,\"ContractData\",A48, \"T_CVol\",, \"T\")","v":879955},null,{"$f":" IFERROR(O48/RTD(\"cqg.rtd\",,\"StudyData\",A48, \"MA\", \"InputChoice=Vol,MAType=Sim,Period=21\", \"MA\",\"D\",\"-1\",\"all\",,,,\"T\"),\"\")","v":0.34108299499695305},{"$f":"IUSG!AB15","v":"https://finance.yahoo.com/quote/CAR"}]
[null,null,"CQG Inc.,   Copyright © 2017",null,null,null,"Designed by Thom Hartle",null,null,"iShares is a registered trademark of BlackRock, Inc. S&P® is a registered trademark of Standard & Poor’s Financial Services LLC",null,null,null,null,null,null,null,null,null,null,null,null,{"$f":"IUSG!B565","v":0.25531914893617019},"of the stocks in the ETF are higher today"]

{"sheet":"Symbols","index":1,"n_rows":564,"n_cols":5,"rows_kept":564,"cut":false,"hidden":false,"merged":[]}
["3D Systems Corporation","S.US.DDD",null,null,{"$error":"#N/A"}]
["3M Company","S.US.MMM",null,null,{"$error":"#N/A"}]
["AO Smith Corp","S.US.AOS",null,null,{"$error":"#N/A"}]
["AbbVie Inc.","S.US.ABBV",null,null,{"$error":"#N/A"}]
["ABIOMED Inc","S.US.ABMD",null,null,{"$error":"#N/A"}]
["Acadia Healthcare Company, Inc.","S.US.ACHC",null,null,{"$error":"#N/A"}]
["Accenture PLC Ireland","S.US.ACN",null,null,{"$error":"#N/A"}]
["ACI Worldwide Inc","S.US.ACIW",null,null,{"$error":"#N/A"}]
["Activision Blizzard Inc","S.US.ATVI",null,null,{"$error":"#N/A"}]
["Acuity Brands Inc","S.US.AYI",null,null,{"$error":"#N/A"}]
["Acxiom Corp","S.US.ACXM",null,null,{"$error":"#N/A"}]
["Adobe Systems Inc","S.US.ADBE",null,null,{"$error":"#N/A"}]
["Advance Auto Parts Inc","S.US.AAP",null,null,{"$error":"#N/A"}]
["Advanced Micro Devices","S.US.AMD",null,null,{"$error":"#N/A"}]
["Aetna Inc","S.US.AET",null,null,{"$error":"#N/A"}]
["Agilent Technologies","S.US.A",null,null,{"$error":"#N/A"}]
["Air Products & Chems Inc","S.US.APD",null,null,{"$error":"#N/A"}]
["Akamai Tech Inc","S.US.AKAM",null,null,{"$error":"#N/A"}]
["Akorn Inc","S.US.AKRX",null,null,{"$error":"#N/A"}]
["Alaska Air Group Inc","S.US.ALK",null,null,{"$error":"#N/A"}]
["Albemarle Corporation","S.US.ALB",null,null,{"$error":"#N/A"}]
["Alexander & Baldwin, Inc.","S.US.ALEX",null,null,{"$error":"#N/A"}]
["Alexandria Real Estate Equities Inc","S.US.ARE",null,null,{"$error":"#N/A"}]
["Alexion Pharmaceuticals","S.US.ALXN",null,null,{"$error":"#N/A"}]
["Align Technology Inc","S.US.ALGN",null,null,{"$error":"#N/A"}]
["Allegion plc","S.US.ALLE",null,null,{"$error":"#N/A"}]
["Alliance Data Systems Corp","S.US.ADS",null,null,{"$error":"#N/A"}]
["Alliant Energy Corp","S.US.LNT",null,null,{"$error":"#N/A"}]
["Alphabet Inc. Class A","S.US.GOOGL",null,null,{"$error":"#N/A"}]
["Google, Inc. Class C","S.US.GOOG",null,null,{"$error":"#N/A"}]
["Altria Group Inc","S.US.MO",null,null,{"$error":"#N/A"}]
["Amazon.com Inc","S.US.AMZN",null,null,{"$error":"#N/A"}]
["AMC Networks Inc. Class A","S.US.AMCX",null,null,{"$error":"#N/A"}]
["American Campus Communities Inc","S.US.ACC",null,null,{"$error":"#N/A"}]
["American Express Co","S.US.AXP",null,null,{"$error":"#N/A"}]
["American Tower Corp ClA","S.US.AMT",null,null,{"$error":"#N/A"}]
["American Water Works","S.US.AWK",null,null,{"$error":"#N/A"}]
["Ameriprise Financial Inc","S.US.AMP",null,null,{"$error":"#N/A"}]
["Amgen Inc","S.US.AMGN",null,null,{"$error":"#N/A"}]
["Amphenol","S.US.APH",null,null,{"$error":"#N/A"}]
["Anadarko Petroleum Corp","S.US.APC",null,null,{"$error":"#N/A"}]
["Analog Devices Inc","S.US.ADI",null,null,{"$error":"#N/A"}]
["ANSYS Inc","S.US.ANSS",null,null,{"$error":"#N/A"}]
["AON Corporation","S.US.AON",null,null,{"$error":"#N/A"}]
["Apache Corporation","S.US.APA",null,null,{"$error":"#N/A"}]
["Apartmt Investmt & Mgt Co","S.US.AIV",null,null,{"$error":"#N/A"}]
["Apple Inc","S.US.AAPL",null,null,{"$error":"#N/A"}]
["Applied Materials Inc","S.US.AMAT",null,null,{"$error":"#N/A"}]
["AptarGroup Inc","S.US.ATR",null,null,{"$error":"#N/A"}]
["Aqua America Inc","S.US.WTR",null,null,{"$error":"#N/A"}]
["ARRIS International plc","S.US.ARRS",null,null,{"$error":"#N/A"}]
["Arthur J Gallagher Co","S.US.AJG",null,null,{"$error":"#N/A"}]
["Autodesk Inc","S.US.ADSK",null,null,{"$error":"#N/A"}]
["Auto Data Processing Inc","S.US.ADP",null,null,{"$error":"#N/A"}]
["Autozone Inc","S.US.AZO",null,null,{"$error":"#N/A"}]
["AvalonBay Communities, Inc.","S.US.AVB",null,null,{"$error":"#N/A"}]
["Avery Dennison Corp","S.US.AVY",null,null,{"$error":"#N/A"}]
["AVIS Budget Group Inc","S.US.CAR",null,null,{"$error":"#N/A"}]
["Baker Hughes Inc","S.US.BHI",null,null,{"$error":"#N/A"}]
["Hawaii Corporation","S.US.BOH",null,null,{"$error":"#N/A"}]
["Bank of the Ozarks","S.US.OZRK",null,null,{"$error":"#N/A"}]
["Becton Dickinson & Co","S.US.BDX",null,null,{"$error":"#N/A"}]
["Belden Inc.","S.US.BDC",null,null,{"$error":"#N/A"}]
["Best Buy Co Inc","S.US.BBY",null,null,{"$error":"#N/A"}]
["768: Current Message -> Not found: CAS.US.BIOCA","CAS.US.BIOCA",null,null,{"$error":"#N/A"}]
["Bio-Techne Corp","S.US.TECH",null,null,{"$error":"#N/A"}]
["Biogen Inc.","S.US.BIIB",null,null,{"$error":"#N/A"}]
["Bioverativ Inc.","S.US.BIVV",null,null,{"$error":"#N/A"}]
["BLACK HILLS CORP","S.US.BKH",null,null,{"$error":"#N/A"}]
["Blackrock Inc","S.US.BLK",null,null,{"$error":"#N/A"}]
["Boeing Company","S.US.BA",null,null,{"$error":"#N/A"}]
["Boston Beer Co","S.US.SAM",null,null,{"$error":"#N/A"}]
["Boston Properties Inc","S.US.BXP",null,null,{"$error":"#N/A"}]
["Boston Scientific Corp","S.US.BSX",null,null,{"$error":"#N/A"}]
["Brinker Internatl Inc","S.US.EAT",null,null,{"$error":"#N/A"}]
["Bristol-Myers Squibb Co","S.US.BMY",null,null,{"$error":"#N/A"}]
["Broadcom Limited","S.US.AVGO",null,null,{"$error":"#N/A"}]
["Broadridge Financial Solutions","S.US.BR",null,null,{"$error":"#N/A"}]
["Brocade Communications Systems, Inc.","S.US.BRCD",null,null,{"$error":"#N/A"}]
["BROWN AND BROWN INC","S.US.BRO",null,null,{"$error":"#N/A"}]
["Brown-Forman Corporation ClsB","S.US.BFB",null,null,{"$error":"#N/A"}]
["Buffalo Wild Wings Inc","S.US.BWLD",null,null,{"$error":"#N/A"}]
["Bard (CR) Inc","S.US.BCR",null,null,{"$error":"#N/A"}]
["Cabelas Inc","S.US.CAB",null,null,{"$error":"#N/A"}]
["Cable ONE, Inc.","S.US.CABO",null,null,{"$error":"#N/A"}]
["Cabot Oil/Gas Corp","S.US.COG",null,null,{"$error":"#N/A"}]
["Cadence Design Systems, Inc","S.US.CDNS",null,null,{"$error":"#N/A"}]
["Camden Property Trust","S.US.CPT",null,null,{"$error":"#N/A"}]
["Campbell Soup Company","S.US.CPB",null,null,{"$error":"#N/A"}]
["Carlisle Cos Inc","S.US.CSL",null,null,{"$error":"#N/A"}]
["Carmax Inc","S.US.KMX",null,null,{"$error":"#N/A"}]
["Carters Inc","S.US.CRI",null,null,{"$error":"#N/A"}]
["Catalent, Inc.","S.US.CTLT",null,null,{"$error":"#N/A"}]
["Caterpillar Inc","S.US.CAT",null,null,{"$error":"#N/A"}]
["CBOE Holdings, Inc.","S.US.CBOE",null,null,{"$error":"#N/A"}]
["CBRE Group, Inc.","S.US.CBG",null,null,{"$error":"#N/A"}]
["CBS Corporation","S.US.CBS",null,null,{"$error":"#N/A"}]
["CDK Global, Inc.","S.US.CDK",null,null,{"$error":"#N/A"}]
["Celgene Corporation","S.US.CELG",null,null,{"$error":"#N/A"}]
["Centerpoint Energy Holding Co.","S.US.CNP",null,null,{"$error":"#N/A"}]
["Cerner Corporation","S.US.CERN",null,null,{"$error":"#N/A"}]
["CH Robinson Worldwide Inc","S.US.CHRW",null,null,{"$error":"#N/A"}]
["Charles River Labs Hldgs Inc","S.US.CRL",null,null,{"$error":"#N/A"}]
["Charles Schwab Corp","S.US.SCHW",null,null,{"$error":"#N/A"}]
["Charter Communications, Inc. Class A","S.US.CHTR",null,null,{"$error":"#N/A"}]
["Cheesecake Factory Inc","S.US.CAKE",null,null,{"$error":"#N/A"}]
["Chemical Financial Corp","S.US.CHFC",null,null,{"$error":"#N/A"}]
["The Chemours Company","S.US.CC",null,null,{"$error":"#N/A"}]
["Chesapeake Energy Corp","S.US.CHK",null,null,{"$error":"#N/A"}]
["Chicos FAS Inc","S.US.CHS",null,null,{"$error":"#N/A"}]
["Chipotle Mexican Grill","S.US.CMG",null,null,{"$error":"#N/A"}]
["Church/Dwight Co Inc","S.US.CHD",null,null,{"$error":"#N/A"}]
["Churchill Downs","S.US.CHDN",null,null,{"$error":"#N/A"}]
["Cimarex Energy Co","S.US.XEC",null,null,{"$error":"#N/A"}]
["Cincinnati Fincl Corp","S.US.CINF",null,null,{"$error":"#N/A"}]
["Cinemark Holdings, Inc","S.US.CNK",null,null,{"$error":"#N/A"}]
["Cintas Corp","S.US.CTAS",null,null,{"$error":"#N/A"}]
["Cirrus Logic Inc","S.US.CRUS",null,null,{"$error":"#N/A"}]
["Citizens Financial Group, Inc.","S.US.CFG",null,null,{"$error":"#N/A"}]
["Citrix Systems Inc","S.US.CTXS",null,null,{"$error":"#N/A"}]
["Clorox Company","S.US.CLX",null,null,{"$error":"#N/A"}]
["Chicago Merc Exch Holding Inc","S.US.CME",null,null,{"$error":"#N/A"}]
["COACH INC","S.US.COH",null,null,{"$error":"#N/A"}]
["Coca-Cola Company","S.US.KO",null,null,{"$error":"#N/A"}]
["Cognex Corp","S.US.CGNX",null,null,{"$error":"#N/A"}]
["Cognizant Tech Solutions Corp","S.US.CTSH",null,null,{"$error":"#N/A"}]
["Coherent Inc.","S.US.COHR",null,null,{"$error":"#N/A"}]
["Colgate-Palmolive Co","S.US.CL",null,null,{"$error":"#N/A"}]
["Comcast Corp ClsA","S.US.CMCSA",null,null,{"$error":"#N/A"}]
["Comerica Inc","S.US.CMA",null,null,{"$error":"#N/A"}]
["Commerce Bancshares Inc","S.US.CBSH",null,null,{"$error":"#N/A"}]
["CommVault Systems Inc","S.US.CVLT",null,null,{"$error":"#N/A"}]
["Compass Minerals Intl","S.US.CMP",null,null,{"$error":"#N/A"}]
["Concho Resources Inc","S.US.CXO",null,null,{"$error":"#N/A"}]
["Constellation Brands Inc","S.US.STZ",null,null,{"$error":"#N/A"}]
["Convergys Corp","S.US.CVG",null,null,{"$error":"#N/A"}]
["Cooper Companies Inc (The)","S.US.COO",null,null,{"$error":"#N/A"}]
["Copart Inc","S.US.CPRT",null,null,{"$error":"#N/A"}]
["Corelogic, Inc.","S.US.CLGX",null,null,{"$error":"#N/A"}]
["Corning Incorporated","S.US.GLW",null,null,{"$error":"#N/A"}]
["Corporate Office Prop Trust Inc","S.US.OFC",null,null,{"$error":"#N/A"}]
["COTY Inc","S.US.COTY",null,null,{"$error":"#N/A"}]
["Cracker Barrel Old Country Store","S.US.CBRL",null,null,{"$error":"#N/A"}]
["Crane Company","S.US.CR",null,null,{"$error":"#N/A"}]
["Crown Castle Intl","S.US.CCI",null,null,{"$error":"#N/A"}]
["CSRA Inc.","S.US.CSRA",null,null,{"$error":"#N/A"}]
["CSX Corporation","S.US.CSX",null,null,{"$error":"#N/A"}]
["Cullen Frost Bankers Inc","S.US.CFR",null,null,{"$error":"#N/A"}]
["Cummings Inc","S.US.CMI",null,null,{"$error":"#N/A"}]
["Curtiss-Wright Corporation","S.US.CW",null,null,{"$error":"#N/A"}]
["Cypress Semicndctr Corp","S.US.CY",null,null,{"$error":"#N/A"}]
["CyrusOne Inc","S.US.CONE",null,null,{"$error":"#N/A"}]
["Danaher Corporation","S.US.DHR",null,null,{"$error":"#N/A"}]
["Darden Restaurants Inc","S.US.DRI",null,null,{"$error":"#N/A"}]
["DCT Industrial Trust","S.US.DCT",null,null,{"$error":"#N/A"}]
["Deckers Outdoor Corp","S.US.DECK",null,null,{"$error":"#N/A"}]
["Deere & Company","S.US.DE",null,null,{"$error":"#N/A"}]
["Deluxe Corporation","S.US.DLX",null,null,{"$error":"#N/A"}]
["Devon Energy Corp","S.US.DVN",null,null,{"$error":"#N/A"}]
["Dicks Sporting Goods Inc.","S.US.DKS",null,null,{"$error":"#N/A"}]
["Digital Realty","S.US.DLR",null,null,{"$error":"#N/A"}]
["Discover Financial Services","S.US.DFS",null,null,{"$error":"#N/A"}]
["Discovery Holding Channel Common A","S.US.DISCA",null,null,{"$error":"#N/A"}]
["Discovery Communications Inc.","S.US.DISCK",null,null,{"$error":"#N/A"}]
["DISH Network Corp.","S.US.DISH",null,null,{"$error":"#N/A"}]
["Dollar General Corporation","S.US.DG",null,null,{"$error":"#N/A"}]
["Dollar Tree Stores","S.US.DLTR",null,null,{"$error":"#N/A"}]
["Dominion Resources Inc New","S.US.D",null,null,{"$error":"#N/A"}]
["Dominos Pizza, Inc.","S.US.DPZ",null,null,{"$error":"#N/A"}]
["Donaldson Company Inc","S.US.DCI",null,null,{"$error":"#N/A"}]
["Douglas Emmett, Inc.","S.US.DEI",null,null,{"$error":"#N/A"}]
["Dr Pepper Snapple Group, Inc","S.US.DPS",null,null,{"$error":"#N/A"}]
["Duke Realty Corp","S.US.DRE",null,null,{"$error":"#N/A"}]
["Dun & Bradstreet Corp","S.US.DNB",null,null,{"$error":"#N/A"}]
["Dunkin' Brands Group, Inc.","S.US.DNKN",null,null,{"$error":"#N/A"}]
["DXC Technology Company","S.US.DXC",null,null,{"$error":"#N/A"}]
["Dycom Industries Inc","S.US.DY",null,null,{"$error":"#N/A"}]
["E.I. du Pont de Nemours and Co. (DuPont)","S.US.DD",null,null,{"$error":"#N/A"}]
["E*Trade Financial Corp","S.US.ETFC",null,null,{"$error":"#N/A"}]
["Eagle Materials Inc","S.US.EXP",null,null,{"$error":"#N/A"}]
["East West Bancorp","S.US.EWBC",null,null,{"$error":"#N/A"}]
["Eaton Vance Corp","S.US.EV",null,null,{"$error":"#N/A"}]
["eBay Inc","S.US.EBAY",null,null,{"$error":"#N/A"}]
["Ecolab Inc","S.US.ECL",null,null,{"$error":"#N/A"}]
["Education Realty Trust Inc","S.US.EDR",null,null,{"$error":"#N/A"}]
["Edwards LifeSciences","S.US.EW",null,null,{"$error":"#N/A"}]
["Electronic Arts","S.US.EA",null,null,{"$error":"#N/A"}]
["Lilly (Eli) & Company","S.US.LLY",null,null,{"$error":"#N/A"}]
["EMCOR Group","S.US.EME",null,null,{"$error":"#N/A"}]
["Emerson Electric Co","S.US.EMR",null,null,{"$error":"#N/A"}]
["Energen Corp","S.US.EGN",null,null,{"$error":"#N/A"}]
["Energizer Holdings, Inc.","S.US.ENR",null,null,{"$error":"#N/A"}]
["Enersys","S.US.ENS",null,null,{"$error":"#N/A"}]
["Envision Healthcare Corporation","S.US.EVHC",null,null,{"$error":"#N/A"}]
["EOG Resources","S.US.EOG",null,null,{"$error":"#N/A"}]
["EPR Properties","S.US.EPR",null,null,{"$error":"#N/A"}]
["EQT Corp","S.US.EQT",null,null,{"$error":"#N/A"}]
["Equifax Inc","S.US.EFX",null,null,{"$error":"#N/A"}]
["Equinix Inc","S.US.EQIX",null,null,{"$error":"#N/A"}]
["Equity Residential Properties Trust","S.US.EQR",null,null,{"$error":"#N/A"}]
["Essex Property Trust Inc","S.US.ESS",null,null,{"$error":"#N/A"}]
["Estee Lauder Companies","S.US.EL",null,null,{"$error":"#N/A"}]
["Expedia Inc","S.US.EXPE",null,null,{"$error":"#N/A"}]
["Expeditors Intl of WA Inc","S.US.EXPD",null,null,{"$error":"#N/A"}]
["Extra Space Storage Inc","S.US.EXR",null,null,{"$error":"#N/A"}]
["F5 Networks Inc","S.US.FFIV",null,null,{"$error":"#N/A"}]
["Facebook, Inc.","S.US.FB",null,null,{"$error":"#N/A"}]
["Factet Research","S.US.FDS",null,null,{"$error":"#N/A"}]
["Fair Isaac Inc","S.US.FICO",null,null,{"$error":"#N/A"}]
["Fastenal Co","S.US.FAST",null,null,{"$error":"#N/A"}]
["Federal Realty Invstmt Trst","S.US.FRT",null,null,{"$error":"#N/A"}]
["Federated Investors Inc ClB","S.US.FII",null,null,{"$error":"#N/A"}]
["FedEx Corp","S.US.FDX",null,null,{"$error":"#N/A"}]
["Fidelity National Info Services","S.US.FIS",null,null,{"$error":"#N/A"}]
["First Tennessee Nat Corp","S.US.FHN",null,null,{"$error":"#N/A"}]
["First Industrial Reality Trust Inc","S.US.FR",null,null,{"$error":"#N/A"}]
["FISERV Inc","S.US.FISV",null,null,{"$error":"#N/A"}]
["FLIR Systems Inc","S.US.FLIR",null,null,{"$error":"#N/A"}]
["FMC Corporation","S.US.FMC",null,null,{"$error":"#N/A"}]
["Foot Locker Inc","S.US.FL",null,null,{"$error":"#N/A"}]
["Fortinet, Inc.","S.US.FTNT",null,null,{"$error":"#N/A"}]
["Fortive Corporation","S.US.FTV",null,null,{"$error":"#N/A"}]
["Fortune Brands Home & Security, Inc.","S.US.FBHS",null,null,{"$error":"#N/A"}]
["Freeport-McMoRan Inc.","S.US.FCX",null,null,{"$error":"#N/A"}]
["Fulton Financial Corporation","S.US.FULT",null,null,{"$error":"#N/A"}]
["Garmin Ltd","S.US.GRMN",null,null,{"$error":"#N/A"}]
["Gartner Group","S.US.IT",null,null,{"$error":"#N/A"}]
["GATX Corporation","S.US.GATX",null,null,{"$error":"#N/A"}]
["General Dynamics Corp","S.US.GD",null,null,{"$error":"#N/A"}]
["General Electric Co","S.US.GE",null,null,{"$error":"#N/A"}]
["General Mills Inc","S.US.GIS",null,null,{"$error":"#N/A"}]
["Genesee/Wyoming Inc","S.US.GWR",null,null,{"$error":"#N/A"}]
["Gentex Corporation","S.US.GNTX",null,null,{"$error":"#N/A"}]
["The GEO Group Inc","S.US.GEO",null,null,{"$error":"#N/A"}]
["GGP Inc.","S.US.GGP",null,null,{"$error":"#N/A"}]
["Gilead Sciences Inc","S.US.GILD",null,null,{"$error":"#N/A"}]
["Global Payments","S.US.GPN",null,null,{"$error":"#N/A"}]
["Globus Medical, Inc.","S.US.GMED",null,null,{"$error":"#N/A"}]
["Graco Inc","S.US.GGG",null,null,{"$error":"#N/A"}]
["Granite Constr Inc","S.US.GVA",null,null,{"$error":"#N/A"}]
["Gulfport Energy","S.US.GPOR",null,null,{"$error":"#N/A"}]
["Halliburton Company","S.US.HAL",null,null,{"$error":"#N/A"}]
["Hanesbrands, Inc","S.US.HBI",null,null,{"$error":"#N/A"}]
["Harley-Davidson Inc","S.US.HOG",null,null,{"$error":"#N/A"}]
["Harris Corporation","S.US.HRS",null,null,{"$error":"#N/A"}]
["Hasbro Inc","S.US.HAS",null,null,{"$error":"#N/A"}]
["HCA Holdings Inc.","S.US.HCA",null,null,{"$error":"#N/A"}]
["Healthcare Realty Trust","S.US.HR",null,null,{"$error":"#N/A"}]
["HealthSouth Corporation","S.US.HLS",null,null,{"$error":"#N/A"}]
["Hershey Foods Corp","S.US.HSY",null,null,{"$error":"#N/A"}]
["Highwoods Properties Inc","S.US.HIW",null,null,{"$error":"#N/A"}]
["Hill Rom Holdings Inc","S.US.HRC",null,null,{"$error":"#N/A"}]
["HNI Corporation","S.US.HNI",null,null,{"$error":"#N/A"}]
["Hologic Inc","S.US.HOLX",null,null,{"$error":"#N/A"}]
["Home Depot, Inc.","S.US.HD",null,null,{"$error":"#N/A"}]
["Honeywell Intl","S.US.HON",null,null,{"$error":"#N/A"}]
["Host Hotels & Resorts Inc","S.US.HST",null,null,{"$error":"#N/A"}]
["Hubbell Inc Cls B","S.US.HUBB",null,null,{"$error":"#N/A"}]
["Humana Inc","S.US.HUM",null,null,{"$error":"#N/A"}]
["Huntington Ingalls Industries","S.US.HII",null,null,{"$error":"#N/A"}]
["Idex Corp","S.US.IEX",null,null,{"$error":"#N/A"}]
["IDEXX Laboratories Inc","S.US.IDXX",null,null,{"$error":"#N/A"}]
["Illinois Tools Works Inc","S.US.ITW",null,null,{"$error":"#N/A"}]
["Illumina Inc","S.US.ILMN",null,null,{"$error":"#N/A"}]
["INC Research Holdings, Inc. Class A","S.US.INCR",null,null,{"$error":"#N/A"}]
["Incyte Corporation","S.US.INCY",null,null,{"$error":"#N/A"}]
["Ingersoll-Rand Co","S.US.IR",null,null,{"$error":"#N/A"}]
["Ingredion Incorporated","S.US.INGR",null,null,{"$error":"#N/A"}]
["Integrated Dvc Tech Inc","S.US.IDTI",null,null,{"$error":"#N/A"}]
["Intel Corporation","S.US.INTC",null,null,{"$error":"#N/A"}]
["Intercontinental, Inc.","S.US.ICE",null,null,{"$error":"#N/A"}]
["InterDigital Comms Corp","S.US.IDCC",null,null,{"$error":"#N/A"}]
["Internatl Bancshares Corp","S.US.IBOC",null,null,{"$error":"#N/A"}]
["International Business Machines","S.US.IBM",null,null,{"$error":"#N/A"}]
["Intl Flvrs & Fragrances","S.US.IFF",null,null,{"$error":"#N/A"}]
["Interpublic Grp of Cos","S.US.IPG",null,null,{"$error":"#N/A"}]
["Intuit Corp","S.US.INTU",null,null,{"$error":"#N/A"}]
["Intuitive Surgical Inc","S.US.ISRG",null,null,{"$error":"#N/A"}]
["IPG Photonics Corporation","S.US.IPGP",null,null,{"$error":"#N/A"}]
["Iron Mountain Inc","S.US.IRM",null,null,{"$error":"#N/A"}]
["j2 Global, Inc.","S.US.JCOM",null,null,{"$error":"#N/A"}]
["Jack Henry/Associates Inc","S.US.JKHY",null,null,{"$error":"#N/A"}]
["Jack in the Box, Inc.","S.US.JACK",null,null,{"$error":"#N/A"}]
["Hunt (JB) Transport Svcs","S.US.JBHT",null,null,{"$error":"#N/A"}]
["John Wiley/Sons Inc","S.US.JWA",null,null,{"$error":"#N/A"}]
["Johnson & Johnson","S.US.JNJ",null,null,{"$error":"#N/A"}]
["Juniper Networks, Inc.","S.US.JNPR",null,null,{"$error":"#N/A"}]
["Kate Spade Company","S.US.KATE",null,null,{"$error":"#N/A"}]
["Kellogg Company","S.US.K",null,null,{"$error":"#N/A"}]
["Kennametal Inc","S.US.KMT",null,null,{"$error":"#N/A"}]
["KeyCorp","S.US.KEY",null,null,{"$error":"#N/A"}]
["Keysight Technologies Inc.","S.US.KEYS",null,null,{"$error":"#N/A"}]
["Kilroy Realty Corp","S.US.KRC",null,null,{"$error":"#N/A"}]
["Kimberly-Clark Corp","S.US.KMB",null,null,{"$error":"#N/A"}]
["Kimco Realty Corp","S.US.KIM",null,null,{"$error":"#N/A"}]
["KLA-Tencor","S.US.KLAC",null,null,{"$error":"#N/A"}]
["L Brands, Inc.","S.US.LB",null,null,{"$error":"#N/A"}]
["L3 Technologies, Inc.","S.US.LLL",null,null,{"$error":"#N/A"}]
["Laboratory Corp of Amer","S.US.LH",null,null,{"$error":"#N/A"}]
["LAM Research Corporation","S.US.LRCX",null,null,{"$error":"#N/A"}]
["Lamar Advertising Co","S.US.LAMR",null,null,{"$error":"#N/A"}]
["Lamb Weston Holdings, Inc.","S.US.LW",null,null,{"$error":"#N/A"}]
["Lancaster Colony Corp","S.US.LANC",null,null,{"$error":"#N/A"}]
["Landstar System Inc","S.US.LSTR",null,null,{"$error":"#N/A"}]
["Leggett & Platt Inc","S.US.LEG",null,null,{"$error":"#N/A"}]
["Lennox Internatl","S.US.LII",null,null,{"$error":"#N/A"}]
["Level 3 Comm Inc","S.US.LVLT",null,null,{"$error":"#N/A"}]
["Liberty Property Trust","S.US.LPT",null,null,{"$error":"#N/A"}]
["Lincoln Electric Hldgs Inc","S.US.LECO",null,null,{"$error":"#N/A"}]
["Littelfuse Inc","S.US.LFUS",null,null,{"$error":"#N/A"}]
["Live Nation Entertainment Inc","S.US.LYV",null,null,{"$error":"#N/A"}]
["LKQ Corporation","S.US.LKQ",null,null,{"$error":"#N/A"}]
["Lockheed Martin Corp","S.US.LMT",null,null,{"$error":"#N/A"}]
["LogMein, Inc","S.US.LOGM",null,null,{"$error":"#N/A"}]
["Lowes Companies Inc","S.US.LOW",null,null,{"$error":"#N/A"}]
["Cali Realty Corp","S.US.CLI",null,null,{"$error":"#N/A"}]
["Manhattan Assoc","S.US.MANH",null,null,{"$error":"#N/A"}]
["MarketAxcess Inc","S.US.MKTX",null,null,{"$error":"#N/A"}]
["Marriot International, Inc.","S.US.MAR",null,null,{"$error":"#N/A"}]
["Marsh & McLennan Cos Inc","S.US.MMC",null,null,{"$error":"#N/A"}]
["Martin Marietta Materials Inc","S.US.MLM",null,null,{"$error":"#N/A"}]
["Masco Corporation","S.US.MAS",null,null,{"$error":"#N/A"}]
["Masimo Corporation","S.US.MASI",null,null,{"$error":"#N/A"}]
["Mastercard Inc.","S.US.MA",null,null,{"$error":"#N/A"}]
["Mattel Inc","S.US.MAT",null,null,{"$error":"#N/A"}]
["Maximus","S.US.MMS",null,null,{"$error":"#N/A"}]
["MB Financial Inc","S.US.MBFI",null,null,{"$error":"#N/A"}]
["McCormick & Company Inc","S.US.MKC",null,null,{"$error":"#N/A"}]
["McDonald's Corporation","S.US.MCD",null,null,{"$error":"#N/A"}]
["MDU Resources Group Inc","S.US.MDU",null,null,{"$error":"#N/A"}]
["Mead Johnson Nutrition Co","S.US.MJN",null,null,{"$error":"#N/A"}]
["Mednax Inc","S.US.MD",null,null,{"$error":"#N/A"}]
["Merck & Co Inc","S.US.MRK",null,null,{"$error":"#N/A"}]
["Meredith Corporation","S.US.MDP",null,null,{"$error":"#N/A"}]
["Mettler-Toledo Internatl Inc","S.US.MTD",null,null,{"$error":"#N/A"}]
["Michael Kors Holdings Limited","S.US.KORS",null,null,{"$error":"#N/A"}]
["The Michaels Companies, Inc.","S.US.MIK",null,null,{"$error":"#N/A"}]
["Microchip Technology Inc","S.US.MCHP",null,null,{"$error":"#N/A"}]
["Microsemi Corp","S.US.MSCC",null,null,{"$error":"#N/A"}]
["Microsoft Corporation","S.US.MSFT",null,null,{"$error":"#N/A"}]
["Mid-America Apt Communities Inc","S.US.MAA",null,null,{"$error":"#N/A"}]
["Minerals Technologies Inc","S.US.MTX",null,null,{"$error":"#N/A"}]
["Mohawk Industries Inc","S.US.MHK",null,null,{"$error":"#N/A"}]
["Monolithic Power Systems Inc","S.US.MPWR",null,null,{"$error":"#N/A"}]
["Monsanto Co","S.US.MON",null,null,{"$error":"#N/A"}]
["Monster Beverage Corporation","S.US.MNST",null,null,{"$error":"#N/A"}]
["Moodys Corp","S.US.MCO",null,null,{"$error":"#N/A"}]
["Motorola Solutions, Inc.","S.US.MSI",null,null,{"$error":"#N/A"}]
["MSA Safety Incorporated","S.US.MSA",null,null,{"$error":"#N/A"}]
["MSC Industrial Direct Co Inc","S.US.MSM",null,null,{"$error":"#N/A"}]
["MSCI, Inc.","S.US.MSCI",null,null,{"$error":"#N/A"}]
["Murphy Oil Corp","S.US.MUR",null,null,{"$error":"#N/A"}]
["Nasdaq, Inc.","S.US.NDAQ",null,null,{"$error":"#N/A"}]
["National Fuel Gas Co","S.US.NFG",null,null,{"$error":"#N/A"}]
["Natl Instruments Corp","S.US.NATI",null,null,{"$error":"#N/A"}]
["National Retail Properties","S.US.NNN",null,null,{"$error":"#N/A"}]
["NCR Corp","S.US.NCR",null,null,{"$error":"#N/A"}]
["NetApp inc.","S.US.NTAP",null,null,{"$error":"#N/A"}]
["Netflix Inc","S.US.NFLX",null,null,{"$error":"#N/A"}]
["Newell Brands Inc.","S.US.NWL",null,null,{"$error":"#N/A"}]
["Newfield Exploration Co","S.US.NFX",null,null,{"$error":"#N/A"}]
["Newmarket Corporation Holding Company","S.US.NEU",null,null,{"$error":"#N/A"}]
["Newmont Mining Corp Hldg Co","S.US.NEM",null,null,{"$error":"#N/A"}]
["Nextera Energy, Inc.","S.US.NEE",null,null,{"$error":"#N/A"}]
["Nielsen N.V.","S.US.NLSN",null,null,{"$error":"#N/A"}]
["NIKE Inc ClsB","S.US.NKE",null,null,{"$error":"#N/A"}]
["Noble Energy Inc","S.US.NBL",null,null,{"$error":"#N/A"}]
["Nordson Corporation","S.US.NDSN",null,null,{"$error":"#N/A"}]
["Northern Trust Corp","S.US.NTRS",null,null,{"$error":"#N/A"}]
["Northrop Grumman Corporation","S.US.NOC",null,null,{"$error":"#N/A"}]
["Nu Skin Asia Pacific Inc","S.US.NUS",null,null,{"$error":"#N/A"}]
["Nucor Corp","S.US.NUE",null,null,{"$error":"#N/A"}]
["NuVasive Inc","S.US.NUVA",null,null,{"$error":"#N/A"}]
["NVIDIA Corp","S.US.NVDA",null,null,{"$error":"#N/A"}]
["NVR Inc","S.US.NVR",null,null,{"$error":"#N/A"}]
["Occidental Petroleum","S.US.OXY",null,null,{"$error":"#N/A"}]
["Old Dominion Freight Line Inc","S.US.ODFL",null,null,{"$error":"#N/A"}]
["Omnicom Group Inc","S.US.OMC",null,null,{"$error":"#N/A"}]
["ONEOK Inc New","S.US.OKE",null,null,{"$error":"#N/A"}]
["Oracle Corporation","S.US.ORCL",null,null,{"$error":"#N/A"}]
["OReilly Automotive Inc","S.US.ORLY",null,null,{"$error":"#N/A"}]
["Oshkosh Truck Corp","S.US.OSK",null,null,{"$error":"#N/A"}]
["PACCAR Inc","S.US.PCAR",null,null,{"$error":"#N/A"}]
["Packaging Corp of America","S.US.PKG",null,null,{"$error":"#N/A"}]
["Panera Bread Co ClA","S.US.PNRA",null,null,{"$error":"#N/A"}]
["Papa Johns Internatl Inc","S.US.PZZA",null,null,{"$error":"#N/A"}]
["PAREXEL Intl Corp","S.US.PRXL",null,null,{"$error":"#N/A"}]
["Parker-Hannifin Corp","S.US.PH",null,null,{"$error":"#N/A"}]
["Patterson-UTI Energy Inc","S.US.PTEN",null,null,{"$error":"#N/A"}]
["Paychex Inc","S.US.PAYX",null,null,{"$error":"#N/A"}]
["PayPal Holdings, Inc.","S.US.PYPL",null,null,{"$error":"#N/A"}]
["PepsiCo Inc","S.US.PEP",null,null,{"$error":"#N/A"}]
["Pfizer Inc","S.US.PFE",null,null,{"$error":"#N/A"}]
["Philip Morris International","S.US.PM",null,null,{"$error":"#N/A"}]
["Pioneer Natural Resources","S.US.PXD",null,null,{"$error":"#N/A"}]
["Plantronics Inc","S.US.PLT",null,null,{"$error":"#N/A"}]
["Polaris Indutries Inc.","S.US.PII",null,null,{"$error":"#N/A"}]
["Pool Corporation","S.US.POOL",null,null,{"$error":"#N/A"}]
["Post Holdings, Inc.","S.US.POST",null,null,{"$error":"#N/A"}]
["Potlatch Corp","S.US.PCH",null,null,{"$error":"#N/A"}]
["PPG Industries Inc","S.US.PPG",null,null,{"$error":"#N/A"}]
["Praxair Inc","S.US.PX",null,null,{"$error":"#N/A"}]
["Prestige Brands Holding Inc","S.US.PBH",null,null,{"$error":"#N/A"}]
["Primerica, Inc.","S.US.PRI",null,null,{"$error":"#N/A"}]
["PrivateBancorp Inc","S.US.PVTB",null,null,{"$error":"#N/A"}]
["Procter & Gamble Co","S.US.PG",null,null,{"$error":"#N/A"}]
["Prologis, Inc","S.US.PLD",null,null,{"$error":"#N/A"}]
["PTC Inc","S.US.PTC",null,null,{"$error":"#N/A"}]
["Public Storage Inc","S.US.PSA",null,null,{"$error":"#N/A"}]
["QEP Resources, Inc.","S.US.QEP",null,null,{"$error":"#N/A"}]
["QUALCOMM Inc","S.US.QCOM",null,null,{"$error":"#N/A"}]
["Quanta Services Inc","S.US.PWR",null,null,{"$error":"#N/A"}]
["Quest Diagnostics Inc","S.US.DGX",null,null,{"$error":"#N/A"}]
["Range Resources Corp","S.US.RRC",null,null,{"$error":"#N/A"}]
["Raymond James Fincl Inc","S.US.RJF",null,null,{"$error":"#N/A"}]
["Rayonier Inc Reit","S.US.RYN",null,null,{"$error":"#N/A"}]
["Raytheon Company","S.US.RTN",null,null,{"$error":"#N/A"}]
["Realty Income Corp","S.US.O",null,null,{"$error":"#N/A"}]
["Red Hat Inc","S.US.RHT",null,null,{"$error":"#N/A"}]
["Regency Realty Corp","S.US.REG",null,null,{"$error":"#N/A"}]
["Regeneron Pharm Inc","S.US.REGN",null,null,{"$error":"#N/A"}]
["Republic Services Inc ClA","S.US.RSG",null,null,{"$error":"#N/A"}]
["Resmed Inc","S.US.RMD",null,null,{"$error":"#N/A"}]
["Reynolds American Inc.","S.US.RAI",null,null,{"$error":"#N/A"}]
["Rockwell Automation Inc","S.US.ROK",null,null,{"$error":"#N/A"}]
["Rockwell Collins","S.US.COL",null,null,{"$error":"#N/A"}]
["Rollins Inc","S.US.ROL",null,null,{"$error":"#N/A"}]
["Roper Technologies, Inc.","S.US.ROP",null,null,{"$error":"#N/A"}]
["Ross Stores Inc","S.US.ROST",null,null,{"$error":"#N/A"}]
["Royal Carribean Cruises Ltd","S.US.RCL",null,null,{"$error":"#N/A"}]
["Royal Gold Inc","S.US.RGLD",null,null,{"$error":"#N/A"}]
["RPM Inc","S.US.RPM",null,null,{"$error":"#N/A"}]
["S&P Global Inc.","S.US.SPGI",null,null,{"$error":"#N/A"}]
["Sabre Corporation","S.US.SABR",null,null,{"$error":"#N/A"}]
["Salesforce.com Inc","S.US.CRM",null,null,{"$error":"#N/A"}]
["Sally Beauty Holdings, Inc","S.US.SBH",null,null,{"$error":"#N/A"}]
["Schlumberger Limited","S.US.SLB",null,null,{"$error":"#N/A"}]
["Science Applications International Corporation","S.US.SAIC",null,null,{"$error":"#N/A"}]
["Scotts Co (The)","S.US.SMG",null,null,{"$error":"#N/A"}]
["Scripps Network Interactive Inc","S.US.SNI",null,null,{"$error":"#N/A"}]
["Sealed Air Corp New","S.US.SEE",null,null,{"$error":"#N/A"}]
["SEI Investments Co","S.US.SEIC",null,null,{"$error":"#N/A"}]
["Sensient Tech Corp","S.US.SXT",null,null,{"$error":"#N/A"}]
["Service Corporation Intl","S.US.SCI",null,null,{"$error":"#N/A"}]
["Sherwin-Williams Co","S.US.SHW",null,null,{"$error":"#N/A"}]
["Signature Bank","S.US.SBNY",null,null,{"$error":"#N/A"}]
["Silicon Laboratories","S.US.SLAB",null,null,{"$error":"#N/A"}]
["Simon Property Grp","S.US.SPG",null,null,{"$error":"#N/A"}]
["Skechers USA Inc","S.US.SKX",null,null,{"$error":"#N/A"}]
["Skyworks Solutions Inc","S.US.SWKS",null,null,{"$error":"#N/A"}]
["SLM Corporation","S.US.SLM",null,null,{"$error":"#N/A"}]
["SM Energy Company","S.US.SM",null,null,{"$error":"#N/A"}]
["Snap-On Tools Corp","S.US.SNA",null,null,{"$error":"#N/A"}]
["Sonoco Products Co","S.US.SON",null,null,{"$error":"#N/A"}]
["Sothebys Holdings Inc","S.US.BID",null,null,{"$error":"#N/A"}]
["Southwest Airlines Co","S.US.LUV",null,null,{"$error":"#N/A"}]
["Southwest Gas Holdings, Inc.","S.US.SWX",null,null,{"$error":"#N/A"}]
["SOUTHWESTERN ENERGY CO","S.US.SWN",null,null,{"$error":"#N/A"}]
["Sprouts Farmers Market, Inc.","S.US.SFM",null,null,{"$error":"#N/A"}]
["Stanley Black and Decker Inc","S.US.SWK",null,null,{"$error":"#N/A"}]
["Starbucks Corp","S.US.SBUX",null,null,{"$error":"#N/A"}]
["Steel Dynamics Inc","S.US.STLD",null,null,{"$error":"#N/A"}]
["Stryker Corp","S.US.SYK",null,null,{"$error":"#N/A"}]
["Superior Energy Services Inc","S.US.SPN",null,null,{"$error":"#N/A"}]
["SVB Financial Group","S.US.SIVB",null,null,{"$error":"#N/A"}]
["Symantec Corp","S.US.SYMC",null,null,{"$error":"#N/A"}]
["Synopsis","S.US.SNPS",null,null,{"$error":"#N/A"}]
["Synovous Fin Corp","S.US.SNV",null,null,{"$error":"#N/A"}]
["Sysco Corp","S.US.SYY",null,null,{"$error":"#N/A"}]
["T Rowe Price Group Inc","S.US.TROW",null,null,{"$error":"#N/A"}]
["Take-Two Interactive Software","S.US.TTWO",null,null,{"$error":"#N/A"}]
["Tanger Factory Outlet Centers, Inc.","S.US.SKT",null,null,{"$error":"#N/A"}]
["Taubman Centers Inc","S.US.TCO",null,null,{"$error":"#N/A"}]
["TE Connectivity Ltd.","S.US.TEL",null,null,{"$error":"#N/A"}]
["Teledyne Technologies Inc","S.US.TDY",null,null,{"$error":"#N/A"}]
["Teleflex Inc","S.US.TFX",null,null,{"$error":"#N/A"}]
["Tempur Pedic International, Inc.","S.US.TPX",null,null,{"$error":"#N/A"}]
["Teradyne Inc","S.US.TER",null,null,{"$error":"#N/A"}]
["Texas Capital Bancshares Inc","S.US.TCBI",null,null,{"$error":"#N/A"}]
["Texas Instruments Inc","S.US.TXN",null,null,{"$error":"#N/A"}]
["Texas Roadhouse, Inc.","S.US.TXRH",null,null,{"$error":"#N/A"}]
["The Priceline Group Inc.","S.US.PCLN",null,null,{"$error":"#N/A"}]
["Thermo Electron Corp","S.US.TMO",null,null,{"$error":"#N/A"}]
["THOR INDUSTRIES INC","S.US.THO",null,null,{"$error":"#N/A"}]
["Tiffany & Co","S.US.TIF",null,null,{"$error":"#N/A"}]
["Time Warner Inc","S.US.TWX",null,null,{"$error":"#N/A"}]
["TJX Companies Inc","S.US.TJX",null,null,{"$error":"#N/A"}]
["Tootsie Roll Industries Inc","S.US.TR",null,null,{"$error":"#N/A"}]
["The Toro Company","S.US.TTC",null,null,{"$error":"#N/A"}]
["Total Systems Services Inc","S.US.TSS",null,null,{"$error":"#N/A"}]
["Tractor Supply Co","S.US.TSCO",null,null,{"$error":"#N/A"}]
["TransDigm Group","S.US.TDG",null,null,{"$error":"#N/A"}]
["Trimble Inc.","S.US.TRMB",null,null,{"$error":"#N/A"}]
["TripAdvisor, Inc.","S.US.TRIP",null,null,{"$error":"#N/A"}]
["Trustmark Corporation","S.US.TRMK",null,null,{"$error":"#N/A"}]
["Tupperware Brands Corp","S.US.TUP",null,null,{"$error":"#N/A"}]
["Twenty-First Century Fox, Inc. Class A","S.US.FOXA",null,null,{"$error":"#N/A"}]
["Twenty-First Century Fox, Inc. Class B","S.US.FOX",null,null,{"$error":"#N/A"}]
["TYLER TECHNOLOGIES INC","S.US.TYL",null,null,{"$error":"#N/A"}]
["United Dominion Realty Trust","S.US.UDR",null,null,{"$error":"#N/A"}]
["Ulta Salon Cosmetics & Fragrance Inc","S.US.ULTA",null,null,{"$error":"#N/A"}]
["The Ultimate Software Grp","S.US.ULTI",null,null,{"$error":"#N/A"}]
["UMB Financial Corp","S.US.UMBF",null,null,{"$error":"#N/A"}]
["Under Armour Inc Class A","S.US.UAA",null,null,{"$error":"#N/A"}]
["Under Armour Inc","S.US.UA",null,null,{"$error":"#N/A"}]
["Union Pacific Corp","S.US.UNP",null,null,{"$error":"#N/A"}]
["United Bankshares","S.US.UBSI",null,null,{"$error":"#N/A"}]
["UAL Continental Holdings, Inc.","S.US.UAL",null,null,{"$error":"#N/A"}]
["United Parcel Svc","S.US.UPS",null,null,{"$error":"#N/A"}]
["United Rentals Inc","S.US.URI",null,null,{"$error":"#N/A"}]
["United Therapeutics Corp","S.US.UTHR",null,null,{"$error":"#N/A"}]
["United Health Group Inc","S.US.UNH",null,null,{"$error":"#N/A"}]
["Uniti Group Inc.","S.US.UNIT",null,null,{"$error":"#N/A"}]
["Universal Health Svcs ClsB","S.US.UHS",null,null,{"$error":"#N/A"}]
["Urban Edge Properties","S.US.UE",null,null,{"$error":"#N/A"}]
["Urban Outfitters Inc","S.US.URBN",null,null,{"$error":"#N/A"}]
["U S Bancorp","S.US.USB",null,null,{"$error":"#N/A"}]
["United States Steel Corporation","S.US.X",null,null,{"$error":"#N/A"}]
["ProShares Ultra Semiconductors","S.US.USD",null,null,{"$error":"#N/A"}]
["Valmont Industries Inc","S.US.VMI",null,null,{"$error":"#N/A"}]
["Valspar Corp (The)","S.US.VAL",null,null,{"$error":"#N/A"}]
["Varian Medical Systems Inc","S.US.VAR",null,null,{"$error":"#N/A"}]
["VCA Inc.","S.US.WOOF",null,null,{"$error":"#N/A"}]
["Ventas Inc","S.US.VTR",null,null,{"$error":"#N/A"}]
["Verisign Inc","S.US.VRSN",null,null,{"$error":"#N/A"}]
["Verisk Analytics, Inc.","S.US.VRSK",null,null,{"$error":"#N/A"}]
["Verizon Communications","S.US.VZ",null,null,{"$error":"#N/A"}]
["Versum Materials Inc.","S.US.VSM",null,null,{"$error":"#N/A"}]
["Vertex Pharmaceuticals Incorporated","S.US.VRTX",null,null,{"$error":"#N/A"}]
["ViaSat","S.US.VSAT",null,null,{"$error":"#N/A"}]
["Visa Inc.","S.US.V",null,null,{"$error":"#N/A"}]
["Vornado Realty Trust","S.US.VNO",null,null,{"$error":"#N/A"}]
["Vulcan Material Co","S.US.VMC",null,null,{"$error":"#N/A"}]
["Disney (Walt) Company","S.US.DIS",null,null,{"$error":"#N/A"}]
["Washington Federal, Inc.","S.US.WAFD",null,null,{"$error":"#N/A"}]
["Waste Mgmt Inc New","S.US.WM",null,null,{"$error":"#N/A"}]
["Waters Corporation","S.US.WAT",null,null,{"$error":"#N/A"}]
["Watsco Inc","S.US.WSO",null,null,{"$error":"#N/A"}]
["WebMD Health Corp","S.US.WBMD",null,null,{"$error":"#N/A"}]
["Webster Financial Corp","S.US.WBS",null,null,{"$error":"#N/A"}]
["Wisconsin Energy Corp","S.US.WEC",null,null,{"$error":"#N/A"}]
["Weingarten Realty Investors","S.US.WRI",null,null,{"$error":"#N/A"}]
["Wellcare Group Inc","S.US.WCG",null,null,{"$error":"#N/A"}]
["Welltower Inc.","S.US.HCN",null,null,{"$error":"#N/A"}]
["The Wendy's Company","S.US.WEN",null,null,{"$error":"#N/A"}]
["West Pharmaceuticals Svcs Inc","S.US.WST",null,null,{"$error":"#N/A"}]
["Westar Energy Inc","S.US.WR",null,null,{"$error":"#N/A"}]
["The Western Union Company","S.US.WU",null,null,{"$error":"#N/A"}]
["Westinghouse Air Brake Co","S.US.WAB",null,null,{"$error":"#N/A"}]
["WEX Inc","S.US.WEX",null,null,{"$error":"#N/A"}]
["Washington Gas Light Co","S.US.WGL",null,null,{"$error":"#N/A"}]
["Williams Companies Inc","S.US.WMB",null,null,{"$error":"#N/A"}]
["Woodward, Inc.","S.US.WWD",null,null,{"$error":"#N/A"}]
["Worthington Industries Inc","S.US.WOR",null,null,{"$error":"#N/A"}]
["WPX Energy, Inc.","S.US.WPX",null,null,{"$error":"#N/A"}]
["Grainger (WW) Inc","S.US.GWW",null,null,{"$error":"#N/A"}]
["Wyndham Worldwide Corp","S.US.WYN",null,null,{"$error":"#N/A"}]
["Wynn Resorts Ltd","S.US.WYNN",null,null,{"$error":"#N/A"}]
["Xilinx Inc","S.US.XLNX",null,null,{"$error":"#N/A"}]
["Xylem, Inc.","S.US.XYL",null,null,{"$error":"#N/A"}]
["Yum Brands Inc","S.US.YUM",null,null,{"$error":"#N/A"}]
["Zebra Technologies Corp","S.US.ZBRA",null,null,{"$error":"#N/A"}]
["Zimmer Biomet Holdings, Inc","S.US.ZBH",null,null,{"$error":"#N/A"}]
["Zoetis Inc","S.US.ZTS",null,null,{"$error":"#N/A"}]

{"sheet":"IUSG","index":2,"n_rows":3043,"n_cols":28,"rows_kept":3043,"cut":false,"hidden":true,"merged":[]}
[null,{"$f":"IF(D1>=0,1,)","v":1},"S.US.DDD",{"$f":"IFERROR(RTD(\"cqg.rtd\", ,\"ContractData\",C1, \"PerCentNetLastTrade\",, \"T\")/100,\"\")","v":4.11522633744856E-3},55,{"$f":"IFERROR(E1,\"\")","v":55},{"$f":"C1","v":"S.US.DDD"},1,{"$f":"IFERROR(VLOOKUP(H1,$F$1:$G$564,2,FALSE),\"\")","v":"S.US.NWL"},{"$f":"IFERROR(RTD(\"cqg.rtd\", ,\"ContractData\",I1, \"PerCentNetLastTrade\",, \"T\")/100,\"\")","v":0.13645182151325716},null,{"$f":"MIN(D1:D564)","v":-6.1107359891964891E-2},{"$f":"VLOOKUP(L1,D1:G564,3,FALSE)","v":564},{"$f":"VLOOKUP(M1,$H$1:$I$564,2,FALSE)","v":"S.US.CAR"},{"$f":"IFERROR(RTD(\"cqg.rtd\", ,\"ContractData\",N1, \"PerCentNetLastTrade\",, \"T\")/100,\"\")","v":-6.1107359891964891E-2},null,{"$f":"\"https://finance.yahoo.com/quote/\"&RIGHT(I1,(LEN(I1)-5))","v":"https://finance.yahoo.com/quote/NWL"},null,{"$f":"RTD(\"cqg.rtd\", ,\"ContractData\",I1, \"LongDescription\",, \"T\")","v":"Newell Brands Inc."},null,null,{"$f":"N15","v":"S.US.KMT"},{"$f":"RTD(\"cqg.rtd\", ,\"ContractData\",V1, \"LongDescription\",, \"T\")","v":"Kennametal Inc"},null,null,{"$f":"IFERROR(RTD(\"cqg.rtd\", ,\"ContractData\",V1, \"PerCentNetLastTrade\",, \"T\")/100,\"\")","v":-1.8943170488534399E-2},{"$f":"Z1*-1","v":1.8943170488534399E-2},{"$f":"\"https://finance.yahoo.com/quote/\"&RIGHT(V1,(LEN(V1)-5))","v":"https://finance.yahoo.com/quote/KMT"}]
[null,{"$f":"IF(D2>=0,1,)","v":0},"S.US.MMM",{"$f":"IFERROR(RTD(\"cqg.rtd\", ,\"ContractData\",C2, \"PerCentNetLastTrade\",, \"T\")/100,\"\")","v":-3.1093279839518556E-3},272,{"$f":"IFERROR(E2,\"\")","v":272},{"$f":"C2","v":"S.US.MMM"},{"$f":"H1+1","v":2},"S.US.KATE",{"$f":"IFERROR(RTD(\"cqg.rtd\", ,\"ContractData\",I2, \"PerCentNetLastTrade\",, \"T\")/100,\"\")","v":8.1909251620506773E-2},null,null,{"$f":"M1-1","v":563},"S.US.LOGM",{"$f":"IFERROR(RTD(\"cqg.rtd\", ,\"ContractData\",N2, \"PerCentNetLastTrade\",, \"T\")/100,\"\")","v":-3.8445638693675073E-2},null,{"$f":"\"https://finance.yahoo.com/quote/\"&RIGHT(I2,(LEN(I2)-5))","v":"https://finance.yahoo.com/quote/KATE"},null,{"$f":"RTD(\"cqg.rtd\", ,\"ContractData\",I2, \"LongDescription\",, \"T\")","v":"Kate Spade Company"},null,null,{"$f":"N14","v":"S.US.MTX"},{"$f":"RTD(\"cqg.rtd\", ,\"ContractData\",V2, \"LongDescription\",, \"T\")","v":"Minerals Technologies Inc"},null,null,{"$f":"IFERROR(RTD(\"cqg.rtd\", ,\"ContractData\",V2, \"PerCentNetLastTrade\",, \"T\")/100,\"\")","v":-1.9292604501607719E-2},{"$f":"Z2*-1","v":1.9292604501607719E-2},{"$f":"\"https://finance.yahoo.com/quote/\"&RIGHT(V2,(LEN(V2)-5))","v":"https://finance.yahoo.com/quote/MTX"}]
[null,0,"S.US.AOS",{"$f":"IFERROR(RTD(\"cqg.rtd\", ,\"ContractData\",C3, \"PerCentNetLastTrade\",, \"T\")/100,\"\")","v":-5.9642147117296221E-3},381,381,"S.US.AOS",{"$f":"H2+1","v":3},"S.US.COH",{"$f":"IFERROR(RTD(\"cqg.rtd\", ,\"ContractData\",I3, \"PerCentNetLastTrade\",, \"T\")/100,\"\")","v":5.8837318330989215E-2},null,null,{"$f":"M2-1","v":562},"S.US.MIK",{"$f":"IFERROR(RTD(\"cqg.rtd\", ,\"ContractData\",N3, \"PerCentNetLastTrade\",, \"T\")/100,\"\")","v":-3.2430031097290091E-2},null,"https://finance.yahoo.com/quote/COH",null,{"$f":"RTD(\"cqg.rtd\", ,\"ContractData\",I3, \"LongDescription\",, \"T\")","v":"COACH INC"},null,null,{"$f":"N13","v":"S.US.TFX"},{"$f":"RTD(\"cqg.rtd\", ,\"ContractData\",V3, \"LongDescription\",, \"T\")","v":"Teleflex Inc"},null,null,{"$f":"IFERROR(RTD(\"cqg.rtd\", ,\"ContractData\",V3, \"PerCentNetLastTrade\",, \"T\")/100,\"\")","v":-2.0115803134671061E-2},2.0115803134671061E-2,"https://finance.yahoo.com/quote/TFX"]
[null,0,"S.US.ABBV",{"$f":"IFERROR(RTD(\"cqg.rtd\", ,\"ContractData\",C4, \"PerCentNetLastTrade\",, \"T\")/100,\"\")","v":-7.7623525899387967E-3},423,423,"S.US.ABBV",4,"S.US.VAR",{"$f":"IFERROR(RTD(\"cqg.rtd\", ,\"ContractData\",I4, \"PerCentNetLastTrade\",, \"T\")/100,\"\")","v":4.1463149896884835E-2},null,null,561,"S.US.CHTR",{"$f":"IFERROR(RTD(\"cqg.rtd\", ,\"ContractData\",N4, \"PerCentNetLastTrade\",, \"T\")/100,\"\")","v":-2.8824899934285206E-2},null,"https://finance.yahoo.com/quote/VAR",null,{"$f":"RTD(\"cqg.rtd\", ,\"ContractData\",I4, \"LongDescription\",, \"T\")","v":"Varian Medical Systems Inc"},null,null,{"$f":"N12","v":"S.US.GVA"},{"$f":"RTD(\"cqg.rtd\", ,\"ContractData\",V4, \"LongDescription\",, \"T\")","v":"Granite Constr Inc"},null,null,{"$f":"IFERROR(RTD(\"cqg.rtd\", ,\"ContractData\",V4, \"PerCentNetLastTrade\",, \"T\")/100,\"\")","v":-2.0315169925954054E-2},2.0315169925954054E-2,"https://finance.yahoo.com/quote/GVA"]
[null,0,"S.US.ABMD",{"$f":"IFERROR(RTD(\"cqg.rtd\", ,\"ContractData\",C5, \"PerCentNetLastTrade\",, \"T\")/100,\"\")","v":-1.1726678192888822E-2},490,490,"S.US.ABMD",5,"S.US.URI",{"$f":"IFERROR(RTD(\"cqg.rtd\", ,\"ContractData\",I5, \"PerCentNetLastTrade\",, \"T\")/100,\"\")","v":2.43208516886931E-2},null,null,560,"S.US.INCY",{"$f":"IFERROR(RTD(\"cqg.rtd\", ,\"ContractData\",N5, \"PerCentNetLastTrade\",, \"T\")/100,\"\")","v":-2.802058655338616E-2},null,"https://finance.yahoo.com/quote/URI",null,{"$f":"RTD(\"cqg.rtd\", ,\"ContractData\",I5, \"LongDescription\",, \"T\")","v":"United Rentals Inc"},null,null,{"$f":"N11","v":"S.US.KIM"},{"$f":"RTD(\"cqg.rtd\", ,\"ContractData\",V5, \"LongDescription\",, \"T\")","v":"Kimco Realty Corp"},null,null,{"$f":"IFERROR(RTD(\"cqg.rtd\", ,\"ContractData\",V5, \"PerCentNetLastTrade\",, \"T\")/100,\"\")","v":-2.156469408224674E-2},2.156469408224674E-2,"https://finance.yahoo.com/quote/KIM"]
[null,0,"S.US.ACHC",{"$f":"IFERROR(RTD(\"cqg.rtd\", ,\"ContractData\",C6, \"PerCentNetLastTrade\",, \"T\")/100,\"\")","v":-1.266948210713492E-2},499,499,"S.US.ACHC",6,"S.US.TCBI",{"$f":"IFERROR(RTD(\"cqg.rtd\", ,\"ContractData\",I6, \"PerCentNetLastTrade\",, \"T\")/100,\"\")","v":2.0236530880420499E-2},null,null,559,"S.US.JWA",{"$f":"IFERROR(RTD(\"cqg.rtd\", ,\"ContractData\",N6, \"PerCentNetLastTrade\",, \"T\")/100,\"\")","v":-2.7906976744186046E-2},null,"https://finance.yahoo.com/quote/TCBI",null,{"$f":"RTD(\"cqg.rtd\", ,\"ContractData\",I6, \"LongDescription\",, \"T\")","v":"Texas Capital Bancshares Inc"},null,null,{"$f":"N10","v":"S.US.SKT"},{"$f":"RTD(\"cqg.rtd\", ,\"ContractData\",V6, \"LongDescription\",, \"T\")","v":"Tanger Factory Outlet Centers, Inc."},null,null,{"$f":"IFERROR(RTD(\"cqg.rtd\", ,\"ContractData\",V6, \"PerCentNetLastTrade\",, \"T\")/100,\"\")","v":-2.2004889975550123E-2},2.2004889975550123E-2,"https://finance.yahoo.com/quote/SKT"]
[null,0,"S.US.ACN",{"$f":"IFERROR(RTD(\"cqg.rtd\", ,\"ContractData\",C7, \"PerCentNetLastTrade\",, \"T\")/100,\"\")","v":-4.3614219881500989E-3},331,331,"S.US.ACN",7,"S.US.TRIP",{"$f":"IFERROR(RTD(\"cqg.rtd\", ,\"ContractData\",I7, \"PerCentNetLastTrade\",, \"T\")/100,\"\")","v":1.8843404808317088E-2},null,null,558,"S.US.WRI",{"$f":"IFERROR(RTD(\"cqg.rtd\", ,\"ContractData\",N7, \"PerCentNetLastTrade\",, \"T\")/100,\"\")","v":-2.3643528341921797E-2},null,"https://finance.yahoo.com/quote/TRIP",null,{"$f":"RTD(\"cqg.rtd\", ,\"ContractData\",I7, \"LongDescription\",, \"T\")","v":"TripAdvisor, Inc."},null,null,{"$f":"N9","v":"S.US.TCO"},{"$f":"RTD(\"cqg.rtd\", ,\"ContractData\",V7, \"LongDescription\",, \"T\")","v":"Taubman Centers Inc"},null,null,{"$f":"IFERROR(RTD(\"cqg.rtd\", ,\"ContractData\",V7, \"PerCentNetLastTrade\",, \"T\")/100,\"\")","v":-2.2552704690308872E-2},2.2552704690308872E-2,"https://finance.yahoo.com/quote/TCO"]
[null,0,"S.US.ACIW",{"$f":"IFERROR(RTD(\"cqg.rtd\", ,\"ContractData\",C8, \"PerCentNetLastTrade\",, \"T\")/100,\"\")","v":-7.9731430969366343E-3},430,430,"S.US.ACIW",8,"S.US.XLNX",{"$f":"IFERROR(RTD(\"cqg.rtd\", ,\"ContractData\",I8, \"PerCentNetLastTrade\",, \"T\")/100,\"\")","v":1.6406373244991324E-2},null,null,557,"S.US.SLM",{"$f":"IFERROR(RTD(\"cqg.rtd\", ,\"ContractData\",N8, \"PerCentNetLastTrade\",, \"T\")/100,\"\")","v":-2.347024308466052E-2},null,"https://finance.yahoo.com/quote/XLNX",null,{"$f":"RTD(\"cqg.rtd\", ,\"ContractData\",I8, \"LongDescription\",, \"T\")","v":"Xilinx Inc"},null,null,{"$f":"N8","v":"S.US.SLM"},{"$f":"RTD(\"cqg.rtd\", ,\"ContractData\",V8, \"LongDescription\",, \"T\")","v":"SLM Corporation"},null,null,{"$f":"IFERROR(RTD(\"cqg.rtd\", ,\"ContractData\",V8, \"PerCentNetLastTrade\",, \"T\")/100,\"\")","v":-2.347024308466052E-2},2.347024308466052E-2,"https://finance.yahoo.com/quote/SLM"]
[null,0,"S.US.ATVI",{"$f":"IFERROR(RTD(\"cqg.rtd\", ,\"ContractData\",C9, \"PerCentNetLastTrade\",, \"T\")/100,\"\")","v":-7.8023407022106625E-3},427,427,"S.US.ATVI",9,"S.US.LB",{"$f":"IFERROR(RTD(\"cqg.rtd\", ,\"ContractData\",I9, \"PerCentNetLastTrade\",, \"T\")/100,\"\")","v":1.5857478465152702E-2},null,null,556,"S.US.TCO",{"$f":"IFERROR(RTD(\"cqg.rtd\", ,\"ContractData\",N9, \"PerCentNetLastTrade\",, \"T\")/100,\"\")","v":-2.2552704690308872E-2},null,"https://finance.yahoo.com/quote/LB",null,{"$f":"RTD(\"cqg.rtd\", ,\"ContractData\",I9, \"LongDescription\",, \"T\")","v":"L Brands, Inc."},null,null,{"$f":"N7","v":"S.US.WRI"},{"$f":"RTD(\"cqg.rtd\", ,\"ContractData\",V9, \"LongDescription\",, \"T\")","v":"Weingarten Realty Investors"},null,null,{"$f":"IFERROR(RTD(\"cqg.rtd\", ,\"ContractData\",V9, \"PerCentNetLastTrade\",, \"T\")/100,\"\")","v":-2.3643528341921797E-2},2.3643528341921797E-2,"https://finance.yahoo.com/quote/WRI"]
[null,1,"S.US.AYI",{"$f":"IFERROR(RTD(\"cqg.rtd\", ,\"ContractData\",C10, \"PerCentNetLastTrade\",, \"T\")/100,\"\")","v":5.7775377969762421E-3},43,43,"S.US.AYI",10,"S.US.MUR",{"$f":"IFERROR(RTD(\"cqg.rtd\", ,\"ContractData\",I10, \"PerCentNetLastTrade\",, \"T\")/100,\"\")","v":1.4132925897631781E-2},null,null,555,"S.US.SKT",{"$f":"IFERROR(RTD(\"cqg.rtd\", ,\"ContractData\",N10, \"PerCentNetLastTrade\",, \"T\")/100,\"\")","v":-2.2004889975550123E-2},null,"https://finance.yahoo.com/quote/MUR",null,{"$f":"RTD(\"cqg.rtd\", ,\"ContractData\",I10, \"LongDescription\",, \"T\")","v":"Murphy Oil Corp"},null,null,{"$f":"N6","v":"S.US.JWA"},{"$f":"RTD(\"cqg.rtd\", ,\"ContractData\",V10, \"LongDescription\",, \"T\")","v":"John Wiley/Sons Inc"},null,null,{"$f":"IFERROR(RTD(\"cqg.rtd\", ,\"ContractData\",V10, \"PerCentNetLastTrade\",, \"T\")/100,\"\")","v":-2.7906976744186046E-2},2.7906976744186046E-2,"https://finance.yahoo.com/quote/JWA"]
[null,0,"S.US.ACXM",{"$f":"IFERROR(RTD(\"cqg.rtd\", ,\"ContractData\",C11, \"PerCentNetLastTrade\",, \"T\")/100,\"\")","v":-6.9276065119501214E-3},403,403,"S.US.ACXM",11,"S.US.CTSH",{"$f":"IFERROR(RTD(\"cqg.rtd\", ,\"ContractData\",I11, \"PerCentNetLastTrade\",, \"T\")/100,\"\")","v":1.3761467889908256E-2},null,null,554,"S.US.KIM",{"$f":"IFERROR(RTD(\"cqg.rtd\", ,\"ContractData\",N11, \"PerCentNetLastTrade\",, \"T\")/100,\"\")","v":-2.156469408224674E-2},null,"https://finance.yahoo.com/quote/CTSH",null,{"$f":"RTD(\"cqg.rtd\", ,\"ContractData\",I11, \"LongDescription\",, \"T\")","v":"Cognizant Tech Solutions Corp"},null,null,{"$f":"N5","v":"S.US.INCY"},{"$f":"RTD(\"cqg.rtd\", ,\"ContractData\",V11, \"LongDescription\",, \"T\")","v":"Incyte Corporation"},null,null,{"$f":"IFERROR(RTD(\"cqg.rtd\", ,\"ContractData\",V11, \"PerCentNetLastTrade\",, \"T\")/100,\"\")","v":-2.802058655338616E-2},2.802058655338616E-2,"https://finance.yahoo.com/quote/INCY"]
[null,0,"S.US.ADBE",{"$f":"IFERROR(RTD(\"cqg.rtd\", ,\"ContractData\",C12, \"PerCentNetLastTrade\",, \"T\")/100,\"\")","v":-3.1889646989024028E-3},276,276,"S.US.ADBE",12,"S.US.CSL",{"$f":"IFERROR(RTD(\"cqg.rtd\", ,\"ContractData\",I12, \"PerCentNetLastTrade\",, \"T\")/100,\"\")","v":1.3616610333172382E-2},null,null,553,"S.US.GVA",{"$f":"IFERROR(RTD(\"cqg.rtd\", ,\"ContractData\",N12, \"PerCentNetLastTrade\",, \"T\")/100,\"\")","v":-2.0315169925954054E-2},null,"https://finance.yahoo.com/quote/CSL",null,{"$f":"RTD(\"cqg.rtd\", ,\"ContractData\",I12, \"LongDescription\",, \"T\")","v":"Carlisle Cos Inc"},null,null,{"$f":"N4","v":"S.US.CHTR"},{"$f":"RTD(\"cqg.rtd\", ,\"ContractData\",V12, \"LongDescription\",, \"T\")","v":"Charter Communications, Inc. Class A"},null,null,{"$f":"IFERROR(RTD(\"cqg.rtd\", ,\"ContractData\",V12, \"PerCentNetLastTrade\",, \"T\")/100,\"\")","v":-2.8824899934285206E-2},2.8824899934285206E-2,"https://finance.yahoo.com/quote/CHTR"]
[null,1,"S.US.AAP",{"$f":"IFERROR(RTD(\"cqg.rtd\", ,\"ContractData\",C13, \"PerCentNetLastTrade\",, \"T\")/100,\"\")","v":1.5174506828528073E-3},98,98,"S.US.AAP",13,"S.US.GPOR",{"$f":"IFERROR(RTD(\"cqg.rtd\", ,\"ContractData\",I13, \"PerCentNetLastTrade\",, \"T\")/100,\"\")","v":1.338432122370937E-2},null,null,552,"S.US.TFX",{"$f":"IFERROR(RTD(\"cqg.rtd\", ,\"ContractData\",N13, \"PerCentNetLastTrade\",, \"T\")/100,\"\")","v":-2.0115803134671061E-2},null,"https://finance.yahoo.com/quote/GPOR",null,{"$f":"RTD(\"cqg.rtd\", ,\"ContractData\",I13, \"LongDescription\",, \"T\")","v":"Gulfport Energy"},null,null,{"$f":"N3","v":"S.US.MIK"},{"$f":"RTD(\"cqg.rtd\", ,\"ContractData\",V13, \"LongDescription\",, \"T\")","v":"The Michaels Companies, Inc."},null,null,{"$f":"IFERROR(RTD(\"cqg.rtd\", ,\"ContractData\",V13, \"PerCentNetLastTrade\",, \"T\")/100,\"\")","v":-3.2430031097290091E-2},3.2430031097290091E-2,"https://finance.yahoo.com/quote/MIK"]
[null,0,"S.US.AMD",{"$f":"IFERROR(RTD(\"cqg.rtd\", ,\"ContractData\",C14, \"PerCentNetLastTrade\",, \"T\")/100,\"\")","v":-1.5701668302257114E-2},536,536,"S.US.AMD",14,"S.US.CHS",{"$f":"IFERROR(RTD(\"cqg.rtd\", ,\"ContractData\",I14, \"PerCentNetLastTrade\",, \"T\")/100,\"\")","v":1.3167520117044624E-2},null,null,551,"S.US.MTX",{"$f":"IFERROR(RTD(\"cqg.rtd\", ,\"ContractData\",N14, \"PerCentNetLastTrade\",, \"T\")/100,\"\")","v":-1.9292604501607719E-2},null,"https://finance.yahoo.com/quote/CHS",null,{"$f":"RTD(\"cqg.rtd\", ,\"ContractData\",I14, \"LongDescription\",, \"T\")","v":"Chicos FAS Inc"},null,null,{"$f":"N2","v":"S.US.LOGM"},{"$f":"RTD(\"cqg.rtd\", ,\"ContractData\",V14, \"LongDescription\",, \"T\")","v":"LogMein, Inc"},null,null,{"$f":"IFERROR(RTD(\"cqg.rtd\", ,\"ContractData\",V14, \"PerCentNetLastTrade\",, \"T\")/100,\"\")","v":-3.8445638693675073E-2},3.8445638693675073E-2,"https://finance.yahoo.com/quote/LOGM"]
[null,1,"S.US.AET",{"$f":"IFERROR(RTD(\"cqg.rtd\", ,\"ContractData\",C15, \"PerCentNetLastTrade\",, \"T\")/100,\"\")","v":1.8469844427079635E-3},90,90,"S.US.AET",15,"S.US.AAPL",{"$f":"IFERROR(RTD(\"cqg.rtd\", ,\"ContractData\",I15, \"PerCentNetLastTrade\",, \"T\")/100,\"\")","v":1.2755102040816327E-2},null,null,550,"S.US.KMT",{"$f":"IFERROR(RTD(\"cqg.rtd\", ,\"ContractData\",N15, \"PerCentNetLastTrade\",, \"T\")/100,\"\")","v":-1.8943170488534399E-2},null,"https://finance.yahoo.com/quote/AAPL",null,{"$f":"RTD(\"cqg.rtd\", ,\"ContractData\",I15, \"LongDescription\",, \"T\")","v":"Apple Inc"},null,null,{"$f":"N1","v":"S.US.CAR"},{"$f":"RTD(\"cqg.rtd\", ,\"ContractData\",V15, \"LongDescription\",, \"T\")","v":"AVIS Budget Group Inc"},null,null,{"$f":"IFERROR(RTD(\"cqg.rtd\", ,\"ContractData\",V15, \"PerCentNetLastTrade\",, \"T\")/100,\"\")","v":-6.1107359891964891E-2},6.1107359891964891E-2,"https://finance.yahoo.com/quote/CAR"]
[null,0,"S.US.A",{"$f":"IFERROR(RTD(\"cqg.rtd\", ,\"ContractData\",C16, \"PerCentNetLastTrade\",, \"T\")/100,\"\")","v":-2.8248587570621469E-3},262,262,"S.US.A",16,"S.US.CFG"]
[null,0,"S.US.APD",{"$f":"IFERROR(RTD(\"cqg.rtd\", ,\"ContractData\",C17, \"PerCentNetLastTrade\",, \"T\")/100,\"\")","v":-4.2113843227822309E-3},327,327,"S.US.APD",17,"S.US.K"]
[null,0,"S.US.AKAM",{"$f":"IFERROR(RTD(\"cqg.rtd\", ,\"ContractData\",C18, \"PerCentNetLastTrade\",, \"T\")/100,\"\")","v":-1.6689046614233646E-2},540,540,"S.US.AKAM",18,"S.US.SLB"]
[null,1,"S.US.AKRX",{"$f":"IFERROR(RTD(\"cqg.rtd\", ,\"ContractData\",C19, \"PerCentNetLastTrade\",, \"T\")/100,\"\")","v":0},138,138,"S.US.AKRX",19,"S.US.TSS"]
[null,0,"S.US.ALK",{"$f":"IFERROR(RTD(\"cqg.rtd\", ,\"ContractData\",C20, \"PerCentNetLastTrade\",, \"T\")/100,\"\")","v":-1.0558423275457531E-2},476,476,"S.US.ALK",20,"S.US.REGN"]
[null,0,"S.US.ALB",{"$f":"IFERROR(RTD(\"cqg.rtd\", ,\"ContractData\",C21, \"PerCentNetLastTrade\",, \"T\")/100,\"\")","v":-6.7266612126170343E-3},395,395,"S.US.ALB",21,"S.US.NUS"]
[null,0,"S.US.ALEX",{"$f":"IFERROR(RTD(\"cqg.rtd\", ,\"ContractData\",C22, \"PerCentNetLastTrade\",, \"T\")/100,\"\")","v":-9.2967818831942786E-3},453,453,"S.US.ALEX",22,"S.US.PXD"]
[null,0,"S.US.ARE",{"$f":"IFERROR(RTD(\"cqg.rtd\", ,\"ContractData\",C23, \"PerCentNetLastTrade\",, \"T\")/100,\"\")","v":-9.5793782112688324E-4},183,183,"S.US.ARE",23,"S.US.MNST"]
[null,1,"S.US.ALXN",{"$f":"IFERROR(RTD(\"cqg.rtd\", ,\"ContractData\",C24, \"PerCentNetLastTrade\",, \"T\")/100,\"\")","v":6.2102158049992242E-3},41,41,"S.US.ALXN",24,"S.US.CHK"]
[null,0,"S.US.ALGN",{"$f":"IFERROR(RTD(\"cqg.rtd\", ,\"ContractData\",C25, \"PerCentNetLastTrade\",, \"T\")/100,\"\")","v":-7.607041947402738E-3},418,418,"S.US.ALGN",25,"S.US.AMZN"]
[null,0,"S.US.ALLE",{"$f":"IFERROR(RTD(\"cqg.rtd\", ,\"ContractData\",C26, \"PerCentNetLastTrade\",, \"T\")/100,\"\")","v":-1.3548387096774193E-2},510,510,"S.US.ALLE",26,"S.US.QEP"]
[null,0,"S.US.ADS",{"$f":"IFERROR(RTD(\"cqg.rtd\", ,\"ContractData\",C27, \"PerCentNetLastTrade\",, \"T\")/100,\"\")","v":-5.6362284238130654E-3},371,371,"S.US.ADS",27,"S.US.SEE"]
[null,0,"S.US.LNT",{"$f":"IFERROR(RTD(\"cqg.rtd\", ,\"ContractData\",C28, \"PerCentNetLastTrade\",, \"T\")/100,\"\")","v":-8.4872690963554657E-3},441,441,"S.US.LNT",28,"S.US.EAT"]
[null,0,"S.US.GOOGL",{"$f":"IFERROR(RTD(\"cqg.rtd\", ,\"ContractData\",C29, \"PerCentNetLastTrade\",, \"T\")/100,\"\")","v":-2.2098749842151786E-4},150,150,"S.US.GOOGL",29,"S.US.SYY"]
[null,0,"S.US.GOOG",{"$f":"IFERROR(RTD(\"cqg.rtd\", ,\"ContractData\",C30, \"PerCentNetLastTrade\",, \"T\")/100,\"\")","v":-7.873760961245996E-4},174,174,"S.US.GOOG",30,"S.US.NFG"]
[null,0,"S.US.MO",{"$f":"IFERROR(RTD(\"cqg.rtd\", ,\"ContractData\",C31, \"PerCentNetLastTrade\",, \"T\")/100,\"\")","v":-1.2690355329949238E-3},192,192,"S.US.MO",31,"S.US.PII"]
[null,1,"S.US.AMZN",{"$f":"IFERROR(RTD(\"cqg.rtd\", ,\"ContractData\",C32, \"PerCentNetLastTrade\",, \"T\")/100,\"\")","v":8.9493122089600169E-3},25,25,"S.US.AMZN",32,"S.US.CPB"]
[null,0,"S.US.AMCX",{"$f":"IFERROR(RTD(\"cqg.rtd\", ,\"ContractData\",C33, \"PerCentNetLastTrade\",, \"T\")/100,\"\")","v":-1.1745862253069941E-2},491,491,"S.US.AMCX",33,"S.US.APA"]
[null,0,"S.US.ACC",{"$f":"IFERROR(RTD(\"cqg.rtd\", ,\"ContractData\",C34, \"PerCentNetLastTrade\",, \"T\")/100,\"\")","v":-1.3247863247863248E-2},507,507,"S.US.ACC",34,"S.US.AZO"]
[null,0,"S.US.AXP",{"$f":"IFERROR(RTD(\"cqg.rtd\", ,\"ContractData\",C35, \"PerCentNetLastTrade\",, \"T\")/100,\"\")","v":-6.3840653728294177E-4},167,167,"S.US.AXP",35,"S.US.NFX"]
[null,0,"S.US.AMT",{"$f":"IFERROR(RTD(\"cqg.rtd\", ,\"ContractData\",C36, \"PerCentNetLastTrade\",, \"T\")/100,\"\")","v":-4.0407180045069543E-3},313,313,"S.US.AMT",36,"S.US.MMS"]
[null,1,"S.US.AWK",{"$f":"IFERROR(RTD(\"cqg.rtd\", ,\"ContractData\",C37, \"PerCentNetLastTrade\",, \"T\")/100,\"\")","v":1.5655577299412914E-3},97,97,"S.US.AWK",37,"S.US.CMA"]
[null,0,"S.US.AMP",{"$f":"IFERROR(RTD(\"cqg.rtd\", ,\"ContractData\",C38, \"PerCentNetLastTrade\",, \"T\")/100,\"\")","v":-3.3379909951870828E-3},281,281,"S.US.AMP",38,"S.US.ULTA"]
[null,0,"S.US.AMGN",{"$f":"IFERROR(RTD(\"cqg.rtd\", ,\"ContractData\",C39, \"PerCentNetLastTrade\",, \"T\")/100,\"\")","v":-3.8459190525608937E-3},302,302,"S.US.AMGN",39,"S.US.KORS"]
[null,1,"S.US.APH",{"$f":"IFERROR(RTD(\"cqg.rtd\", ,\"ContractData\",C40, \"PerCentNetLastTrade\",, \"T\")/100,\"\")","v":1.3863856924996535E-3},101,101,"S.US.APH",40,"S.US.MRK"]
[null,0,"S.US.APC",{"$f":"IFERROR(RTD(\"cqg.rtd\", ,\"ContractData\",C41, \"PerCentNetLastTrade\",, \"T\")/100,\"\")","v":-5.3242061228370406E-3},360,360,"S.US.APC",41,"S.US.ALXN"]
[null,0,"S.US.ADI",{"$f":"IFERROR(RTD(\"cqg.rtd\", ,\"ContractData\",C42, \"PerCentNetLastTrade\",, \"T\")/100,\"\")","v":-4.2221929014381841E-3},328,328,"S.US.ADI",42,"S.US.WMB"]
[null,1,"S.US.ANSS",{"$f":"IFERROR(RTD(\"cqg.rtd\", ,\"ContractData\",C43, \"PerCentNetLastTrade\",, \"T\")/100,\"\")","v":2.0627062706270625E-3},87,87,"S.US.ANSS",43,"S.US.AYI"]
[null,1,"S.US.AON",{"$f":"IFERROR(RTD(\"cqg.rtd\", ,\"ContractData\",C44, \"PerCentNetLastTrade\",, \"T\")/100,\"\")","v":3.7621656988631718E-3},59,59,"S.US.AON",44,"S.US.DRE"]
[null,1,"S.US.APA",{"$f":"IFERROR(RTD(\"cqg.rtd\", ,\"ContractData\",C45, \"PerCentNetLastTrade\",, \"T\")/100,\"\")","v":7.3037127206329886E-3},33,33,"S.US.APA",45,"S.US.EGN"]
[null,0,"S.US.AIV",{"$f":"IFERROR(RTD(\"cqg.rtd\", ,\"ContractData\",C46, \"PerCentNetLastTrade\",, \"T\")/100,\"\")","v":-1.1146496815286623E-2},487,487,"S.US.AIV",46,"S.US.TPX"]
[null,1,"S.US.AAPL",{"$f":"IFERROR(RTD(\"cqg.rtd\", ,\"ContractData\",C47, \"PerCentNetLastTrade\",, \"T\")/100,\"\")","v":1.2755102040816327E-2},15,15,"S.US.AAPL",47,"S.US.MDP"]
[null,0,"S.US.AMAT",{"$f":"IFERROR(RTD(\"cqg.rtd\", ,\"ContractData\",C48, \"PerCentNetLastTrade\",, \"T\")/100,\"\")","v":-1.9125029882859192E-3},224,224,"S.US.AMAT",48,"S.US.UNIT"]
[null,1,"S.US.ATR",{"$f":"IFERROR(RTD(\"cqg.rtd\", ,\"ContractData\",C49, \"PerCentNetLastTrade\",, \"T\")/100,\"\")","v":1.3429373702844585E-3},104,104,"S.US.ATR",49,"S.US.ORLY"]
[null,0,"S.US.WTR",{"$f":"IFERROR(RTD(\"cqg.rtd\", ,\"ContractData\",C50, \"PerCentNetLastTrade\",, \"T\")/100,\"\")","v":-4.0422885572139302E-3},314,314,"S.US.WTR",50,"S.US.UA"]
[null,1,"S.US.ARRS",{"$f":"IFERROR(RTD(\"cqg.rtd\", ,\"ContractData\",C51, \"PerCentNetLastTrade\",, \"T\")/100,\"\")","v":7.2306579898770787E-4},122,122,"S.US.ARRS",51,"S.US.HOLX"]
[null,1,"S.US.AJG",{"$f":"IFERROR(RTD(\"cqg.rtd\", ,\"ContractData\",C52, \"PerCentNetLastTrade\",, \"T\")/100,\"\")","v":8.9750493627714948E-4},115,115,"S.US.AJG",52,"S.US.LAMR"]
[null,1,"S.US.ADSK",{"$f":"IFERROR(RTD(\"cqg.rtd\", ,\"ContractData\",C53, \"PerCentNetLastTrade\",, \"T\")/100,\"\")","v":1.3942513942513943E-3},100,100,"S.US.ADSK",53,"S.US.DY"]
[null,0,"S.US.ADP",{"$f":"IFERROR(RTD(\"cqg.rtd\", ,\"ContractData\",C54, \"PerCentNetLastTrade\",, \"T\")/100,\"\")","v":-9.3665021653741558E-3},456,456,"S.US.ADP",54,"S.US.OKE"]
[null,1,"S.US.AZO",{"$f":"IFERROR(RTD(\"cqg.rtd\", ,\"ContractData\",C55, \"PerCentNetLastTrade\",, \"T\")/100,\"\")","v":7.1174377224199293E-3},34,34,"S.US.AZO",55,"S.US.DDD"]
[null,0,"S.US.AVB",{"$f":"IFERROR(RTD(\"cqg.rtd\", ,\"ContractData\",C56, \"PerCentNetLastTrade\",, \"T\")/100,\"\")","v":-3.9948119325551234E-3},309,309,"S.US.AVB",56,"S.US.CVLT"]
[null,0,"S.US.AVY",{"$f":"IFERROR(RTD(\"cqg.rtd\", ,\"ContractData\",C57, \"PerCentNetLastTrade\",, \"T\")/100,\"\")","v":-2.7325650469288343E-3},255,255,"S.US.AVY",57,"S.US.BBY"]
[null,0,"S.US.CAR",{"$f":"IFERROR(RTD(\"cqg.rtd\", ,\"ContractData\",C58, \"PerCentNetLastTrade\",, \"T\")/100,\"\")","v":-6.1107359891964891E-2},564,564,"S.US.CAR",58,"S.US.SM"]
[null,1,"S.US.BHI",{"$f":"IFERROR(RTD(\"cqg.rtd\", ,\"ContractData\",C59, \"PerCentNetLastTrade\",, \"T\")/100,\"\")","v":2.8653295128939827E-3},73,73,"S.US.BHI",59,"S.US.AON"]
[null,0,"S.US.BOH",{"$f":"IFERROR(RTD(\"cqg.rtd\", ,\"ContractData\",C60, \"PerCentNetLastTrade\",, \"T\")/100,\"\")","v":-3.8754995761172339E-3},303,303,"S.US.BOH",60,"S.US.SCI"]
[null,0,"S.US.OZRK",{"$f":"IFERROR(RTD(\"cqg.rtd\", ,\"ContractData\",C61, \"PerCentNetLastTrade\",, \"T\")/100,\"\")","v":-6.2124663491406088E-4},166,166,"S.US.OZRK",61,"S.US.DVN"]
[null,0,"S.US.BDX",{"$f":"IFERROR(RTD(\"cqg.rtd\", ,\"ContractData\",C62, \"PerCentNetLastTrade\",, \"T\")/100,\"\")","v":-4.0453074433656963E-3},316,316,"S.US.BDX",62,"S.US.HCA"]
[null,0,"S.US.BDC",{"$f":"IFERROR(RTD(\"cqg.rtd\", ,\"ContractData\",C63, \"PerCentNetLastTrade\",, \"T\")/100,\"\")","v":-9.8930481283422463E-3},465,465,"S.US.BDC",63,"S.US.TUP"]
[null,1,"S.US.BBY",{"$f":"IFERROR(RTD(\"cqg.rtd\", ,\"ContractData\",C64, \"PerCentNetLastTrade\",, \"T\")/100,\"\")","v":4.0681906237892288E-3},57,57,"S.US.BBY",64,"S.US.GLW"]
[null,0,"S.US.BIOCA",{"$f":"IFERROR(RTD(\"cqg.rtd\", ,\"ContractData\",C65, \"PerCentNetLastTrade\",, \"T\")/100,\"\")","v":-1.3181138741676859E-2},506,506,"S.US.BIOCA",65,{"$f":"IFERROR(VLOOKUP(H65,$F$1:$G$564,2,FALSE),\"\")","v":"S.US.XYL"}]
[null,{"$f":"IF(D66>=0,1,)","v":1},"S.US.TECH",{"$f":"IFERROR(RTD(\"cqg.rtd\", ,\"ContractData\",C66, \"PerCentNetLastTrade\",, \"T\")/100,\"\")","v":2.8873048813498146E-3},72,{"$f":"IFERROR(E66,\"\")","v":72},{"$f":"C66","v":"S.US.TECH"},66,"S.US.EOG"]
[null,1,"S.US.BIIB",{"$f":"IFERROR(RTD(\"cqg.rtd\", ,\"ContractData\",C67, \"PerCentNetLastTrade\",, \"T\")/100,\"\")","v":1.2206751859622355E-3},108,108,"S.US.BIIB",{"$f":"H66+1","v":67},"S.US.VSM"]
[null,0,"S.US.BIVV",{"$f":"IFERROR(RTD(\"cqg.rtd\", ,\"ContractData\",C68, \"PerCentNetLastTrade\",, \"T\")/100,\"\")","v":-8.3600142298114553E-3},434,434,"S.US.BIVV",68,"S.US.NVR"]
[null,0,"S.US.BKH",{"$f":"IFERROR(RTD(\"cqg.rtd\", ,\"ContractData\",C69, \"PerCentNetLastTrade\",, \"T\")/100,\"\")","v":-3.7545126353790616E-3},297,297,"S.US.BKH",69,"S.US.CAB"]
[null,0,"S.US.BLK",{"$f":"IFERROR(RTD(\"cqg.rtd\", ,\"ContractData\",C70, \"PerCentNetLastTrade\",, \"T\")/100,\"\")","v":-2.0585782780904731E-3},230,230,"S.US.BLK",70,"S.US.SCHW"]
[null,1,"S.US.BA",{"$f":"IFERROR(RTD(\"cqg.rtd\", ,\"ContractData\",C71, \"PerCentNetLastTrade\",, \"T\")/100,\"\")","v":1.7836873682503648E-3},92,92,"S.US.BA",71,"S.US.LVLT"]
[null,0,"S.US.SAM",{"$f":"IFERROR(RTD(\"cqg.rtd\", ,\"ContractData\",C72, \"PerCentNetLastTrade\",, \"T\")/100,\"\")","v":-1.7082336863682951E-3},214,214,"S.US.SAM",72,"S.US.TECH"]
[null,0,"S.US.BXP",{"$f":"IFERROR(RTD(\"cqg.rtd\", ,\"ContractData\",C73, \"PerCentNetLastTrade\",, \"T\")/100,\"\")","v":-7.9096045197740109E-3},429,429,"S.US.BXP",73,"S.US.BHI"]
[null,0,"S.US.BSX",{"$f":"IFERROR(RTD(\"cqg.rtd\", ,\"ContractData\",C74, \"PerCentNetLastTrade\",, \"T\")/100,\"\")","v":-2.2632968691059978E-3},235,235,"S.US.BSX",74,"S.US.HNI"]
[null,1,"S.US.EAT",{"$f":"IFERROR(RTD(\"cqg.rtd\", ,\"ContractData\",C75, \"PerCentNetLastTrade\",, \"T\")/100,\"\")","v":8.5135757017947532E-3},28,28,"S.US.EAT",75,"S.US.HD"]
[null,0,"S.US.BMY",{"$f":"IFERROR(RTD(\"cqg.rtd\", ,\"ContractData\",C76, \"PerCentNetLastTrade\",, \"T\")/100,\"\")","v":-2.3572076155938351E-3},238,238,"S.US.BMY",76,"S.US.EBAY"]
[null,0,"S.US.AVGO",{"$f":"IFERROR(RTD(\"cqg.rtd\", ,\"ContractData\",C77, \"PerCentNetLastTrade\",, \"T\")/100,\"\")","v":-1.3247957606535659E-3},196,196,"S.US.AVGO",77,"S.US.MHK"]
[null,0,"S.US.BR",{"$f":"IFERROR(RTD(\"cqg.rtd\", ,\"ContractData\",C78, \"PerCentNetLastTrade\",, \"T\")/100,\"\")","v":-7.1107241329270068E-3},407,407,"S.US.BR",78,"S.US.TMO"]
[null,1,"S.US.BRCD",{"$f":"IFERROR(RTD(\"cqg.rtd\", ,\"ContractData\",C79, \"PerCentNetLastTrade\",, \"T\")/100,\"\")","v":1.5910898965791568E-3},96,96,"S.US.BRCD",79,"S.US.GIS"]
[null,1,"S.US.BRO",{"$f":"IFERROR(RTD(\"cqg.rtd\", ,\"ContractData\",C80, \"PerCentNetLastTrade\",, \"T\")/100,\"\")","v":0},139,139,"S.US.BRO",80,"S.US.KEYS"]
[null,0,"S.US.BFB",{"$f":"IFERROR(RTD(\"cqg.rtd\", ,\"ContractData\",C81, \"PerCentNetLastTrade\",, \"T\")/100,\"\")","v":-5.3050397877984091E-3},359,359,"S.US.BFB",81,"S.US.LMT"]
[null,1,"S.US.BWLD",{"$f":"IFERROR(RTD(\"cqg.rtd\", ,\"ContractData\",C82, \"PerCentNetLastTrade\",, \"T\")/100,\"\")","v":6.2363579669473025E-4},126,126,"S.US.BWLD",82,"S.US.PRI"]
[null,0,"S.US.BCR",{"$f":"IFERROR(RTD(\"cqg.rtd\", ,\"ContractData\",C83, \"PerCentNetLastTrade\",, \"T\")/100,\"\")","v":-2.8242168479143E-3},261,261,"S.US.BCR",83,"S.US.HBI"]
[null,1,"S.US.CAB",{"$f":"IFERROR(RTD(\"cqg.rtd\", ,\"ContractData\",C84, \"PerCentNetLastTrade\",, \"T\")/100,\"\")","v":3.2028469750889684E-3},69,69,"S.US.CAB",84,"S.US.PWR"]
[null,0,"S.US.CABO",{"$f":"IFERROR(RTD(\"cqg.rtd\", ,\"ContractData\",C85, \"PerCentNetLastTrade\",, \"T\")/100,\"\")","v":-5.9023668639053249E-3},380,380,"S.US.CABO",85,"S.US.FFIV"]
[null,0,"S.US.COG",{"$f":"IFERROR(RTD(\"cqg.rtd\", ,\"ContractData\",C86, \"PerCentNetLastTrade\",, \"T\")/100,\"\")","v":-1.1584609019445594E-2},489,489,"S.US.COG",86,"S.US.HAL"]
[null,0,"S.US.CDNS",{"$f":"IFERROR(RTD(\"cqg.rtd\", ,\"ContractData\",C87, \"PerCentNetLastTrade\",, \"T\")/100,\"\")","v":-5.4479418886198552E-3},363,363,"S.US.CDNS",87,"S.US.ANSS"]
[null,0,"S.US.CPT",{"$f":"IFERROR(RTD(\"cqg.rtd\", ,\"ContractData\",C88, \"PerCentNetLastTrade\",, \"T\")/100,\"\")","v":-3.1568722680913063E-3},275,275,"S.US.CPT",88,"S.US.VSAT"]
[null,1,"S.US.CPB",{"$f":"IFERROR(RTD(\"cqg.rtd\", ,\"ContractData\",C89, \"PerCentNetLastTrade\",, \"T\")/100,\"\")","v":7.3170731707317069E-3},32,32,"S.US.CPB",89,"S.US.NBL"]
[null,1,"S.US.CSL",{"$f":"IFERROR(RTD(\"cqg.rtd\", ,\"ContractData\",C90, \"PerCentNetLastTrade\",, \"T\")/100,\"\")","v":1.3616610333172382E-2},12,12,"S.US.CSL",90,"S.US.AET"]
[null,1,"S.US.KMX",{"$f":"IFERROR(RTD(\"cqg.rtd\", ,\"ContractData\",C91, \"PerCentNetLastTrade\",, \"T\")/100,\"\")","v":1.6747613465081226E-3},94,94,"S.US.KMX",91,"S.US.XEC"]
[null,0,"S.US.CRI",{"$f":"IFERROR(RTD(\"cqg.rtd\", ,\"ContractData\",C92, \"PerCentNetLastTrade\",, \"T\")/100,\"\")","v":-4.3948976310429844E-3},332,332,"S.US.CRI",92,"S.US.BA"]
[null,0,"S.US.CTLT",{"$f":"IFERROR(RTD(\"cqg.rtd\", ,\"ContractData\",C93, \"PerCentNetLastTrade\",, \"T\")/100,\"\")","v":-9.7637795275590557E-3},464,464,"S.US.CTLT",93,"S.US.HII"]
[null,0,"S.US.CAT",{"$f":"IFERROR(RTD(\"cqg.rtd\", ,\"ContractData\",C94, \"PerCentNetLastTrade\",, \"T\")/100,\"\")","v":-3.0108390204737052E-3},267,267,"S.US.CAT",94,"S.US.KMX"]
[null,0,"S.US.CBOE",{"$f":"IFERROR(RTD(\"cqg.rtd\", ,\"ContractData\",C95, \"PerCentNetLastTrade\",, \"T\")/100,\"\")","v":-9.3123209169054446E-3},454,454,"S.US.CBOE",95,"S.US.MTD"]
[null,0,"S.US.CBG",{"$f":"IFERROR(RTD(\"cqg.rtd\", ,\"ContractData\",C96, \"PerCentNetLastTrade\",, \"T\")/100,\"\")","v":-1.5773728583084037E-2},538,538,"S.US.CBG",96,"S.US.BRCD"]
[null,0,"S.US.CBS",{"$f":"IFERROR(RTD(\"cqg.rtd\", ,\"ContractData\",C97, \"PerCentNetLastTrade\",, \"T\")/100,\"\")","v":-1.8098159509202454E-2},546,546,"S.US.CBS",97,"S.US.AWK"]
[null,0,"S.US.CDK",{"$f":"IFERROR(RTD(\"cqg.rtd\", ,\"ContractData\",C98, \"PerCentNetLastTrade\",, \"T\")/100,\"\")","v":-6.1419104574107E-3},384,384,"S.US.CDK",98,"S.US.AAP"]
[null,0,"S.US.CELG",{"$f":"IFERROR(RTD(\"cqg.rtd\", ,\"ContractData\",C99, \"PerCentNetLastTrade\",, \"T\")/100,\"\")","v":-1.4377910301445959E-2},519,519,"S.US.CELG",99,"S.US.GWW"]
[null,0,"S.US.CNP",{"$f":"IFERROR(RTD(\"cqg.rtd\", ,\"ContractData\",C100, \"PerCentNetLastTrade\",, \"T\")/100,\"\")","v":-8.9126559714795012E-3},446,446,"S.US.CNP",100,"S.US.ADSK"]
[null,0,"S.US.CERN",{"$f":"IFERROR(RTD(\"cqg.rtd\", ,\"ContractData\",C101, \"PerCentNetLastTrade\",, \"T\")/100,\"\")","v":-1.8492834026814608E-3},220,220,"S.US.CERN",101,"S.US.APH"]
[null,0,"S.US.CHRW",{"$f":"IFERROR(RTD(\"cqg.rtd\", ,\"ContractData\",C102, \"PerCentNetLastTrade\",, \"T\")/100,\"\")","v":-1.1860940695296524E-2},493,493,"S.US.CHRW",102,"S.US.TR"]
[null,0,"S.US.CRL",{"$f":"IFERROR(RTD(\"cqg.rtd\", ,\"ContractData\",C103, \"PerCentNetLastTrade\",, \"T\")/100,\"\")","v":-3.3116237995363726E-4},156,156,"S.US.CRL",103,"S.US.MBFI"]
[null,1,"S.US.SCHW",{"$f":"IFERROR(RTD(\"cqg.rtd\", ,\"ContractData\",C104, \"PerCentNetLastTrade\",, \"T\")/100,\"\")","v":2.9902815848492398E-3},70,70,"S.US.SCHW",104,"S.US.ATR"]
[null,0,"S.US.CHTR",{"$f":"IFERROR(RTD(\"cqg.rtd\", ,\"ContractData\",C105, \"PerCentNetLastTrade\",, \"T\")/100,\"\")","v":-2.8824899934285206E-2},561,561,"S.US.CHTR",105,"S.US.DGX"]
[null,1,"S.US.CAKE",{"$f":"IFERROR(RTD(\"cqg.rtd\", ,\"ContractData\",C106, \"PerCentNetLastTrade\",, \"T\")/100,\"\")","v":6.3421595053115589E-4},125,125,"S.US.CAKE",106,"S.US.VRTX"]
[null,1,"S.US.CHFC",{"$f":"IFERROR(RTD(\"cqg.rtd\", ,\"ContractData\",C107, \"PerCentNetLastTrade\",, \"T\")/100,\"\")","v":6.0950832994717595E-4},128,128,"S.US.CHFC",107,"S.US.GPN"]
[null,0,"S.US.CC",{"$f":"IFERROR(RTD(\"cqg.rtd\", ,\"ContractData\",C108, \"PerCentNetLastTrade\",, \"T\")/100,\"\")","v":-1.8186226964112512E-2},547,547,"S.US.CC",108,"S.US.BIIB"]
[null,1,"S.US.CHK",{"$f":"IFERROR(RTD(\"cqg.rtd\", ,\"ContractData\",C109, \"PerCentNetLastTrade\",, \"T\")/100,\"\")","v":9.1575091575091579E-3},24,24,"S.US.CHK",109,"S.US.NTRS"]
[null,1,"S.US.CHS",{"$f":"IFERROR(RTD(\"cqg.rtd\", ,\"ContractData\",C110, \"PerCentNetLastTrade\",, \"T\")/100,\"\")","v":1.3167520117044624E-2},14,14,"S.US.CHS",110,"S.US.PFE"]
[null,0,"S.US.CMG",{"$f":"IFERROR(RTD(\"cqg.rtd\", ,\"ContractData\",C111, \"PerCentNetLastTrade\",, \"T\")/100,\"\")","v":-5.8699768567220699E-3},378,378,"S.US.CMG",111,"S.US.ZBH"]
[null,0,"S.US.CHD",{"$f":"IFERROR(RTD(\"cqg.rtd\", ,\"ContractData\",C112, \"PerCentNetLastTrade\",, \"T\")/100,\"\")","v":-6.301693580149665E-3},388,388,"S.US.CHD",112,"S.US.UAA"]
[null,0,"S.US.CHDN",{"$f":"IFERROR(RTD(\"cqg.rtd\", ,\"ContractData\",C113, \"PerCentNetLastTrade\",, \"T\")/100,\"\")","v":-3.9995224450811847E-3},310,310,"S.US.CHDN",113,"S.US.GEO"]
[null,1,"S.US.XEC",{"$f":"IFERROR(RTD(\"cqg.rtd\", ,\"ContractData\",C114, \"PerCentNetLastTrade\",, \"T\")/100,\"\")","v":1.828761429758936E-3},91,91,"S.US.XEC",114,"S.US.NKE"]
[null,0,"S.US.CINF",{"$f":"IFERROR(RTD(\"cqg.rtd\", ,\"ContractData\",C115, \"PerCentNetLastTrade\",, \"T\")/100,\"\")","v":-5.5061414654807286E-3},365,365,"S.US.CINF",115,"S.US.AJG"]
[null,0,"S.US.CNK",{"$f":"IFERROR(RTD(\"cqg.rtd\", ,\"ContractData\",C116, \"PerCentNetLastTrade\",, \"T\")/100,\"\")","v":-3.2437442075996291E-3},277,277,"S.US.CNK",116,"S.US.CMP"]
[null,0,"S.US.CTAS",{"$f":"IFERROR(RTD(\"cqg.rtd\", ,\"ContractData\",C117, \"PerCentNetLastTrade\",, \"T\")/100,\"\")","v":-1.3009187738840555E-2},504,504,"S.US.CTAS",117,"S.US.MANH"]
[null,0,"S.US.CRUS",{"$f":"IFERROR(RTD(\"cqg.rtd\", ,\"ContractData\",C118, \"PerCentNetLastTrade\",, \"T\")/100,\"\")","v":-2.1974572280646682E-3},233,233,"S.US.CRUS",118,"S.US.URBN"]
[null,1,"S.US.CFG",{"$f":"IFERROR(RTD(\"cqg.rtd\", ,\"ContractData\",C119, \"PerCentNetLastTrade\",, \"T\")/100,\"\")","v":1.1090073032188261E-2},16,16,"S.US.CFG",119,"S.US.RTN"]
[null,0,"S.US.CTXS",{"$f":"IFERROR(RTD(\"cqg.rtd\", ,\"ContractData\",C120, \"PerCentNetLastTrade\",, \"T\")/100,\"\")","v":-5.8299039780521263E-3},377,377,"S.US.CTXS",120,"S.US.UMBF"]
[null,0,"S.US.CLX",{"$f":"IFERROR(RTD(\"cqg.rtd\", ,\"ContractData\",C121, \"PerCentNetLastTrade\",, \"T\")/100,\"\")","v":-5.4932651064790424E-3},364,364,"S.US.CLX",121,"S.US.FB"]
[null,0,"S.US.CME",{"$f":"IFERROR(RTD(\"cqg.rtd\", ,\"ContractData\",C122, \"PerCentNetLastTrade\",, \"T\")/100,\"\")","v":-3.0313236780060626E-3},269,269,"S.US.CME",122,"S.US.ARRS"]
[null,1,"S.US.COH",{"$f":"IFERROR(RTD(\"cqg.rtd\", ,\"ContractData\",C123, \"PerCentNetLastTrade\",, \"T\")/100,\"\")","v":5.8837318330989215E-2},3,3,"S.US.COH",123,"S.US.CBSH"]
[null,0,"S.US.KO",{"$f":"IFERROR(RTD(\"cqg.rtd\", ,\"ContractData\",C124, \"PerCentNetLastTrade\",, \"T\")/100,\"\")","v":-2.9755092698558021E-3},266,266,"S.US.KO",124,"S.US.NEU"]
[null,0,"S.US.CGNX",{"$f":"IFERROR(RTD(\"cqg.rtd\", ,\"ContractData\",C125, \"PerCentNetLastTrade\",, \"T\")/100,\"\")","v":-3.6666666666666666E-3},291,291,"S.US.CGNX",125,"S.US.CAKE"]
[null,1,"S.US.CTSH",{"$f":"IFERROR(RTD(\"cqg.rtd\", ,\"ContractData\",C126, \"PerCentNetLastTrade\",, \"T\")/100,\"\")","v":1.3761467889908256E-2},11,11,"S.US.CTSH",126,"S.US.BWLD"]
[null,0,"S.US.COHR",{"$f":"IFERROR(RTD(\"cqg.rtd\", ,\"ContractData\",C127, \"PerCentNetLastTrade\",, \"T\")/100,\"\")","v":-7.5945993959850777E-3},417,417,"S.US.COHR",127,"S.US.DLTR"]
[null,0,"S.US.CL",{"$f":"IFERROR(RTD(\"cqg.rtd\", ,\"ContractData\",C128, \"PerCentNetLastTrade\",, \"T\")/100,\"\")","v":-8.3553822587383378E-4},178,178,"S.US.CL",128,"S.US.CHFC"]
[null,0,"S.US.CMCSA",{"$f":"IFERROR(RTD(\"cqg.rtd\", ,\"ContractData\",C129, \"PerCentNetLastTrade\",, \"T\")/100,\"\")","v":-1.5380671622660857E-3},204,204,"S.US.CMCSA",129,{"$f":"IFERROR(VLOOKUP(H129,$F$1:$G$564,2,FALSE),\"\")","v":"S.US.MCHP"}]
[null,{"$f":"IF(D130>=0,1,)","v":1},"S.US.CMA",{"$f":"IFERROR(RTD(\"cqg.rtd\", ,\"ContractData\",C130, \"PerCentNetLastTrade\",, \"T\")/100,\"\")","v":6.7039106145251395E-3},37,{"$f":"IFERROR(E130,\"\")","v":37},{"$f":"C130","v":"S.US.CMA"},130,"S.US.PCLN"]
[null,1,"S.US.CBSH",{"$f":"IFERROR(RTD(\"cqg.rtd\", ,\"ContractData\",C131, \"PerCentNetLastTrade\",, \"T\")/100,\"\")","v":7.1479628305932811E-4},123,123,"S.US.CBSH",{"$f":"H130+1","v":131},"S.US.ROP"]
[null,1,"S.US.CVLT",{"$f":"IFERROR(RTD(\"cqg.rtd\", ,\"ContractData\",C132, \"PerCentNetLastTrade\",, \"T\")/100,\"\")","v":4.0744021257750227E-3},56,56,"S.US.CVLT",132,"S.US.TRMK"]
[null,1,"S.US.CMP",{"$f":"IFERROR(RTD(\"cqg.rtd\", ,\"ContractData\",C133, \"PerCentNetLastTrade\",, \"T\")/100,\"\")","v":8.8626292466765133E-4},116,116,"S.US.CMP",133,"S.US.EW"]
[null,0,"S.US.CXO",{"$f":"IFERROR(RTD(\"cqg.rtd\", ,\"ContractData\",C134, \"PerCentNetLastTrade\",, \"T\")/100,\"\")","v":-5.0165933472254374E-3},352,352,"S.US.CXO",134,"S.US.USD"]
[null,0,"S.US.STZ",{"$f":"IFERROR(RTD(\"cqg.rtd\", ,\"ContractData\",C135, \"PerCentNetLastTrade\",, \"T\")/100,\"\")","v":-3.6972718615203631E-3},292,292,"S.US.STZ",135,"S.US.OMC"]
[null,0,"S.US.CVG",{"$f":"IFERROR(RTD(\"cqg.rtd\", ,\"ContractData\",C136, \"PerCentNetLastTrade\",, \"T\")/100,\"\")","v":-8.7221979938944605E-4},181,181,"S.US.CVG",136,"S.US.FAST"]
[null,0,"S.US.COO",{"$f":"IFERROR(RTD(\"cqg.rtd\", ,\"ContractData\",C137, \"PerCentNetLastTrade\",, \"T\")/100,\"\")","v":-9.722424772738322E-5},146,146,"S.US.COO",137,"S.US.POST"]
[null,0,"S.US.CPRT",{"$f":"IFERROR(RTD(\"cqg.rtd\", ,\"ContractData\",C138, \"PerCentNetLastTrade\",, \"T\")/100,\"\")","v":-2.6101141924959213E-3},251,251,"S.US.CPRT",138,"S.US.AKRX"]
[null,0,"S.US.CLGX",{"$f":"IFERROR(RTD(\"cqg.rtd\", ,\"ContractData\",C139, \"PerCentNetLastTrade\",, \"T\")/100,\"\")","v":-1.0735122520420071E-2},480,480,"S.US.CLGX",139,"S.US.BRO"]
[null,1,"S.US.GLW",{"$f":"IFERROR(RTD(\"cqg.rtd\", ,\"ContractData\",C140, \"PerCentNetLastTrade\",, \"T\")/100,\"\")","v":3.4590107229332413E-3},64,64,"S.US.GLW",140,"S.US.GGG"]
[null,0,"S.US.OFC",{"$f":"IFERROR(RTD(\"cqg.rtd\", ,\"ContractData\",C141, \"PerCentNetLastTrade\",, \"T\")/100,\"\")","v":-3.6122817579771222E-3},289,289,"S.US.OFC",141,"S.US.LOW"]
[null,0,"S.US.COTY",{"$f":"IFERROR(RTD(\"cqg.rtd\", ,\"ContractData\",C142, \"PerCentNetLastTrade\",, \"T\")/100,\"\")","v":-6.0874377421140016E-3},382,382,"S.US.COTY",142,"S.US.MAS"]
[null,0,"S.US.CBRL",{"$f":"IFERROR(RTD(\"cqg.rtd\", ,\"ContractData\",C143, \"PerCentNetLastTrade\",, \"T\")/100,\"\")","v":-3.2906764168190127E-3},279,279,"S.US.CBRL",143,"S.US.TER"]
[null,0,"S.US.CR",{"$f":"IFERROR(RTD(\"cqg.rtd\", ,\"ContractData\",C144, \"PerCentNetLastTrade\",, \"T\")/100,\"\")","v":-4.0115331578287582E-3},312,312,"S.US.CR",144,"S.US.WU"]
[null,0,"S.US.CCI",{"$f":"IFERROR(RTD(\"cqg.rtd\", ,\"ContractData\",C145, \"PerCentNetLastTrade\",, \"T\")/100,\"\")","v":-4.5871559633027525E-3},338,338,"S.US.CCI",145,"S.US.NEE"]
[null,0,"S.US.CSRA",{"$f":"IFERROR(RTD(\"cqg.rtd\", ,\"ContractData\",C146, \"PerCentNetLastTrade\",, \"T\")/100,\"\")","v":-2.0249746878164025E-3},228,228,"S.US.CSRA",146,"S.US.COO"]
[null,0,"S.US.CSX",{"$f":"IFERROR(RTD(\"cqg.rtd\", ,\"ContractData\",C147, \"PerCentNetLastTrade\",, \"T\")/100,\"\")","v":-7.6190476190476193E-4},172,172,"S.US.CSX",147,"S.US.CFR"]
[null,0,"S.US.CFR",{"$f":"IFERROR(RTD(\"cqg.rtd\", ,\"ContractData\",C148, \"PerCentNetLastTrade\",, \"T\")/100,\"\")","v":-1.0828370330265295E-4},147,147,"S.US.CFR",148,"S.US.WWD"]
[null,0,"S.US.CMI",{"$f":"IFERROR(RTD(\"cqg.rtd\", ,\"ContractData\",C149, \"PerCentNetLastTrade\",, \"T\")/100,\"\")","v":-4.6951376382814505E-3},342,342,"S.US.CMI",149,"S.US.FTV"]
[null,0,"S.US.CW",{"$f":"IFERROR(RTD(\"cqg.rtd\", ,\"ContractData\",C150, \"PerCentNetLastTrade\",, \"T\")/100,\"\")","v":-1.2813307856580868E-2},503,503,"S.US.CW",150,"S.US.GOOGL"]
[null,0,"S.US.CY",{"$f":"IFERROR(RTD(\"cqg.rtd\", ,\"ContractData\",C151, \"PerCentNetLastTrade\",, \"T\")/100,\"\")","v":-1.4869888475836431E-2},527,527,"S.US.CY",151,"S.US.UNH"]
[null,0,"S.US.CONE",{"$f":"IFERROR(RTD(\"cqg.rtd\", ,\"ContractData\",C152, \"PerCentNetLastTrade\",, \"T\")/100,\"\")","v":-4.9153468050245766E-3},351,351,"S.US.CONE",152,"S.US.ECL"]
[null,0,"S.US.DHR",{"$f":"IFERROR(RTD(\"cqg.rtd\", ,\"ContractData\",C153, \"PerCentNetLastTrade\",, \"T\")/100,\"\")","v":-1.6694490818030051E-3},212,212,"S.US.DHR",153,"S.US.HRC"]
[null,0,"S.US.DRI",{"$f":"IFERROR(RTD(\"cqg.rtd\", ,\"ContractData\",C154, \"PerCentNetLastTrade\",, \"T\")/100,\"\")","v":-1.4886064353601283E-3},201,201,"S.US.DRI",154,"S.US.SBNY"]
[null,0,"S.US.DCT",{"$f":"IFERROR(RTD(\"cqg.rtd\", ,\"ContractData\",C155, \"PerCentNetLastTrade\",, \"T\")/100,\"\")","v":-2.5237817899437004E-3},249,249,"S.US.DCT",155,"S.US.MKC"]
[null,0,"S.US.DECK",{"$f":"IFERROR(RTD(\"cqg.rtd\", ,\"ContractData\",C156, \"PerCentNetLastTrade\",, \"T\")/100,\"\")","v":-3.7866315442871257E-3},299,299,"S.US.DECK",156,"S.US.CRL"]
[null,0,"S.US.DE",{"$f":"IFERROR(RTD(\"cqg.rtd\", ,\"ContractData\",C157, \"PerCentNetLastTrade\",, \"T\")/100,\"\")","v":-4.4204756431792062E-3},334,334,"S.US.DE",157,"S.US.VAL"]
[null,0,"S.US.DLX",{"$f":"IFERROR(RTD(\"cqg.rtd\", ,\"ContractData\",C158, \"PerCentNetLastTrade\",, \"T\")/100,\"\")","v":-9.4839609483960956E-3},460,460,"S.US.DLX",158,"S.US.USB"]
[null,1,"S.US.DVN",{"$f":"IFERROR(RTD(\"cqg.rtd\", ,\"ContractData\",C159, \"PerCentNetLastTrade\",, \"T\")/100,\"\")","v":3.682272488164124E-3},61,61,"S.US.DVN",159,"S.US.UAL"]
[null,0,"S.US.DKS",{"$f":"IFERROR(RTD(\"cqg.rtd\", ,\"ContractData\",C160, \"PerCentNetLastTrade\",, \"T\")/100,\"\")","v":-3.7181996086105675E-3},294,294,"S.US.DKS",160,"S.US.IDTI"]
[null,0,"S.US.DLR",{"$f":"IFERROR(RTD(\"cqg.rtd\", ,\"ContractData\",C161, \"PerCentNetLastTrade\",, \"T\")/100,\"\")","v":-6.4141991037694399E-3},391,391,"S.US.DLR",161,"S.US.DFS"]
[null,0,"S.US.DFS",{"$f":"IFERROR(RTD(\"cqg.rtd\", ,\"ContractData\",C162, \"PerCentNetLastTrade\",, \"T\")/100,\"\")","v":-4.9751243781094535E-4},161,161,"S.US.DFS",162,"S.US.DEI"]
[null,0,"S.US.DISCA",{"$f":"IFERROR(RTD(\"cqg.rtd\", ,\"ContractData\",C163, \"PerCentNetLastTrade\",, \"T\")/100,\"\")","v":-7.3827980804724988E-3},412,412,"S.US.DISCA",163,"S.US.FLIR"]
[null,0,"S.US.DISCK",{"$f":"IFERROR(RTD(\"cqg.rtd\", ,\"ContractData\",C164, \"PerCentNetLastTrade\",, \"T\")/100,\"\")","v":-5.6689342403628117E-3},373,373,"S.US.DISCK",164,"S.US.MJN"]
[null,0,"S.US.DISH",{"$f":"IFERROR(RTD(\"cqg.rtd\", ,\"ContractData\",C165, \"PerCentNetLastTrade\",, \"T\")/100,\"\")","v":-3.4090909090909089E-3},282,282,"S.US.DISH",165,"S.US.PNRA"]
[null,0,"S.US.DG",{"$f":"IFERROR(RTD(\"cqg.rtd\", ,\"ContractData\",C166, \"PerCentNetLastTrade\",, \"T\")/100,\"\")","v":-1.4941591958706874E-3},202,202,"S.US.DG",166,"S.US.OZRK"]
[null,1,"S.US.DLTR",{"$f":"IFERROR(RTD(\"cqg.rtd\", ,\"ContractData\",C167, \"PerCentNetLastTrade\",, \"T\")/100,\"\")","v":6.0975609756097561E-4},127,127,"S.US.DLTR",167,"S.US.AXP"]
[null,0,"S.US.D",{"$f":"IFERROR(RTD(\"cqg.rtd\", ,\"ContractData\",C168, \"PerCentNetLastTrade\",, \"T\")/100,\"\")","v":-1.7895947846094848E-3},218,218,"S.US.D",168,"S.US.JNPR"]
[null,0,"S.US.DPZ",{"$f":"IFERROR(RTD(\"cqg.rtd\", ,\"ContractData\",C169, \"PerCentNetLastTrade\",, \"T\")/100,\"\")","v":-1.6570008285004142E-3},211,211,"S.US.DPZ",169,"S.US.MCD"]
[null,0,"S.US.DCI",{"$f":"IFERROR(RTD(\"cqg.rtd\", ,\"ContractData\",C170, \"PerCentNetLastTrade\",, \"T\")/100,\"\")","v":-1.6988744956466342E-3},213,213,"S.US.DCI",170,"S.US.FR"]
[null,0,"S.US.DEI",{"$f":"IFERROR(RTD(\"cqg.rtd\", ,\"ContractData\",C171, \"PerCentNetLastTrade\",, \"T\")/100,\"\")","v":-5.1988562516246421E-4},162,162,"S.US.DEI",171,"S.US.NOC"]
[null,0,"S.US.DPS",{"$f":"IFERROR(RTD(\"cqg.rtd\", ,\"ContractData\",C172, \"PerCentNetLastTrade\",, \"T\")/100,\"\")","v":-4.6047582501918651E-3},339,339,"S.US.DPS",172,"S.US.CSX"]
[null,1,"S.US.DRE",{"$f":"IFERROR(RTD(\"cqg.rtd\", ,\"ContractData\",C173, \"PerCentNetLastTrade\",, \"T\")/100,\"\")","v":5.3821313240043052E-3},44,44,"S.US.DRE",173,"S.US.ROST"]
[null,0,"S.US.DNB",{"$f":"IFERROR(RTD(\"cqg.rtd\", ,\"ContractData\",C174, \"PerCentNetLastTrade\",, \"T\")/100,\"\")","v":-7.7759123442608467E-3},425,425,"S.US.DNB",174,"S.US.GOOG"]
[null,0,"S.US.DNKN",{"$f":"IFERROR(RTD(\"cqg.rtd\", ,\"ContractData\",C175, \"PerCentNetLastTrade\",, \"T\")/100,\"\")","v":-1.8581382883687689E-2},548,548,"S.US.DNKN",175,"S.US.PM"]
[null,0,"S.US.DXC",{"$f":"IFERROR(RTD(\"cqg.rtd\", ,\"ContractData\",C176, \"PerCentNetLastTrade\",, \"T\")/100,\"\")","v":-8.802143130501339E-3},445,445,"S.US.DXC",176,"S.US.JNJ"]
[null,1,"S.US.DY",{"$f":"IFERROR(RTD(\"cqg.rtd\", ,\"ContractData\",C177, \"PerCentNetLastTrade\",, \"T\")/100,\"\")","v":4.1728486646884274E-3},53,53,"S.US.DY",177,"S.US.SNA"]
[null,0,"S.US.DD",{"$f":"IFERROR(RTD(\"cqg.rtd\", ,\"ContractData\",C178, \"PerCentNetLastTrade\",, \"T\")/100,\"\")","v":-1.059896475228001E-2},477,477,"S.US.DD",178,"S.US.CL"]
[null,0,"S.US.ETFC",{"$f":"IFERROR(RTD(\"cqg.rtd\", ,\"ContractData\",C179, \"PerCentNetLastTrade\",, \"T\")/100,\"\")","v":-1.9553072625698321E-3},225,225,"S.US.ETFC",179,"S.US.WPX"]
[null,0,"S.US.EXP",{"$f":"IFERROR(RTD(\"cqg.rtd\", ,\"ContractData\",C180, \"PerCentNetLastTrade\",, \"T\")/100,\"\")","v":-8.1917475728155338E-3},432,432,"S.US.EXP",180,"S.US.NATI"]
[null,0,"S.US.EWBC",{"$f":"IFERROR(RTD(\"cqg.rtd\", ,\"ContractData\",C181, \"PerCentNetLastTrade\",, \"T\")/100,\"\")","v":-4.8473967684021547E-3},347,347,"S.US.EWBC",181,"S.US.CVG"]
[null,0,"S.US.EV",{"$f":"IFERROR(RTD(\"cqg.rtd\", ,\"ContractData\",C182, \"PerCentNetLastTrade\",, \"T\")/100,\"\")","v":-6.4234916265198437E-3},392,392,"S.US.EV",182,"S.US.SPN"]
[null,1,"S.US.EBAY",{"$f":"IFERROR(RTD(\"cqg.rtd\", ,\"ContractData\",C183, \"PerCentNetLastTrade\",, \"T\")/100,\"\")","v":2.6865671641791043E-3},76,76,"S.US.EBAY",183,"S.US.ARE"]
[null,0,"S.US.ECL",{"$f":"IFERROR(RTD(\"cqg.rtd\", ,\"ContractData\",C184, \"PerCentNetLastTrade\",, \"T\")/100,\"\")","v":-2.3721040562979363E-4},152,152,"S.US.ECL",184,"S.US.WOOF"]
[null,0,"S.US.EDR",{"$f":"IFERROR(RTD(\"cqg.rtd\", ,\"ContractData\",C185, \"PerCentNetLastTrade\",, \"T\")/100,\"\")","v":-1.7304667016255899E-2},544,544,"S.US.EDR",185,"S.US.FISV"]
[null,1,"S.US.EW",{"$f":"IFERROR(RTD(\"cqg.rtd\", ,\"ContractData\",C186, \"PerCentNetLastTrade\",, \"T\")/100,\"\")","v":2.7129679869777537E-4},133,133,"S.US.EW",186,"S.US.KEY"]
[null,0,"S.US.EA",{"$f":"IFERROR(RTD(\"cqg.rtd\", ,\"ContractData\",C187, \"PerCentNetLastTrade\",, \"T\")/100,\"\")","v":-2.8201378734071443E-3},260,260,"S.US.EA",187,"S.US.RAI"]
[null,0,"S.US.LLY",{"$f":"IFERROR(RTD(\"cqg.rtd\", ,\"ContractData\",C188, \"PerCentNetLastTrade\",, \"T\")/100,\"\")","v":-1.4543691673736515E-2},522,522,"S.US.LLY",188,"S.US.TIF"]
[null,0,"S.US.EME",{"$f":"IFERROR(RTD(\"cqg.rtd\", ,\"ContractData\",C189, \"PerCentNetLastTrade\",, \"T\")/100,\"\")","v":-1.373792270531401E-2},511,511,"S.US.EME",189,"S.US.MON"]
[null,0,"S.US.EMR",{"$f":"IFERROR(RTD(\"cqg.rtd\", ,\"ContractData\",C190, \"PerCentNetLastTrade\",, \"T\")/100,\"\")","v":-4.4112656939260262E-3},333,333,"S.US.EMR",190,"S.US.UBSI"]
[null,1,"S.US.EGN",{"$f":"IFERROR(RTD(\"cqg.rtd\", ,\"ContractData\",C191, \"PerCentNetLastTrade\",, \"T\")/100,\"\")","v":5.335365853658537E-3},45,45,"S.US.EGN",191,"S.US.RSG"]
[null,0,"S.US.ENR",{"$f":"IFERROR(RTD(\"cqg.rtd\", ,\"ContractData\",C192, \"PerCentNetLastTrade\",, \"T\")/100,\"\")","v":-3.4608378870673948E-3},283,283,"S.US.ENR",192,"S.US.MO"]
[null,0,"S.US.ENS",{"$f":"IFERROR(RTD(\"cqg.rtd\", ,\"ContractData\",C193, \"PerCentNetLastTrade\",, \"T\")/100,\"\")","v":-4.1686517389232965E-3},325,325,"S.US.ENS",193,{"$f":"IFERROR(VLOOKUP(H193,$F$1:$G$564,2,FALSE),\"\")","v":"S.US.IPGP"}]
[null,{"$f":"IF(D194>=0,1,)","v":0},"S.US.EVHC",{"$f":"IFERROR(RTD(\"cqg.rtd\", ,\"ContractData\",C194, \"PerCentNetLastTrade\",, \"T\")/100,\"\")","v":-1.8766290182450043E-2},549,{"$f":"IFERROR(E194,\"\")","v":549},{"$f":"C194","v":"S.US.EVHC"},194,"S.US.QCOM"]
[null,1,"S.US.EOG",{"$f":"IFERROR(RTD(\"cqg.rtd\", ,\"ContractData\",C195, \"PerCentNetLastTrade\",, \"T\")/100,\"\")","v":3.4110915492957744E-3},66,66,"S.US.EOG",{"$f":"H194+1","v":195},"S.US.HUM"]
[null,0,"S.US.EPR",{"$f":"IFERROR(RTD(\"cqg.rtd\", ,\"ContractData\",C196, \"PerCentNetLastTrade\",, \"T\")/100,\"\")","v":-3.5440884604479726E-3},288,288,"S.US.EPR",196,"S.US.AVGO"]
[null,0,"S.US.EQT",{"$f":"IFERROR(RTD(\"cqg.rtd\", ,\"ContractData\",C197, \"PerCentNetLastTrade\",, \"T\")/100,\"\")","v":-9.1034008931638617E-3},449,449,"S.US.EQT",197,"S.US.WAT"]
[null,0,"S.US.EFX",{"$f":"IFERROR(RTD(\"cqg.rtd\", ,\"ContractData\",C198, \"PerCentNetLastTrade\",, \"T\")/100,\"\")","v":-5.5471507816439733E-3},368,368,"S.US.EFX",198,"S.US.PG"]
[null,0,"S.US.EQIX",{"$f":"IFERROR(RTD(\"cqg.rtd\", ,\"ContractData\",C199, \"PerCentNetLastTrade\",, \"T\")/100,\"\")","v":-3.1436950146627569E-3},274,274,"S.US.EQIX",199,"S.US.LRCX"]
[null,0,"S.US.EQR",{"$f":"IFERROR(RTD(\"cqg.rtd\", ,\"ContractData\",C200, \"PerCentNetLastTrade\",, \"T\")/100,\"\")","v":-7.6347533974652614E-3},419,419,"S.US.EQR",200,"S.US.WAFD"]
[null,0,"S.US.ESS",{"$f":"IFERROR(RTD(\"cqg.rtd\", ,\"ContractData\",C201, \"PerCentNetLastTrade\",, \"T\")/100,\"\")","v":-3.2751527738946362E-3},278,278,"S.US.ESS",201,"S.US.DRI"]
[null,0,"S.US.EL",{"$f":"IFERROR(RTD(\"cqg.rtd\", ,\"ContractData\",C202, \"PerCentNetLastTrade\",, \"T\")/100,\"\")","v":-6.4613396510876586E-3},393,393,"S.US.EL",202,"S.US.DG"]
[null,0,"S.US.EXPE",{"$f":"IFERROR(RTD(\"cqg.rtd\", ,\"ContractData\",C203, \"PerCentNetLastTrade\",, \"T\")/100,\"\")","v":-5.6988174953697115E-3},374,374,"S.US.EXPE",203,"S.US.HAS"]
[null,0,"S.US.EXPD",{"$f":"IFERROR(RTD(\"cqg.rtd\", ,\"ContractData\",C204, \"PerCentNetLastTrade\",, \"T\")/100,\"\")","v":-1.0479867622724766E-2},474,474,"S.US.EXPD",204,"S.US.CMCSA"]
[null,0,"S.US.EXR",{"$f":"IFERROR(RTD(\"cqg.rtd\", ,\"ContractData\",C205, \"PerCentNetLastTrade\",, \"T\")/100,\"\")","v":-6.9491756370077661E-3},405,405,"S.US.EXR",205,"S.US.LANC"]
[null,1,"S.US.FFIV",{"$f":"IFERROR(RTD(\"cqg.rtd\", ,\"ContractData\",C206, \"PerCentNetLastTrade\",, \"T\")/100,\"\")","v":2.2555806175624175E-3},85,85,"S.US.FFIV",206,"S.US.UNP"]
[null,1,"S.US.FB",{"$f":"IFERROR(RTD(\"cqg.rtd\", ,\"ContractData\",C207, \"PerCentNetLastTrade\",, \"T\")/100,\"\")","v":7.9872204472843447E-4},121,121,"S.US.FB",207,"S.US.FULT"]
[null,0,"S.US.FDS",{"$f":"IFERROR(RTD(\"cqg.rtd\", ,\"ContractData\",C208, \"PerCentNetLastTrade\",, \"T\")/100,\"\")","v":-1.3957457182909734E-2},514,514,"S.US.FDS",208,"S.US.KMB"]
[null,0,"S.US.FICO",{"$f":"IFERROR(RTD(\"cqg.rtd\", ,\"ContractData\",C209, \"PerCentNetLastTrade\",, \"T\")/100,\"\")","v":-7.1060836777608579E-3},406,406,"S.US.FICO",209,"S.US.POOL"]
[null,1,"S.US.FAST",{"$f":"IFERROR(RTD(\"cqg.rtd\", ,\"ContractData\",C210, \"PerCentNetLastTrade\",, \"T\")/100,\"\")","v":2.1891418563922942E-4},136,136,"S.US.FAST",210,"S.US.PLD"]
[null,0,"S.US.FRT",{"$f":"IFERROR(RTD(\"cqg.rtd\", ,\"ContractData\",C211, \"PerCentNetLastTrade\",, \"T\")/100,\"\")","v":-1.2652507907817443E-2},498,498,"S.US.FRT",211,"S.US.DPZ"]
[null,0,"S.US.FII",{"$f":"IFERROR(RTD(\"cqg.rtd\", ,\"ContractData\",C212, \"PerCentNetLastTrade\",, \"T\")/100,\"\")","v":-5.4305663304887505E-3},361,361,"S.US.FII",212,"S.US.DHR"]
[null,0,"S.US.FDX",{"$f":"IFERROR(RTD(\"cqg.rtd\", ,\"ContractData\",C213, \"PerCentNetLastTrade\",, \"T\")/100,\"\")","v":-4.7292381249350382E-3},345,345,"S.US.FDX",213,"S.US.DCI"]
[null,0,"S.US.FIS",{"$f":"IFERROR(RTD(\"cqg.rtd\", ,\"ContractData\",C214, \"PerCentNetLastTrade\",, \"T\")/100,\"\")","v":-2.0469596628537026E-3},229,229,"S.US.FIS",214,"S.US.SAM"]
[null,0,"S.US.FHN",{"$f":"IFERROR(RTD(\"cqg.rtd\", ,\"ContractData\",C215, \"PerCentNetLastTrade\",, \"T\")/100,\"\")","v":-4.8992923244420249E-3},350,350,"S.US.FHN",215,"S.US.TEL"]
[null,0,"S.US.FR",{"$f":"IFERROR(RTD(\"cqg.rtd\", ,\"ContractData\",C216, \"PerCentNetLastTrade\",, \"T\")/100,\"\")","v":-7.1149057274991104E-4},170,170,"S.US.FR",216,"S.US.TXN"]
[null,0,"S.US.FISV",{"$f":"IFERROR(RTD(\"cqg.rtd\", ,\"ContractData\",C217, \"PerCentNetLastTrade\",, \"T\")/100,\"\")","v":-1E-3},185,185,"S.US.FISV",217,"S.US.PSA"]
[null,0,"S.US.FLIR",{"$f":"IFERROR(RTD(\"cqg.rtd\", ,\"ContractData\",C218, \"PerCentNetLastTrade\",, \"T\")/100,\"\")","v":-5.4127198917456026E-4},163,163,"S.US.FLIR",218,"S.US.D"]
[null,0,"S.US.FMC",{"$f":"IFERROR(RTD(\"cqg.rtd\", ,\"ContractData\",C219, \"PerCentNetLastTrade\",, \"T\")/100,\"\")","v":-1.1870650839132215E-2},494,494,"S.US.FMC",219,"S.US.TWX"]
[null,0,"S.US.FL",{"$f":"IFERROR(RTD(\"cqg.rtd\", ,\"ContractData\",C220, \"PerCentNetLastTrade\",, \"T\")/100,\"\")","v":-3.126628452318916E-3},273,273,"S.US.FL",220,"S.US.CERN"]
[null,0,"S.US.FTNT",{"$f":"IFERROR(RTD(\"cqg.rtd\", ,\"ContractData\",C221, \"PerCentNetLastTrade\",, \"T\")/100,\"\")","v":-4.4910179640718561E-3},337,337,"S.US.FTNT",221,"S.US.WST"]
[null,0,"S.US.FTV",{"$f":"IFERROR(RTD(\"cqg.rtd\", ,\"ContractData\",C222, \"PerCentNetLastTrade\",, \"T\")/100,\"\")","v":-1.5837820715869499E-4},149,149,"S.US.FTV",222,"S.US.SWKS"]
[null,0,"S.US.FBHS",{"$f":"IFERROR(RTD(\"cqg.rtd\", ,\"ContractData\",C223, \"PerCentNetLastTrade\",, \"T\")/100,\"\")","v":-2.3629489603024575E-3},239,239,"S.US.FBHS",223,"S.US.INTC"]
[null,0,"S.US.FCX",{"$f":"IFERROR(RTD(\"cqg.rtd\", ,\"ContractData\",C224, \"PerCentNetLastTrade\",, \"T\")/100,\"\")","v":-1.4406779661016949E-2},520,520,"S.US.FCX",224,"S.US.AMAT"]
[null,0,"S.US.FULT",{"$f":"IFERROR(RTD(\"cqg.rtd\", ,\"ContractData\",C225, \"PerCentNetLastTrade\",, \"T\")/100,\"\")","v":-1.6260162601626016E-3},207,207,"S.US.FULT",225,"S.US.ETFC"]
[null,0,"S.US.GRMN",{"$f":"IFERROR(RTD(\"cqg.rtd\", ,\"ContractData\",C226, \"PerCentNetLastTrade\",, \"T\")/100,\"\")","v":-8.3825490569632306E-3},435,435,"S.US.GRMN",226,"S.US.MMC"]
[null,0,"S.US.IT",{"$f":"IFERROR(RTD(\"cqg.rtd\", ,\"ContractData\",C227, \"PerCentNetLastTrade\",, \"T\")/100,\"\")","v":-3.8862391803568277E-3},304,304,"S.US.IT",227,"S.US.SBH"]
[null,0,"S.US.GATX",{"$f":"IFERROR(RTD(\"cqg.rtd\", ,\"ContractData\",C228, \"PerCentNetLastTrade\",, \"T\")/100,\"\")","v":-7.6833138466677799E-3},421,421,"S.US.GATX",228,"S.US.CSRA"]
[null,0,"S.US.GD",{"$f":"IFERROR(RTD(\"cqg.rtd\", ,\"ContractData\",C229, \"PerCentNetLastTrade\",, \"T\")/100,\"\")","v":-2.857580241873756E-3},263,263,"S.US.GD",229,"S.US.FIS"]
[null,0,"S.US.GE",{"$f":"IFERROR(RTD(\"cqg.rtd\", ,\"ContractData\",C230, \"PerCentNetLastTrade\",, \"T\")/100,\"\")","v":-3.0800821355236141E-3},271,271,"S.US.GE",230,"S.US.BLK"]
[null,1,"S.US.GIS",{"$f":"IFERROR(RTD(\"cqg.rtd\", ,\"ContractData\",C231, \"PerCentNetLastTrade\",, \"T\")/100,\"\")","v":2.617801047120419E-3},79,79,"S.US.GIS",231,"S.US.SYMC"]
[null,0,"S.US.GWR",{"$f":"IFERROR(RTD(\"cqg.rtd\", ,\"ContractData\",C232, \"PerCentNetLastTrade\",, \"T\")/100,\"\")","v":-1.4270203195284627E-2},517,517,"S.US.GWR",232,"S.US.IEX"]
[null,0,"S.US.GNTX",{"$f":"IFERROR(RTD(\"cqg.rtd\", ,\"ContractData\",C233, \"PerCentNetLastTrade\",, \"T\")/100,\"\")","v":-3.489531405782652E-3},285,285,"S.US.GNTX",233,"S.US.CRUS"]
[null,1,"S.US.GEO",{"$f":"IFERROR(RTD(\"cqg.rtd\", ,\"ContractData\",C234, \"PerCentNetLastTrade\",, \"T\")/100,\"\")","v":9.383797309978105E-4},113,113,"S.US.GEO",234,"S.US.PCH"]
[null,0,"S.US.GGP",{"$f":"IFERROR(RTD(\"cqg.rtd\", ,\"ContractData\",C235, \"PerCentNetLastTrade\",, \"T\")/100,\"\")","v":-1.5716210148181409E-2},537,537,"S.US.GGP",235,"S.US.BSX"]
[null,0,"S.US.GILD",{"$f":"IFERROR(RTD(\"cqg.rtd\", ,\"ContractData\",C236, \"PerCentNetLastTrade\",, \"T\")/100,\"\")","v":-4.8672566371681415E-3},349,349,"S.US.GILD",236,"S.US.PBH"]
[null,1,"S.US.GPN",{"$f":"IFERROR(RTD(\"cqg.rtd\", ,\"ContractData\",C237, \"PerCentNetLastTrade\",, \"T\")/100,\"\")","v":1.2780295108632508E-3},107,107,"S.US.GPN",237,"S.US.SEIC"]
[null,0,"S.US.GMED",{"$f":"IFERROR(RTD(\"cqg.rtd\", ,\"ContractData\",C238, \"PerCentNetLastTrade\",, \"T\")/100,\"\")","v":-8.9228808158062448E-3},447,447,"S.US.GMED",238,"S.US.BMY"]
[null,1,"S.US.GGG",{"$f":"IFERROR(RTD(\"cqg.rtd\", ,\"ContractData\",C239, \"PerCentNetLastTrade\",, \"T\")/100,\"\")","v":0},140,140,"S.US.GGG",239,"S.US.FBHS"]
[null,0,"S.US.GVA",{"$f":"IFERROR(RTD(\"cqg.rtd\", ,\"ContractData\",C240, \"PerCentNetLastTrade\",, \"T\")/100,\"\")","v":-2.0315169925954054E-2},553,553,"S.US.GVA",240,"S.US.CRM"]
[null,1,"S.US.GPOR",{"$f":"IFERROR(RTD(\"cqg.rtd\", ,\"ContractData\",C241, \"PerCentNetLastTrade\",, \"T\")/100,\"\")","v":1.338432122370937E-2},13,13,"S.US.GPOR",241,"S.US.LPT"]
[null,1,"S.US.HAL",{"$f":"IFERROR(RTD(\"cqg.rtd\", ,\"ContractData\",C242, \"PerCentNetLastTrade\",, \"T\")/100,\"\")","v":2.1939447125932428E-3},86,86,"S.US.HAL",242,"S.US.PKG"]
[null,1,"S.US.HBI",{"$f":"IFERROR(RTD(\"cqg.rtd\", ,\"ContractData\",C243, \"PerCentNetLastTrade\",, \"T\")/100,\"\")","v":2.3299161230195715E-3},83,83,"S.US.HBI",243,"S.US.WM"]
[null,0,"S.US.HOG",{"$f":"IFERROR(RTD(\"cqg.rtd\", ,\"ContractData\",C244, \"PerCentNetLastTrade\",, \"T\")/100,\"\")","v":-1.1033991813489945E-2},485,485,"S.US.HOG",244,"S.US.YUM"]
[null,0,"S.US.HRS",{"$f":"IFERROR(RTD(\"cqg.rtd\", ,\"ContractData\",C245, \"PerCentNetLastTrade\",, \"T\")/100,\"\")","v":-3.7933526011560692E-3},300,300,"S.US.HRS",245,"S.US.OXY"]
[null,0,"S.US.HAS",{"$f":"IFERROR(RTD(\"cqg.rtd\", ,\"ContractData\",C246, \"PerCentNetLastTrade\",, \"T\")/100,\"\")","v":-1.497005988023952E-3},203,203,"S.US.HAS",246,"S.US.COL"]
[null,1,"S.US.HCA",{"$f":"IFERROR(RTD(\"cqg.rtd\", ,\"ContractData\",C247, \"PerCentNetLastTrade\",, \"T\")/100,\"\")","v":3.592814371257485E-3},62,62,"S.US.HCA",247,"S.US.VRSK"]
[null,0,"S.US.HR",{"$f":"IFERROR(RTD(\"cqg.rtd\", ,\"ContractData\",C248, \"PerCentNetLastTrade\",, \"T\")/100,\"\")","v":-1.2728966159577771E-2},501,501,"S.US.HR",248,"S.US.RYN"]
[null,0,"S.US.HLS",{"$f":"IFERROR(RTD(\"cqg.rtd\", ,\"ContractData\",C249, \"PerCentNetLastTrade\",, \"T\")/100,\"\")","v":-4.6335299073294017E-3},341,341,"S.US.HLS",249,"S.US.DCT"]
[null,0,"S.US.HSY",{"$f":"IFERROR(RTD(\"cqg.rtd\", ,\"ContractData\",C250, \"PerCentNetLastTrade\",, \"T\")/100,\"\")","v":-4.1841004184100415E-3},326,326,"S.US.HSY",250,"S.US.SNV"]
[null,0,"S.US.HIW",{"$f":"IFERROR(RTD(\"cqg.rtd\", ,\"ContractData\",C251, \"PerCentNetLastTrade\",, \"T\")/100,\"\")","v":-8.4479371316306482E-3},438,438,"S.US.HIW",251,"S.US.CPRT"]
[null,0,"S.US.HRC",{"$f":"IFERROR(RTD(\"cqg.rtd\", ,\"ContractData\",C252, \"PerCentNetLastTrade\",, \"T\")/100,\"\")","v":-2.6253609871357313E-4},153,153,"S.US.HRC",252,"S.US.SHW"]
[null,1,"S.US.HNI",{"$f":"IFERROR(RTD(\"cqg.rtd\", ,\"ContractData\",C253, \"PerCentNetLastTrade\",, \"T\")/100,\"\")","v":2.8540065861690448E-3},74,74,"S.US.HNI",253,"S.US.ORCL"]
[null,1,"S.US.HOLX",{"$f":"IFERROR(RTD(\"cqg.rtd\", ,\"ContractData\",C254, \"PerCentNetLastTrade\",, \"T\")/100,\"\")","v":4.662522202486679E-3},51,51,"S.US.HOLX",254,"S.US.ITW"]
[null,1,"S.US.HD",{"$f":"IFERROR(RTD(\"cqg.rtd\", ,\"ContractData\",C255, \"PerCentNetLastTrade\",, \"T\")/100,\"\")","v":2.8254029409876067E-3},75,75,"S.US.HD",255,"S.US.AVY"]
[null,0,"S.US.HON",{"$f":"IFERROR(RTD(\"cqg.rtd\", ,\"ContractData\",C256, \"PerCentNetLastTrade\",, \"T\")/100,\"\")","v":-2.8156152499809756E-3},259,259,"S.US.HON",256,"S.US.NTAP"]
[null,0,"S.US.HST",{"$f":"IFERROR(RTD(\"cqg.rtd\", ,\"ContractData\",C257, \"PerCentNetLastTrade\",, \"T\")/100,\"\")","v":-1.4892443463872036E-2},528,528,"S.US.HST",257,{"$f":"IFERROR(VLOOKUP(H257,$F$1:$G$564,2,FALSE),\"\")","v":"S.US.TSCO"}]
[null,{"$f":"IF(D258>=0,1,)","v":0},"S.US.HUBB",{"$f":"IFERROR(RTD(\"cqg.rtd\", ,\"ContractData\",C258, \"PerCentNetLastTrade\",, \"T\")/100,\"\")","v":-3.0149862552097191E-3},268,{"$f":"IFERROR(E258,\"\")","v":268},{"$f":"C258","v":"S.US.HUBB"},258,"S.US.INTU"]
[null,0,"S.US.HUM",{"$f":"IFERROR(RTD(\"cqg.rtd\", ,\"ContractData\",C259, \"PerCentNetLastTrade\",, \"T\")/100,\"\")","v":-1.3057103064066853E-3},195,195,"S.US.HUM",{"$f":"H258+1","v":259},"S.US.HON"]
[null,1,"S.US.HII",{"$f":"IFERROR(RTD(\"cqg.rtd\", ,\"ContractData\",C260, \"PerCentNetLastTrade\",, \"T\")/100,\"\")","v":1.6879795396419436E-3},93,93,"S.US.HII",260,"S.US.EA"]
[null,0,"S.US.IEX",{"$f":"IFERROR(RTD(\"cqg.rtd\", ,\"ContractData\",C261, \"PerCentNetLastTrade\",, \"T\")/100,\"\")","v":-2.1825773391535397E-3},232,232,"S.US.IEX",261,"S.US.BCR"]
[null,0,"S.US.IDXX",{"$f":"IFERROR(RTD(\"cqg.rtd\", ,\"ContractData\",C262, \"PerCentNetLastTrade\",, \"T\")/100,\"\")","v":-4.062288422477996E-3},318,318,"S.US.IDXX",262,"S.US.A"]
[null,0,"S.US.ITW",{"$f":"IFERROR(RTD(\"cqg.rtd\", ,\"ContractData\",C263, \"PerCentNetLastTrade\",, \"T\")/100,\"\")","v":-2.7220630372492838E-3},254,254,"S.US.ITW",263,"S.US.GD"]
[null,0,"S.US.ILMN",{"$f":"IFERROR(RTD(\"cqg.rtd\", ,\"ContractData\",C264, \"PerCentNetLastTrade\",, \"T\")/100,\"\")","v":-1.0045954900074809E-2},469,469,"S.US.ILMN",264,"S.US.IPG"]
[null,0,"S.US.INCR",{"$f":"IFERROR(RTD(\"cqg.rtd\", ,\"ContractData\",C265, \"PerCentNetLastTrade\",, \"T\")/100,\"\")","v":-3.0660377358490564E-3},270,270,"S.US.INCR",265,"S.US.SBUX"]
[null,0,"S.US.INCY",{"$f":"IFERROR(RTD(\"cqg.rtd\", ,\"ContractData\",C266, \"PerCentNetLastTrade\",, \"T\")/100,\"\")","v":-2.802058655338616E-2},560,560,"S.US.INCY",266,"S.US.KO"]
[null,0,"S.US.IR",{"$f":"IFERROR(RTD(\"cqg.rtd\", ,\"ContractData\",C267, \"PerCentNetLastTrade\",, \"T\")/100,\"\")","v":-3.8884568381290967E-3},305,305,"S.US.IR",267,"S.US.CAT"]
[null,0,"S.US.INGR",{"$f":"IFERROR(RTD(\"cqg.rtd\", ,\"ContractData\",C268, \"PerCentNetLastTrade\",, \"T\")/100,\"\")","v":-1.3846281402868749E-2},512,512,"S.US.INGR",268,"S.US.HUBB"]
[null,0,"S.US.IDTI",{"$f":"IFERROR(RTD(\"cqg.rtd\", ,\"ContractData\",C269, \"PerCentNetLastTrade\",, \"T\")/100,\"\")","v":-4.3029259896729772E-4},160,160,"S.US.IDTI",269,"S.US.CME"]
[null,0,"S.US.INTC",{"$f":"IFERROR(RTD(\"cqg.rtd\", ,\"ContractData\",C270, \"PerCentNetLastTrade\",, \"T\")/100,\"\")","v":-1.9011406844106462E-3},223,223,"S.US.INTC",270,"S.US.INCR"]
[null,0,"S.US.ICE",{"$f":"IFERROR(RTD(\"cqg.rtd\", ,\"ContractData\",C271, \"PerCentNetLastTrade\",, \"T\")/100,\"\")","v":-6.1197485941118087E-3},383,383,"S.US.ICE",271,"S.US.GE"]
[null,0,"S.US.IDCC",{"$f":"IFERROR(RTD(\"cqg.rtd\", ,\"ContractData\",C272, \"PerCentNetLastTrade\",, \"T\")/100,\"\")","v":-1.1216056670602126E-2},488,488,"S.US.IDCC",272,"S.US.MMM"]
[null,0,"S.US.IBOC",{"$f":"IFERROR(RTD(\"cqg.rtd\", ,\"ContractData\",C273, \"PerCentNetLastTrade\",, \"T\")/100,\"\")","v":-4.0650406504065036E-3},319,319,"S.US.IBOC",273,"S.US.FL"]
[null,0,"S.US.IBM",{"$f":"IFERROR(RTD(\"cqg.rtd\", ,\"ContractData\",C274, \"PerCentNetLastTrade\",, \"T\")/100,\"\")","v":-1.4704933892292809E-2},523,523,"S.US.IBM",274,"S.US.EQIX"]
[null,0,"S.US.IFF",{"$f":"IFERROR(RTD(\"cqg.rtd\", ,\"ContractData\",C275, \"PerCentNetLastTrade\",, \"T\")/100,\"\")","v":-1.0411431033244775E-2},473,473,"S.US.IFF",275,"S.US.CPT"]
[null,0,"S.US.IPG",{"$f":"IFERROR(RTD(\"cqg.rtd\", ,\"ContractData\",C276, \"PerCentNetLastTrade\",, \"T\")/100,\"\")","v":-2.883031301482702E-3},264,264,"S.US.IPG",276,"S.US.ADBE"]
[null,0,"S.US.INTU",{"$f":"IFERROR(RTD(\"cqg.rtd\", ,\"ContractData\",C277, \"PerCentNetLastTrade\",, \"T\")/100,\"\")","v":-2.7746947835738068E-3},258,258,"S.US.INTU",277,"S.US.CNK"]
[null,0,"S.US.ISRG",{"$f":"IFERROR(RTD(\"cqg.rtd\", ,\"ContractData\",C278, \"PerCentNetLastTrade\",, \"T\")/100,\"\")","v":-3.9386742540033388E-3},306,306,"S.US.ISRG",278,"S.US.ESS"]
[null,0,"S.US.IPGP",{"$f":"IFERROR(RTD(\"cqg.rtd\", ,\"ContractData\",C279, \"PerCentNetLastTrade\",, \"T\")/100,\"\")","v":-1.2712181260749269E-3},193,193,"S.US.IPGP",279,"S.US.CBRL"]
[null,0,"S.US.IRM",{"$f":"IFERROR(RTD(\"cqg.rtd\", ,\"ContractData\",C280, \"PerCentNetLastTrade\",, \"T\")/100,\"\")","v":-8.5082246171298923E-3},443,443,"S.US.IRM",280,"S.US.LECO"]
[null,0,"S.US.JCOM",{"$f":"IFERROR(RTD(\"cqg.rtd\", ,\"ContractData\",C281, \"PerCentNetLastTrade\",, \"T\")/100,\"\")","v":-1.1808851120185411E-2},492,492,"S.US.JCOM",281,"S.US.AMP"]
[null,0,"S.US.JKHY",{"$f":"IFERROR(RTD(\"cqg.rtd\", ,\"ContractData\",C282, \"PerCentNetLastTrade\",, \"T\")/100,\"\")","v":-6.8262862964849728E-3},398,398,"S.US.JKHY",282,"S.US.DISH"]
[null,0,"S.US.JACK",{"$f":"IFERROR(RTD(\"cqg.rtd\", ,\"ContractData\",C283, \"PerCentNetLastTrade\",, \"T\")/100,\"\")","v":-7.1738720030205773E-3},409,409,"S.US.JACK",283,"S.US.ENR"]
[null,0,"S.US.JBHT",{"$f":"IFERROR(RTD(\"cqg.rtd\", ,\"ContractData\",C284, \"PerCentNetLastTrade\",, \"T\")/100,\"\")","v":-9.2415192155978817E-3},452,452,"S.US.JBHT",284,"S.US.LFUS"]
[null,0,"S.US.JWA",{"$f":"IFERROR(RTD(\"cqg.rtd\", ,\"ContractData\",C285, \"PerCentNetLastTrade\",, \"T\")/100,\"\")","v":-2.7906976744186046E-2},559,559,"S.US.JWA",285,"S.US.GNTX"]
[null,0,"S.US.JNJ",{"$f":"IFERROR(RTD(\"cqg.rtd\", ,\"ContractData\",C286, \"PerCentNetLastTrade\",, \"T\")/100,\"\")","v":-8.0965104040158691E-4},176,176,"S.US.JNJ",286,"S.US.SLAB"]
[null,0,"S.US.JNPR",{"$f":"IFERROR(RTD(\"cqg.rtd\", ,\"ContractData\",C287, \"PerCentNetLastTrade\",, \"T\")/100,\"\")","v":-6.5466448445171855E-4},168,168,"S.US.JNPR",287,"S.US.PEP"]
[null,1,"S.US.KATE",{"$f":"IFERROR(RTD(\"cqg.rtd\", ,\"ContractData\",C288, \"PerCentNetLastTrade\",, \"T\")/100,\"\")","v":8.1909251620506773E-2},2,2,"S.US.KATE",288,"S.US.EPR"]
[null,1,"S.US.K",{"$f":"IFERROR(RTD(\"cqg.rtd\", ,\"ContractData\",C289, \"PerCentNetLastTrade\",, \"T\")/100,\"\")","v":1.0609704342905644E-2},17,17,"S.US.K",289,"S.US.OFC"]
[null,0,"S.US.KMT",{"$f":"IFERROR(RTD(\"cqg.rtd\", ,\"ContractData\",C290, \"PerCentNetLastTrade\",, \"T\")/100,\"\")","v":-1.8943170488534399E-2},550,550,"S.US.KMT",290,"S.US.VMI"]
[null,0,"S.US.KEY",{"$f":"IFERROR(RTD(\"cqg.rtd\", ,\"ContractData\",C291, \"PerCentNetLastTrade\",, \"T\")/100,\"\")","v":-1.0678056593699948E-3},186,186,"S.US.KEY",291,"S.US.CGNX"]
[null,1,"S.US.KEYS",{"$f":"IFERROR(RTD(\"cqg.rtd\", ,\"ContractData\",C292, \"PerCentNetLastTrade\",, \"T\")/100,\"\")","v":2.5693730729701952E-3},80,80,"S.US.KEYS",292,"S.US.STZ"]
[null,0,"S.US.KRC",{"$f":"IFERROR(RTD(\"cqg.rtd\", ,\"ContractData\",C293, \"PerCentNetLastTrade\",, \"T\")/100,\"\")","v":-6.1529855964200806E-3},385,385,"S.US.KRC",293,"S.US.NFLX"]
[null,0,"S.US.KMB",{"$f":"IFERROR(RTD(\"cqg.rtd\", ,\"ContractData\",C294, \"PerCentNetLastTrade\",, \"T\")/100,\"\")","v":-1.6330974414806752E-3},208,208,"S.US.KMB",294,"S.US.DKS"]
[null,0,"S.US.KIM",{"$f":"IFERROR(RTD(\"cqg.rtd\", ,\"ContractData\",C295, \"PerCentNetLastTrade\",, \"T\")/100,\"\")","v":-2.156469408224674E-2},554,554,"S.US.KIM",295,"S.US.NDSN"]
[null,0,"S.US.KLAC",{"$f":"IFERROR(RTD(\"cqg.rtd\", ,\"ContractData\",C296, \"PerCentNetLastTrade\",, \"T\")/100,\"\")","v":-4.4580939171785213E-3},336,336,"S.US.KLAC",296,"S.US.BID"]
[null,1,"S.US.LB",{"$f":"IFERROR(RTD(\"cqg.rtd\", ,\"ContractData\",C297, \"PerCentNetLastTrade\",, \"T\")/100,\"\")","v":1.5857478465152702E-2},9,9,"S.US.LB",297,"S.US.BKH"]
[null,0,"S.US.LLL",{"$f":"IFERROR(RTD(\"cqg.rtd\", ,\"ContractData\",C298, \"PerCentNetLastTrade\",, \"T\")/100,\"\")","v":-7.7514792899408278E-3},422,422,"S.US.LLL",298,"S.US.VTR"]
[null,0,"S.US.LH",{"$f":"IFERROR(RTD(\"cqg.rtd\", ,\"ContractData\",C299, \"PerCentNetLastTrade\",, \"T\")/100,\"\")","v":-4.0033712600084283E-3},311,311,"S.US.LH",299,"S.US.DECK"]
[null,0,"S.US.LRCX",{"$f":"IFERROR(RTD(\"cqg.rtd\", ,\"ContractData\",C300, \"PerCentNetLastTrade\",, \"T\")/100,\"\")","v":-1.4636418069323399E-3},199,199,"S.US.LRCX",300,"S.US.HRS"]
[null,1,"S.US.LAMR",{"$f":"IFERROR(RTD(\"cqg.rtd\", ,\"ContractData\",C301, \"PerCentNetLastTrade\",, \"T\")/100,\"\")","v":4.4824205070738195E-3},52,52,"S.US.LAMR",301,"S.US.RJF"]
[null,0,"S.US.LW",{"$f":"IFERROR(RTD(\"cqg.rtd\", ,\"ContractData\",C302, \"PerCentNetLastTrade\",, \"T\")/100,\"\")","v":-9.381765696415684E-3},457,457,"S.US.LW",302,"S.US.AMGN"]
[null,0,"S.US.LANC",{"$f":"IFERROR(RTD(\"cqg.rtd\", ,\"ContractData\",C303, \"PerCentNetLastTrade\",, \"T\")/100,\"\")","v":-1.5394587587100955E-3},205,205,"S.US.LANC",303,"S.US.BOH"]
[null,0,"S.US.LSTR",{"$f":"IFERROR(RTD(\"cqg.rtd\", ,\"ContractData\",C304, \"PerCentNetLastTrade\",, \"T\")/100,\"\")","v":-9.5408467501490752E-3},461,461,"S.US.LSTR",304,"S.US.IT"]
[null,0,"S.US.LEG",{"$f":"IFERROR(RTD(\"cqg.rtd\", ,\"ContractData\",C305, \"PerCentNetLastTrade\",, \"T\")/100,\"\")","v":-5.2054285183119539E-3},355,355,"S.US.LEG",305,"S.US.IR"]
[null,0,"S.US.LII",{"$f":"IFERROR(RTD(\"cqg.rtd\", ,\"ContractData\",C306, \"PerCentNetLastTrade\",, \"T\")/100,\"\")","v":-5.8981233243967819E-3},379,379,"S.US.LII",306,"S.US.ISRG"]
[null,1,"S.US.LVLT",{"$f":"IFERROR(RTD(\"cqg.rtd\", ,\"ContractData\",C307, \"PerCentNetLastTrade\",, \"T\")/100,\"\")","v":2.9493407356002777E-3},71,71,"S.US.LVLT",307,"S.US.RHT"]
[null,0,"S.US.LPT",{"$f":"IFERROR(RTD(\"cqg.rtd\", ,\"ContractData\",C308, \"PerCentNetLastTrade\",, \"T\")/100,\"\")","v":-2.4384296513045595E-3},241,241,"S.US.LPT",308,"S.US.NLSN"]
[null,0,"S.US.LECO",{"$f":"IFERROR(RTD(\"cqg.rtd\", ,\"ContractData\",C309, \"PerCentNetLastTrade\",, \"T\")/100,\"\")","v":-3.3218912634259772E-3},280,280,"S.US.LECO",309,"S.US.AVB"]
[null,0,"S.US.LFUS",{"$f":"IFERROR(RTD(\"cqg.rtd\", ,\"ContractData\",C310, \"PerCentNetLastTrade\",, \"T\")/100,\"\")","v":-3.4691070040074167E-3},284,284,"S.US.LFUS",310,"S.US.CHDN"]
[null,0,"S.US.LYV",{"$f":"IFERROR(RTD(\"cqg.rtd\", ,\"ContractData\",C311, \"PerCentNetLastTrade\",, \"T\")/100,\"\")","v":-1.4471780028943559E-2},521,521,"S.US.LYV",311,"S.US.LH"]
[null,0,"S.US.LKQ",{"$f":"IFERROR(RTD(\"cqg.rtd\", ,\"ContractData\",C312, \"PerCentNetLastTrade\",, \"T\")/100,\"\")","v":-4.1243654822335028E-3},323,323,"S.US.LKQ",312,"S.US.CR"]
[null,1,"S.US.LMT",{"$f":"IFERROR(RTD(\"cqg.rtd\", ,\"ContractData\",C313, \"PerCentNetLastTrade\",, \"T\")/100,\"\")","v":2.5638208255503057E-3},81,81,"S.US.LMT",313,"S.US.AMT"]
[null,0,"S.US.LOGM",{"$f":"IFERROR(RTD(\"cqg.rtd\", ,\"ContractData\",C314, \"PerCentNetLastTrade\",, \"T\")/100,\"\")","v":-3.8445638693675073E-2},563,563,"S.US.LOGM",314,"S.US.WTR"]
[null,1,"S.US.LOW",{"$f":"IFERROR(RTD(\"cqg.rtd\", ,\"ContractData\",C315, \"PerCentNetLastTrade\",, \"T\")/100,\"\")","v":0},141,141,"S.US.LOW",315,"S.US.NVDA"]
[null,0,"S.US.CLI",{"$f":"IFERROR(RTD(\"cqg.rtd\", ,\"ContractData\",C316, \"PerCentNetLastTrade\",, \"T\")/100,\"\")","v":-1.5178894109143477E-2},533,533,"S.US.CLI",316,"S.US.BDX"]
[null,1,"S.US.MANH",{"$f":"IFERROR(RTD(\"cqg.rtd\", ,\"ContractData\",C317, \"PerCentNetLastTrade\",, \"T\")/100,\"\")","v":8.8417329796640148E-4},117,117,"S.US.MANH",317,"S.US.SXT"]
[null,0,"S.US.MKTX",{"$f":"IFERROR(RTD(\"cqg.rtd\", ,\"ContractData\",C318, \"PerCentNetLastTrade\",, \"T\")/100,\"\")","v":-1.6343696763202728E-2},539,539,"S.US.MKTX",318,"S.US.IDXX"]
[null,0,"S.US.MAR",{"$f":"IFERROR(RTD(\"cqg.rtd\", ,\"ContractData\",C319, \"PerCentNetLastTrade\",, \"T\")/100,\"\")","v":-5.6671818650180315E-3},372,372,"S.US.MAR",319,"S.US.IBOC"]
[null,0,"S.US.MMC",{"$f":"IFERROR(RTD(\"cqg.rtd\", ,\"ContractData\",C320, \"PerCentNetLastTrade\",, \"T\")/100,\"\")","v":-2.0131525969668499E-3},226,226,"S.US.MMC",320,"S.US.MAT"]
[null,0,"S.US.MLM",{"$f":"IFERROR(RTD(\"cqg.rtd\", ,\"ContractData\",C321, \"PerCentNetLastTrade\",, \"T\")/100,\"\")","v":-1.5449379078088823E-2},535,535,"S.US.MLM",321,{"$f":"IFERROR(VLOOKUP(H321,$F$1:$G$564,2,FALSE),\"\")","v":"S.US.SPGI"}]
[null,{"$f":"IF(D322>=0,1,)","v":1},"S.US.MAS",{"$f":"IFERROR(RTD(\"cqg.rtd\", ,\"ContractData\",C322, \"PerCentNetLastTrade\",, \"T\")/100,\"\")","v":0},142,{"$f":"IFERROR(E322,\"\")","v":142},{"$f":"C322","v":"S.US.MAS"},322,"S.US.WGL"]
[null,0,"S.US.MASI",{"$f":"IFERROR(RTD(\"cqg.rtd\", ,\"ContractData\",C323, \"PerCentNetLastTrade\",, \"T\")/100,\"\")","v":-8.4832032575500507E-3},440,440,"S.US.MASI",{"$f":"H322+1","v":323},"S.US.LKQ"]
[null,0,"S.US.MA",{"$f":"IFERROR(RTD(\"cqg.rtd\", ,\"ContractData\",C324, \"PerCentNetLastTrade\",, \"T\")/100,\"\")","v":-9.1914893617021272E-3},451,451,"S.US.MA",324,"S.US.VRSN"]
[null,0,"S.US.MAT",{"$f":"IFERROR(RTD(\"cqg.rtd\", ,\"ContractData\",C325, \"PerCentNetLastTrade\",, \"T\")/100,\"\")","v":-4.0687160940325491E-3},320,320,"S.US.MAT",325,"S.US.ENS"]
[null,1,"S.US.MMS",{"$f":"IFERROR(RTD(\"cqg.rtd\", ,\"ContractData\",C326, \"PerCentNetLastTrade\",, \"T\")/100,\"\")","v":6.7445303503865768E-3},36,36,"S.US.MMS",326,"S.US.HSY"]
[null,1,"S.US.MBFI",{"$f":"IFERROR(RTD(\"cqg.rtd\", ,\"ContractData\",C327, \"PerCentNetLastTrade\",, \"T\")/100,\"\")","v":1.3534852244529664E-3},103,103,"S.US.MBFI",327,"S.US.APD"]
[null,0,"S.US.MKC",{"$f":"IFERROR(RTD(\"cqg.rtd\", ,\"ContractData\",C328, \"PerCentNetLastTrade\",, \"T\")/100,\"\")","v":-2.9952076677316293E-4},155,155,"S.US.MKC",328,"S.US.ADI"]
[null,0,"S.US.MCD",{"$f":"IFERROR(RTD(\"cqg.rtd\", ,\"ContractData\",C329, \"PerCentNetLastTrade\",, \"T\")/100,\"\")","v":-6.9463739927757716E-4},169,169,"S.US.MCD",329,"S.US.V"]
[null,0,"S.US.MDU",{"$f":"IFERROR(RTD(\"cqg.rtd\", ,\"ContractData\",C330, \"PerCentNetLastTrade\",, \"T\")/100,\"\")","v":-8.4226646248085763E-3},437,437,"S.US.MDU",330,"S.US.PYPL"]
[null,0,"S.US.MJN",{"$f":"IFERROR(RTD(\"cqg.rtd\", ,\"ContractData\",C331, \"PerCentNetLastTrade\",, \"T\")/100,\"\")","v":-5.6274620146314015E-4},164,164,"S.US.MJN",331,"S.US.ACN"]
[null,0,"S.US.MD",{"$f":"IFERROR(RTD(\"cqg.rtd\", ,\"ContractData\",C332, \"PerCentNetLastTrade\",, \"T\")/100,\"\")","v":-9.3998553868402026E-3},458,458,"S.US.MD",332,"S.US.CRI"]
[null,1,"S.US.MRK",{"$f":"IFERROR(RTD(\"cqg.rtd\", ,\"ContractData\",C333, \"PerCentNetLastTrade\",, \"T\")/100,\"\")","v":6.2529310614350478E-3},40,40,"S.US.MRK",333,"S.US.EMR"]
[null,1,"S.US.MDP",{"$f":"IFERROR(RTD(\"cqg.rtd\", ,\"ContractData\",C334, \"PerCentNetLastTrade\",, \"T\")/100,\"\")","v":5.244755244755245E-3},47,47,"S.US.MDP",334,"S.US.DE"]
[null,1,"S.US.MTD",{"$f":"IFERROR(RTD(\"cqg.rtd\", ,\"ContractData\",C335, \"PerCentNetLastTrade\",, \"T\")/100,\"\")","v":1.635608483110964E-3},95,95,"S.US.MTD",335,"S.US.UHS"]
[null,1,"S.US.KORS",{"$f":"IFERROR(RTD(\"cqg.rtd\", ,\"ContractData\",C336, \"PerCentNetLastTrade\",, \"T\")/100,\"\")","v":6.2992125984251968E-3},39,39,"S.US.KORS",336,"S.US.KLAC"]
[null,0,"S.US.MIK",{"$f":"IFERROR(RTD(\"cqg.rtd\", ,\"ContractData\",C337, \"PerCentNetLastTrade\",, \"T\")/100,\"\")","v":-3.2430031097290091E-2},562,562,"S.US.MIK",337,"S.US.FTNT"]
[null,1,"S.US.MCHP",{"$f":"IFERROR(RTD(\"cqg.rtd\", ,\"ContractData\",C338, \"PerCentNetLastTrade\",, \"T\")/100,\"\")","v":5.3212717839563656E-4},129,129,"S.US.MCHP",338,"S.US.CCI"]
[null,0,"S.US.MSCC",{"$f":"IFERROR(RTD(\"cqg.rtd\", ,\"ContractData\",C339, \"PerCentNetLastTrade\",, \"T\")/100,\"\")","v":-1.1054247697031729E-2},486,486,"S.US.MSCC",339,"S.US.DPS"]
[null,0,"S.US.MSFT",{"$f":"IFERROR(RTD(\"cqg.rtd\", ,\"ContractData\",C340, \"PerCentNetLastTrade\",, \"T\")/100,\"\")","v":-5.2173913043478256E-3},356,356,"S.US.MSFT",340,"S.US.LUV"]
[null,0,"S.US.MAA",{"$f":"IFERROR(RTD(\"cqg.rtd\", ,\"ContractData\",C341, \"PerCentNetLastTrade\",, \"T\")/100,\"\")","v":-8.3958020989505239E-3},436,436,"S.US.MAA",341,"S.US.HLS"]
[null,0,"S.US.MTX",{"$f":"IFERROR(RTD(\"cqg.rtd\", ,\"ContractData\",C342, \"PerCentNetLastTrade\",, \"T\")/100,\"\")","v":-1.9292604501607719E-2},551,551,"S.US.MTX",342,"S.US.CMI"]
[null,1,"S.US.MHK",{"$f":"IFERROR(RTD(\"cqg.rtd\", ,\"ContractData\",C343, \"PerCentNetLastTrade\",, \"T\")/100,\"\")","v":2.6701119724375538E-3},77,77,"S.US.MHK",343,"S.US.TJX"]
[null,0,"S.US.MPWR",{"$f":"IFERROR(RTD(\"cqg.rtd\", ,\"ContractData\",C344, \"PerCentNetLastTrade\",, \"T\")/100,\"\")","v":-7.4898352236250796E-3},416,416,"S.US.MPWR",344,"S.US.WEC"]
[null,0,"S.US.MON",{"$f":"IFERROR(RTD(\"cqg.rtd\", ,\"ContractData\",C345, \"PerCentNetLastTrade\",, \"T\")/100,\"\")","v":-1.2048192771084336E-3},189,189,"S.US.MON",345,"S.US.FDX"]
[null,1,"S.US.MNST",{"$f":"IFERROR(RTD(\"cqg.rtd\", ,\"ContractData\",C346, \"PerCentNetLastTrade\",, \"T\")/100,\"\")","v":9.2729188619599581E-3},23,23,"S.US.MNST",346,"S.US.UPS"]
[null,0,"S.US.MCO",{"$f":"IFERROR(RTD(\"cqg.rtd\", ,\"ContractData\",C347, \"PerCentNetLastTrade\",, \"T\")/100,\"\")","v":-1.2602554343229299E-2},497,497,"S.US.MCO",347,"S.US.EWBC"]
[null,0,"S.US.MSI",{"$f":"IFERROR(RTD(\"cqg.rtd\", ,\"ContractData\",C348, \"PerCentNetLastTrade\",, \"T\")/100,\"\")","v":-1.0066319279962105E-2},470,470,"S.US.MSI",348,"S.US.ROK"]
[null,0,"S.US.MSA",{"$f":"IFERROR(RTD(\"cqg.rtd\", ,\"ContractData\",C349, \"PerCentNetLastTrade\",, \"T\")/100,\"\")","v":-9.4661113214691405E-3},459,459,"S.US.MSA",349,"S.US.GILD"]
[null,0,"S.US.MSM",{"$f":"IFERROR(RTD(\"cqg.rtd\", ,\"ContractData\",C350, \"PerCentNetLastTrade\",, \"T\")/100,\"\")","v":-7.4785132269226473E-3},415,415,"S.US.MSM",350,"S.US.FHN"]
[null,0,"S.US.MSCI",{"$f":"IFERROR(RTD(\"cqg.rtd\", ,\"ContractData\",C351, \"PerCentNetLastTrade\",, \"T\")/100,\"\")","v":-1.506931886678722E-2},531,531,"S.US.MSCI",351,"S.US.CONE"]
[null,1,"S.US.MUR",{"$f":"IFERROR(RTD(\"cqg.rtd\", ,\"ContractData\",C352, \"PerCentNetLastTrade\",, \"T\")/100,\"\")","v":1.4132925897631781E-2},10,10,"S.US.MUR",352,"S.US.CXO"]
[null,0,"S.US.NDAQ",{"$f":"IFERROR(RTD(\"cqg.rtd\", ,\"ContractData\",C353, \"PerCentNetLastTrade\",, \"T\")/100,\"\")","v":-1.074952142541599E-2},481,481,"S.US.NDAQ",353,"S.US.SYK"]
[null,1,"S.US.NFG",{"$f":"IFERROR(RTD(\"cqg.rtd\", ,\"ContractData\",C354, \"PerCentNetLastTrade\",, \"T\")/100,\"\")","v":7.9825834542815669E-3},30,30,"S.US.NFG",354,"S.US.SNPS"]
[null,0,"S.US.NATI",{"$f":"IFERROR(RTD(\"cqg.rtd\", ,\"ContractData\",C355, \"PerCentNetLastTrade\",, \"T\")/100,\"\")","v":-8.576329331046312E-4},180,180,"S.US.NATI",355,"S.US.LEG"]
[null,0,"S.US.NNN",{"$f":"IFERROR(RTD(\"cqg.rtd\", ,\"ContractData\",C356, \"PerCentNetLastTrade\",, \"T\")/100,\"\")","v":-1.7091899925687392E-2},542,542,"S.US.NNN",356,"S.US.MSFT"]
[null,0,"S.US.NCR",{"$f":"IFERROR(RTD(\"cqg.rtd\", ,\"ContractData\",C357, \"PerCentNetLastTrade\",, \"T\")/100,\"\")","v":-8.564814814814815E-3},444,444,"S.US.NCR",357,"S.US.SWK"]
[null,0,"S.US.NTAP",{"$f":"IFERROR(RTD(\"cqg.rtd\", ,\"ContractData\",C358, \"PerCentNetLastTrade\",, \"T\")/100,\"\")","v":-2.739043824701195E-3},256,256,"S.US.NTAP",358,"S.US.PH"]
[null,0,"S.US.NFLX",{"$f":"IFERROR(RTD(\"cqg.rtd\", ,\"ContractData\",C359, \"PerCentNetLastTrade\",, \"T\")/100,\"\")","v":-3.7037037037037034E-3},293,293,"S.US.NFLX",359,"S.US.BFB"]
[null,1,"S.US.NWL",{"$f":"IFERROR(RTD(\"cqg.rtd\", ,\"ContractData\",C360, \"PerCentNetLastTrade\",, \"T\")/100,\"\")","v":0.13645182151325716},1,1,"S.US.NWL",360,"S.US.APC"]
[null,1,"S.US.NFX",{"$f":"IFERROR(RTD(\"cqg.rtd\", ,\"ContractData\",C361, \"PerCentNetLastTrade\",, \"T\")/100,\"\")","v":6.938421509106678E-3},35,35,"S.US.NFX",361,"S.US.FII"]
[null,1,"S.US.NEU",{"$f":"IFERROR(RTD(\"cqg.rtd\", ,\"ContractData\",C362, \"PerCentNetLastTrade\",, \"T\")/100,\"\")","v":6.8987819338148107E-4},124,124,"S.US.NEU",362,"S.US.DIS"]
[null,0,"S.US.NEM",{"$f":"IFERROR(RTD(\"cqg.rtd\", ,\"ContractData\",C363, \"PerCentNetLastTrade\",, \"T\")/100,\"\")","v":-7.6382523678582333E-3},420,420,"S.US.NEM",363,"S.US.CDNS"]
[null,0,"S.US.NEE",{"$f":"IFERROR(RTD(\"cqg.rtd\", ,\"ContractData\",C364, \"PerCentNetLastTrade\",, \"T\")/100,\"\")","v":-7.4443534579021815E-5},145,145,"S.US.NEE",364,"S.US.CLX"]
[null,0,"S.US.NLSN",{"$f":"IFERROR(RTD(\"cqg.rtd\", ,\"ContractData\",C365, \"PerCentNetLastTrade\",, \"T\")/100,\"\")","v":-3.9800995024875628E-3},308,308,"S.US.NLSN",365,"S.US.CINF"]
[null,1,"S.US.NKE",{"$f":"IFERROR(RTD(\"cqg.rtd\", ,\"ContractData\",C366, \"PerCentNetLastTrade\",, \"T\")/100,\"\")","v":9.2678405931417981E-4},114,114,"S.US.NKE",366,"S.US.UDR"]
[null,1,"S.US.NBL",{"$f":"IFERROR(RTD(\"cqg.rtd\", ,\"ContractData\",C367, \"PerCentNetLastTrade\",, \"T\")/100,\"\")","v":1.9336126329358686E-3},89,89,"S.US.NBL",367,"S.US.UTHR"]
[null,0,"S.US.NDSN",{"$f":"IFERROR(RTD(\"cqg.rtd\", ,\"ContractData\",C368, \"PerCentNetLastTrade\",, \"T\")/100,\"\")","v":-3.7391913998597805E-3},295,295,"S.US.NDSN",368,"S.US.EFX"]
[null,1,"S.US.NTRS",{"$f":"IFERROR(RTD(\"cqg.rtd\", ,\"ContractData\",C369, \"PerCentNetLastTrade\",, \"T\")/100,\"\")","v":1.215066828675577E-3},109,109,"S.US.NTRS",369,"S.US.TXRH"]
[null,0,"S.US.NOC",{"$f":"IFERROR(RTD(\"cqg.rtd\", ,\"ContractData\",C370, \"PerCentNetLastTrade\",, \"T\")/100,\"\")","v":-7.2315294684825835E-4},171,171,"S.US.NOC",370,"S.US.RCL"]
[null,1,"S.US.NUS",{"$f":"IFERROR(RTD(\"cqg.rtd\", ,\"ContractData\",C371, \"PerCentNetLastTrade\",, \"T\")/100,\"\")","v":9.578890294596059E-3},21,21,"S.US.NUS",371,"S.US.ADS"]
[null,0,"S.US.NUE",{"$f":"IFERROR(RTD(\"cqg.rtd\", ,\"ContractData\",C372, \"PerCentNetLastTrade\",, \"T\")/100,\"\")","v":-7.2763353729121882E-3},410,410,"S.US.NUE",372,"S.US.MAR"]
[null,0,"S.US.NUVA",{"$f":"IFERROR(RTD(\"cqg.rtd\", ,\"ContractData\",C373, \"PerCentNetLastTrade\",, \"T\")/100,\"\")","v":-5.7668543182754365E-3},375,375,"S.US.NUVA",373,"S.US.DISCK"]
[null,0,"S.US.NVDA",{"$f":"IFERROR(RTD(\"cqg.rtd\", ,\"ContractData\",C374, \"PerCentNetLastTrade\",, \"T\")/100,\"\")","v":-4.0439052570768342E-3},315,315,"S.US.NVDA",374,"S.US.EXPE"]
[null,1,"S.US.NVR",{"$f":"IFERROR(RTD(\"cqg.rtd\", ,\"ContractData\",C375, \"PerCentNetLastTrade\",, \"T\")/100,\"\")","v":3.2400153450084812E-3},68,68,"S.US.NVR",375,"S.US.NUVA"]
[null,0,"S.US.OXY",{"$f":"IFERROR(RTD(\"cqg.rtd\", ,\"ContractData\",C376, \"PerCentNetLastTrade\",, \"T\")/100,\"\")","v":-2.4834437086092716E-3},245,245,"S.US.OXY",376,"S.US.WYN"]
[null,0,"S.US.ODFL",{"$f":"IFERROR(RTD(\"cqg.rtd\", ,\"ContractData\",C377, \"PerCentNetLastTrade\",, \"T\")/100,\"\")","v":-9.9502487562189053E-3},467,467,"S.US.ODFL",377,"S.US.CTXS"]
[null,1,"S.US.OMC",{"$f":"IFERROR(RTD(\"cqg.rtd\", ,\"ContractData\",C378, \"PerCentNetLastTrade\",, \"T\")/100,\"\")","v":2.3897717767953162E-4},135,135,"S.US.OMC",378,"S.US.CMG"]
[null,1,"S.US.OKE",{"$f":"IFERROR(RTD(\"cqg.rtd\", ,\"ContractData\",C379, \"PerCentNetLastTrade\",, \"T\")/100,\"\")","v":4.1469194312796212E-3},54,54,"S.US.OKE",379,"S.US.LII"]
[null,0,"S.US.ORCL",{"$f":"IFERROR(RTD(\"cqg.rtd\", ,\"ContractData\",C380, \"PerCentNetLastTrade\",, \"T\")/100,\"\")","v":-2.6327336551118913E-3},253,253,"S.US.ORCL",380,"S.US.CABO"]
[null,1,"S.US.ORLY",{"$f":"IFERROR(RTD(\"cqg.rtd\", ,\"ContractData\",C381, \"PerCentNetLastTrade\",, \"T\")/100,\"\")","v":4.9861495844875344E-3},49,49,"S.US.ORLY",381,"S.US.AOS"]
[null,0,"S.US.OSK",{"$f":"IFERROR(RTD(\"cqg.rtd\", ,\"ContractData\",C382, \"PerCentNetLastTrade\",, \"T\")/100,\"\")","v":-1.4943038911081521E-2},529,529,"S.US.OSK",382,"S.US.COTY"]
[null,0,"S.US.PCAR",{"$f":"IFERROR(RTD(\"cqg.rtd\", ,\"ContractData\",C383, \"PerCentNetLastTrade\",, \"T\")/100,\"\")","v":-1.3275656324582339E-2},508,508,"S.US.PCAR",383,"S.US.ICE"]
[null,0,"S.US.PKG",{"$f":"IFERROR(RTD(\"cqg.rtd\", ,\"ContractData\",C384, \"PerCentNetLastTrade\",, \"T\")/100,\"\")","v":-2.446183953033268E-3},242,242,"S.US.PKG",384,"S.US.CDK"]
[null,0,"S.US.PNRA",{"$f":"IFERROR(RTD(\"cqg.rtd\", ,\"ContractData\",C385, \"PerCentNetLastTrade\",, \"T\")/100,\"\")","v":-6.067186102950568E-4},165,165,"S.US.PNRA",385,{"$f":"IFERROR(VLOOKUP(H385,$F$1:$G$564,2,FALSE),\"\")","v":"S.US.KRC"}]
[null,{"$f":"IF(D386>=0,1,)","v":0},"S.US.PZZA",{"$f":"IFERROR(RTD(\"cqg.rtd\", ,\"ContractData\",C386, \"PerCentNetLastTrade\",, \"T\")/100,\"\")","v":-8.5048687292000498E-3},442,{"$f":"IFERROR(E386,\"\")","v":442},{"$f":"C386","v":"S.US.PZZA"},386,"S.US.TYL"]
[null,0,"S.US.PRXL",{"$f":"IFERROR(RTD(\"cqg.rtd\", ,\"ContractData\",C387, \"PerCentNetLastTrade\",, \"T\")/100,\"\")","v":-6.3897763578274758E-3},390,390,"S.US.PRXL",{"$f":"H386+1","v":387},"S.US.WR"]
[null,0,"S.US.PH",{"$f":"IFERROR(RTD(\"cqg.rtd\", ,\"ContractData\",C388, \"PerCentNetLastTrade\",, \"T\")/100,\"\")","v":-5.2763819095477385E-3},358,358,"S.US.PH",388,"S.US.CHD"]
[null,0,"S.US.PTEN",{"$f":"IFERROR(RTD(\"cqg.rtd\", ,\"ContractData\",C389, \"PerCentNetLastTrade\",, \"T\")/100,\"\")","v":-7.8089113458888384E-3},428,428,"S.US.PTEN",389,"S.US.WEX"]
[null,0,"S.US.PAYX",{"$f":"IFERROR(RTD(\"cqg.rtd\", ,\"ContractData\",C390, \"PerCentNetLastTrade\",, \"T\")/100,\"\")","v":-8.3234244946492272E-3},433,433,"S.US.PAYX",390,"S.US.PRXL"]
[null,0,"S.US.PYPL",{"$f":"IFERROR(RTD(\"cqg.rtd\", ,\"ContractData\",C391, \"PerCentNetLastTrade\",, \"T\")/100,\"\")","v":-4.2596348884381338E-3},330,330,"S.US.PYPL",391,"S.US.DLR"]
[null,0,"S.US.PEP",{"$f":"IFERROR(RTD(\"cqg.rtd\", ,\"ContractData\",C392, \"PerCentNetLastTrade\",, \"T\")/100,\"\")","v":-3.5329447094152979E-3},287,287,"S.US.PEP",392,"S.US.EV"]
[null,1,"S.US.PFE",{"$f":"IFERROR(RTD(\"cqg.rtd\", ,\"ContractData\",C393, \"PerCentNetLastTrade\",, \"T\")/100,\"\")","v":1.1947431302270011E-3},110,110,"S.US.PFE",393,"S.US.EL"]
[null,0,"S.US.PM",{"$f":"IFERROR(RTD(\"cqg.rtd\", ,\"ContractData\",C394, \"PerCentNetLastTrade\",, \"T\")/100,\"\")","v":-8.0178173719376393E-4},175,175,"S.US.PM",394,"S.US.WOR"]
[null,1,"S.US.PXD",{"$f":"IFERROR(RTD(\"cqg.rtd\", ,\"ContractData\",C395, \"PerCentNetLastTrade\",, \"T\")/100,\"\")","v":9.4334060491716287E-3},22,22,"S.US.PXD",395,"S.US.ALB"]
[null,0,"S.US.PLT",{"$f":"IFERROR(RTD(\"cqg.rtd\", ,\"ContractData\",C396, \"PerCentNetLastTrade\",, \"T\")/100,\"\")","v":-7.4640451483706542E-3},414,414,"S.US.PLT",396,"S.US.SIVB"]
[null,1,"S.US.PII",{"$f":"IFERROR(RTD(\"cqg.rtd\", ,\"ContractData\",C397, \"PerCentNetLastTrade\",, \"T\")/100,\"\")","v":7.3341094295692666E-3},31,31,"S.US.PII",397,"S.US.PTC"]
[null,0,"S.US.POOL",{"$f":"IFERROR(RTD(\"cqg.rtd\", ,\"ContractData\",C398, \"PerCentNetLastTrade\",, \"T\")/100,\"\")","v":-1.6420361247947454E-3},209,209,"S.US.POOL",398,"S.US.JKHY"]
[null,1,"S.US.POST",{"$f":"IFERROR(RTD(\"cqg.rtd\", ,\"ContractData\",C399, \"PerCentNetLastTrade\",, \"T\")/100,\"\")","v":1.2312238364934746E-4},137,137,"S.US.POST",399,"S.US.VZ"]
[null,0,"S.US.PCH",{"$f":"IFERROR(RTD(\"cqg.rtd\", ,\"ContractData\",C400, \"PerCentNetLastTrade\",, \"T\")/100,\"\")","v":-2.205071664829107E-3},234,234,"S.US.PCH",400,"S.US.PX"]
[null,0,"S.US.PPG",{"$f":"IFERROR(RTD(\"cqg.rtd\", ,\"ContractData\",C401, \"PerCentNetLastTrade\",, \"T\")/100,\"\")","v":-1.4833574529667149E-2},524,524,"S.US.PPG",401,"S.US.TTWO"]
[null,0,"S.US.PX",{"$f":"IFERROR(RTD(\"cqg.rtd\", ,\"ContractData\",C402, \"PerCentNetLastTrade\",, \"T\")/100,\"\")","v":-6.8736484399135002E-3},400,400,"S.US.PX",402,"S.US.SKX"]
[null,0,"S.US.PBH",{"$f":"IFERROR(RTD(\"cqg.rtd\", ,\"ContractData\",C403, \"PerCentNetLastTrade\",, \"T\")/100,\"\")","v":-2.3074192403265887E-3},236,236,"S.US.PBH",403,"S.US.ACXM"]
[null,1,"S.US.PRI",{"$f":"IFERROR(RTD(\"cqg.rtd\", ,\"ContractData\",C404, \"PerCentNetLastTrade\",, \"T\")/100,\"\")","v":2.3446658851113715E-3},82,82,"S.US.PRI",404,"S.US.TRMB"]
[null,0,"S.US.PVTB",{"$f":"IFERROR(RTD(\"cqg.rtd\", ,\"ContractData\",C405, \"PerCentNetLastTrade\",, \"T\")/100,\"\")","v":-1.2740989103101426E-2},502,502,"S.US.PVTB",405,"S.US.EXR"]
[null,0,"S.US.PG",{"$f":"IFERROR(RTD(\"cqg.rtd\", ,\"ContractData\",C406, \"PerCentNetLastTrade\",, \"T\")/100,\"\")","v":-1.3872832369942196E-3},198,198,"S.US.PG",406,"S.US.FICO"]
[null,0,"S.US.PLD",{"$f":"IFERROR(RTD(\"cqg.rtd\", ,\"ContractData\",C407, \"PerCentNetLastTrade\",, \"T\")/100,\"\")","v":-1.6465422612513723E-3},210,210,"S.US.PLD",407,"S.US.BR"]
[null,0,"S.US.PTC",{"$f":"IFERROR(RTD(\"cqg.rtd\", ,\"ContractData\",C408, \"PerCentNetLastTrade\",, \"T\")/100,\"\")","v":-6.8089804931910193E-3},397,397,"S.US.PTC",408,"S.US.RGLD"]
[null,0,"S.US.PSA",{"$f":"IFERROR(RTD(\"cqg.rtd\", ,\"ContractData\",C409, \"PerCentNetLastTrade\",, \"T\")/100,\"\")","v":-1.7767106842737097E-3},217,217,"S.US.PSA",409,"S.US.JACK"]
[null,1,"S.US.QEP",{"$f":"IFERROR(RTD(\"cqg.rtd\", ,\"ContractData\",C410, \"PerCentNetLastTrade\",, \"T\")/100,\"\")","v":8.7183958151700099E-3},26,26,"S.US.QEP",410,"S.US.NUE"]
[null,0,"S.US.QCOM",{"$f":"IFERROR(RTD(\"cqg.rtd\", ,\"ContractData\",C411, \"PerCentNetLastTrade\",, \"T\")/100,\"\")","v":-1.2743491716730386E-3},194,194,"S.US.QCOM",411,"S.US.WEN"]
[null,1,"S.US.PWR",{"$f":"IFERROR(RTD(\"cqg.rtd\", ,\"ContractData\",C412, \"PerCentNetLastTrade\",, \"T\")/100,\"\")","v":2.3181686467690522E-3},84,84,"S.US.PWR",412,"S.US.DISCA"]
[null,1,"S.US.DGX",{"$f":"IFERROR(RTD(\"cqg.rtd\", ,\"ContractData\",C413, \"PerCentNetLastTrade\",, \"T\")/100,\"\")","v":1.3073116070594826E-3},105,105,"S.US.DGX",413,"S.US.SON"]
[null,0,"S.US.RRC",{"$f":"IFERROR(RTD(\"cqg.rtd\", ,\"ContractData\",C414, \"PerCentNetLastTrade\",, \"T\")/100,\"\")","v":-9.1533180778032037E-3},450,450,"S.US.RRC",414,"S.US.PLT"]
[null,0,"S.US.RJF",{"$f":"IFERROR(RTD(\"cqg.rtd\", ,\"ContractData\",C415, \"PerCentNetLastTrade\",, \"T\")/100,\"\")","v":-3.8157894736842108E-3},301,301,"S.US.RJF",415,"S.US.MSM"]
[null,0,"S.US.RYN",{"$f":"IFERROR(RTD(\"cqg.rtd\", ,\"ContractData\",C416, \"PerCentNetLastTrade\",, \"T\")/100,\"\")","v":-2.5179856115107912E-3},248,248,"S.US.RYN",416,"S.US.MPWR"]
[null,1,"S.US.RTN",{"$f":"IFERROR(RTD(\"cqg.rtd\", ,\"ContractData\",C417, \"PerCentNetLastTrade\",, \"T\")/100,\"\")","v":8.1550718273634031E-4},119,119,"S.US.RTN",417,"S.US.COHR"]
[null,0,"S.US.O",{"$f":"IFERROR(RTD(\"cqg.rtd\", ,\"ContractData\",C418, \"PerCentNetLastTrade\",, \"T\")/100,\"\")","v":-7.7711056163899681E-3},424,424,"S.US.O",418,"S.US.ALGN"]
[null,0,"S.US.RHT",{"$f":"IFERROR(RTD(\"cqg.rtd\", ,\"ContractData\",C419, \"PerCentNetLastTrade\",, \"T\")/100,\"\")","v":-3.9498927886243091E-3},307,307,"S.US.RHT",419,"S.US.EQR"]
[null,0,"S.US.REG",{"$f":"IFERROR(RTD(\"cqg.rtd\", ,\"ContractData\",C420, \"PerCentNetLastTrade\",, \"T\")/100,\"\")","v":-1.3882240306366683E-2},513,513,"S.US.REG",420,"S.US.NEM"]
[null,1,"S.US.REGN",{"$f":"IFERROR(RTD(\"cqg.rtd\", ,\"ContractData\",C421, \"PerCentNetLastTrade\",, \"T\")/100,\"\")","v":9.6270396270396272E-3},20,20,"S.US.REGN",421,"S.US.GATX"]
[null,0,"S.US.RSG",{"$f":"IFERROR(RTD(\"cqg.rtd\", ,\"ContractData\",C422, \"PerCentNetLastTrade\",, \"T\")/100,\"\")","v":-1.2652222046496916E-3},191,191,"S.US.RSG",422,"S.US.LLL"]
[null,0,"S.US.RMD",{"$f":"IFERROR(RTD(\"cqg.rtd\", ,\"ContractData\",C423, \"PerCentNetLastTrade\",, \"T\")/100,\"\")","v":-1.0952586828073209E-2},484,484,"S.US.RMD",423,"S.US.ABBV"]
[null,0,"S.US.RAI",{"$f":"IFERROR(RTD(\"cqg.rtd\", ,\"ContractData\",C424, \"PerCentNetLastTrade\",, \"T\")/100,\"\")","v":-1.0807472595337347E-3},187,187,"S.US.RAI",424,"S.US.O"]
[null,0,"S.US.ROK",{"$f":"IFERROR(RTD(\"cqg.rtd\", ,\"ContractData\",C425, \"PerCentNetLastTrade\",, \"T\")/100,\"\")","v":-4.8596457574013683E-3},348,348,"S.US.ROK",425,"S.US.DNB"]
[null,0,"S.US.COL",{"$f":"IFERROR(RTD(\"cqg.rtd\", ,\"ContractData\",C426, \"PerCentNetLastTrade\",, \"T\")/100,\"\")","v":-2.4985585239285027E-3},246,246,"S.US.COL",426,"S.US.TTC"]
[null,0,"S.US.ROL",{"$f":"IFERROR(RTD(\"cqg.rtd\", ,\"ContractData\",C427, \"PerCentNetLastTrade\",, \"T\")/100,\"\")","v":-0.01},468,468,"S.US.ROL",427,"S.US.ATVI"]
[null,1,"S.US.ROP",{"$f":"IFERROR(RTD(\"cqg.rtd\", ,\"ContractData\",C428, \"PerCentNetLastTrade\",, \"T\")/100,\"\")","v":4.0742417383431417E-4},131,131,"S.US.ROP",428,"S.US.PTEN"]
[null,0,"S.US.ROST",{"$f":"IFERROR(RTD(\"cqg.rtd\", ,\"ContractData\",C429, \"PerCentNetLastTrade\",, \"T\")/100,\"\")","v":-7.7279752704791343E-4},173,173,"S.US.ROST",429,"S.US.BXP"]
[null,0,"S.US.RCL",{"$f":"IFERROR(RTD(\"cqg.rtd\", ,\"ContractData\",C430, \"PerCentNetLastTrade\",, \"T\")/100,\"\")","v":-5.615908672436015E-3},370,370,"S.US.RCL",430,"S.US.ACIW"]
[null,0,"S.US.RGLD",{"$f":"IFERROR(RTD(\"cqg.rtd\", ,\"ContractData\",C431, \"PerCentNetLastTrade\",, \"T\")/100,\"\")","v":-7.1520526391074231E-3},408,408,"S.US.RGLD",431,"S.US.SWX"]
[null,0,"S.US.RPM",{"$f":"IFERROR(RTD(\"cqg.rtd\", ,\"ContractData\",C432, \"PerCentNetLastTrade\",, \"T\")/100,\"\")","v":-1.0262257696693273E-2},471,471,"S.US.RPM",432,"S.US.EXP"]
[null,0,"S.US.SPGI",{"$f":"IFERROR(RTD(\"cqg.rtd\", ,\"ContractData\",C433, \"PerCentNetLastTrade\",, \"T\")/100,\"\")","v":-4.0712468193384223E-3},321,321,"S.US.SPGI",433,"S.US.PAYX"]
[null,0,"S.US.SABR",{"$f":"IFERROR(RTD(\"cqg.rtd\", ,\"ContractData\",C434, \"PerCentNetLastTrade\",, \"T\")/100,\"\")","v":-9.7205346294046164E-3},463,463,"S.US.SABR",434,"S.US.BIVV"]
[null,0,"S.US.CRM",{"$f":"IFERROR(RTD(\"cqg.rtd\", ,\"ContractData\",C435, \"PerCentNetLastTrade\",, \"T\")/100,\"\")","v":-2.414625733011383E-3},240,240,"S.US.CRM",435,"S.US.GRMN"]
[null,0,"S.US.SBH",{"$f":"IFERROR(RTD(\"cqg.rtd\", ,\"ContractData\",C436, \"PerCentNetLastTrade\",, \"T\")/100,\"\")","v":-2.014098690835851E-3},227,227,"S.US.SBH",436,"S.US.MAA"]
[null,1,"S.US.SLB",{"$f":"IFERROR(RTD(\"cqg.rtd\", ,\"ContractData\",C437, \"PerCentNetLastTrade\",, \"T\")/100,\"\")","v":1.0421008753647354E-2},18,18,"S.US.SLB",437,"S.US.MDU"]
[null,0,"S.US.SAIC",{"$f":"IFERROR(RTD(\"cqg.rtd\", ,\"ContractData\",C438, \"PerCentNetLastTrade\",, \"T\")/100,\"\")","v":-9.9288876962297049E-3},466,466,"S.US.SAIC",438,"S.US.HIW"]
[null,0,"S.US.SMG",{"$f":"IFERROR(RTD(\"cqg.rtd\", ,\"ContractData\",C439, \"PerCentNetLastTrade\",, \"T\")/100,\"\")","v":-9.3178036605657232E-3},455,455,"S.US.SMG",439,"S.US.THO"]
[null,0,"S.US.SNI",{"$f":"IFERROR(RTD(\"cqg.rtd\", ,\"ContractData\",C440, \"PerCentNetLastTrade\",, \"T\")/100,\"\")","v":-1.5034482758620689E-2},530,530,"S.US.SNI",440,"S.US.MASI"]
[null,1,"S.US.SEE",{"$f":"IFERROR(RTD(\"cqg.rtd\", ,\"ContractData\",C441, \"PerCentNetLastTrade\",, \"T\")/100,\"\")","v":8.5171434811094123E-3},27,27,"S.US.SEE",441,"S.US.LNT"]
[null,0,"S.US.SEIC",{"$f":"IFERROR(RTD(\"cqg.rtd\", ,\"ContractData\",C442, \"PerCentNetLastTrade\",, \"T\")/100,\"\")","v":-2.3341762303053879E-3},237,237,"S.US.SEIC",442,"S.US.PZZA"]
[null,0,"S.US.SXT",{"$f":"IFERROR(RTD(\"cqg.rtd\", ,\"ContractData\",C443, \"PerCentNetLastTrade\",, \"T\")/100,\"\")","v":-4.0585413848235148E-3},317,317,"S.US.SXT",443,"S.US.IRM"]
[null,1,"S.US.SCI",{"$f":"IFERROR(RTD(\"cqg.rtd\", ,\"ContractData\",C444, \"PerCentNetLastTrade\",, \"T\")/100,\"\")","v":3.7232392181197642E-3},60,60,"S.US.SCI",444,"S.US.NCR"]
[null,0,"S.US.SHW",{"$f":"IFERROR(RTD(\"cqg.rtd\", ,\"ContractData\",C445, \"PerCentNetLastTrade\",, \"T\")/100,\"\")","v":-2.6312677388836332E-3},252,252,"S.US.SHW",445,"S.US.DXC"]
[null,0,"S.US.SBNY",{"$f":"IFERROR(RTD(\"cqg.rtd\", ,\"ContractData\",C446, \"PerCentNetLastTrade\",, \"T\")/100,\"\")","v":-2.9201343261790042E-4},154,154,"S.US.SBNY",446,"S.US.CNP"]
[null,0,"S.US.SLAB",{"$f":"IFERROR(RTD(\"cqg.rtd\", ,\"ContractData\",C447, \"PerCentNetLastTrade\",, \"T\")/100,\"\")","v":-3.5211267605633799E-3},286,286,"S.US.SLAB",447,"S.US.GMED"]
[null,0,"S.US.SPG",{"$f":"IFERROR(RTD(\"cqg.rtd\", ,\"ContractData\",C448, \"PerCentNetLastTrade\",, \"T\")/100,\"\")","v":-1.7262338925358618E-2},543,543,"S.US.SPG",448,"S.US.WCG"]
[null,0,"S.US.SKX",{"$f":"IFERROR(RTD(\"cqg.rtd\", ,\"ContractData\",C449, \"PerCentNetLastTrade\",, \"T\")/100,\"\")","v":-6.9190069190069193E-3},402,{"$f":"IFERROR(E449,\"\")","v":402},{"$f":"C449","v":"S.US.SKX"},449,{"$f":"IFERROR(VLOOKUP(H449,$F$1:$G$564,2,FALSE),\"\")","v":"S.US.EQT"}]
[null,{"$f":"IF(D450>=0,1,)","v":0},"S.US.SWKS",{"$f":"IFERROR(RTD(\"cqg.rtd\", ,\"ContractData\",C450, \"PerCentNetLastTrade\",, \"T\")/100,\"\")","v":-1.8726591760299628E-3},222,222,"S.US.SWKS",450,"S.US.RRC"]
[null,0,"S.US.SLM",{"$f":"IFERROR(RTD(\"cqg.rtd\", ,\"ContractData\",C451, \"PerCentNetLastTrade\",, \"T\")/100,\"\")","v":-2.347024308466052E-2},557,557,"S.US.SLM",{"$f":"H450+1","v":451},"S.US.MA"]
[null,1,"S.US.SM",{"$f":"IFERROR(RTD(\"cqg.rtd\", ,\"ContractData\",C452, \"PerCentNetLastTrade\",, \"T\")/100,\"\")","v":3.7789324515824282E-3},58,58,"S.US.SM",452,"S.US.JBHT"]
[null,0,"S.US.SNA",{"$f":"IFERROR(RTD(\"cqg.rtd\", ,\"ContractData\",C453, \"PerCentNetLastTrade\",, \"T\")/100,\"\")","v":-8.2135523613963038E-4},177,177,"S.US.SNA",453,"S.US.ALEX"]
[null,0,"S.US.SON",{"$f":"IFERROR(RTD(\"cqg.rtd\", ,\"ContractData\",C454, \"PerCentNetLastTrade\",, \"T\")/100,\"\")","v":-7.3863636363636362E-3},413,413,"S.US.SON",454,"S.US.CBOE"]
[null,0,"S.US.BID",{"$f":"IFERROR(RTD(\"cqg.rtd\", ,\"ContractData\",C455, \"PerCentNetLastTrade\",, \"T\")/100,\"\")","v":-3.7523452157598499E-3},296,296,"S.US.BID",455,"S.US.SMG"]
[null,0,"S.US.LUV",{"$f":"IFERROR(RTD(\"cqg.rtd\", ,\"ContractData\",C456, \"PerCentNetLastTrade\",, \"T\")/100,\"\")","v":-4.6232876712328768E-3},340,340,"S.US.LUV",456,"S.US.ADP"]
[null,0,"S.US.SWX",{"$f":"IFERROR(RTD(\"cqg.rtd\", ,\"ContractData\",C457, \"PerCentNetLastTrade\",, \"T\")/100,\"\")","v":-8.084651052193555E-3},431,431,"S.US.SWX",457,"S.US.LW"]
[null,0,"S.US.SWN",{"$f":"IFERROR(RTD(\"cqg.rtd\", ,\"ContractData\",C458, \"PerCentNetLastTrade\",, \"T\")/100,\"\")","v":-1.08843537414966E-2},482,482,"S.US.SWN",458,"S.US.MD"]
[null,0,"S.US.SFM",{"$f":"IFERROR(RTD(\"cqg.rtd\", ,\"ContractData\",C459, \"PerCentNetLastTrade\",, \"T\")/100,\"\")","v":-1.4855687606112054E-2},526,526,"S.US.SFM",459,"S.US.MSA"]
[null,0,"S.US.SWK",{"$f":"IFERROR(RTD(\"cqg.rtd\", ,\"ContractData\",C460, \"PerCentNetLastTrade\",, \"T\")/100,\"\")","v":-5.2665752831686031E-3},357,357,"S.US.SWK",460,"S.US.DLX"]
[null,0,"S.US.SBUX",{"$f":"IFERROR(RTD(\"cqg.rtd\", ,\"ContractData\",C461, \"PerCentNetLastTrade\",, \"T\")/100,\"\")","v":-2.9532403609515995E-3},265,265,"S.US.SBUX",461,"S.US.LSTR"]
[null,0,"S.US.STLD",{"$f":"IFERROR(RTD(\"cqg.rtd\", ,\"ContractData\",C462, \"PerCentNetLastTrade\",, \"T\")/100,\"\")","v":-1.340033500837521E-2},509,509,"S.US.STLD",462,"S.US.HCN"]
[null,0,"S.US.SYK",{"$f":"IFERROR(RTD(\"cqg.rtd\", ,\"ContractData\",C463, \"PerCentNetLastTrade\",, \"T\")/100,\"\")","v":-5.075022065313327E-3},353,353,"S.US.SYK",463,"S.US.SABR"]
[null,0,"S.US.SPN",{"$f":"IFERROR(RTD(\"cqg.rtd\", ,\"ContractData\",C464, \"PerCentNetLastTrade\",, \"T\")/100,\"\")","v":-8.8573959255978745E-4},182,182,"S.US.SPN",464,"S.US.CTLT"]
[null,0,"S.US.SIVB",{"$f":"IFERROR(RTD(\"cqg.rtd\", ,\"ContractData\",C465, \"PerCentNetLastTrade\",, \"T\")/100,\"\")","v":-6.7341910758280865E-3},396,396,"S.US.SIVB",465,"S.US.BDC"]
[null,0,"S.US.SYMC",{"$f":"IFERROR(RTD(\"cqg.rtd\", ,\"ContractData\",C466, \"PerCentNetLastTrade\",, \"T\")/100,\"\")","v":-2.1671826625386998E-3},231,231,"S.US.SYMC",466,"S.US.SAIC"]
[null,0,"S.US.SNPS",{"$f":"IFERROR(RTD(\"cqg.rtd\", ,\"ContractData\",C467, \"PerCentNetLastTrade\",, \"T\")/100,\"\")","v":-5.115778136779753E-3},354,354,"S.US.SNPS",467,"S.US.ODFL"]
[null,0,"S.US.SNV",{"$f":"IFERROR(RTD(\"cqg.rtd\", ,\"ContractData\",C468, \"PerCentNetLastTrade\",, \"T\")/100,\"\")","v":-2.5918944392082943E-3},250,250,"S.US.SNV",468,"S.US.ROL"]
[null,1,"S.US.SYY",{"$f":"IFERROR(RTD(\"cqg.rtd\", ,\"ContractData\",C469, \"PerCentNetLastTrade\",, \"T\")/100,\"\")","v":8.3167600795516182E-3},29,29,"S.US.SYY",469,"S.US.ILMN"]
[null,0,"S.US.TROW",{"$f":"IFERROR(RTD(\"cqg.rtd\", ,\"ContractData\",C470, \"PerCentNetLastTrade\",, \"T\")/100,\"\")","v":-1.5159944367176634E-2},532,532,"S.US.TROW",470,"S.US.MSI"]
[null,0,"S.US.TTWO",{"$f":"IFERROR(RTD(\"cqg.rtd\", ,\"ContractData\",C471, \"PerCentNetLastTrade\",, \"T\")/100,\"\")","v":-6.8786303882604708E-3},401,401,"S.US.TTWO",471,"S.US.RPM"]
[null,0,"S.US.SKT",{"$f":"IFERROR(RTD(\"cqg.rtd\", ,\"ContractData\",C472, \"PerCentNetLastTrade\",, \"T\")/100,\"\")","v":-2.2004889975550123E-2},555,555,"S.US.SKT",472,"S.US.TDY"]
[null,0,"S.US.TCO",{"$f":"IFERROR(RTD(\"cqg.rtd\", ,\"ContractData\",C473, \"PerCentNetLastTrade\",, \"T\")/100,\"\")","v":-2.2552704690308872E-2},556,556,"S.US.TCO",473,"S.US.IFF"]
[null,0,"S.US.TEL",{"$f":"IFERROR(RTD(\"cqg.rtd\", ,\"ContractData\",C474, \"PerCentNetLastTrade\",, \"T\")/100,\"\")","v":-1.7229953611663353E-3},215,215,"S.US.TEL",474,"S.US.EXPD"]
[null,0,"S.US.TDY",{"$f":"IFERROR(RTD(\"cqg.rtd\", ,\"ContractData\",C475, \"PerCentNetLastTrade\",, \"T\")/100,\"\")","v":-1.0385975250441958E-2},472,472,"S.US.TDY",475,"S.US.FOX"]
[null,0,"S.US.TFX",{"$f":"IFERROR(RTD(\"cqg.rtd\", ,\"ContractData\",C476, \"PerCentNetLastTrade\",, \"T\")/100,\"\")","v":-2.0115803134671061E-2},552,552,"S.US.TFX",476,"S.US.ALK"]
[null,1,"S.US.TPX",{"$f":"IFERROR(RTD(\"cqg.rtd\", ,\"ContractData\",C477, \"PerCentNetLastTrade\",, \"T\")/100,\"\")","v":5.2664840952180323E-3},46,46,"S.US.TPX",477,"S.US.DD"]
[null,1,"S.US.TER",{"$f":"IFERROR(RTD(\"cqg.rtd\", ,\"ContractData\",C478, \"PerCentNetLastTrade\",, \"T\")/100,\"\")","v":0},143,143,"S.US.TER",478,"S.US.WBMD"]
[null,1,"S.US.TCBI",{"$f":"IFERROR(RTD(\"cqg.rtd\", ,\"ContractData\",C479, \"PerCentNetLastTrade\",, \"T\")/100,\"\")","v":2.0236530880420499E-2},6,6,"S.US.TCBI",479,"S.US.WBS"]
[null,0,"S.US.TXN",{"$f":"IFERROR(RTD(\"cqg.rtd\", ,\"ContractData\",C480, \"PerCentNetLastTrade\",, \"T\")/100,\"\")","v":-1.7581313575285695E-3},216,216,"S.US.TXN",480,"S.US.CLGX"]
[null,0,"S.US.TXRH",{"$f":"IFERROR(RTD(\"cqg.rtd\", ,\"ContractData\",C481, \"PerCentNetLastTrade\",, \"T\")/100,\"\")","v":-5.5555555555555558E-3},369,369,"S.US.TXRH",481,"S.US.NDAQ"]
[null,1,"S.US.PCLN",{"$f":"IFERROR(RTD(\"cqg.rtd\", ,\"ContractData\",C482, \"PerCentNetLastTrade\",, \"T\")/100,\"\")","v":4.8328211593517717E-4},130,130,"S.US.PCLN",482,"S.US.SWN"]
[null,1,"S.US.TMO",{"$f":"IFERROR(RTD(\"cqg.rtd\", ,\"ContractData\",C483, \"PerCentNetLastTrade\",, \"T\")/100,\"\")","v":2.6306559102069449E-3},78,78,"S.US.TMO",483,"S.US.WSO"]
[null,0,"S.US.THO",{"$f":"IFERROR(RTD(\"cqg.rtd\", ,\"ContractData\",C484, \"PerCentNetLastTrade\",, \"T\")/100,\"\")","v":-8.4809447128287706E-3},439,439,"S.US.THO",484,"S.US.RMD"]
[null,0,"S.US.TIF",{"$f":"IFERROR(RTD(\"cqg.rtd\", ,\"ContractData\",C485, \"PerCentNetLastTrade\",, \"T\")/100,\"\")","v":-1.0811979673478215E-3},188,188,"S.US.TIF",485,"S.US.HOG"]
[null,0,"S.US.TWX",{"$f":"IFERROR(RTD(\"cqg.rtd\", ,\"ContractData\",C486, \"PerCentNetLastTrade\",, \"T\")/100,\"\")","v":-1.8298261665141812E-3},219,219,"S.US.TWX",486,"S.US.MSCC"]
[null,0,"S.US.TJX",{"$f":"IFERROR(RTD(\"cqg.rtd\", ,\"ContractData\",C487, \"PerCentNetLastTrade\",, \"T\")/100,\"\")","v":-4.701995170923878E-3},343,343,"S.US.TJX",487,"S.US.AIV"]
[null,1,"S.US.TR",{"$f":"IFERROR(RTD(\"cqg.rtd\", ,\"ContractData\",C488, \"PerCentNetLastTrade\",, \"T\")/100,\"\")","v":1.3679890560875513E-3},102,102,"S.US.TR",488,"S.US.IDCC"]
[null,0,"S.US.TTC",{"$f":"IFERROR(RTD(\"cqg.rtd\", ,\"ContractData\",C489, \"PerCentNetLastTrade\",, \"T\")/100,\"\")","v":-7.799610019499025E-3},426,426,"S.US.TTC",489,"S.US.COG"]
[null,1,"S.US.TSS",{"$f":"IFERROR(RTD(\"cqg.rtd\", ,\"ContractData\",C490, \"PerCentNetLastTrade\",, \"T\")/100,\"\")","v":9.9199443090845808E-3},19,19,"S.US.TSS",490,"S.US.ABMD"]
[null,0,"S.US.TSCO",{"$f":"IFERROR(RTD(\"cqg.rtd\", ,\"ContractData\",C491, \"PerCentNetLastTrade\",, \"T\")/100,\"\")","v":-2.744148506860371E-3},257,257,"S.US.TSCO",491,"S.US.AMCX"]
[null,0,"S.US.TDG",{"$f":"IFERROR(RTD(\"cqg.rtd\", ,\"ContractData\",C492, \"PerCentNetLastTrade\",, \"T\")/100,\"\")","v":-1.2157816299317593E-2},496,496,"S.US.TDG",492,"S.US.JCOM"]
[null,0,"S.US.TRMB",{"$f":"IFERROR(RTD(\"cqg.rtd\", ,\"ContractData\",C493, \"PerCentNetLastTrade\",, \"T\")/100,\"\")","v":-6.9444444444444441E-3},404,404,"S.US.TRMB",493,"S.US.CHRW"]
[null,1,"S.US.TRIP",{"$f":"IFERROR(RTD(\"cqg.rtd\", ,\"ContractData\",C494, \"PerCentNetLastTrade\",, \"T\")/100,\"\")","v":1.8843404808317088E-2},7,7,"S.US.TRIP",494,"S.US.FMC"]
[null,1,"S.US.TRMK",{"$f":"IFERROR(RTD(\"cqg.rtd\", ,\"ContractData\",C495, \"PerCentNetLastTrade\",, \"T\")/100,\"\")","v":2.9940119760479042E-4},132,132,"S.US.TRMK",495,"S.US.ZTS"]
[null,1,"S.US.TUP",{"$f":"IFERROR(RTD(\"cqg.rtd\", ,\"ContractData\",C496, \"PerCentNetLastTrade\",, \"T\")/100,\"\")","v":3.5817605730816913E-3},63,63,"S.US.TUP",496,"S.US.TDG"]
[null,0,"S.US.FOXA",{"$f":"IFERROR(RTD(\"cqg.rtd\", ,\"ContractData\",C497, \"PerCentNetLastTrade\",, \"T\")/100,\"\")","v":-1.269732326698696E-2},500,500,"S.US.FOXA",497,"S.US.MCO"]
[null,0,"S.US.FOX",{"$f":"IFERROR(RTD(\"cqg.rtd\", ,\"ContractData\",C498, \"PerCentNetLastTrade\",, \"T\")/100,\"\")","v":-1.0496850944716585E-2},475,475,"S.US.FOX",498,"S.US.FRT"]
[null,0,"S.US.TYL",{"$f":"IFERROR(RTD(\"cqg.rtd\", ,\"ContractData\",C499, \"PerCentNetLastTrade\",, \"T\")/100,\"\")","v":-6.1969797244449797E-3},386,386,"S.US.TYL",499,"S.US.ACHC"]
[null,0,"S.US.UDR",{"$f":"IFERROR(RTD(\"cqg.rtd\", ,\"ContractData\",C500, \"PerCentNetLastTrade\",, \"T\")/100,\"\")","v":-5.5292259083728279E-3},366,366,"S.US.UDR",500,"S.US.FOXA"]
[null,1,"S.US.ULTA",{"$f":"IFERROR(RTD(\"cqg.rtd\", ,\"ContractData\",C501, \"PerCentNetLastTrade\",, \"T\")/100,\"\")","v":6.4981216367143869E-3},38,38,"S.US.ULTA",501,"S.US.HR"]
[null,0,"S.US.ULTI",{"$f":"IFERROR(RTD(\"cqg.rtd\", ,\"ContractData\",C502, \"PerCentNetLastTrade\",, \"T\")/100,\"\")","v":-1.3154212146655471E-2},505,505,"S.US.ULTI",502,"S.US.PVTB"]
[null,1,"S.US.UMBF",{"$f":"IFERROR(RTD(\"cqg.rtd\", ,\"ContractData\",C503, \"PerCentNetLastTrade\",, \"T\")/100,\"\")","v":8.1344902386117134E-4},120,120,"S.US.UMBF",503,"S.US.CW"]
[null,1,"S.US.UAA",{"$f":"IFERROR(RTD(\"cqg.rtd\", ,\"ContractData\",C504, \"PerCentNetLastTrade\",, \"T\")/100,\"\")","v":9.713453132588636E-4},112,112,"S.US.UAA",504,"S.US.CTAS"]
[null,1,"S.US.UA",{"$f":"IFERROR(RTD(\"cqg.rtd\", ,\"ContractData\",C505, \"PerCentNetLastTrade\",, \"T\")/100,\"\")","v":4.7145102147721323E-3},50,50,"S.US.UA",505,"S.US.ULTI"]
[null,0,"S.US.UNP",{"$f":"IFERROR(RTD(\"cqg.rtd\", ,\"ContractData\",C506, \"PerCentNetLastTrade\",, \"T\")/100,\"\")","v":-1.6257225433526012E-3},206,206,"S.US.UNP",506,"S.US.BIOCA"]
[null,0,"S.US.UBSI",{"$f":"IFERROR(RTD(\"cqg.rtd\", ,\"ContractData\",C507, \"PerCentNetLastTrade\",, \"T\")/100,\"\")","v":-1.2406947890818859E-3},190,190,"S.US.UBSI",507,"S.US.ACC"]
[null,0,"S.US.UAL",{"$f":"IFERROR(RTD(\"cqg.rtd\", ,\"ContractData\",C508, \"PerCentNetLastTrade\",, \"T\")/100,\"\")","v":-3.9840637450199205E-4},159,159,"S.US.UAL",508,"S.US.PCAR"]
[null,0,"S.US.UPS",{"$f":"IFERROR(RTD(\"cqg.rtd\", ,\"ContractData\",C509, \"PerCentNetLastTrade\",, \"T\")/100,\"\")","v":-4.8403611654100342E-3},346,346,"S.US.UPS",509,"S.US.STLD"]
[null,1,"S.US.URI",{"$f":"IFERROR(RTD(\"cqg.rtd\", ,\"ContractData\",C510, \"PerCentNetLastTrade\",, \"T\")/100,\"\")","v":2.43208516886931E-2},5,5,"S.US.URI",510,"S.US.ALLE"]
[null,0,"S.US.UTHR",{"$f":"IFERROR(RTD(\"cqg.rtd\", ,\"ContractData\",C511, \"PerCentNetLastTrade\",, \"T\")/100,\"\")","v":-5.5356561380657766E-3},367,367,"S.US.UTHR",511,"S.US.EME"]
[null,0,"S.US.UNH",{"$f":"IFERROR(RTD(\"cqg.rtd\", ,\"ContractData\",C512, \"PerCentNetLastTrade\",, \"T\")/100,\"\")","v":-2.2972662531587412E-4},151,151,"S.US.UNH",512,"S.US.INGR"]
[null,1,"S.US.UNIT",{"$f":"IFERROR(RTD(\"cqg.rtd\", ,\"ContractData\",C513, \"PerCentNetLastTrade\",, \"T\")/100,\"\")","v":5.1302288871349641E-3},48,{"$f":"IFERROR(E513,\"\")","v":48},{"$f":"C513","v":"S.US.UNIT"},513,{"$f":"IFERROR(VLOOKUP(H513,$F$1:$G$564,2,FALSE),\"\")","v":"S.US.REG"}]
[null,{"$f":"IF(D514>=0,1,)","v":0},"S.US.UHS",{"$f":"IFERROR(RTD(\"cqg.rtd\", ,\"ContractData\",C514, \"PerCentNetLastTrade\",, \"T\")/100,\"\")","v":-4.426592343634724E-3},335,335,"S.US.UHS",514,"S.US.FDS"]
[null,0,"S.US.UE",{"$f":"IFERROR(RTD(\"cqg.rtd\", ,\"ContractData\",C515, \"PerCentNetLastTrade\",, \"T\")/100,\"\")","v":-1.4855355746677092E-2},525,525,"S.US.UE",{"$f":"H514+1","v":515},"S.US.WYNN"]
[null,1,"S.US.URBN",{"$f":"IFERROR(RTD(\"cqg.rtd\", ,\"ContractData\",C516, \"PerCentNetLastTrade\",, \"T\")/100,\"\")","v":8.4781687155574396E-4},118,118,"S.US.URBN",516,"S.US.WAB"]
[null,0,"S.US.USB",{"$f":"IFERROR(RTD(\"cqg.rtd\", ,\"ContractData\",C517, \"PerCentNetLastTrade\",, \"T\")/100,\"\")","v":-3.8632412594166504E-4},158,158,"S.US.USB",517,"S.US.GWR"]
[null,0,"S.US.X",{"$f":"IFERROR(RTD(\"cqg.rtd\", ,\"ContractData\",C518, \"PerCentNetLastTrade\",, \"T\")/100,\"\")","v":-1.7682643089809214E-2},545,545,"S.US.X",518,"S.US.VNO"]
[null,1,"S.US.USD",{"$f":"IFERROR(RTD(\"cqg.rtd\", ,\"ContractData\",C519, \"PerCentNetLastTrade\",, \"T\")/100,\"\")","v":2.5575447570332479E-4},134,134,"S.US.USD",519,"S.US.CELG"]
[null,0,"S.US.VMI",{"$f":"IFERROR(RTD(\"cqg.rtd\", ,\"ContractData\",C520, \"PerCentNetLastTrade\",, \"T\")/100,\"\")","v":-3.6136662286465177E-3},290,290,"S.US.VMI",520,"S.US.FCX"]
[null,0,"S.US.VAL",{"$f":"IFERROR(RTD(\"cqg.rtd\", ,\"ContractData\",C521, \"PerCentNetLastTrade\",, \"T\")/100,\"\")","v":-3.5561877667140827E-4},157,157,"S.US.VAL",521,"S.US.LYV"]
[null,1,"S.US.VAR",{"$f":"IFERROR(RTD(\"cqg.rtd\", ,\"ContractData\",C522, \"PerCentNetLastTrade\",, \"T\")/100,\"\")","v":4.1463149896884835E-2},4,4,"S.US.VAR",522,"S.US.LLY"]
[null,0,"S.US.WOOF",{"$f":"IFERROR(RTD(\"cqg.rtd\", ,\"ContractData\",C523, \"PerCentNetLastTrade\",, \"T\")/100,\"\")","v":-9.7879282218597059E-4},184,184,"S.US.WOOF",523,"S.US.IBM"]
[null,0,"S.US.VTR",{"$f":"IFERROR(RTD(\"cqg.rtd\", ,\"ContractData\",C524, \"PerCentNetLastTrade\",, \"T\")/100,\"\")","v":-3.7647058823529413E-3},298,298,"S.US.VTR",524,"S.US.PPG"]
[null,0,"S.US.VRSN",{"$f":"IFERROR(RTD(\"cqg.rtd\", ,\"ContractData\",C525, \"PerCentNetLastTrade\",, \"T\")/100,\"\")","v":-4.1294642857142858E-3},324,324,"S.US.VRSN",525,"S.US.UE"]
[null,0,"S.US.VRSK",{"$f":"IFERROR(RTD(\"cqg.rtd\", ,\"ContractData\",C526, \"PerCentNetLastTrade\",, \"T\")/100,\"\")","v":-2.5075225677031092E-3},247,247,"S.US.VRSK",526,"S.US.SFM"]
[null,0,"S.US.VZ",{"$f":"IFERROR(RTD(\"cqg.rtd\", ,\"ContractData\",C527, \"PerCentNetLastTrade\",, \"T\")/100,\"\")","v":-6.8537159991432853E-3},399,399,"S.US.VZ",527,"S.US.CY"]
[null,1,"S.US.VSM",{"$f":"IFERROR(RTD(\"cqg.rtd\", ,\"ContractData\",C528, \"PerCentNetLastTrade\",, \"T\")/100,\"\")","v":3.2883919763235779E-3},67,67,"S.US.VSM",528,"S.US.HST"]
[null,1,"S.US.VRTX",{"$f":"IFERROR(RTD(\"cqg.rtd\", ,\"ContractData\",C529, \"PerCentNetLastTrade\",, \"T\")/100,\"\")","v":1.3061650992685476E-3},106,106,"S.US.VRTX",529,"S.US.OSK"]
[null,1,"S.US.VSAT",{"$f":"IFERROR(RTD(\"cqg.rtd\", ,\"ContractData\",C530, \"PerCentNetLastTrade\",, \"T\")/100,\"\")","v":1.9850358833409681E-3},88,88,"S.US.VSAT",530,"S.US.SNI"]
[null,0,"S.US.V",{"$f":"IFERROR(RTD(\"cqg.rtd\", ,\"ContractData\",C531, \"PerCentNetLastTrade\",, \"T\")/100,\"\")","v":-4.2349875122163101E-3},329,329,"S.US.V",531,"S.US.MSCI"]
[null,0,"S.US.VNO",{"$f":"IFERROR(RTD(\"cqg.rtd\", ,\"ContractData\",C532, \"PerCentNetLastTrade\",, \"T\")/100,\"\")","v":-1.4315569487983282E-2},518,518,"S.US.VNO",532,"S.US.TROW"]
[null,0,"S.US.VMC",{"$f":"IFERROR(RTD(\"cqg.rtd\", ,\"ContractData\",C533, \"PerCentNetLastTrade\",, \"T\")/100,\"\")","v":-1.7065915140128386E-2},541,541,"S.US.VMC",533,"S.US.CLI"]
[null,0,"S.US.DIS",{"$f":"IFERROR(RTD(\"cqg.rtd\", ,\"ContractData\",C534, \"PerCentNetLastTrade\",, \"T\")/100,\"\")","v":-5.4469149031163497E-3},362,362,"S.US.DIS",534,"S.US.ZBRA"]
[null,0,"S.US.WAFD",{"$f":"IFERROR(RTD(\"cqg.rtd\", ,\"ContractData\",C535, \"PerCentNetLastTrade\",, \"T\")/100,\"\")","v":-1.4836795252225518E-3},200,200,"S.US.WAFD",535,"S.US.MLM"]
[null,0,"S.US.WM",{"$f":"IFERROR(RTD(\"cqg.rtd\", ,\"ContractData\",C536, \"PerCentNetLastTrade\",, \"T\")/100,\"\")","v":-2.4526502248262707E-3},243,243,"S.US.WM",536,"S.US.AMD"]
[null,0,"S.US.WAT",{"$f":"IFERROR(RTD(\"cqg.rtd\", ,\"ContractData\",C537, \"PerCentNetLastTrade\",, \"T\")/100,\"\")","v":-1.3793103448275861E-3},197,197,"S.US.WAT",537,"S.US.GGP"]
[null,0,"S.US.WSO",{"$f":"IFERROR(RTD(\"cqg.rtd\", ,\"ContractData\",C538, \"PerCentNetLastTrade\",, \"T\")/100,\"\")","v":-1.0917187387775622E-2},483,483,"S.US.WSO",538,"S.US.CBG"]
[null,0,"S.US.WBMD",{"$f":"IFERROR(RTD(\"cqg.rtd\", ,\"ContractData\",C539, \"PerCentNetLastTrade\",, \"T\")/100,\"\")","v":-1.069809610154125E-2},478,478,"S.US.WBMD",539,"S.US.MKTX"]
[null,0,"S.US.WBS",{"$f":"IFERROR(RTD(\"cqg.rtd\", ,\"ContractData\",C540, \"PerCentNetLastTrade\",, \"T\")/100,\"\")","v":-1.0734138393712862E-2},479,479,"S.US.WBS",540,"S.US.AKAM"]
[null,0,"S.US.WEC",{"$f":"IFERROR(RTD(\"cqg.rtd\", ,\"ContractData\",C541, \"PerCentNetLastTrade\",, \"T\")/100,\"\")","v":-4.7077922077922076E-3},344,344,"S.US.WEC",541,"S.US.VMC"]
[null,0,"S.US.WRI",{"$f":"IFERROR(RTD(\"cqg.rtd\", ,\"ContractData\",C542, \"PerCentNetLastTrade\",, \"T\")/100,\"\")","v":-2.3643528341921797E-2},558,558,"S.US.WRI",542,"S.US.NNN"]
[null,0,"S.US.WCG",{"$f":"IFERROR(RTD(\"cqg.rtd\", ,\"ContractData\",C543, \"PerCentNetLastTrade\",, \"T\")/100,\"\")","v":-9.0717546529322252E-3},448,448,"S.US.WCG",543,"S.US.SPG"]
[null,0,"S.US.HCN",{"$f":"IFERROR(RTD(\"cqg.rtd\", ,\"ContractData\",C544, \"PerCentNetLastTrade\",, \"T\")/100,\"\")","v":-9.5988538681948416E-3},462,462,"S.US.HCN",544,"S.US.EDR"]
[null,0,"S.US.WEN",{"$f":"IFERROR(RTD(\"cqg.rtd\", ,\"ContractData\",C545, \"PerCentNetLastTrade\",, \"T\")/100,\"\")","v":-7.2799470549305099E-3},411,411,"S.US.WEN",545,"S.US.X"]
[null,0,"S.US.WST",{"$f":"IFERROR(RTD(\"cqg.rtd\", ,\"ContractData\",C546, \"PerCentNetLastTrade\",, \"T\")/100,\"\")","v":-1.8643190056965304E-3},221,221,"S.US.WST",546,"S.US.CBS"]
[null,0,"S.US.WR",{"$f":"IFERROR(RTD(\"cqg.rtd\", ,\"ContractData\",C547, \"PerCentNetLastTrade\",, \"T\")/100,\"\")","v":-6.2833206397562838E-3},387,387,"S.US.WR",547,"S.US.CC"]
[null,1,"S.US.WU",{"$f":"IFERROR(RTD(\"cqg.rtd\", ,\"ContractData\",C548, \"PerCentNetLastTrade\",, \"T\")/100,\"\")","v":0},144,144,"S.US.WU",548,"S.US.DNKN"]
[null,0,"S.US.WAB",{"$f":"IFERROR(RTD(\"cqg.rtd\", ,\"ContractData\",C549, \"PerCentNetLastTrade\",, \"T\")/100,\"\")","v":-1.4216867469879517E-2},516,516,"S.US.WAB",549,"S.US.EVHC"]
[null,0,"S.US.WEX",{"$f":"IFERROR(RTD(\"cqg.rtd\", ,\"ContractData\",C550, \"PerCentNetLastTrade\",, \"T\")/100,\"\")","v":-6.336115860404304E-3},389,389,"S.US.WEX",550,"S.US.KMT"]
[null,0,"S.US.WGL",{"$f":"IFERROR(RTD(\"cqg.rtd\", ,\"ContractData\",C551, \"PerCentNetLastTrade\",, \"T\")/100,\"\")","v":-4.101326899879373E-3},322,322,"S.US.WGL",551,"S.US.MTX"]
[null,1,"S.US.WMB",{"$f":"IFERROR(RTD(\"cqg.rtd\", ,\"ContractData\",C552, \"PerCentNetLastTrade\",, \"T\")/100,\"\")","v":5.9504132231404964E-3},42,42,"S.US.WMB",552,"S.US.TFX"]
[null,0,"S.US.WWD",{"$f":"IFERROR(RTD(\"cqg.rtd\", ,\"ContractData\",C553, \"PerCentNetLastTrade\",, \"T\")/100,\"\")","v":-1.483459427384661E-4},148,148,"S.US.WWD",553,"S.US.GVA"]
[null,0,"S.US.WOR",{"$f":"IFERROR(RTD(\"cqg.rtd\", ,\"ContractData\",C554, \"PerCentNetLastTrade\",, \"T\")/100,\"\")","v":-6.5774019262391358E-3},394,394,"S.US.WOR",554,"S.US.KIM"]
[null,0,"S.US.WPX",{"$f":"IFERROR(RTD(\"cqg.rtd\", ,\"ContractData\",C555, \"PerCentNetLastTrade\",, \"T\")/100,\"\")","v":-8.5397096498719043E-4},179,179,"S.US.WPX",555,"S.US.SKT"]
[null,1,"S.US.GWW",{"$f":"IFERROR(RTD(\"cqg.rtd\", ,\"ContractData\",C556, \"PerCentNetLastTrade\",, \"T\")/100,\"\")","v":1.4268350684352377E-3},99,99,"S.US.GWW",556,"S.US.TCO"]
[null,0,"S.US.WYN",{"$f":"IFERROR(RTD(\"cqg.rtd\", ,\"ContractData\",C557, \"PerCentNetLastTrade\",, \"T\")/100,\"\")","v":-5.8290829603414177E-3},376,376,"S.US.WYN",557,"S.US.SLM"]
[null,0,"S.US.WYNN",{"$f":"IFERROR(RTD(\"cqg.rtd\", ,\"ContractData\",C558, \"PerCentNetLastTrade\",, \"T\")/100,\"\")","v":-1.4082200753233994E-2},515,515,"S.US.WYNN",558,"S.US.WRI"]
[null,1,"S.US.XLNX",{"$f":"IFERROR(RTD(\"cqg.rtd\", ,\"ContractData\",C559, \"PerCentNetLastTrade\",, \"T\")/100,\"\")","v":1.6406373244991324E-2},8,8,"S.US.XLNX",559,"S.US.JWA"]
[null,1,"S.US.XYL",{"$f":"IFERROR(RTD(\"cqg.rtd\", ,\"ContractData\",C560, \"PerCentNetLastTrade\",, \"T\")/100,\"\")","v":3.4416826003824093E-3},65,65,"S.US.XYL",560,"S.US.INCY"]
[null,0,"S.US.YUM",{"$f":"IFERROR(RTD(\"cqg.rtd\", ,\"ContractData\",C561, \"PerCentNetLastTrade\",, \"T\")/100,\"\")","v":-2.4531024531024531E-3},244,244,"S.US.YUM",561,"S.US.CHTR"]
[null,0,"S.US.ZBRA",{"$f":"IFERROR(RTD(\"cqg.rtd\", ,\"ContractData\",C562, \"PerCentNetLastTrade\",, \"T\")/100,\"\")","v":-1.5430820215410108E-2},534,534,"S.US.ZBRA",562,"S.US.MIK"]
[null,1,"S.US.ZBH",{"$f":"IFERROR(RTD(\"cqg.rtd\", ,\"ContractData\",C563, \"PerCentNetLastTrade\",, \"T\")/100,\"\")","v":1.1154968251244209E-3},111,111,"S.US.ZBH",563,"S.US.LOGM"]
[null,0,"S.US.ZTS",{"$f":"IFERROR(RTD(\"cqg.rtd\", ,\"ContractData\",C564, \"PerCentNetLastTrade\",, \"T\")/100,\"\")","v":-1.2106944677988903E-2},495,495,"S.US.ZTS",564,"S.US.CAR"]
[null,{"$f":"SUM(B1:B564)/564","v":0.25531914893617019}]
[]
[]
[]
[]
[]
[]
[]
[]
[]
[]
[]
[]
[]
[]
[]
[]
[]
[]
[]
[]
[]
[]
[]
[]
[]
[]
[]
[]
[]
[]
[]
[]
[]
[]
[]
[]
[]
[]
[]
[]
[]
[]
[]
[]
[]
[]
[]
[]
[]
[]
[]
[]
[]
[]
[]
[]
[]
[]
[]
[]
[]
[]
[]
[]
[]
[]
[]
[]
[]
[]
[]
[]
[]
[]
[]
[]
[]
[]
[]
[]
[]
[]
[]
[]
[]
[]
[]
[]
[]
[]
[]
[]
[]
[]
[]
[]
[]
[]
[]
[]
[]
[]
[]
[]
[]
[]
[]
[]
[]
[]
[]
[]
[]
[]
[]
[]
[]
[]
[]
[]
[]
[]
[]
[]
[]
[]
[]
[]
[]
[]
[]
[]
[]
[]
[]
[]
[]
[]
[]
[]
[]
[]
[]
[]
[]
[]
[]
[]
[]
[]
[]
[]
[]
[]
[]
[]
[]
[]
[]
[]
[]
[]
[]
[]
[]
[]
[]
[]
[]
[]
[]
[]
[]
[]
[]
[]
[]
[]
[]
[]
[]
[]
[]
[]
[]
[]
[]
[]
[]
[]
[]
[]
[]
[]
[]
[]
[]
[]
[]
[]
[]
[]
[]
[]
[]
[]
[]
[]
[]
[]
[]
[]
[]
[]
[]
[]
[]
[]
[]
[]
[]
[]
[]
[]
[]
[]
[]
[]
[]
[]
[]
[]
[]
[]
[]
[]
[]
[]
[]
[]
[]
[]
[]
[]
[]
[]
[]
[]
[]
[]
[]
[]
[]
[]
[]
[]
[]
[]
[]
[]
[]
[]
[]
[]
[]
[]
[]
[]
[]
[]
[]
[]
[]
[]
[]
[]
[]
[]
[]
[]
[]
[]
[]
[]
[]
[]
[]
[]
[]
[]
[]
[]
[]
[]
[]
[]
[]
[]
[]
[]
[]
[]
[]
[]
[]
[]
[]
[]
[]
[]
[]
[]
[]
[]
[]
[]
[]
[]
[]
[]
[]
[]
[]
[]
[]
[]
[]
[]
[]
[]
[]
[]
[]
[]
[]
[]
[]
[]
[]
[]
[]
[]
[]
[]
[]
[]
[]
[]
[]
[]
[]
[]
[]
[]
[]
[]
[]
[]
[]
[]
[]
[]
[]
[]
[]
[]
[]
[]
[]
[]
[]
[]
[]
[]
[]
[]
[]
[]
[]
[]
[]
[]
[]
[]
[]
[]
[]
[]
[]
[]
[]
[]
[]
[]
[]
[]
[]
[]
[]
[]
[]
[]
[]
[]
[]
[]
[]
[]
[]
[]
[]
[]
[]
[]
[]
[]
[]
[]
[]
[]
[]
[]
[]
[]
[]
[]
[]
[]
[]
[]
[]
[]
[]
[]
[]
[]
[]
[]
[]
[]
[]
[]
[]
[]
[]
[]
[]
[]
[]
[]
[]
[]
[]
[]
[]
[]
[]
[]
[]
[]
[]
[]
[]
[]
[]
[]
[]
[]
[]
[]
[]
[]
[]
[]
[]
[]
[]
[]
[]
[]
[]
[]
[]
[]
[]
[]
[]
[]
[]
[]
[]
[]
[]
[]
[]
[]
[]
[]
[]
[]
[]
[]
[]
[]
[]
[]
[]
[]
[]
[]
[]
[]
[]
[]
[]
[]
[]
[]
[]
[]
[]
[]
[]
[]
[]
[]
[]
[]
[]
[]
[]
[]
[]
[]
[]
[]
[]
[]
[]
[]
[]
[]
[]
[]
[]
[]
[]
[]
[]
[]
[]
[]
[]
[]
[]
[]
[]
[]
[]
[]
[]
[]
[]
[]
[]
[]
[]
[]
[]
[]
[]
[]
[]
[]
[]
[]
[]
[]
[]
[]
[]
[]
[]
[]
[]
[]
[]
[]
[]
[]
[]
[]
[]
[]
[]
[]
[]
[]
[]
[]
[]
[]
[]
[]
[]
[]
[]
[]
[]
[]
[]
[]
[]
[]
[]
[]
[]
[]
[]
[]
[]
[]
[]
[]
[]
[]
[]
[]
[]
[]
[]
[]
[]
[]
[]
[]
[]
[]
[]
[]
[]
[]
[]
[]
[]
[]
[]
[]
[]
[]
[]
[]
[]
[]
[]
[]
[]
[]
[]
[]
[]
[]
[]
[]
[]
[]
[]
[]
[]
[]
[]
[]
[]
[]
[]
[]
[]
[]
[]
[]
[]
[]
[]
[]
[]
[]
[]
[]
[]
[]
[]
[]
[]
[]
[]
[]
[]
[]
[]
[]
[]
[]
[]
[]
[]
[]
[]
[]
[]
[]
[]
[]
[]
[]
[]
[]
[]
[]
[]
[]
[]
[]
[]
[]
[]
[]
[]
[]
[]
[]
[]
[]
[]
[]
[]
[]
[]
[]
[]
[]
[]
[]
[]
[]
[]
[]
[]
[]
[]
[]
[]
[]
[]
[]
[]
[]
[]
[]
[]
[]
[]
[]
[]
[]
[]
[]
[]
[]
[]
[]
[]
[]
[]
[]
[]
[]
[]
[]
[]
[]
[]
[]
[]
[]
[]
[]
[]
[]
[]
[]
[]
[]
[]
[]
[]
[]
[]
[]
[]
[]
[]
[]
[]
[]
[]
[]
[]
[]
[]
[]
[]
[]
[]
[]
[]
[]
[]
[]
[]
[]
[]
[]
[]
[]
[]
[]
[]
[]
[]
[]
[]
[]
[]
[]
[]
[]
[]
[]
[]
[]
[]
[]
[]
[]
[]
[]
[]
[]
[]
[]
[]
[]
[]
[]
[]
[]
[]
[]
[]
[]
[]
[]
[]
[]
[]
[]
[]
[]
[]
[]
[]
[]
[]
[]
[]
[]
[]
[]
[]
[]
[]
[]
[]
[]
[]
[]
[]
[]
[]
[]
[]
[]
[]
[]
[]
[]
[]
[]
[]
[]
[]
[]
[]
[]
[]
[]
[]
[]
[]
[]
[]
[]
[]
[]
[]
[]
[]
[]
[]
[]
[]
[]
[]
[]
[]
[]
[]
[]
[]
[]
[]
[]
[]
[]
[]
[]
[]
[]
[]
[]
[]
[]
[]
[]
[]
[]
[]
[]
[]
[]
[]
[]
[]
[]
[]
[]
[]
[]
[]
[]
[]
[]
[]
[]
[]
[]
[]
[]
[]
[]
[]
[]
[]
[]
[]
[]
[]
[]
[]
[]
[]
[]
[]
[]
[]
[]
[]
[]
[]
[]
[]
[]
[]
[]
[]
[]
[]
[]
[]
[]
[]
[]
[]
[]
[]
[]
[]
[]
[]
[]
[]
[]
[]
[]
[]
[]
[]
[]
[]
[]
[]
[]
[]
[]
[]
[]
[]
[]
[]
[]
[]
[]
[]
[]
[]
[]
[]
[]
[]
[]
[]
[]
[]
[]
[]
[]
[]
[]
[]
[]
[]
[]
[]
[]
[]
[]
[]
[]
[]
[]
[]
[]
[]
[]
[]
[]
[]
[]
[]
[]
[]
[]
[]
[]
[]
[]
[]
[]
[]
[]
[]
[]
[]
[]
[]
[]
[]
[]
[]
[]
[]
[]
[]
[]
[]
[]
[]
[]
[]
[]
[]
[]
[]
[]
[]
[]
[]
[]
[]
[]
[]
[]
[]
[]
[]
[]
[]
[]
[]
[]
[]
[]
[]
[]
[]
[]
[]
[]
[]
[]
[]
[]
[]
[]
[]
[]
[]
[]
[]
[]
[]
[]
[]
[]
[]
[]
[]
[]
[]
[]
[]
[]
[]
[]
[]
[]
[]
[]
[]
[]
[]
[]
[]
[]
[]
[]
[]
[]
[]
[]
[]
[]
[]
[]
[]
[]
[]
[]
[]
[]
[]
[]
[]
[]
[]
[]
[]
[]
[]
[]
[]
[]
[]
[]
[]
[]
[]
[]
[]
[]
[]
[]
[]
[]
[]
[]
[]
[]
[]
[]
[]
[]
[]
[]
[]
[]
[]
[]
[]
[]
[]
[]
[]
[]
[]
[]
[]
[]
[]
[]
[]
[]
[]
[]
[]
[]
[]
[]
[]
[]
[]
[]
[]
[]
[]
[]
[]
[]
[]
[]
[]
[]
[]
[]
[]
[]
[]
[]
[]
[]
[]
[]
[]
[]
[]
[]
[]
[]
[]
[]
[]
[]
[]
[]
[]
[]
[]
[]
[]
[]
[]
[]
[]
[]
[]
[]
[]
[]
[]
[]
[]
[]
[]
[]
[]
[]
[]
[]
[]
[]
[]
[]
[]
[]
[]
[]
[]
[]
[]
[]
[]
[]
[]
[]
[]
[]
[]
[]
[]
[]
[]
[]
[]
[]
[]
[]
[]
[]
[]
[]
[]
[]
[]
[]
[]
[]
[]
[]
[]
[]
[]
[]
[]
[]
[]
[]
[]
[]
[]
[]
[]
[]
[]
[]
[]
[]
[]
[]
[]
[]
[]
[]
[]
[]
[]
[]
[]
[]
[]
[]
[]
[]
[]
[]
[]
[]
[]
[]
[]
[]
[]
[]
[]
[]
[]
[]
[]
[]
[]
[]
[]
[]
[]
[]
[]
[]
[]
[]
[]
[]
[]
[]
[]
[]
[]
[]
[]
[]
[]
[]
[]
[]
[]
[]
[]
[]
[]
[]
[]
[]
[]
[]
[]
[]
[]
[]
[]
[]
[]
[]
[]
[]
[]
[]
[]
[]
[]
[]
[]
[]
[]
[]
[]
[]
[]
[]
[]
[]
[]
[]
[]
[]
[]
[]
[]
[]
[]
[]
[]
[]
[]
[]
[]
[]
[]
[]
[]
[]
[]
[]
[]
[]
[]
[]
[]
[]
[]
[]
[]
[]
[]
[]
[]
[]
[]
[]
[]
[]
[]
[]
[]
[]
[]
[]
[]
[]
[]
[]
[]
[]
[]
[]
[]
[]
[]
[]
[]
[]
[]
[]
[]
[]
[]
[]
[]
[]
[]
[]
[]
[]
[]
[]
[]
[]
[]
[]
[]
[]
[]
[]
[]
[]
[]
[]
[]
[]
[]
[]
[]
[]
[]
[]
[]
[]
[]
[]
[]
[]
[]
[]
[]
[]
[]
[]
[]
[]
[]
[]
[]
[]
[]
[]
[]
[]
[]
[]
[]
[]
[]
[]
[]
[]
[]
[]
[]
[]
[]
[]
[]
[]
[]
[]
[]
[]
[]
[]
[]
[]
[]
[]
[]
[]
[]
[]
[]
[]
[]
[]
[]
[]
[]
[]
[]
[]
[]
[]
[]
[]
[]
[]
[]
[]
[]
[]
[]
[]
[]
[]
[]
[]
[]
[]
[]
[]
[]
[]
[]
[]
[]
[]
[]
[]
[]
[]
[]
[]
[]
[]
[]
[]
[]
[]
[]
[]
[]
[]
[]
[]
[]
[]
[]
[]
[]
[]
[]
[]
[]
[]
[]
[]
[]
[]
[]
[]
[]
[]
[]
[]
[]
[]
[]
[]
[]
[]
[]
[]
[]
[]
[]
[]
[]
[]
[]
[]
[]
[]
[]
[]
[]
[]
[]
[]
[]
[]
[]
[]
[]
[]
[]
[]
[]
[]
[]
[]
[]
[]
[]
[]
[]
[]
[]
[]
[]
[]
[]
[]
[]
[]
[]
[]
[]
[]
[]
[]
[]
[]
[]
[]
[]
[]
[]
[]
[]
[]
[]
[]
[]
[]
[]
[]
[]
[]
[]
[]
[]
[]
[]
[]
[]
[]
[]
[]
[]
[]
[]
[]
[]
[]
[]
[]
[]
[]
[]
[]
[]
[]
[]
[]
[]
[]
[]
[]
[]
[]
[]
[]
[]
[]
[]
[]
[]
[]
[]
[]
[]
[]
[]
[]
[]
[]
[]
[]
[]
[]
[]
[]
[]
[]
[]
[]
[]
[]
[]
[]
[]
[]
[]
[]
[]
[]
[]
[]
[]
[]
[]
[]
[]
[]
[]
[]
[]
[]
[]
[]
[]
[]
[]
[]
[]
[]
[]
[]
[]
[]
[]
[]
[]
[]
[]
[]
[]
[]
[]
[]
[]
[]
[]
[]
[]
[]
[]
[]
[]
[]
[]
[]
[]
[]
[]
[]
[]
[]
[]
[]
[]
[]
[]
[]
[]
[]
[]
[]
[]
[]
[]
[]
[]
[]
[]
[]
[]
[]
[]
[]
[]
[]
[]
[]
[]
[]
[]
[]
[]
[]
[]
[]
[]
[]
[]
[]
[]
[]
[]
[]
[]
[]
[]
[]
[]
[]
[]
[]
[]
[]
[]
[]
[]
[]
[]
[]
[]
[]
[]
[]
[]
[]
[]
[]
[]
[]
[]
[]
[]
[]
[]
[]
[]
[]
[]
[]
[]
[]
[]
[]
[]
[]
[]
[]
[]
[]
[]
[]
[]
[]
[]
[]
[]
[]
[]
[]
[]
[]
[]
[]
[]
[]
[]
[]
[]
[]
[]
[]
[]
[]
[]
[]
[]
[]
[]
[]
[]
[]
[]
[]
[]
[]
[]
[]
[]
[]
[]
[]
[]
[]
[]
[]
[]
[]
[]
[]
[]
[]
[]
[]
[]
[]
[]
[]
[]
[]
[]
[]
[]
[]
[]
[]
[]
[]
[]
[]
[]
[]
[]
[]
[]
[]
[]
[]
[]
[]
[]
[]
[]
[]
[]
[]
[]
[]
[]
[]
[]
[]
[]
[]
[]
[]
[]
[]
[]
[]
[]
[]
[]
[]
[]
[]
[]
[]
[]
[]
[]
[]
[]
[]
[]
[]
[]
[]
[]
[]
[]
[]
[]
[]
[]
[]
[]
[]
[]
[]
[]
[]
[]
[]
[]
[]
[]
[]
[]
[]
[]
[]
[]
[]
[]
[]
[]
[]
[]
[]
[]
[]
[]
[]
[]
[]
[]
[]
[]
[]
[]
[]
[]
[]
[]
[]
[]
[]
[]
[]
[]
[]
[]
[]
[]
[]
[]
[]
[]
[]
[]
[]
[]
[]
[]
[]
[]
[]
[]
[]
[]
[]
[]
[]
[]
[]
[]
[]
[]
[]
[]
[]
[]
[]
[]
[]
[]
[]
[]
[]
[]
[]
[]
[]
[]
[]
[]
[]
[]
[]
[]
[]
[]
[]
[]
[]
[]
[]
[]
[]
[]
[]
[]
[]
[]
[]
[]
[]
[]
[]
[]
[]
[]
[]
[]
[]
[]
[]
[]
[]
[]
[]
[]
[]
[]
[]
[]
[]
[]
[]
[]
[]
[]
[]
[]
[]
[]
[]
[]
[]
[]
[]
[]
[]
[]
[]
[]
[]
[]
[]
[]
[]
[]
[]
[]
[]
[]
[]
[]
[]
[]
[]
[]
[]
[]
[]
[]
[]
[]
[]
[]
[]
[]
[]
[]
[]
[]
[]
[]
[]
[]
[]
[]
[]
[]
[]
[]
[]
[]
[]
[]
[]
[]
[]
[]
[]
[]
[]
[]
[]
[]
[]
[]
[]
[]
[]
[]
[]
[]
[]
[]
[]
[]
[]
[]
[]
[]
[]
[]
[]
[]
[]
[]
[]
[]
[]
[]
[]
[]
[]
[]
[]
[]
[]
[]
[]
[]
[]
[]
[]
[]
[]
[]
[]
[]
[]
[]
[]
[]
[]
[]
[]
[]
[]
[]
[]
[]
[]
[]
[]
[]
[]
[]
[]
[]
[]
[]
[]
[]
[]
[]
[]
[]
[]
[]
[]
[]
[]
[]
[]
[]
[]
[]
[]
[]
[]
[]
[]
[]
[]
[]
[]
[]
[]
[]
[]
[]
[]
[]
[]
[]
[]
[]
[]
[]
[]
[]
[]
[]
[]
[]
[]
[]
[]
[]
[]
[]
[]
[]
[]
[]
[]
[]
[]
[]
[]
[]
[]
[]
[]
[]
[]
[]
[]
[]
[]
[]
[]
[]
[]
[]
[]
[]
[]
[]
[]
[]
[]
[]
[]
[]
[]
[]
[]
[]
[]
[]
[]
[]
[]
[]
[]
[]
[]
[]
[]
[]
[]
[]
[]
[]
[]
[]
[null,null,null,null,1945]
[null,null,null,null,1945]
[null,null,null,null,1945]
[null,null,null,null,1945]
[null,null,null,null,1945]
[null,null,null,null,1945]
[null,null,null,null,1945]
[null,null,null,null,1945]
[null,null,null,null,1945]
[null,null,null,null,1945]
[null,null,null,null,1945]
[null,null,null,null,1945]
[null,null,null,null,1945]
[null,null,null,null,1945]
[null,null,null,null,1945]
[null,null,null,null,1945]
[null,null,null,null,1945]
[null,null,null,null,1945]
[null,null,null,null,1945]
[null,null,null,null,1945]
[null,null,null,null,1945]
[null,null,null,null,1945]
[null,null,null,null,1945]
[null,null,null,null,1945]
[null,null,null,null,1945]