{"text_format":"1","workbook":"xlsx","n_sheets":4,"sheets":["Display","NLR","NLR 2","Symbols"],"not_rendered":{"charts":2,"images":3,"macros":1,"external_links":0,"defined_names":1,"comments":0,"pivot_tables":0},"unopened":[],"bounds":{"document_bytes":16777216,"sheet_cells":100000,"rows_first":2000,"rows_last":500,"rows_between":2000,"halvings":0,"cell_chars":16384,"cell_head_chars":4096},"cells_cut":0,"cells_raw":0,"read":"whole","date_system":"1900"}

{"sheet":"Display","index":0,"n_rows":52,"n_cols":28,"rows_kept":52,"cut":false,"hidden":false,"merged":[[46,10,46,11],[46,12,46,13],[47,10,47,11],[47,12,47,13],[43,10,43,11],[43,12,43,13],[44,10,44,11],[44,12,44,13],[45,10,45,11],[45,12,45,13],[38,10,38,11],[38,12,38,13],[39,10,39,11],[39,12,39,13],[40,10,40,11],[40,12,40,13],[35,10,35,11],[35,12,35,13],[36,10,36,11],[36,12,36,13],[37,10,37,11],[37,12,37,13],[26,18,26,30],[6,2,6,6],[7,2,7,6],[8,2,8,6],[14,2,14,6],[10,2,10,6],[11,2,11,6],[12,2,12,6],[13,2,13,6],[8,14,8,15],[7,14,7,15],[6,14,6,15],[20,2,20,6],[20,14,20,15],[21,2,21,6],[21,14,21,15],[18,2,18,6],[18,14,18,15],[19,2,19,6],[19,14,19,15],[22,2,22,6],[22,14,22,15],[23,2,23,6],[23,14,23,15],[1,1,2,4],[1,27,2,30],[1,5,2,26],[4,18,4,30],[17,2,17,6],[17,14,17,15],[15,2,15,6],[5,2,5,6],[15,14,15,15],[14,14,14,15],[13,14,13,15],[12,14,12,15],[11,14,11,15],[10,14,10,15],[9,14,9,15],[9,2,9,6],[5,14,5,15],[4,1,4,16],[16,2,16,6],[16,14,16,15],[34,10,34,11],[34,12,34,13],[24,2,24,6],[24,14,24,15],[25,2,25,6],[25,14,25,15],[26,2,26,6],[26,14,26,15],[27,2,27,6],[27,14,27,15],[28,2,28,6],[28,14,28,15],[41,2,41,6],[41,14,41,15],[43,2,43,6],[43,14,43,15],[41,10,41,11],[41,12,41,13],[42,10,42,11],[42,12,42,13],[29,2,29,6],[29,14,29,15],[30,2,30,6],[30,14,30,15],[31,2,31,6],[31,14,31,15],[33,2,33,6],[33,14,33,15],[34,2,34,6],[34,14,34,15],[32,2,32,6],[32,14,32,15],[32,10,32,11],[32,12,32,13],[33,10,33,11],[33,12,33,13],[48,25,48,30],[35,2,35,6],[35,14,35,15],[36,2,36,6],[36,14,36,15],[48,9,48,24],[46,2,46,6],[46,14,46,15],[47,2,47,6],[47,14,47,15],[37,2,37,6],[37,14,37,15],[38,2,38,6],[38,14,38,15],[39,2,39,6],[39,14,39,15],[44,2,44,6],[44,14,44,15],[45,2,45,6],[45,14,45,15],[40,2,40,6],[40,14,40,15],[42,2,42,6],[42,14,42,15]]}
[]
[null,null,null,null,null,"CQG Market Vectors Uranium + Nuclear Energy ETF (US Stocks)",null,null,null,null,null,null,null,null,null,null,null,null,null,null,null,null,null,null,null,null,null,{"$f":"RTD(\"cqg.rtd\", ,\"SystemInfo\", \"Linetime\")","v":45930.30667824074}]
[]
[]
[null,"Exchange Traded Funds Performance",null,null,null,null,null,null,null,null,null,null,null,null,null,null,null,null,"Today's Ranked Percent Net Change"]
[null,"Symbol","Description",null,null,null,null,"Last","NC","%NC","NC/ATR","Open","High","Low","Volume",null,"Ratio"]
[null,"S.NLR",{"$f":"RTD(\"cqg.rtd\", ,\"ContractData\",B7, \"LongDescription\",, \"T\")","v":"Market Vectors Uranium+Nuclear EnergyETF"},null,null,null,null,{"$f":"RTD(\"cqg.rtd\", ,\"ContractData\",B7, \"LastTradeToday\",, \"T\")","v":""},{"$f":"RTD(\"cqg.rtd\", ,\"ContractData\",B7, \"NetLastTradeToday\",, \"T\")","v":""},{"$f":"IFERROR(RTD(\"cqg.rtd\", ,\"ContractData\",B7, \"PerCentNetLastTrade\",, \"T\")/100,\"\")","v":""},{"$f":"IFERROR(I7/RTD(\"cqg.rtd\",,\"StudyData\",B7, \"ATR\", \"MaType=Sim,Period=10\", \"ATR\",\"D\",\"-1\",\"ALL\",,,\"FALSE\",\"T\")/100,\"\")","v":""},{"$f":"RTD(\"cqg.rtd\", ,\"ContractData\",B7, \"OPen\",, \"T\")","v":""},{"$f":"RTD(\"cqg.rtd\", ,\"ContractData\", B7, \"HIgh\",, \"T\")","v":""},{"$f":"RTD(\"cqg.rtd\", ,\"ContractData\",B7, \"LOw\",, \"T\")","v":""},{"$f":"RTD(\"cqg.rtd\", ,\"ContractData\",B7, \"T_CVol\",, \"T\")","v":2311},null,{"$f":" IFERROR(O7/RTD(\"cqg.rtd\",,\"StudyData\",B7, \"MA\", \"InputChoice=Vol,MAType=Sim,Period=21\", \"MA\",\"D\",\"-1\",\"all\",,,,\"T\"),\"\")","v":3.9594678937255982E-3}]
[null,"S.SMH",{"$f":"RTD(\"cqg.rtd\", ,\"ContractData\",B8, \"LongDescription\",, \"T\")","v":"VanEck Semiconductor ETF"},null,null,null,null,{"$f":"RTD(\"cqg.rtd\", ,\"ContractData\",B8, \"LastTradeToday\",, \"T\")","v":""},{"$f":"RTD(\"cqg.rtd\", ,\"ContractData\",B8, \"NetLastTradeToday\",, \"T\")","v":""},{"$f":"IFERROR(RTD(\"cqg.rtd\", ,\"ContractData\",B8, \"PerCentNetLastTrade\",, \"T\")/100,\"\")","v":""},{"$f":"IFERROR(I8/RTD(\"cqg.rtd\",,\"StudyData\",B8, \"ATR\", \"MaType=Sim,Period=10\", \"ATR\",\"D\",\"-1\",\"ALL\",,,\"FALSE\",\"T\")/100,\"\")","v":""},{"$f":"RTD(\"cqg.rtd\", ,\"ContractData\",B8, \"OPen\",, \"T\")","v":""},{"$f":"RTD(\"cqg.rtd\", ,\"ContractData\", B8, \"HIgh\",, \"T\")","v":""},{"$f":"RTD(\"cqg.rtd\", ,\"ContractData\",B8, \"LOw\",, \"T\")","v":""},{"$f":"RTD(\"cqg.rtd\", ,\"ContractData\",B8, \"T_CVol\",, \"T\")","v":29035},null,{"$f":" IFERROR(O8/RTD(\"cqg.rtd\",,\"StudyData\",B8, \"MA\", \"InputChoice=Vol,MAType=Sim,Period=21\", \"MA\",\"D\",\"-1\",\"all\",,,,\"T\"),\"\")","v":3.3392997687159681E-3}]
[null,"S.ANGL",{"$f":"RTD(\"cqg.rtd\", ,\"ContractData\",B9, \"LongDescription\",, \"T\")","v":"VanEck Fallen Angel High Yield Bond ETF"},null,null,null,null,{"$f":"RTD(\"cqg.rtd\", ,\"ContractData\",B9, \"LastTradeToday\",, \"T\")","v":""},{"$f":"RTD(\"cqg.rtd\", ,\"ContractData\",B9, \"NetLastTradeToday\",, \"T\")","v":""},{"$f":"IFERROR(RTD(\"cqg.rtd\", ,\"ContractData\",B9, \"PerCentNetLastTrade\",, \"T\")/100,\"\")","v":""},{"$f":"IFERROR(I9/RTD(\"cqg.rtd\",,\"StudyData\",B9, \"ATR\", \"MaType=Sim,Period=10\", \"ATR\",\"D\",\"-1\",\"ALL\",,,\"FALSE\",\"T\")/100,\"\")","v":""},{"$f":"RTD(\"cqg.rtd\", ,\"ContractData\",B9, \"OPen\",, \"T\")","v":""},{"$f":"RTD(\"cqg.rtd\", ,\"ContractData\", B9, \"HIgh\",, \"T\")","v":""},{"$f":"RTD(\"cqg.rtd\", ,\"ContractData\",B9, \"LOw\",, \"T\")","v":""},{"$f":"RTD(\"cqg.rtd\", ,\"ContractData\",B9, \"T_CVol\",, \"T\")","v":26},null,{"$f":" IFERROR(O9/RTD(\"cqg.rtd\",,\"StudyData\",B9, \"MA\", \"InputChoice=Vol,MAType=Sim,Period=21\", \"MA\",\"D\",\"-1\",\"all\",,,,\"T\"),\"\")","v":4.8901665021086835E-5}]
[null,"S.PPH",{"$f":"RTD(\"cqg.rtd\", ,\"ContractData\",B10, \"LongDescription\",, \"T\")","v":"VanEck Pharmaceutical ETF"},null,null,null,null,{"$f":"RTD(\"cqg.rtd\", ,\"ContractData\",B10, \"LastTradeToday\",, \"T\")","v":""},{"$f":"RTD(\"cqg.rtd\", ,\"ContractData\",B10, \"NetLastTradeToday\",, \"T\")","v":""},{"$f":"IFERROR(RTD(\"cqg.rtd\", ,\"ContractData\",B10, \"PerCentNetLastTrade\",, \"T\")/100,\"\")","v":""},{"$f":"IFERROR(I10/RTD(\"cqg.rtd\",,\"StudyData\",B10, \"ATR\", \"MaType=Sim,Period=10\", \"ATR\",\"D\",\"-1\",\"ALL\",,,\"FALSE\",\"T\")/100,\"\")","v":""},{"$f":"RTD(\"cqg.rtd\", ,\"ContractData\",B10, \"OPen\",, \"T\")","v":""},{"$f":"RTD(\"cqg.rtd\", ,\"ContractData\", B10, \"HIgh\",, \"T\")","v":""},{"$f":"RTD(\"cqg.rtd\", ,\"ContractData\",B10, \"LOw\",, \"T\")","v":""},{"$f":"RTD(\"cqg.rtd\", ,\"ContractData\",B10, \"T_CVol\",, \"T\")","v":3},null,{"$f":" IFERROR(O10/RTD(\"cqg.rtd\",,\"StudyData\",B10, \"MA\", \"InputChoice=Vol,MAType=Sim,Period=21\", \"MA\",\"D\",\"-1\",\"all\",,,,\"T\"),\"\")","v":1.1183668861151013E-5}]
[null,"S.DAPP",{"$f":"RTD(\"cqg.rtd\", ,\"ContractData\",B11, \"LongDescription\",, \"T\")","v":"VanEck Digital Transformation ETF"},null,null,null,null,{"$f":"RTD(\"cqg.rtd\", ,\"ContractData\",B11, \"LastTradeToday\",, \"T\")","v":""},{"$f":"RTD(\"cqg.rtd\", ,\"ContractData\",B11, \"NetLastTradeToday\",, \"T\")","v":""},{"$f":"IFERROR(RTD(\"cqg.rtd\", ,\"ContractData\",B11, \"PerCentNetLastTrade\",, \"T\")/100,\"\")","v":""},{"$f":"IFERROR(I11/RTD(\"cqg.rtd\",,\"StudyData\",B11, \"ATR\", \"MaType=Sim,Period=10\", \"ATR\",\"D\",\"-1\",\"ALL\",,,\"FALSE\",\"T\")/100,\"\")","v":""},{"$f":"RTD(\"cqg.rtd\", ,\"ContractData\",B11, \"OPen\",, \"T\")","v":""},{"$f":"RTD(\"cqg.rtd\", ,\"ContractData\", B11, \"HIgh\",, \"T\")","v":""},{"$f":"RTD(\"cqg.rtd\", ,\"ContractData\",B11, \"LOw\",, \"T\")","v":""},{"$f":"RTD(\"cqg.rtd\", ,\"ContractData\",B11, \"T_CVol\",, \"T\")","v":1322},null,{"$f":" IFERROR(O11/RTD(\"cqg.rtd\",,\"StudyData\",B11, \"MA\", \"InputChoice=Vol,MAType=Sim,Period=21\", \"MA\",\"D\",\"-1\",\"all\",,,,\"T\"),\"\")","v":2.0158545413037779E-3}]
[null,"S.ESPO",{"$f":"RTD(\"cqg.rtd\", ,\"ContractData\",B12, \"LongDescription\",, \"T\")","v":"VanEck Video Gaming and eSports ETF"},null,null,null,null,{"$f":"RTD(\"cqg.rtd\", ,\"ContractData\",B12, \"LastTradeToday\",, \"T\")","v":""},{"$f":"RTD(\"cqg.rtd\", ,\"ContractData\",B12, \"NetLastTradeToday\",, \"T\")","v":""},{"$f":"IFERROR(RTD(\"cqg.rtd\", ,\"ContractData\",B12, \"PerCentNetLastTrade\",, \"T\")/100,\"\")","v":""},{"$f":"IFERROR(I12/RTD(\"cqg.rtd\",,\"StudyData\",B12, \"ATR\", \"MaType=Sim,Period=10\", \"ATR\",\"D\",\"-1\",\"ALL\",,,\"FALSE\",\"T\")/100,\"\")","v":""},{"$f":"RTD(\"cqg.rtd\", ,\"ContractData\",B12, \"OPen\",, \"T\")","v":""},{"$f":"RTD(\"cqg.rtd\", ,\"ContractData\", B12, \"HIgh\",, \"T\")","v":""},{"$f":"RTD(\"cqg.rtd\", ,\"ContractData\",B12, \"LOw\",, \"T\")","v":""},{"$f":"RTD(\"cqg.rtd\", ,\"ContractData\",B12, \"T_CVol\",, \"T\")","v":134},null,{"$f":" IFERROR(O12/RTD(\"cqg.rtd\",,\"StudyData\",B12, \"MA\", \"InputChoice=Vol,MAType=Sim,Period=21\", \"MA\",\"D\",\"-1\",\"all\",,,,\"T\"),\"\")","v":2.5330242815671611E-3}]
[null,"S.BBH",{"$f":"RTD(\"cqg.rtd\", ,\"ContractData\",B13, \"LongDescription\",, \"T\")","v":"VanEck Biotech ETF"},null,null,null,null,{"$f":"RTD(\"cqg.rtd\", ,\"ContractData\",B13, \"LastTradeToday\",, \"T\")","v":""},{"$f":"RTD(\"cqg.rtd\", ,\"ContractData\",B13, \"NetLastTradeToday\",, \"T\")","v":""},{"$f":"IFERROR(RTD(\"cqg.rtd\", ,\"ContractData\",B13, \"PerCentNetLastTrade\",, \"T\")/100,\"\")","v":""},{"$f":"IFERROR(I13/RTD(\"cqg.rtd\",,\"StudyData\",B13, \"ATR\", \"MaType=Sim,Period=10\", \"ATR\",\"D\",\"-1\",\"ALL\",,,\"FALSE\",\"T\")/100,\"\")","v":""},{"$f":"RTD(\"cqg.rtd\", ,\"ContractData\",B13, \"OPen\",, \"T\")","v":""},{"$f":"RTD(\"cqg.rtd\", ,\"ContractData\", B13, \"HIgh\",, \"T\")","v":""},{"$f":"RTD(\"cqg.rtd\", ,\"ContractData\",B13, \"LOw\",, \"T\")","v":""},{"$f":"RTD(\"cqg.rtd\", ,\"ContractData\",B13, \"T_CVol\",, \"T\")","v":0},null,{"$f":" IFERROR(O13/RTD(\"cqg.rtd\",,\"StudyData\",B13, \"MA\", \"InputChoice=Vol,MAType=Sim,Period=21\", \"MA\",\"D\",\"-1\",\"all\",,,,\"T\"),\"\")","v":0}]
[null,"S.RTH",{"$f":"RTD(\"cqg.rtd\", ,\"ContractData\",B14, \"LongDescription\",, \"T\")","v":"VanEck Retail ETF"},null,null,null,null,{"$f":"RTD(\"cqg.rtd\", ,\"ContractData\",B14, \"LastTradeToday\",, \"T\")","v":""},{"$f":"RTD(\"cqg.rtd\", ,\"ContractData\",B14, \"NetLastTradeToday\",, \"T\")","v":""},{"$f":"IFERROR(RTD(\"cqg.rtd\", ,\"ContractData\",B14, \"PerCentNetLastTrade\",, \"T\")/100,\"\")","v":""},{"$f":"IFERROR(I14/RTD(\"cqg.rtd\",,\"StudyData\",B14, \"ATR\", \"MaType=Sim,Period=10\", \"ATR\",\"D\",\"-1\",\"ALL\",,,\"FALSE\",\"T\")/100,\"\")","v":""},{"$f":"RTD(\"cqg.rtd\", ,\"ContractData\",B14, \"OPen\",, \"T\")","v":""},{"$f":"RTD(\"cqg.rtd\", ,\"ContractData\", B14, \"HIgh\",, \"T\")","v":""},{"$f":"RTD(\"cqg.rtd\", ,\"ContractData\",B14, \"LOw\",, \"T\")","v":""},{"$f":"RTD(\"cqg.rtd\", ,\"ContractData\",B14, \"T_CVol\",, \"T\")","v":1},null,{"$f":" IFERROR(O14/RTD(\"cqg.rtd\",,\"StudyData\",B14, \"MA\", \"InputChoice=Vol,MAType=Sim,Period=21\", \"MA\",\"D\",\"-1\",\"all\",,,,\"T\"),\"\")","v":2.596696013453371E-4}]
[null,"S.BJK",{"$f":"RTD(\"cqg.rtd\", ,\"ContractData\",B15, \"LongDescription\",, \"T\")","v":"VanEck Gaming ETF"},null,null,null,null,{"$f":"RTD(\"cqg.rtd\", ,\"ContractData\",B15, \"LastTradeToday\",, \"T\")","v":""},{"$f":"RTD(\"cqg.rtd\", ,\"ContractData\",B15, \"NetLastTradeToday\",, \"T\")","v":""},{"$f":"IFERROR(RTD(\"cqg.rtd\", ,\"ContractData\",B15, \"PerCentNetLastTrade\",, \"T\")/100,\"\")","v":""},{"$f":"IFERROR(I15/RTD(\"cqg.rtd\",,\"StudyData\",B15, \"ATR\", \"MaType=Sim,Period=10\", \"ATR\",\"D\",\"-1\",\"ALL\",,,\"FALSE\",\"T\")/100,\"\")","v":""},{"$f":"RTD(\"cqg.rtd\", ,\"ContractData\",B15, \"OPen\",, \"T\")","v":""},{"$f":"RTD(\"cqg.rtd\", ,\"ContractData\", B15, \"HIgh\",, \"T\")","v":""},{"$f":"RTD(\"cqg.rtd\", ,\"ContractData\",B15, \"LOw\",, \"T\")","v":""},{"$f":"RTD(\"cqg.rtd\", ,\"ContractData\",B15, \"T_CVol\",, \"T\")","v":0},null,{"$f":" IFERROR(O15/RTD(\"cqg.rtd\",,\"StudyData\",B15, \"MA\", \"InputChoice=Vol,MAType=Sim,Period=21\", \"MA\",\"D\",\"-1\",\"all\",,,,\"T\"),\"\")","v":0}]
[null,"S.QQQ",{"$f":"RTD(\"cqg.rtd\", ,\"ContractData\",B16, \"LongDescription\",, \"T\")","v":"Invesco QQQ Trust Series 1"},null,null,null,null,{"$f":"RTD(\"cqg.rtd\", ,\"ContractData\",B16, \"LastTradeToday\",, \"T\")","v":""},{"$f":"RTD(\"cqg.rtd\", ,\"ContractData\",B16, \"NetLastTradeToday\",, \"T\")","v":""},{"$f":"IFERROR(RTD(\"cqg.rtd\", ,\"ContractData\",B16, \"PerCentNetLastTrade\",, \"T\")/100,\"\")","v":""},{"$f":"IFERROR(I16/RTD(\"cqg.rtd\",,\"StudyData\",B16, \"ATR\", \"MaType=Sim,Period=10\", \"ATR\",\"D\",\"-1\",\"ALL\",,,\"FALSE\",\"T\")/100,\"\")","v":""},{"$f":"RTD(\"cqg.rtd\", ,\"ContractData\",B16, \"OPen\",, \"T\")","v":""},{"$f":"RTD(\"cqg.rtd\", ,\"ContractData\", B16, \"HIgh\",, \"T\")","v":""},{"$f":"RTD(\"cqg.rtd\", ,\"ContractData\",B16, \"LOw\",, \"T\")","v":""},{"$f":"RTD(\"cqg.rtd\", ,\"ContractData\",B16, \"T_CVol\",, \"T\")","v":679739},null,{"$f":" IFERROR(O16/RTD(\"cqg.rtd\",,\"StudyData\",B16, \"MA\", \"InputChoice=Vol,MAType=Sim,Period=21\", \"MA\",\"D\",\"-1\",\"all\",,,,\"T\"),\"\")","v":1.2510117103900122E-2}]
[null,null,"Today's Ranked Percentage Change",null,null,null,null,"Last","NC","%NC","NC/ATR","Open","High","Low","Volume",null,"Ratio"]
[{"$f":"TRIM(NLR!O1)","v":""},"News",{"$f":"IFERROR(RTD(\"cqg.rtd\", ,\"ContractData\",A18, \"LongDescription\",, \"T\")&\" (\"&RIGHT(A18,LEN(A18)-5)&\")\",\"\")","v":""},null,null,null,null,{"$f":"IFERROR(RTD(\"cqg.rtd\", ,\"ContractData\",A18, \"LastTradeToday\",, \"T\"),\"\")","v":"Obligatory parameter <contract>(position - 1) is not specified"},{"$f":"IFERROR(RTD(\"cqg.rtd\", ,\"ContractData\",A18, \"NetLastTradeToday\",, \"T\"),\"\")","v":"Obligatory parameter <contract>(position - 1) is not specified"},{"$f":"IFERROR(RTD(\"cqg.rtd\", ,\"ContractData\",A18, \"PerCentNetLastTrade\",, \"T\")/100,\"\")","v":""},{"$f":"IFERROR(I18/RTD(\"cqg.rtd\",,\"StudyData\",A18, \"ATR\", \"MaType=Sim,Period=10\", \"ATR\",\"D\",\"-1\",\"ALL\",,,\"FALSE\",\"T\")/100,\"\")","v":""},{"$f":"IFERROR(RTD(\"cqg.rtd\", ,\"ContractData\",A18, \"OPen\",, \"T\"),\"\")","v":"Obligatory parameter <contract>(position - 1) is not specified"},{"$f":"IFERROR(RTD(\"cqg.rtd\", ,\"ContractData\", A18, \"HIgh\",, \"T\"),\"\")","v":"Obligatory parameter <contract>(position - 1) is not specified"},{"$f":"IFERROR(RTD(\"cqg.rtd\", ,\"ContractData\",A18, \"LOw\",, \"T\"),\"\")","v":"Obligatory parameter <contract>(position - 1) is not specified"},{"$f":"IFERROR(RTD(\"cqg.rtd\", ,\"ContractData\",A18, \"T_CVol\",, \"T\"),\"\")","v":"Obligatory parameter <contract>(position - 1) is not specified"},null,{"$f":" IFERROR(O18/RTD(\"cqg.rtd\",,\"StudyData\",A18, \"MA\", \"InputChoice=Vol,MAType=Sim,Period=21\", \"MA\",\"D\",\"-1\",\"all\",,,,\"T\"),\"\")","v":""},{"$f":"NLR!R1","v":{"$error":"#VALUE!"}}]
[{"$f":"TRIM(NLR!O2)","v":""},"News",{"$f":"IFERROR(RTD(\"cqg.rtd\", ,\"ContractData\",A19, \"LongDescription\",, \"T\")&\" (\"&RIGHT(A19,LEN(A19)-5)&\")\",\"\")","v":""},null,null,null,null,{"$f":"IFERROR(RTD(\"cqg.rtd\", ,\"ContractData\",A19, \"LastTradeToday\",, \"T\"),\"\")","v":"Obligatory parameter <contract>(position - 1) is not specified"},{"$f":"IFERROR(RTD(\"cqg.rtd\", ,\"ContractData\",A19, \"NetLastTradeToday\",, \"T\"),\"\")","v":"Obligatory parameter <contract>(position - 1) is not specified"},{"$f":"IFERROR(RTD(\"cqg.rtd\", ,\"ContractData\",A19, \"PerCentNetLastTrade\",, \"T\")/100,\"\")","v":""},{"$f":"IFERROR(I19/RTD(\"cqg.rtd\",,\"StudyData\",A19, \"ATR\", \"MaType=Sim,Period=10\", \"ATR\",\"D\",\"-1\",\"ALL\",,,\"FALSE\",\"T\")/100,\"\")","v":""},{"$f":"IFERROR(RTD(\"cqg.rtd\", ,\"ContractData\",A19, \"OPen\",, \"T\"),\"\")","v":"Obligatory parameter <contract>(position - 1) is not specified"},{"$f":"IFERROR(RTD(\"cqg.rtd\", ,\"ContractData\", A19, \"HIgh\",, \"T\"),\"\")","v":"Obligatory parameter <contract>(position - 1) is not specified"},{"$f":"IFERROR(RTD(\"cqg.rtd\", ,\"ContractData\",A19, \"LOw\",, \"T\"),\"\")","v":"Obligatory parameter <contract>(position - 1) is not specified"},{"$f":"IFERROR(RTD(\"cqg.rtd\", ,\"ContractData\",A19, \"T_CVol\",, \"T\"),\"\")","v":"Obligatory parameter <contract>(position - 1) is not specified"},null,{"$f":" IFERROR(O19/RTD(\"cqg.rtd\",,\"StudyData\",A19, \"MA\", \"InputChoice=Vol,MAType=Sim,Period=21\", \"MA\",\"D\",\"-1\",\"all\",,,,\"T\"),\"\")","v":""},{"$f":"NLR!R2","v":{"$error":"#VALUE!"}}]
[{"$f":"TRIM(NLR!O3)","v":""},"News",{"$f":"IFERROR(RTD(\"cqg.rtd\", ,\"ContractData\",A20, \"LongDescription\",, \"T\")&\" (\"&RIGHT(A20,LEN(A20)-5)&\")\",\"\")","v":""},null,null,null,null,{"$f":"IFERROR(RTD(\"cqg.rtd\", ,\"ContractData\",A20, \"LastTradeToday\",, \"T\"),\"\")","v":"Obligatory parameter <contract>(position - 1) is not specified"},{"$f":"IFERROR(RTD(\"cqg.rtd\", ,\"ContractData\",A20, \"NetLastTradeToday\",, \"T\"),\"\")","v":"Obligatory parameter <contract>(position - 1) is not specified"},{"$f":"IFERROR(RTD(\"cqg.rtd\", ,\"ContractData\",A20, \"PerCentNetLastTrade\",, \"T\")/100,\"\")","v":""},{"$f":"IFERROR(I20/RTD(\"cqg.rtd\",,\"StudyData\",A20, \"ATR\", \"MaType=Sim,Period=10\", \"ATR\",\"D\",\"-1\",\"ALL\",,,\"FALSE\",\"T\")/100,\"\")","v":""},{"$f":"IFERROR(RTD(\"cqg.rtd\", ,\"ContractData\",A20, \"OPen\",, \"T\"),\"\")","v":"Obligatory parameter <contract>(position - 1) is not specified"},{"$f":"IFERROR(RTD(\"cqg.rtd\", ,\"ContractData\", A20, \"HIgh\",, \"T\"),\"\")","v":"Obligatory parameter <contract>(position - 1) is not specified"},{"$f":"IFERROR(RTD(\"cqg.rtd\", ,\"ContractData\",A20, \"LOw\",, \"T\"),\"\")","v":"Obligatory parameter <contract>(position - 1) is not specified"},{"$f":"IFERROR(RTD(\"cqg.rtd\", ,\"ContractData\",A20, \"T_CVol\",, \"T\"),\"\")","v":"Obligatory parameter <contract>(position - 1) is not specified"},null,{"$f":" IFERROR(O20/RTD(\"cqg.rtd\",,\"StudyData\",A20, \"MA\", \"InputChoice=Vol,MAType=Sim,Period=21\", \"MA\",\"D\",\"-1\",\"all\",,,,\"T\"),\"\")","v":""},{"$f":"NLR!R3","v":{"$error":"#VALUE!"}}]
[{"$f":"TRIM(NLR!O4)","v":""},"News",{"$f":"IFERROR(RTD(\"cqg.rtd\", ,\"ContractData\",A21, \"LongDescription\",, \"T\")&\" (\"&RIGHT(A21,LEN(A21)-5)&\")\",\"\")","v":""},null,null,null,null,{"$f":"IFERROR(RTD(\"cqg.rtd\", ,\"ContractData\",A21, \"LastTradeToday\",, \"T\"),\"\")","v":"Obligatory parameter <contract>(position - 1) is not specified"},{"$f":"IFERROR(RTD(\"cqg.rtd\", ,\"ContractData\",A21, \"NetLastTradeToday\",, \"T\"),\"\")","v":"Obligatory parameter <contract>(position - 1) is not specified"},{"$f":"IFERROR(RTD(\"cqg.rtd\", ,\"ContractData\",A21, \"PerCentNetLastTrade\",, \"T\")/100,\"\")","v":""},{"$f":"IFERROR(I21/RTD(\"cqg.rtd\",,\"StudyData\",A21, \"ATR\", \"MaType=Sim,Period=10\", \"ATR\",\"D\",\"-1\",\"ALL\",,,\"FALSE\",\"T\")/100,\"\")","v":""},{"$f":"IFERROR(RTD(\"cqg.rtd\", ,\"ContractData\",A21, \"OPen\",, \"T\"),\"\")","v":"Obligatory parameter <contract>(position - 1) is not specified"},{"$f":"IFERROR(RTD(\"cqg.rtd\", ,\"ContractData\", A21, \"HIgh\",, \"T\"),\"\")","v":"Obligatory parameter <contract>(position - 1) is not specified"},{"$f":"IFERROR(RTD(\"cqg.rtd\", ,\"ContractData\",A21, \"LOw\",, \"T\"),\"\")","v":"Obligatory parameter <contract>(position - 1) is not specified"},{"$f":"IFERROR(RTD(\"cqg.rtd\", ,\"ContractData\",A21, \"T_CVol\",, \"T\"),\"\")","v":"Obligatory parameter <contract>(position - 1) is not specified"},null,{"$f":" IFERROR(O21/RTD(\"cqg.rtd\",,\"StudyData\",A21, \"MA\", \"InputChoice=Vol,MAType=Sim,Period=21\", \"MA\",\"D\",\"-1\",\"all\",,,,\"T\"),\"\")","v":""},{"$f":"NLR!R4","v":{"$error":"#VALUE!"}}]
[{"$f":"TRIM(NLR!O5)","v":""},"News",{"$f":"IFERROR(RTD(\"cqg.rtd\", ,\"ContractData\",A22, \"LongDescription\",, \"T\")&\" (\"&RIGHT(A22,LEN(A22)-5)&\")\",\"\")","v":""},null,null,null,null,{"$f":"IFERROR(RTD(\"cqg.rtd\", ,\"ContractData\",A22, \"LastTradeToday\",, \"T\"),\"\")","v":"Obligatory parameter <contract>(position - 1) is not specified"},{"$f":"IFERROR(RTD(\"cqg.rtd\", ,\"ContractData\",A22, \"NetLastTradeToday\",, \"T\"),\"\")","v":"Obligatory parameter <contract>(position - 1) is not specified"},{"$f":"IFERROR(RTD(\"cqg.rtd\", ,\"ContractData\",A22, \"PerCentNetLastTrade\",, \"T\")/100,\"\")","v":""},{"$f":"IFERROR(I22/RTD(\"cqg.rtd\",,\"StudyData\",A22, \"ATR\", \"MaType=Sim,Period=10\", \"ATR\",\"D\",\"-1\",\"ALL\",,,\"FALSE\",\"T\")/100,\"\")","v":""},{"$f":"IFERROR(RTD(\"cqg.rtd\", ,\"ContractData\",A22, \"OPen\",, \"T\"),\"\")","v":"Obligatory parameter <contract>(position - 1) is not specified"},{"$f":"IFERROR(RTD(\"cqg.rtd\", ,\"ContractData\", A22, \"HIgh\",, \"T\"),\"\")","v":"Obligatory parameter <contract>(position - 1) is not specified"},{"$f":"IFERROR(RTD(\"cqg.rtd\", ,\"ContractData\",A22, \"LOw\",, \"T\"),\"\")","v":"Obligatory parameter <contract>(position - 1) is not specified"},{"$f":"IFERROR(RTD(\"cqg.rtd\", ,\"ContractData\",A22, \"T_CVol\",, \"T\"),\"\")","v":"Obligatory parameter <contract>(position - 1) is not specified"},null,{"$f":" IFERROR(O22/RTD(\"cqg.rtd\",,\"StudyData\",A22, \"MA\", \"InputChoice=Vol,MAType=Sim,Period=21\", \"MA\",\"D\",\"-1\",\"all\",,,,\"T\"),\"\")","v":""},{"$f":"NLR!R5","v":{"$error":"#VALUE!"}}]
[{"$f":"TRIM(NLR!O6)","v":""},"News",{"$f":"IFERROR(RTD(\"cqg.rtd\", ,\"ContractData\",A23, \"LongDescription\",, \"T\")&\" (\"&RIGHT(A23,LEN(A23)-5)&\")\",\"\")","v":""},null,null,null,null,{"$f":"IFERROR(RTD(\"cqg.rtd\", ,\"ContractData\",A23, \"LastTradeToday\",, \"T\"),\"\")","v":"Obligatory parameter <contract>(position - 1) is not specified"},{"$f":"IFERROR(RTD(\"cqg.rtd\", ,\"ContractData\",A23, \"NetLastTradeToday\",, \"T\"),\"\")","v":"Obligatory parameter <contract>(position - 1) is not specified"},{"$f":"IFERROR(RTD(\"cqg.rtd\", ,\"ContractData\",A23, \"PerCentNetLastTrade\",, \"T\")/100,\"\")","v":""},{"$f":"IFERROR(I23/RTD(\"cqg.rtd\",,\"StudyData\",A23, \"ATR\", \"MaType=Sim,Period=10\", \"ATR\",\"D\",\"-1\",\"ALL\",,,\"FALSE\",\"T\")/100,\"\")","v":""},{"$f":"IFERROR(RTD(\"cqg.rtd\", ,\"ContractData\",A23, \"OPen\",, \"T\"),\"\")","v":"Obligatory parameter <contract>(position - 1) is not specified"},{"$f":"IFERROR(RTD(\"cqg.rtd\", ,\"ContractData\", A23, \"HIgh\",, \"T\"),\"\")","v":"Obligatory parameter <contract>(position - 1) is not specified"},{"$f":"IFERROR(RTD(\"cqg.rtd\", ,\"ContractData\",A23, \"LOw\",, \"T\"),\"\")","v":"Obligatory parameter <contract>(position - 1) is not specified"},{"$f":"IFERROR(RTD(\"cqg.rtd\", ,\"ContractData\",A23, \"T_CVol\",, \"T\"),\"\")","v":"Obligatory parameter <contract>(position - 1) is not specified"},null,{"$f":" IFERROR(O23/RTD(\"cqg.rtd\",,\"StudyData\",A23, \"MA\", \"InputChoice=Vol,MAType=Sim,Period=21\", \"MA\",\"D\",\"-1\",\"all\",,,,\"T\"),\"\")","v":""},{"$f":"NLR!R6","v":{"$error":"#VALUE!"}}]
[{"$f":"TRIM(NLR!O7)","v":""},"News",{"$f":"IFERROR(RTD(\"cqg.rtd\", ,\"ContractData\",A24, \"LongDescription\",, \"T\")&\" (\"&RIGHT(A24,LEN(A24)-5)&\")\",\"\")","v":""},null,null,null,null,{"$f":"IFERROR(RTD(\"cqg.rtd\", ,\"ContractData\",A24, \"LastTradeToday\",, \"T\"),\"\")","v":"Obligatory parameter <contract>(position - 1) is not specified"},{"$f":"IFERROR(RTD(\"cqg.rtd\", ,\"ContractData\",A24, \"NetLastTradeToday\",, \"T\"),\"\")","v":"Obligatory parameter <contract>(position - 1) is not specified"},{"$f":"IFERROR(RTD(\"cqg.rtd\", ,\"ContractData\",A24, \"PerCentNetLastTrade\",, \"T\")/100,\"\")","v":""},{"$f":"IFERROR(I24/RTD(\"cqg.rtd\",,\"StudyData\",A24, \"ATR\", \"MaType=Sim,Period=10\", \"ATR\",\"D\",\"-1\",\"ALL\",,,\"FALSE\",\"T\")/100,\"\")","v":""},{"$f":"IFERROR(RTD(\"cqg.rtd\", ,\"ContractData\",A24, \"OPen\",, \"T\"),\"\")","v":"Obligatory parameter <contract>(position - 1) is not specified"},{"$f":"IFERROR(RTD(\"cqg.rtd\", ,\"ContractData\", A24, \"HIgh\",, \"T\"),\"\")","v":"Obligatory parameter <contract>(position - 1) is not specified"},{"$f":"IFERROR(RTD(\"cqg.rtd\", ,\"ContractData\",A24, \"LOw\",, \"T\"),\"\")","v":"Obligatory parameter <contract>(position - 1) is not specified"},{"$f":"IFERROR(RTD(\"cqg.rtd\", ,\"ContractData\",A24, \"T_CVol\",, \"T\"),\"\")","v":"Obligatory parameter <contract>(position - 1) is not specified"},null,{"$f":" IFERROR(O24/RTD(\"cqg.rtd\",,\"StudyData\",A24, \"MA\", \"InputChoice=Vol,MAType=Sim,Period=21\", \"MA\",\"D\",\"-1\",\"all\",,,,\"T\"),\"\")","v":""},{"$f":"NLR!R7","v":{"$error":"#VALUE!"}}]
[{"$f":"TRIM(NLR!O8)","v":""},"News",{"$f":"IFERROR(RTD(\"cqg.rtd\", ,\"ContractData\",A25, \"LongDescription\",, \"T\")&\" (\"&RIGHT(A25,LEN(A25)-5)&\")\",\"\")","v":""},null,null,null,null,{"$f":"IFERROR(RTD(\"cqg.rtd\", ,\"ContractData\",A25, \"LastTradeToday\",, \"T\"),\"\")","v":"Obligatory parameter <contract>(position - 1) is not specified"},{"$f":"IFERROR(RTD(\"cqg.rtd\", ,\"ContractData\",A25, \"NetLastTradeToday\",, \"T\"),\"\")","v":"Obligatory parameter <contract>(position - 1) is not specified"},{"$f":"IFERROR(RTD(\"cqg.rtd\", ,\"ContractData\",A25, \"PerCentNetLastTrade\",, \"T\")/100,\"\")","v":""},{"$f":"IFERROR(I25/RTD(\"cqg.rtd\",,\"StudyData\",A25, \"ATR\", \"MaType=Sim,Period=10\", \"ATR\",\"D\",\"-1\",\"ALL\",,,\"FALSE\",\"T\")/100,\"\")","v":""},{"$f":"IFERROR(RTD(\"cqg.rtd\", ,\"ContractData\",A25, \"OPen\",, \"T\"),\"\")","v":"Obligatory parameter <contract>(position - 1) is not specified"},{"$f":"IFERROR(RTD(\"cqg.rtd\", ,\"ContractData\", A25, \"HIgh\",, \"T\"),\"\")","v":"Obligatory parameter <contract>(position - 1) is not specified"},{"$f":"IFERROR(RTD(\"cqg.rtd\", ,\"ContractData\",A25, \"LOw\",, \"T\"),\"\")","v":"Obligatory parameter <contract>(position - 1) is not specified"},{"$f":"IFERROR(RTD(\"cqg.rtd\", ,\"ContractData\",A25, \"T_CVol\",, \"T\"),\"\")","v":"Obligatory parameter <contract>(position - 1) is not specified"},null,{"$f":" IFERROR(O25/RTD(\"cqg.rtd\",,\"StudyData\",A25, \"MA\", \"InputChoice=Vol,MAType=Sim,Period=21\", \"MA\",\"D\",\"-1\",\"all\",,,,\"T\"),\"\")","v":""},{"$f":"NLR!R8","v":{"$error":"#VALUE!"}}]
[{"$f":"TRIM(NLR!O9)","v":""},"News",{"$f":"IFERROR(RTD(\"cqg.rtd\", ,\"ContractData\",A26, \"LongDescription\",, \"T\")&\" (\"&RIGHT(A26,LEN(A26)-5)&\")\",\"\")","v":""},null,null,null,null,{"$f":"IFERROR(RTD(\"cqg.rtd\", ,\"ContractData\",A26, \"LastTradeToday\",, \"T\"),\"\")","v":"Obligatory parameter <contract>(position - 1) is not specified"},{"$f":"IFERROR(RTD(\"cqg.rtd\", ,\"ContractData\",A26, \"NetLastTradeToday\",, \"T\"),\"\")","v":"Obligatory parameter <contract>(position - 1) is not specified"},{"$f":"IFERROR(RTD(\"cqg.rtd\", ,\"ContractData\",A26, \"PerCentNetLastTrade\",, \"T\")/100,\"\")","v":""},{"$f":"IFERROR(I26/RTD(\"cqg.rtd\",,\"StudyData\",A26, \"ATR\", \"MaType=Sim,Period=10\", \"ATR\",\"D\",\"-1\",\"ALL\",,,\"FALSE\",\"T\")/100,\"\")","v":""},{"$f":"IFERROR(RTD(\"cqg.rtd\", ,\"ContractData\",A26, \"OPen\",, \"T\"),\"\")","v":"Obligatory parameter <contract>(position - 1) is not specified"},{"$f":"IFERROR(RTD(\"cqg.rtd\", ,\"ContractData\", A26, \"HIgh\",, \"T\"),\"\")","v":"Obligatory parameter <contract>(position - 1) is not specified"},{"$f":"IFERROR(RTD(\"cqg.rtd\", ,\"ContractData\",A26, \"LOw\",, \"T\"),\"\")","v":"Obligatory parameter <contract>(position - 1) is not specified"},{"$f":"IFERROR(RTD(\"cqg.rtd\", ,\"ContractData\",A26, \"T_CVol\",, \"T\"),\"\")","v":"Obligatory parameter <contract>(position - 1) is not specified"},null,{"$f":" IFERROR(O26/RTD(\"cqg.rtd\",,\"StudyData\",A26, \"MA\", \"InputChoice=Vol,MAType=Sim,Period=21\", \"MA\",\"D\",\"-1\",\"all\",,,,\"T\"),\"\")","v":""},{"$f":"NLR!R9","v":{"$error":"#VALUE!"}}]
[{"$f":"TRIM(NLR!O10)","v":""},"News",{"$f":"IFERROR(RTD(\"cqg.rtd\", ,\"ContractData\",A27, \"LongDescription\",, \"T\")&\" (\"&RIGHT(A27,LEN(A27)-5)&\")\",\"\")","v":""},null,null,null,null,{"$f":"IFERROR(RTD(\"cqg.rtd\", ,\"ContractData\",A27, \"LastTradeToday\",, \"T\"),\"\")","v":"Obligatory parameter <contract>(position - 1) is not specified"},{"$f":"IFERROR(RTD(\"cqg.rtd\", ,\"ContractData\",A27, \"NetLastTradeToday\",, \"T\"),\"\")","v":"Obligatory parameter <contract>(position - 1) is not specified"},{"$f":"IFERROR(RTD(\"cqg.rtd\", ,\"ContractData\",A27, \"PerCentNetLastTrade\",, \"T\")/100,\"\")","v":""},{"$f":"IFERROR(I27/RTD(\"cqg.rtd\",,\"StudyData\",A27, \"ATR\", \"MaType=Sim,Period=10\", \"ATR\",\"D\",\"-1\",\"ALL\",,,\"FALSE\",\"T\")/100,\"\")","v":""},{"$f":"IFERROR(RTD(\"cqg.rtd\", ,\"ContractData\",A27, \"OPen\",, \"T\"),\"\")","v":"Obligatory parameter <contract>(position - 1) is not specified"},{"$f":"IFERROR(RTD(\"cqg.rtd\", ,\"ContractData\", A27, \"HIgh\",, \"T\"),\"\")","v":"Obligatory parameter <contract>(position - 1) is not specified"},{"$f":"IFERROR(RTD(\"cqg.rtd\", ,\"ContractData\",A27, \"LOw\",, \"T\"),\"\")","v":"Obligatory parameter <contract>(position - 1) is not specified"},{"$f":"IFERROR(RTD(\"cqg.rtd\", ,\"ContractData\",A27, \"T_CVol\",, \"T\"),\"\")","v":"Obligatory parameter <contract>(position - 1) is not specified"},null,{"$f":" IFERROR(O27/RTD(\"cqg.rtd\",,\"StudyData\",A27, \"MA\", \"InputChoice=Vol,MAType=Sim,Period=21\", \"MA\",\"D\",\"-1\",\"all\",,,,\"T\"),\"\")","v":""},{"$f":"NLR!R10","v":{"$error":"#VALUE!"}},"Annual Ranked Percent Net Change "]
[{"$f":"TRIM(NLR!O11)","v":""},"News",{"$f":"IFERROR(RTD(\"cqg.rtd\", ,\"ContractData\",A28, \"LongDescription\",, \"T\")&\" (\"&RIGHT(A28,LEN(A28)-5)&\")\",\"\")","v":""},null,null,null,null,{"$f":"IFERROR(RTD(\"cqg.rtd\", ,\"ContractData\",A28, \"LastTradeToday\",, \"T\"),\"\")","v":"Obligatory parameter <contract>(position - 1) is not specified"},{"$f":"IFERROR(RTD(\"cqg.rtd\", ,\"ContractData\",A28, \"NetLastTradeToday\",, \"T\"),\"\")","v":"Obligatory parameter <contract>(position - 1) is not specified"},{"$f":"IFERROR(RTD(\"cqg.rtd\", ,\"ContractData\",A28, \"PerCentNetLastTrade\",, \"T\")/100,\"\")","v":""},{"$f":"IFERROR(I28/RTD(\"cqg.rtd\",,\"StudyData\",A28, \"ATR\", \"MaType=Sim,Period=10\", \"ATR\",\"D\",\"-1\",\"ALL\",,,\"FALSE\",\"T\")/100,\"\")","v":""},{"$f":"IFERROR(RTD(\"cqg.rtd\", ,\"ContractData\",A28, \"OPen\",, \"T\"),\"\")","v":"Obligatory parameter <contract>(position - 1) is not specified"},{"$f":"IFERROR(RTD(\"cqg.rtd\", ,\"ContractData\", A28, \"HIgh\",, \"T\"),\"\")","v":"Obligatory parameter <contract>(position - 1) is not specified"},{"$f":"IFERROR(RTD(\"cqg.rtd\", ,\"ContractData\",A28, \"LOw\",, \"T\"),\"\")","v":"Obligatory parameter <contract>(position - 1) is not specified"},{"$f":"IFERROR(RTD(\"cqg.rtd\", ,\"ContractData\",A28, \"T_CVol\",, \"T\"),\"\")","v":"Obligatory parameter <contract>(position - 1) is not specified"},null,{"$f":" IFERROR(O28/RTD(\"cqg.rtd\",,\"StudyData\",A28, \"MA\", \"InputChoice=Vol,MAType=Sim,Period=21\", \"MA\",\"D\",\"-1\",\"all\",,,,\"T\"),\"\")","v":""},{"$f":"NLR!R11","v":{"$error":"#VALUE!"}}]
[{"$f":"TRIM(NLR!O12)","v":""},"News",{"$f":"IFERROR(RTD(\"cqg.rtd\", ,\"ContractData\",A29, \"LongDescription\",, \"T\")&\" (\"&RIGHT(A29,LEN(A29)-5)&\")\",\"\")","v":""},null,null,null,null,{"$f":"IFERROR(RTD(\"cqg.rtd\", ,\"ContractData\",A29, \"LastTradeToday\",, \"T\"),\"\")","v":"Obligatory parameter <contract>(position - 1) is not specified"},{"$f":"IFERROR(RTD(\"cqg.rtd\", ,\"ContractData\",A29, \"NetLastTradeToday\",, \"T\"),\"\")","v":"Obligatory parameter <contract>(position - 1) is not specified"},{"$f":"IFERROR(RTD(\"cqg.rtd\", ,\"ContractData\",A29, \"PerCentNetLastTrade\",, \"T\")/100,\"\")","v":""},{"$f":"IFERROR(I29/RTD(\"cqg.rtd\",,\"StudyData\",A29, \"ATR\", \"MaType=Sim,Period=10\", \"ATR\",\"D\",\"-1\",\"ALL\",,,\"FALSE\",\"T\")/100,\"\")","v":""},{"$f":"IFERROR(RTD(\"cqg.rtd\", ,\"ContractData\",A29, \"OPen\",, \"T\"),\"\")","v":"Obligatory parameter <contract>(position - 1) is not specified"},{"$f":"IFERROR(RTD(\"cqg.rtd\", ,\"ContractData\", A29, \"HIgh\",, \"T\"),\"\")","v":"Obligatory parameter <contract>(position - 1) is not specified"},{"$f":"IFERROR(RTD(\"cqg.rtd\", ,\"ContractData\",A29, \"LOw\",, \"T\"),\"\")","v":"Obligatory parameter <contract>(position - 1) is not specified"},{"$f":"IFERROR(RTD(\"cqg.rtd\", ,\"ContractData\",A29, \"T_CVol\",, \"T\"),\"\")","v":"Obligatory parameter <contract>(position - 1) is not specified"},null,{"$f":" IFERROR(O29/RTD(\"cqg.rtd\",,\"StudyData\",A29, \"MA\", \"InputChoice=Vol,MAType=Sim,Period=21\", \"MA\",\"D\",\"-1\",\"all\",,,,\"T\"),\"\")","v":""},{"$f":"NLR!R12","v":{"$error":"#VALUE!"}}]
[{"$f":"TRIM(NLR!O13)","v":""},"News",{"$f":"IFERROR(RTD(\"cqg.rtd\", ,\"ContractData\",A30, \"LongDescription\",, \"T\")&\" (\"&RIGHT(A30,LEN(A30)-5)&\")\",\"\")","v":""},null,null,null,null,{"$f":"IFERROR(RTD(\"cqg.rtd\", ,\"ContractData\",A30, \"LastTradeToday\",, \"T\"),\"\")","v":"Obligatory parameter <contract>(position - 1) is not specified"},{"$f":"IFERROR(RTD(\"cqg.rtd\", ,\"ContractData\",A30, \"NetLastTradeToday\",, \"T\"),\"\")","v":"Obligatory parameter <contract>(position - 1) is not specified"},{"$f":"IFERROR(RTD(\"cqg.rtd\", ,\"ContractData\",A30, \"PerCentNetLastTrade\",, \"T\")/100,\"\")","v":""},{"$f":"IFERROR(I30/RTD(\"cqg.rtd\",,\"StudyData\",A30, \"ATR\", \"MaType=Sim,Period=10\", \"ATR\",\"D\",\"-1\",\"ALL\",,,\"FALSE\",\"T\")/100,\"\")","v":""},{"$f":"IFERROR(RTD(\"cqg.rtd\", ,\"ContractData\",A30, \"OPen\",, \"T\"),\"\")","v":"Obligatory parameter <contract>(position - 1) is not specified"},{"$f":"IFERROR(RTD(\"cqg.rtd\", ,\"ContractData\", A30, \"HIgh\",, \"T\"),\"\")","v":"Obligatory parameter <contract>(position - 1) is not specified"},{"$f":"IFERROR(RTD(\"cqg.rtd\", ,\"ContractData\",A30, \"LOw\",, \"T\"),\"\")","v":"Obligatory parameter <contract>(position - 1) is not specified"},{"$f":"IFERROR(RTD(\"cqg.rtd\", ,\"ContractData\",A30, \"T_CVol\",, \"T\"),\"\")","v":"Obligatory parameter <contract>(position - 1) is not specified"},null,{"$f":" IFERROR(O30/RTD(\"cqg.rtd\",,\"StudyData\",A30, \"MA\", \"InputChoice=Vol,MAType=Sim,Period=21\", \"MA\",\"D\",\"-1\",\"all\",,,,\"T\"),\"\")","v":""},{"$f":"NLR!R13","v":{"$error":"#VALUE!"}}]
[{"$f":"TRIM(NLR!O14)","v":""},"News",{"$f":"IFERROR(RTD(\"cqg.rtd\", ,\"ContractData\",A31, \"LongDescription\",, \"T\")&\" (\"&RIGHT(A31,LEN(A31)-5)&\")\",\"\")","v":""},null,null,null,null,{"$f":"IFERROR(RTD(\"cqg.rtd\", ,\"ContractData\",A31, \"LastTradeToday\",, \"T\"),\"\")","v":"Obligatory parameter <contract>(position - 1) is not specified"},{"$f":"IFERROR(RTD(\"cqg.rtd\", ,\"ContractData\",A31, \"NetLastTradeToday\",, \"T\"),\"\")","v":"Obligatory parameter <contract>(position - 1) is not specified"},{"$f":"IFERROR(RTD(\"cqg.rtd\", ,\"ContractData\",A31, \"PerCentNetLastTrade\",, \"T\")/100,\"\")","v":""},{"$f":"IFERROR(I31/RTD(\"cqg.rtd\",,\"StudyData\",A31, \"ATR\", \"MaType=Sim,Period=10\", \"ATR\",\"D\",\"-1\",\"ALL\",,,\"FALSE\",\"T\")/100,\"\")","v":""},{"$f":"IFERROR(RTD(\"cqg.rtd\", ,\"ContractData\",A31, \"OPen\",, \"T\"),\"\")","v":"Obligatory parameter <contract>(position - 1) is not specified"},{"$f":"IFERROR(RTD(\"cqg.rtd\", ,\"ContractData\", A31, \"HIgh\",, \"T\"),\"\")","v":"Obligatory parameter <contract>(position - 1) is not specified"},{"$f":"IFERROR(RTD(\"cqg.rtd\", ,\"ContractData\",A31, \"LOw\",, \"T\"),\"\")","v":"Obligatory parameter <contract>(position - 1) is not specified"},{"$f":"IFERROR(RTD(\"cqg.rtd\", ,\"ContractData\",A31, \"T_CVol\",, \"T\"),\"\")","v":"Obligatory parameter <contract>(position - 1) is not specified"},null,{"$f":" IFERROR(O31/RTD(\"cqg.rtd\",,\"StudyData\",A31, \"MA\", \"InputChoice=Vol,MAType=Sim,Period=21\", \"MA\",\"D\",\"-1\",\"all\",,,,\"T\"),\"\")","v":""},{"$f":"NLR!R14","v":{"$error":"#VALUE!"}}]
[{"$f":"TRIM(NLR!O15)","v":""},"News",{"$f":"IFERROR(RTD(\"cqg.rtd\", ,\"ContractData\",A32, \"LongDescription\",, \"T\")&\" (\"&RIGHT(A32,LEN(A32)-5)&\")\",\"\")","v":""},null,null,null,null,{"$f":"IFERROR(RTD(\"cqg.rtd\", ,\"ContractData\",A32, \"LastTradeToday\",, \"T\"),\"\")","v":"Obligatory parameter <contract>(position - 1) is not specified"},{"$f":"IFERROR(RTD(\"cqg.rtd\", ,\"ContractData\",A32, \"NetLastTradeToday\",, \"T\"),\"\")","v":"Obligatory parameter <contract>(position - 1) is not specified"},{"$f":"IFERROR(RTD(\"cqg.rtd\", ,\"ContractData\",A32, \"PerCentNetLastTrade\",, \"T\")/100,\"\")","v":""},{"$f":"IFERROR(I32/RTD(\"cqg.rtd\",,\"StudyData\",A32, \"ATR\", \"MaType=Sim,Period=10\", \"ATR\",\"D\",\"-1\",\"ALL\",,,\"FALSE\",\"T\")/100,\"\")","v":""},{"$f":"IFERROR(RTD(\"cqg.rtd\", ,\"ContractData\",A32, \"OPen\",, \"T\"),\"\")","v":"Obligatory parameter <contract>(position - 1) is not specified"},{"$f":"IFERROR(RTD(\"cqg.rtd\", ,\"ContractData\", A32, \"HIgh\",, \"T\"),\"\")","v":"Obligatory parameter <contract>(position - 1) is not specified"},{"$f":"IFERROR(RTD(\"cqg.rtd\", ,\"ContractData\",A32, \"LOw\",, \"T\"),\"\")","v":"Obligatory parameter <contract>(position - 1) is not specified"},{"$f":"IFERROR(RTD(\"cqg.rtd\", ,\"ContractData\",A32, \"T_CVol\",, \"T\"),\"\")","v":"Obligatory parameter <contract>(position - 1) is not specified"},null,{"$f":" IFERROR(O32/RTD(\"cqg.rtd\",,\"StudyData\",A32, \"MA\", \"InputChoice=Vol,MAType=Sim,Period=21\", \"MA\",\"D\",\"-1\",\"all\",,,,\"T\"),\"\")","v":""},{"$f":"NLR!R15","v":{"$error":"#VALUE!"}}]
[null,null,"Annual Percentage Net Change",null,null,null,null,"Last","NC","%NC","Annual %NC",null,"Open %NC",null,"High %NC",null,"Low %NC"]
[{"$f":"TRIM('NLR 2'!O1)","v":"S.US.OKLO"},"News",{"$f":"IFERROR(RTD(\"cqg.rtd\", ,\"ContractData\",A34, \"LongDescription\",, \"T\")&\" (\"&RIGHT(A34,LEN(A34)-5)&\")\",\"\")","v":"Oklo Inc. (OKLO)"},null,null,null,null,{"$f":"IFERROR(RTD(\"cqg.rtd\", ,\"ContractData\",A34, \"LastTradeToday\",, \"T\"),\"\")","v":""},{"$f":"IFERROR(RTD(\"cqg.rtd\", ,\"ContractData\",A34, \"NetLastTradeToday\",, \"T\"),\"\")","v":""},{"$f":"IFERROR(RTD(\"cqg.rtd\", ,\"ContractData\",A34, \"PerCentNetLastTrade\",, \"T\")/100,\"\")","v":""},{"$f":"IFERROR(RTD(\"cqg.rtd\",,\"StudyData\",A34,\"PCB\",\"BaseType=Index,Index=1\",\"Close\",\"A\",,\"all\",,,,\"T\")/100,\"\")","v":4.4879886952425814},null,{"$f":"IFERROR(RTD(\"cqg.rtd\",,\"StudyData\",A34,\"PCB\",\"BaseType=Index,Index=1\",\"Open\",\"A\",,\"all\",,,,\"T\")/100,\"\")","v":0},null,{"$f":"IFERROR(RTD(\"cqg.rtd\",,\"StudyData\",A34,\"PCB\",\"BaseType=Index,Index=1\",\"High\",\"A\",,\"all\",,,,\"T\")/100,\"\")","v":5.8059349976448429},null,{"$f":"IFERROR(RTD(\"cqg.rtd\",,\"StudyData\",A34,\"PCB\",\"BaseType=Index,Index=1\",\"Low\",\"A\",,\"all\",,,,\"T\")/100,\"\")","v":-0.16156382477626},{"$f":"'NLR 2'!R1","v":"https://finance.yahoo.com/quote/OKLO"}]
[{"$f":"TRIM('NLR 2'!O2)","v":"S.US.LEU"},"News",{"$f":"IFERROR(RTD(\"cqg.rtd\", ,\"ContractData\",A35, \"LongDescription\",, \"T\")&\" (\"&RIGHT(A35,LEN(A35)-5)&\")\",\"\")","v":"Centrus Energy Corp. (LEU)"},null,null,null,null,{"$f":"IFERROR(RTD(\"cqg.rtd\", ,\"ContractData\",A35, \"LastTradeToday\",, \"T\"),\"\")","v":""},{"$f":"IFERROR(RTD(\"cqg.rtd\", ,\"ContractData\",A35, \"NetLastTradeToday\",, \"T\"),\"\")","v":""},{"$f":"IFERROR(RTD(\"cqg.rtd\",,\"StudyData\",A35, \"PCB\",\"BaseType=Index,Index=1\", \"Close\", \"A\",,\"all\",,,,\"T\")/100,\"\")","v":3.7383275784416754},{"$f":"IFERROR(RTD(\"cqg.rtd\",,\"StudyData\",A35,\"PCB\",\"BaseType=Index,Index=1\",\"Close\",\"A\",,\"all\",,,,\"T\")/100,\"\")","v":3.7383275784416754},null,{"$f":"IFERROR(RTD(\"cqg.rtd\",,\"StudyData\",A35,\"PCB\",\"BaseType=Index,Index=1\",\"Open\",\"A\",,\"all\",,,,\"T\")/100,\"\")","v":1.3661612370514888E-2},null,{"$f":"IFERROR(RTD(\"cqg.rtd\",,\"StudyData\",A35,\"PCB\",\"BaseType=Index,Index=1\",\"High\",\"A\",,\"all\",,,,\"T\")/100,\"\")","v":4.0741630385827952},null,{"$f":"IFERROR(RTD(\"cqg.rtd\",,\"StudyData\",A35,\"PCB\",\"BaseType=Index,Index=1\",\"Low\",\"A\",,\"all\",,,,\"T\")/100,\"\")","v":-0.25836961417204629},{"$f":"'NLR 2'!R2","v":"https://finance.yahoo.com/quote/LEU"}]
[{"$f":"TRIM('NLR 2'!O3)","v":"S.US.UUUU"},"News",{"$f":"IFERROR(RTD(\"cqg.rtd\", ,\"ContractData\",A36, \"LongDescription\",, \"T\")&\" (\"&RIGHT(A36,LEN(A36)-5)&\")\",\"\")","v":"Energy Fuels Inc. (UUUU)"},null,null,null,null,{"$f":"IFERROR(RTD(\"cqg.rtd\", ,\"ContractData\",A36, \"LastTradeToday\",, \"T\"),\"\")","v":""},{"$f":"IFERROR(RTD(\"cqg.rtd\", ,\"ContractData\",A36, \"NetLastTradeToday\",, \"T\"),\"\")","v":""},{"$f":"IFERROR(RTD(\"cqg.rtd\",,\"StudyData\",A36, \"PCB\",\"BaseType=Index,Index=1\", \"Close\", \"A\",,\"all\",,,,\"T\")/100,\"\")","v":2.2202729044834308},{"$f":"IFERROR(RTD(\"cqg.rtd\",,\"StudyData\",A36,\"PCB\",\"BaseType=Index,Index=1\",\"Close\",\"A\",,\"all\",,,,\"T\")/100,\"\")","v":2.2202729044834308},null,{"$f":"IFERROR(RTD(\"cqg.rtd\",,\"StudyData\",A36,\"PCB\",\"BaseType=Index,Index=1\",\"Open\",\"A\",,\"all\",,,,\"T\")/100,\"\")","v":2.3391812865497096E-2},null,{"$f":"IFERROR(RTD(\"cqg.rtd\",,\"StudyData\",A36,\"PCB\",\"BaseType=Index,Index=1\",\"High\",\"A\",,\"all\",,,,\"T\")/100,\"\")","v":2.660818713450293},null,{"$f":"IFERROR(RTD(\"cqg.rtd\",,\"StudyData\",A36,\"PCB\",\"BaseType=Index,Index=1\",\"Low\",\"A\",,\"all\",,,,\"T\")/100,\"\")","v":-0.37621832358674462},{"$f":"'NLR 2'!R3","v":"https://finance.yahoo.com/quote/UUUU"}]
[{"$f":"TRIM('NLR 2'!O4)","v":"S.US.SMR"},"News",{"$f":"IFERROR(RTD(\"cqg.rtd\", ,\"ContractData\",A37, \"LongDescription\",, \"T\")&\" (\"&RIGHT(A37,LEN(A37)-5)&\")\",\"\")","v":"NuScale Power Corporation (SMR)"},null,null,null,null,{"$f":"IFERROR(RTD(\"cqg.rtd\", ,\"ContractData\",A37, \"LastTradeToday\",, \"T\"),\"\")","v":""},{"$f":"IFERROR(RTD(\"cqg.rtd\", ,\"ContractData\",A37, \"NetLastTradeToday\",, \"T\"),\"\")","v":""},{"$f":"IFERROR(RTD(\"cqg.rtd\",,\"StudyData\",A37, \"PCB\",\"BaseType=Index,Index=1\", \"Close\", \"A\",,\"all\",,,,\"T\")/100,\"\")","v":1.1282766313441162},{"$f":"IFERROR(RTD(\"cqg.rtd\",,\"StudyData\",A37,\"PCB\",\"BaseType=Index,Index=1\",\"Close\",\"A\",,\"all\",,,,\"T\")/100,\"\")","v":1.1282766313441162},null,{"$f":"IFERROR(RTD(\"cqg.rtd\",,\"StudyData\",A37,\"PCB\",\"BaseType=Index,Index=1\",\"Open\",\"A\",,\"all\",,,,\"T\")/100,\"\")","v":3.5694366982710571E-2},null,{"$f":"IFERROR(RTD(\"cqg.rtd\",,\"StudyData\",A37,\"PCB\",\"BaseType=Index,Index=1\",\"High\",\"A\",,\"all\",,,,\"T\")/100,\"\")","v":1.9838259899609594},null,{"$f":"IFERROR(RTD(\"cqg.rtd\",,\"StudyData\",A37,\"PCB\",\"BaseType=Index,Index=1\",\"Low\",\"A\",,\"all\",,,,\"T\")/100,\"\")","v":-0.38204127161182372},{"$f":"'NLR 2'!R4","v":"https://finance.yahoo.com/quote/SMR"}]
[{"$f":"TRIM('NLR 2'!O5)","v":"S.US.UEC"},"News",{"$f":"IFERROR(RTD(\"cqg.rtd\", ,\"ContractData\",A38, \"LongDescription\",, \"T\")&\" (\"&RIGHT(A38,LEN(A38)-5)&\")\",\"\")","v":"Uranium Energy Corp (UEC)"},null,null,null,null,{"$f":"IFERROR(RTD(\"cqg.rtd\", ,\"ContractData\",A38, \"LastTradeToday\",, \"T\"),\"\")","v":""},{"$f":"IFERROR(RTD(\"cqg.rtd\", ,\"ContractData\",A38, \"NetLastTradeToday\",, \"T\"),\"\")","v":""},{"$f":"IFERROR(RTD(\"cqg.rtd\",,\"StudyData\",A38, \"PCB\",\"BaseType=Index,Index=1\", \"Close\", \"A\",,\"all\",,,,\"T\")/100,\"\")","v":1.0762331838565022},{"$f":"IFERROR(RTD(\"cqg.rtd\",,\"StudyData\",A38,\"PCB\",\"BaseType=Index,Index=1\",\"Close\",\"A\",,\"all\",,,,\"T\")/100,\"\")","v":1.0762331838565022},null,{"$f":"IFERROR(RTD(\"cqg.rtd\",,\"StudyData\",A38,\"PCB\",\"BaseType=Index,Index=1\",\"Open\",\"A\",,\"all\",,,,\"T\")/100,\"\")","v":3.1390134529147976E-2},null,{"$f":"IFERROR(RTD(\"cqg.rtd\",,\"StudyData\",A38,\"PCB\",\"BaseType=Index,Index=1\",\"High\",\"A\",,\"all\",,,,\"T\")/100,\"\")","v":1.249626307922272},null,{"$f":"IFERROR(RTD(\"cqg.rtd\",,\"StudyData\",A38,\"PCB\",\"BaseType=Index,Index=1\",\"Low\",\"A\",,\"all\",,,,\"T\")/100,\"\")","v":-0.42451420029895376},{"$f":"'NLR 2'!R5","v":"https://finance.yahoo.com/quote/UEC"}]
[{"$f":"TRIM('NLR 2'!O6)","v":"S.US.NLR"},"News",{"$f":"IFERROR(RTD(\"cqg.rtd\", ,\"ContractData\",A39, \"LongDescription\",, \"T\")&\" (\"&RIGHT(A39,LEN(A39)-5)&\")\",\"\")","v":"Market Vectors Uranium+Nuclear EnergyETF (NLR)"},null,null,null,null,{"$f":"IFERROR(RTD(\"cqg.rtd\", ,\"ContractData\",A39, \"LastTradeToday\",, \"T\"),\"\")","v":""},{"$f":"IFERROR(RTD(\"cqg.rtd\", ,\"ContractData\",A39, \"NetLastTradeToday\",, \"T\"),\"\")","v":""},{"$f":"IFERROR(RTD(\"cqg.rtd\",,\"StudyData\",A39, \"PCB\",\"BaseType=Index,Index=1\", \"Close\", \"A\",,\"all\",,,,\"T\")/100,\"\")","v":0.68133759527907534},{"$f":"IFERROR(RTD(\"cqg.rtd\",,\"StudyData\",A39,\"PCB\",\"BaseType=Index,Index=1\",\"Close\",\"A\",,\"all\",,,,\"T\")/100,\"\")","v":0.68133759527907534},null,{"$f":"IFERROR(RTD(\"cqg.rtd\",,\"StudyData\",A39,\"PCB\",\"BaseType=Index,Index=1\",\"Open\",\"A\",,\"all\",,,,\"T\")/100,\"\")","v":1.180231128596009E-2},null,{"$f":"IFERROR(RTD(\"cqg.rtd\",,\"StudyData\",A39,\"PCB\",\"BaseType=Index,Index=1\",\"High\",\"A\",,\"all\",,,,\"T\")/100,\"\")","v":0.74391443324317663},null,{"$f":"IFERROR(RTD(\"cqg.rtd\",,\"StudyData\",A39,\"PCB\",\"BaseType=Index,Index=1\",\"Low\",\"A\",,\"all\",,,,\"T\")/100,\"\")","v":-0.20998278829604128},{"$f":"'NLR 2'!R6","v":"https://finance.yahoo.com/quote/NLR"}]
[{"$f":"TRIM('NLR 2'!O7)","v":"S.US.CCJ"},"News",{"$f":"IFERROR(RTD(\"cqg.rtd\", ,\"ContractData\",A40, \"LongDescription\",, \"T\")&\" (\"&RIGHT(A40,LEN(A40)-5)&\")\",\"\")","v":"Cameco Corp (CCJ)"},null,null,null,null,{"$f":"IFERROR(RTD(\"cqg.rtd\", ,\"ContractData\",A40, \"LastTradeToday\",, \"T\"),\"\")","v":""},{"$f":"IFERROR(RTD(\"cqg.rtd\", ,\"ContractData\",A40, \"NetLastTradeToday\",, \"T\"),\"\")","v":""},{"$f":"IFERROR(RTD(\"cqg.rtd\",,\"StudyData\",A40, \"PCB\",\"BaseType=Index,Index=1\", \"Close\", \"A\",,\"all\",,,,\"T\")/100,\"\")","v":0.64351041058571723},{"$f":"IFERROR(RTD(\"cqg.rtd\",,\"StudyData\",A40,\"PCB\",\"BaseType=Index,Index=1\",\"Close\",\"A\",,\"all\",,,,\"T\")/100,\"\")","v":0.64351041058571723},null,{"$f":"IFERROR(RTD(\"cqg.rtd\",,\"StudyData\",A40,\"PCB\",\"BaseType=Index,Index=1\",\"Open\",\"A\",,\"all\",,,,\"T\")/100,\"\")","v":-2.3350846468183973E-3},null,{"$f":"IFERROR(RTD(\"cqg.rtd\",,\"StudyData\",A40,\"PCB\",\"BaseType=Index,Index=1\",\"High\",\"A\",,\"all\",,,,\"T\")/100,\"\")","v":0.73438412142440146},null,{"$f":"IFERROR(RTD(\"cqg.rtd\",,\"StudyData\",A40,\"PCB\",\"BaseType=Index,Index=1\",\"Low\",\"A\",,\"all\",,,,\"T\")/100,\"\")","v":-0.31893364467795293},{"$f":"'NLR 2'!R7","v":"https://finance.yahoo.com/quote/CCJ"}]
[{"$f":"TRIM('NLR 2'!O8)","v":"S.US.BWXT"},"News",{"$f":"IFERROR(RTD(\"cqg.rtd\", ,\"ContractData\",A41, \"LongDescription\",, \"T\")&\" (\"&RIGHT(A41,LEN(A41)-5)&\")\",\"\")","v":"BWX Technologies, Inc. (BWXT)"},null,null,null,null,{"$f":"IFERROR(RTD(\"cqg.rtd\", ,\"ContractData\",A41, \"LastTradeToday\",, \"T\"),\"\")","v":""},{"$f":"IFERROR(RTD(\"cqg.rtd\", ,\"ContractData\",A41, \"NetLastTradeToday\",, \"T\"),\"\")","v":""},{"$f":"IFERROR(RTD(\"cqg.rtd\",,\"StudyData\",A41, \"PCB\",\"BaseType=Index,Index=1\", \"Close\", \"A\",,\"all\",,,,\"T\")/100,\"\")","v":0.63353981506418899},{"$f":"IFERROR(RTD(\"cqg.rtd\",,\"StudyData\",A41,\"PCB\",\"BaseType=Index,Index=1\",\"Close\",\"A\",,\"all\",,,,\"T\")/100,\"\")","v":0.63353981506418899},null,{"$f":"IFERROR(RTD(\"cqg.rtd\",,\"StudyData\",A41,\"PCB\",\"BaseType=Index,Index=1\",\"Open\",\"A\",,\"all\",,,,\"T\")/100,\"\")","v":5.6558039321303122E-3},null,{"$f":"IFERROR(RTD(\"cqg.rtd\",,\"StudyData\",A41,\"PCB\",\"BaseType=Index,Index=1\",\"High\",\"A\",,\"all\",,,,\"T\")/100,\"\")","v":0.69898554627884013},null,{"$f":"IFERROR(RTD(\"cqg.rtd\",,\"StudyData\",A41,\"PCB\",\"BaseType=Index,Index=1\",\"Low\",\"A\",,\"all\",,,,\"T\")/100,\"\")","v":-0.24409731573749888},{"$f":"'NLR 2'!R8","v":"https://finance.yahoo.com/quote/BWXT"}]
[{"$f":"TRIM('NLR 2'!O9)","v":"S.US.NNE"},"News",{"$f":"IFERROR(RTD(\"cqg.rtd\", ,\"ContractData\",A42, \"LongDescription\",, \"T\")&\" (\"&RIGHT(A42,LEN(A42)-5)&\")\",\"\")","v":"Nano Nuclear Energy Inc. (NNE)"},null,null,null,null,{"$f":"IFERROR(RTD(\"cqg.rtd\", ,\"ContractData\",A42, \"LastTradeToday\",, \"T\"),\"\")","v":""},{"$f":"IFERROR(RTD(\"cqg.rtd\", ,\"ContractData\",A42, \"NetLastTradeToday\",, \"T\"),\"\")","v":""},{"$f":"IFERROR(RTD(\"cqg.rtd\",,\"StudyData\",A42, \"PCB\",\"BaseType=Index,Index=1\", \"Close\", \"A\",,\"all\",,,,\"T\")/100,\"\")","v":0.5725190839694656},{"$f":"IFERROR(RTD(\"cqg.rtd\",,\"StudyData\",A42,\"PCB\",\"BaseType=Index,Index=1\",\"Close\",\"A\",,\"all\",,,,\"T\")/100,\"\")","v":0.5725190839694656},null,{"$f":"IFERROR(RTD(\"cqg.rtd\",,\"StudyData\",A42,\"PCB\",\"BaseType=Index,Index=1\",\"Open\",\"A\",,\"all\",,,,\"T\")/100,\"\")","v":1.2454801124949727E-2},null,{"$f":"IFERROR(RTD(\"cqg.rtd\",,\"StudyData\",A42,\"PCB\",\"BaseType=Index,Index=1\",\"High\",\"A\",,\"all\",,,,\"T\")/100,\"\")","v":0.93049417436721582},null,{"$f":"IFERROR(RTD(\"cqg.rtd\",,\"StudyData\",A42,\"PCB\",\"BaseType=Index,Index=1\",\"Low\",\"A\",,\"all\",,,,\"T\")/100,\"\")","v":-0.30654881478505419},{"$f":"'NLR 2'!R9","v":"https://finance.yahoo.com/quote/NNE"}]
[{"$f":"TRIM('NLR 2'!O10)","v":"S.US.DNN"},"News",{"$f":"IFERROR(RTD(\"cqg.rtd\", ,\"ContractData\",A43, \"LongDescription\",, \"T\")&\" (\"&RIGHT(A43,LEN(A43)-5)&\")\",\"\")","v":"Denison Mines Corp (DNN)"},null,null,null,null,{"$f":"IFERROR(RTD(\"cqg.rtd\", ,\"ContractData\",A43, \"LastTradeToday\",, \"T\"),\"\")","v":""},{"$f":"IFERROR(RTD(\"cqg.rtd\", ,\"ContractData\",A43, \"NetLastTradeToday\",, \"T\"),\"\")","v":""},{"$f":"IFERROR(RTD(\"cqg.rtd\",,\"StudyData\",A43, \"PCB\",\"BaseType=Index,Index=1\", \"Close\", \"A\",,\"all\",,,,\"T\")/100,\"\")","v":0.55000000000000004},{"$f":"IFERROR(RTD(\"cqg.rtd\",,\"StudyData\",A43,\"PCB\",\"BaseType=Index,Index=1\",\"Close\",\"A\",,\"all\",,,,\"T\")/100,\"\")","v":0.55000000000000004},null,{"$f":"IFERROR(RTD(\"cqg.rtd\",,\"StudyData\",A43,\"PCB\",\"BaseType=Index,Index=1\",\"Open\",\"A\",,\"all\",,,,\"T\")/100,\"\")","v":3.3333333333333368E-2},null,{"$f":"IFERROR(RTD(\"cqg.rtd\",,\"StudyData\",A43,\"PCB\",\"BaseType=Index,Index=1\",\"High\",\"A\",,\"all\",,,,\"T\")/100,\"\")","v":0.63888888888888895},null,{"$f":"IFERROR(RTD(\"cqg.rtd\",,\"StudyData\",A43,\"PCB\",\"BaseType=Index,Index=1\",\"Low\",\"A\",,\"all\",,,,\"T\")/100,\"\")","v":-0.4},{"$f":"'NLR 2'!R10","v":"https://finance.yahoo.com/quote/DNN"}]
[{"$f":"TRIM('NLR 2'!O11)","v":"S.US.CEG"},"News",{"$f":"IFERROR(RTD(\"cqg.rtd\", ,\"ContractData\",A44, \"LongDescription\",, \"T\")&\" (\"&RIGHT(A44,LEN(A44)-5)&\")\",\"\")","v":"Constellation Energy Corporation (CEG)"},null,null,null,null,{"$f":"IFERROR(RTD(\"cqg.rtd\", ,\"ContractData\",A44, \"LastTradeToday\",, \"T\"),\"\")","v":""},{"$f":"IFERROR(RTD(\"cqg.rtd\", ,\"ContractData\",A44, \"NetLastTradeToday\",, \"T\"),\"\")","v":""},{"$f":"IFERROR(RTD(\"cqg.rtd\",,\"StudyData\",A44, \"PCB\",\"BaseType=Index,Index=1\", \"Close\", \"A\",,\"all\",,,,\"T\")/100,\"\")","v":0.49416655491484496},{"$f":"IFERROR(RTD(\"cqg.rtd\",,\"StudyData\",A44,\"PCB\",\"BaseType=Index,Index=1\",\"Close\",\"A\",,\"all\",,,,\"T\")/100,\"\")","v":0.49416655491484496},null,{"$f":"IFERROR(RTD(\"cqg.rtd\",,\"StudyData\",A44,\"PCB\",\"BaseType=Index,Index=1\",\"Open\",\"A\",,\"all\",,,,\"T\")/100,\"\")","v":1.1935094542040978E-2},null,{"$f":"IFERROR(RTD(\"cqg.rtd\",,\"StudyData\",A44,\"PCB\",\"BaseType=Index,Index=1\",\"High\",\"A\",,\"all\",,,,\"T\")/100,\"\")","v":0.59581601180099231},null,{"$f":"IFERROR(RTD(\"cqg.rtd\",,\"StudyData\",A44,\"PCB\",\"BaseType=Index,Index=1\",\"Low\",\"A\",,\"all\",,,,\"T\")/100,\"\")","v":-0.27839613785704709},{"$f":"'NLR 2'!R11","v":"https://finance.yahoo.com/quote/CEG"}]
[{"$f":"TRIM('NLR 2'!O12)","v":"S.US.NXE"},"News",{"$f":"IFERROR(RTD(\"cqg.rtd\", ,\"ContractData\",A45, \"LongDescription\",, \"T\")&\" (\"&RIGHT(A45,LEN(A45)-5)&\")\",\"\")","v":"Nexgen Energy Ltd. (NXE)"},null,null,null,null,{"$f":"IFERROR(RTD(\"cqg.rtd\", ,\"ContractData\",A45, \"LastTradeToday\",, \"T\"),\"\")","v":""},{"$f":"IFERROR(RTD(\"cqg.rtd\", ,\"ContractData\",A45, \"NetLastTradeToday\",, \"T\"),\"\")","v":""},{"$f":"IFERROR(RTD(\"cqg.rtd\",,\"StudyData\",A45, \"PCB\",\"BaseType=Index,Index=1\", \"Close\", \"A\",,\"all\",,,,\"T\")/100,\"\")","v":0.365151515151515},{"$f":"IFERROR(RTD(\"cqg.rtd\",,\"StudyData\",A45,\"PCB\",\"BaseType=Index,Index=1\",\"Close\",\"A\",,\"all\",,,,\"T\")/100,\"\")","v":0.365151515151515},null,{"$f":"IFERROR(RTD(\"cqg.rtd\",,\"StudyData\",A45,\"PCB\",\"BaseType=Index,Index=1\",\"Open\",\"A\",,\"all\",,,,\"T\")/100,\"\")","v":2.5757575757575743E-2},null,{"$f":"IFERROR(RTD(\"cqg.rtd\",,\"StudyData\",A45,\"PCB\",\"BaseType=Index,Index=1\",\"High\",\"A\",,\"all\",,,,\"T\")/100,\"\")","v":0.42727272727272714},null,{"$f":"IFERROR(RTD(\"cqg.rtd\",,\"StudyData\",A45,\"PCB\",\"BaseType=Index,Index=1\",\"Low\",\"A\",,\"all\",,,,\"T\")/100,\"\")","v":-0.40757575757575759},{"$f":"'NLR 2'!R12","v":"https://finance.yahoo.com/quote/NXE"}]
[{"$f":"TRIM('NLR 2'!O13)","v":"S.US.PEG"},"News",{"$f":"IFERROR(RTD(\"cqg.rtd\", ,\"ContractData\",A46, \"LongDescription\",, \"T\")&\" (\"&RIGHT(A46,LEN(A46)-5)&\")\",\"\")","v":"Pub Svc Entrpr Grp Inc (PEG)"},null,null,null,null,{"$f":"IFERROR(RTD(\"cqg.rtd\", ,\"ContractData\",A46, \"LastTradeToday\",, \"T\"),\"\")","v":""},{"$f":"IFERROR(RTD(\"cqg.rtd\", ,\"ContractData\",A46, \"NetLastTradeToday\",, \"T\"),\"\")","v":""},{"$f":"IFERROR(RTD(\"cqg.rtd\",,\"StudyData\",A46, \"PCB\",\"BaseType=Index,Index=1\", \"Close\", \"A\",,\"all\",,,,\"T\")/100,\"\")","v":-1.716179429518273E-2},{"$f":"IFERROR(RTD(\"cqg.rtd\",,\"StudyData\",A46,\"PCB\",\"BaseType=Index,Index=1\",\"Close\",\"A\",,\"all\",,,,\"T\")/100,\"\")","v":-1.716179429518273E-2},null,{"$f":"IFERROR(RTD(\"cqg.rtd\",,\"StudyData\",A46,\"PCB\",\"BaseType=Index,Index=1\",\"Open\",\"A\",,\"all\",,,,\"T\")/100,\"\")","v":7.8115753343592246E-3},null,{"$f":"IFERROR(RTD(\"cqg.rtd\",,\"StudyData\",A46,\"PCB\",\"BaseType=Index,Index=1\",\"High\",\"A\",,\"all\",,,,\"T\")/100,\"\")","v":8.0009468576162937E-2},null,{"$f":"IFERROR(RTD(\"cqg.rtd\",,\"StudyData\",A46,\"PCB\",\"BaseType=Index,Index=1\",\"Low\",\"A\",,\"all\",,,,\"T\")/100,\"\")","v":-0.11622677239910041},{"$f":"'NLR 2'!R13","v":"https://finance.yahoo.com/quote/PEG"}]
[{"$f":"TRIM('NLR 2'!O14)","v":"S.US.EU"},"News",{"$f":"IFERROR(RTD(\"cqg.rtd\", ,\"ContractData\",A47, \"LongDescription\",, \"T\")&\" (\"&RIGHT(A47,LEN(A47)-5)&\")\",\"\")","v":"enCore Energy Corp. (EU)"},null,null,null,null,{"$f":"IFERROR(RTD(\"cqg.rtd\", ,\"ContractData\",A47, \"LastTradeToday\",, \"T\"),\"\")","v":""},{"$f":"IFERROR(RTD(\"cqg.rtd\", ,\"ContractData\",A47, \"NetLastTradeToday\",, \"T\"),\"\")","v":""},{"$f":"IFERROR(RTD(\"cqg.rtd\",,\"StudyData\",A47, \"PCB\",\"BaseType=Index,Index=1\", \"Close\", \"A\",,\"all\",,,,\"T\")/100,\"\")","v":-9.3841642228739086E-2},{"$f":"IFERROR(RTD(\"cqg.rtd\",,\"StudyData\",A47,\"PCB\",\"BaseType=Index,Index=1\",\"Close\",\"A\",,\"all\",,,,\"T\")/100,\"\")","v":-9.3841642228739086E-2},null,{"$f":"IFERROR(RTD(\"cqg.rtd\",,\"StudyData\",A47,\"PCB\",\"BaseType=Index,Index=1\",\"Open\",\"A\",,\"all\",,,,\"T\")/100,\"\")","v":2.0527859237536607E-2},null,{"$f":"IFERROR(RTD(\"cqg.rtd\",,\"StudyData\",A47,\"PCB\",\"BaseType=Index,Index=1\",\"High\",\"A\",,\"all\",,,,\"T\")/100,\"\")","v":0.12023460410557188},null,{"$f":"IFERROR(RTD(\"cqg.rtd\",,\"StudyData\",A47,\"PCB\",\"BaseType=Index,Index=1\",\"Low\",\"A\",,\"all\",,,,\"T\")/100,\"\")","v":-0.70381231671554256},{"$f":"'NLR 2'!R14","v":"https://finance.yahoo.com/quote/EU"}]
[{"$f":"TRIM('NLR 2'!O15)","v":"S.US.PCG"},"News",{"$f":"IFERROR(RTD(\"cqg.rtd\", ,\"ContractData\",A48, \"LongDescription\",, \"T\")&\" (\"&RIGHT(A48,LEN(A48)-5)&\")\",\"\")","v":"PG&E Corp Hldg Co (PCG)"},null,null,null,null,{"$f":"IFERROR(RTD(\"cqg.rtd\", ,\"ContractData\",A48, \"LastTradeToday\",, \"T\"),\"\")","v":""},{"$f":"IFERROR(RTD(\"cqg.rtd\", ,\"ContractData\",A48, \"NetLastTradeToday\",, \"T\"),\"\")","v":""},{"$f":"IFERROR(RTD(\"cqg.rtd\",,\"StudyData\",A48, \"PCB\",\"BaseType=Index,Index=1\", \"Close\", \"A\",,\"all\",,,,\"T\")/100,\"\")","v":-0.25371655104063423},{"$f":"IFERROR(RTD(\"cqg.rtd\",,\"StudyData\",A48,\"PCB\",\"BaseType=Index,Index=1\",\"Close\",\"A\",,\"all\",,,,\"T\")/100,\"\")","v":-0.25371655104063423},null,{"$f":"IFERROR(RTD(\"cqg.rtd\",,\"StudyData\",A48,\"PCB\",\"BaseType=Index,Index=1\",\"Open\",\"A\",,\"all\",,,,\"T\")/100,\"\")","v":4.4598612487611426E-3},null,{"$f":"IFERROR(RTD(\"cqg.rtd\",,\"StudyData\",A48,\"PCB\",\"BaseType=Index,Index=1\",\"High\",\"A\",,\"all\",,,,\"T\")/100,\"\")","v":1.2388503468780971E-2},null,{"$f":"IFERROR(RTD(\"cqg.rtd\",,\"StudyData\",A48,\"PCB\",\"BaseType=Index,Index=1\",\"Low\",\"A\",,\"all\",,,,\"T\")/100,\"\")","v":-0.35728444003964321},{"$f":"'NLR 2'!R15","v":"https://finance.yahoo.com/quote/PCG"}]
[null,null,"CQG Inc.,   Copyright © 2025",null,null,null,"Designed by Thom Hartle",null,null,"From their website: \"NLR offers comprehensive exposure including utilities, uranium miners, and service providers.\"",null,null,null,null,null,null,null,null,null,null,null,null,null,null,null,{"$f":"Z52","v":"100% of the stocks in the ETF are higher today"}]
[]
[null,null,null,null,null,null,null,null,null,null,null,null,null,null,null,null,null,null,null,null,null,null,null,null,null,{"$f":"NLR!B103","v":1},"of the stocks in the ETF are higher today"]
[null,null,null,null,null,null,null,null,null,null,null,null,null,null,null,null,null,null,null,null,null,null,null,null,null,{"$f":"TEXT(Display!Z51,\"0%\")&\" \"&Display!AA51","v":"100% of the stocks in the ETF are higher today"}]

{"sheet":"NLR","index":1,"n_rows":104,"n_cols":34,"rows_kept":104,"cut":false,"hidden":false,"merged":[]}
[{"$f":"IF(Symbols!A1=\"\",\"\",Symbols!A1)","v":"S.US.BWXT"},{"$f":"IF(A1=\"\",\"\",IF(J1>0,1,0))","v":1},{"$f":"A1","v":"S.US.BWXT"},{"$f":"IF(A1=\"\",\"\",RTD(\"cqg.rtd\", ,\"ContractData\",C1, \"LongDescription\",, \"T\"))","v":"BWX Technologies, Inc."},null,{"$f":"(\"$J$\"&\"1\"&\":$J$\"&A103)","v":"$J$1:$J$15"},null,{"$f":"IF(A1=\"\",\"\",RTD(\"cqg.rtd\", ,\"ContractData\",C1, \"LastTradeToday\",, \"T\"))","v":""},{"$f":"IF(A1=\"\",\"\",RTD(\"cqg.rtd\", ,\"ContractData\",C1, \"NetLastTradeToday\",, \"T\"))","v":""},{"$f":"IF(A1=\"\",\"\",IFERROR(RTD(\"cqg.rtd\", ,\"ContractData\",C1, \"PerCentNetLastTrade\",, \"T\")/100,\"\"))","v":""},{"$f":"IF(A1=\"\",\"\",RTD(\"cqg.rtd\", ,\"ContractData\", C1, \"T_CVol\",, \"T\"))","v":2377},1,{"$f":"IFERROR(RANK($J1,INDIRECT((\"$J$\"&\"1\"&\":$J$\"&$A$103)))+COUNTIF($J$1:J1,J1)-1,\"\")","v":""},{"$f":"C1","v":"S.US.BWXT"},{"$f":"IFERROR(VLOOKUP($L1,$M$1:$N$101,2,FALSE),\"\")","v":""},{"$f":"RTD(\"cqg.rtd\", ,\"ContractData\",O1, \"LongDescription\",, \"T\")","v":"Obligatory parameter <contract>(position - 1) is not specified"},{"$f":"IFERROR(RTD(\"cqg.rtd\", ,\"ContractData\",O1, \"PerCentNetLastTrade\",, \"T\")/100,\"\")","v":""},{"$f":"\"https://finance.yahoo.com/quote/\"&RIGHT(O1,(LEN(O1)-5))","v":{"$error":"#VALUE!"}},null,{"$f":"IF(Q1>=0,Q1,NA())","v":""},{"$f":"IF(Q1>=0,NA(),Q1)","v":{"$error":"#N/A"}},{"$f":"IF(ISERROR(T1),U1,T1)","v":""},{"$f":"IF(Q1<0,\"\",IFERROR(RTD(\"cqg.rtd\", ,\"ContractData\",O1, \"LongDescription\",, \"T\"),\"\"))","v":"Obligatory parameter <contract>(position - 1) is not specified"},null,null,{"$f":"IF(W1=\"\",\"\",IFERROR(T1,Q1))","v":""},{"$f":"MIN(J1:J101)","v":0},{"$f":"VLOOKUP(AA1,J1:O98,4,FALSE)","v":{"$error":"#N/A"}},{"$f":"VLOOKUP($AB1,$M$1:$N$101,2,FALSE)","v":{"$error":"#N/A"}},{"$f":"IF(RTD(\"cqg.rtd\", ,\"ContractData\",AC1, \"PerCentNetLastTrade\",, \"T\")>0,\"\",IFERROR(RTD(\"cqg.rtd\", ,\"ContractData\",AC1, \"PerCentNetLastTrade\",, \"T\")/100,\"\"))","v":{"$error":"#N/A"}},{"$f":"IF(AD1>0,\"\",IFERROR(RTD(\"cqg.rtd\", ,\"ContractData\",AC1, \"LongDescription\",, \"T\"),\"\"))","v":{"$error":"#N/A"}},{"$f":"\"\"","v":""},{"$f":"IF(AD1>0,\"\",IFERROR(AD1*-1,\"\"))","v":{"$error":"#N/A"}},{"$f":"\"https://finance.yahoo.com/quote/\"&RIGHT(AC1,(LEN(AC1)-5))","v":{"$error":"#N/A"}}]
[{"$f":"IF(Symbols!A2=\"\",\"\",Symbols!A2)","v":"S.US.CCJ"},{"$f":"IF(A2=\"\",\"\",IF(J2>0,1,0))","v":1},{"$f":"A2","v":"S.US.CCJ"},{"$f":"IF(A2=\"\",\"\",RTD(\"cqg.rtd\", ,\"ContractData\",C2, \"LongDescription\",, \"T\"))","v":"Cameco Corp"},null,null,null,{"$f":"IF(A2=\"\",\"\",RTD(\"cqg.rtd\", ,\"ContractData\",C2, \"LastTradeToday\",, \"T\"))","v":""},{"$f":"IF(A2=\"\",\"\",RTD(\"cqg.rtd\", ,\"ContractData\",C2, \"NetLastTradeToday\",, \"T\"))","v":""},{"$f":"IF(A2=\"\",\"\",IFERROR(RTD(\"cqg.rtd\", ,\"ContractData\",C2, \"PerCentNetLastTrade\",, \"T\")/100,\"\"))","v":""},{"$f":"IF(A2=\"\",\"\",RTD(\"cqg.rtd\", ,\"ContractData\", C2, \"T_CVol\",, \"T\"))","v":18454},{"$f":"L1+1","v":2},{"$f":"IFERROR(RANK($J2,INDIRECT((\"$J$\"&\"1\"&\":$J$\"&$A$103)))+COUNTIF($J$1:J2,J2)-1,\"\")","v":""},{"$f":"C2","v":"S.US.CCJ"},{"$f":"IFERROR(VLOOKUP($L2,$M$1:$N$101,2,FALSE),\"\")","v":""},{"$f":"RTD(\"cqg.rtd\", ,\"ContractData\",O2, \"LongDescription\",, \"T\")","v":"Obligatory parameter <contract>(position - 1) is not specified"},{"$f":"IFERROR(RTD(\"cqg.rtd\", ,\"ContractData\",O2, \"PerCentNetLastTrade\",, \"T\")/100,\"\")","v":""},{"$f":"\"https://finance.yahoo.com/quote/\"&RIGHT(O2,(LEN(O2)-5))","v":{"$error":"#VALUE!"}},null,{"$f":"IF(Q2>=0,Q2,NA())","v":""},{"$f":"IF(Q2>=0,NA(),Q2)","v":{"$error":"#N/A"}},{"$f":"IF(ISERROR(T2),U2,T2)","v":""},{"$f":"IF(Q2<0,\"\",IFERROR(RTD(\"cqg.rtd\", ,\"ContractData\",O2, \"LongDescription\",, \"T\"),\"\"))","v":"Obligatory parameter <contract>(position - 1) is not specified"},null,null,{"$f":"IF(W2=\"\",\"\",IFERROR(T2,Q2))","v":""},null,{"$f":"AB1-1","v":{"$error":"#N/A"}},{"$f":"VLOOKUP($AB2,$M$1:$N$101,2,FALSE)","v":{"$error":"#N/A"}},{"$f":"IF(RTD(\"cqg.rtd\", ,\"ContractData\",AC2, \"PerCentNetLastTrade\",, \"T\")>0,\"\",IFERROR(RTD(\"cqg.rtd\", ,\"ContractData\",AC2, \"PerCentNetLastTrade\",, \"T\")/100,\"\"))","v":{"$error":"#N/A"}},{"$f":"IF(AD2>0,\"\",IFERROR(RTD(\"cqg.rtd\", ,\"ContractData\",AC2, \"LongDescription\",, \"T\"),\"\"))","v":{"$error":"#N/A"}},{"$f":"\"\"","v":""},{"$f":"IF(AD2>0,\"\",IFERROR(AD2*-1,\"\"))","v":{"$error":"#N/A"}},{"$f":"\"https://finance.yahoo.com/quote/\"&RIGHT(AC2,(LEN(AC2)-5))","v":{"$error":"#N/A"}}]
[{"$f":"IF(Symbols!A3=\"\",\"\",Symbols!A3)","v":"S.US.CEG"},1,"S.US.CEG",{"$f":"IF(A3=\"\",\"\",RTD(\"cqg.rtd\", ,\"ContractData\",C3, \"LongDescription\",, \"T\"))","v":"Constellation Energy Corporation"},null,null,null,{"$f":"IF(A3=\"\",\"\",RTD(\"cqg.rtd\", ,\"ContractData\",C3, \"LastTradeToday\",, \"T\"))","v":""},{"$f":"IF(A3=\"\",\"\",RTD(\"cqg.rtd\", ,\"ContractData\",C3, \"NetLastTradeToday\",, \"T\"))","v":""},{"$f":"IF(A3=\"\",\"\",IFERROR(RTD(\"cqg.rtd\", ,\"ContractData\",C3, \"PerCentNetLastTrade\",, \"T\")/100,\"\"))","v":""},{"$f":"IF(A3=\"\",\"\",RTD(\"cqg.rtd\", ,\"ContractData\", C3, \"T_CVol\",, \"T\"))","v":4682},{"$f":"L2+1","v":3},{"$f":"IFERROR(RANK($J3,INDIRECT((\"$J$\"&\"1\"&\":$J$\"&$A$103)))+COUNTIF($J$1:J3,J3)-1,\"\")","v":""},"S.US.CEG","",{"$f":"RTD(\"cqg.rtd\", ,\"ContractData\",O3, \"LongDescription\",, \"T\")","v":"Obligatory parameter <contract>(position - 1) is not specified"},{"$f":"IFERROR(RTD(\"cqg.rtd\", ,\"ContractData\",O3, \"PerCentNetLastTrade\",, \"T\")/100,\"\")","v":""},{"$error":"#VALUE!"},null,"",{"$error":"#N/A"},"",{"$f":"IF(Q3<0,\"\",IFERROR(RTD(\"cqg.rtd\", ,\"ContractData\",O3, \"LongDescription\",, \"T\"),\"\"))","v":"Obligatory parameter <contract>(position - 1) is not specified"},null,null,"",null,{"$f":"AB2-1","v":{"$error":"#N/A"}},{"$error":"#N/A"},{"$f":"IF(RTD(\"cqg.rtd\", ,\"ContractData\",AC3, \"PerCentNetLastTrade\",, \"T\")>0,\"\",IFERROR(RTD(\"cqg.rtd\", ,\"ContractData\",AC3, \"PerCentNetLastTrade\",, \"T\")/100,\"\"))","v":{"$error":"#N/A"}},{"$f":"IF(AD3>0,\"\",IFERROR(RTD(\"cqg.rtd\", ,\"ContractData\",AC3, \"LongDescription\",, \"T\"),\"\"))","v":{"$error":"#N/A"}},{"$f":"\"\"","v":""},{"$error":"#N/A"},{"$error":"#N/A"}]
[{"$f":"IF(Symbols!A4=\"\",\"\",Symbols!A4)","v":"S.US.DNN"},1,"S.US.DNN",{"$f":"IF(A4=\"\",\"\",RTD(\"cqg.rtd\", ,\"ContractData\",C4, \"LongDescription\",, \"T\"))","v":"Denison Mines Corp"},null,null,null,{"$f":"IF(A4=\"\",\"\",RTD(\"cqg.rtd\", ,\"ContractData\",C4, \"LastTradeToday\",, \"T\"))","v":""},{"$f":"IF(A4=\"\",\"\",RTD(\"cqg.rtd\", ,\"ContractData\",C4, \"NetLastTradeToday\",, \"T\"))","v":""},{"$f":"IF(A4=\"\",\"\",IFERROR(RTD(\"cqg.rtd\", ,\"ContractData\",C4, \"PerCentNetLastTrade\",, \"T\")/100,\"\"))","v":""},{"$f":"IF(A4=\"\",\"\",RTD(\"cqg.rtd\", ,\"ContractData\", C4, \"T_CVol\",, \"T\"))","v":68693},4,{"$f":"IFERROR(RANK($J4,INDIRECT((\"$J$\"&\"1\"&\":$J$\"&$A$103)))+COUNTIF($J$1:J4,J4)-1,\"\")","v":""},"S.US.DNN","",{"$f":"RTD(\"cqg.rtd\", ,\"ContractData\",O4, \"LongDescription\",, \"T\")","v":"Obligatory parameter <contract>(position - 1) is not specified"},{"$f":"IFERROR(RTD(\"cqg.rtd\", ,\"ContractData\",O4, \"PerCentNetLastTrade\",, \"T\")/100,\"\")","v":""},{"$error":"#VALUE!"},null,"",{"$error":"#N/A"},"",{"$f":"IF(Q4<0,\"\",IFERROR(RTD(\"cqg.rtd\", ,\"ContractData\",O4, \"LongDescription\",, \"T\"),\"\"))","v":"Obligatory parameter <contract>(position - 1) is not specified"},null,null,"",null,{"$error":"#N/A"},{"$error":"#N/A"},{"$f":"IF(RTD(\"cqg.rtd\", ,\"ContractData\",AC4, \"PerCentNetLastTrade\",, \"T\")>0,\"\",IFERROR(RTD(\"cqg.rtd\", ,\"ContractData\",AC4, \"PerCentNetLastTrade\",, \"T\")/100,\"\"))","v":{"$error":"#N/A"}},{"$f":"IF(AD4>0,\"\",IFERROR(RTD(\"cqg.rtd\", ,\"ContractData\",AC4, \"LongDescription\",, \"T\"),\"\"))","v":{"$error":"#N/A"}},{"$f":"\"\"","v":""},{"$error":"#N/A"},{"$error":"#N/A"}]
[{"$f":"IF(Symbols!A5=\"\",\"\",Symbols!A5)","v":"S.US.EU"},1,"S.US.EU",{"$f":"IF(A5=\"\",\"\",RTD(\"cqg.rtd\", ,\"ContractData\",C5, \"LongDescription\",, \"T\"))","v":"enCore Energy Corp."},null,null,null,{"$f":"IF(A5=\"\",\"\",RTD(\"cqg.rtd\", ,\"ContractData\",C5, \"LastTradeToday\",, \"T\"))","v":""},{"$f":"IF(A5=\"\",\"\",RTD(\"cqg.rtd\", ,\"ContractData\",C5, \"NetLastTradeToday\",, \"T\"))","v":""},{"$f":"IF(A5=\"\",\"\",IFERROR(RTD(\"cqg.rtd\", ,\"ContractData\",C5, \"PerCentNetLastTrade\",, \"T\")/100,\"\"))","v":""},{"$f":"IF(A5=\"\",\"\",RTD(\"cqg.rtd\", ,\"ContractData\", C5, \"T_CVol\",, \"T\"))","v":5264},5,{"$f":"IFERROR(RANK($J5,INDIRECT((\"$J$\"&\"1\"&\":$J$\"&$A$103)))+COUNTIF($J$1:J5,J5)-1,\"\")","v":""},"S.US.EU","",{"$f":"RTD(\"cqg.rtd\", ,\"ContractData\",O5, \"LongDescription\",, \"T\")","v":"Obligatory parameter <contract>(position - 1) is not specified"},{"$f":"IFERROR(RTD(\"cqg.rtd\", ,\"ContractData\",O5, \"PerCentNetLastTrade\",, \"T\")/100,\"\")","v":""},{"$error":"#VALUE!"},null,"",{"$error":"#N/A"},"",{"$f":"IF(Q5<0,\"\",IFERROR(RTD(\"cqg.rtd\", ,\"ContractData\",O5, \"LongDescription\",, \"T\"),\"\"))","v":"Obligatory parameter <contract>(position - 1) is not specified"},null,null,"",null,{"$error":"#N/A"},{"$error":"#N/A"},{"$f":"IF(RTD(\"cqg.rtd\", ,\"ContractData\",AC5, \"PerCentNetLastTrade\",, \"T\")>0,\"\",IFERROR(RTD(\"cqg.rtd\", ,\"ContractData\",AC5, \"PerCentNetLastTrade\",, \"T\")/100,\"\"))","v":{"$error":"#N/A"}},{"$f":"IF(AD5>0,\"\",IFERROR(RTD(\"cqg.rtd\", ,\"ContractData\",AC5, \"LongDescription\",, \"T\"),\"\"))","v":{"$error":"#N/A"}},{"$f":"\"\"","v":""},{"$error":"#N/A"},{"$error":"#N/A"}]
[{"$f":"IF(Symbols!A6=\"\",\"\",Symbols!A6)","v":"S.US.LEU"},1,"S.US.LEU",{"$f":"IF(A6=\"\",\"\",RTD(\"cqg.rtd\", ,\"ContractData\",C6, \"LongDescription\",, \"T\"))","v":"Centrus Energy Corp."},null,null,null,{"$f":"IF(A6=\"\",\"\",RTD(\"cqg.rtd\", ,\"ContractData\",C6, \"LastTradeToday\",, \"T\"))","v":""},{"$f":"IF(A6=\"\",\"\",RTD(\"cqg.rtd\", ,\"ContractData\",C6, \"NetLastTradeToday\",, \"T\"))","v":""},{"$f":"IF(A6=\"\",\"\",IFERROR(RTD(\"cqg.rtd\", ,\"ContractData\",C6, \"PerCentNetLastTrade\",, \"T\")/100,\"\"))","v":""},{"$f":"IF(A6=\"\",\"\",RTD(\"cqg.rtd\", ,\"ContractData\", C6, \"T_CVol\",, \"T\"))","v":12936},6,{"$f":"IFERROR(RANK($J6,INDIRECT((\"$J$\"&\"1\"&\":$J$\"&$A$103)))+COUNTIF($J$1:J6,J6)-1,\"\")","v":""},"S.US.LEU","",{"$f":"RTD(\"cqg.rtd\", ,\"ContractData\",O6, \"LongDescription\",, \"T\")","v":"Obligatory parameter <contract>(position - 1) is not specified"},{"$f":"IFERROR(RTD(\"cqg.rtd\", ,\"ContractData\",O6, \"PerCentNetLastTrade\",, \"T\")/100,\"\")","v":""},{"$error":"#VALUE!"},null,"",{"$error":"#N/A"},"",{"$f":"IF(Q6<0,\"\",IFERROR(RTD(\"cqg.rtd\", ,\"ContractData\",O6, \"LongDescription\",, \"T\"),\"\"))","v":"Obligatory parameter <contract>(position - 1) is not specified"},null,null,"",null,{"$error":"#N/A"},{"$error":"#N/A"},{"$f":"IF(RTD(\"cqg.rtd\", ,\"ContractData\",AC6, \"PerCentNetLastTrade\",, \"T\")>0,\"\",IFERROR(RTD(\"cqg.rtd\", ,\"ContractData\",AC6, \"PerCentNetLastTrade\",, \"T\")/100,\"\"))","v":{"$error":"#N/A"}},{"$f":"IF(AD6>0,\"\",IFERROR(RTD(\"cqg.rtd\", ,\"ContractData\",AC6, \"LongDescription\",, \"T\"),\"\"))","v":{"$error":"#N/A"}},{"$f":"\"\"","v":""},{"$error":"#N/A"},{"$error":"#N/A"}]
[{"$f":"IF(Symbols!A7=\"\",\"\",Symbols!A7)","v":"S.US.NNE"},1,"S.US.NNE",{"$f":"IF(A7=\"\",\"\",RTD(\"cqg.rtd\", ,\"ContractData\",C7, \"LongDescription\",, \"T\"))","v":"Nano Nuclear Energy Inc."},null,null,null,{"$f":"IF(A7=\"\",\"\",RTD(\"cqg.rtd\", ,\"ContractData\",C7, \"LastTradeToday\",, \"T\"))","v":""},{"$f":"IF(A7=\"\",\"\",RTD(\"cqg.rtd\", ,\"ContractData\",C7, \"NetLastTradeToday\",, \"T\"))","v":""},{"$f":"IF(A7=\"\",\"\",IFERROR(RTD(\"cqg.rtd\", ,\"ContractData\",C7, \"PerCentNetLastTrade\",, \"T\")/100,\"\"))","v":""},{"$f":"IF(A7=\"\",\"\",RTD(\"cqg.rtd\", ,\"ContractData\", C7, \"T_CVol\",, \"T\"))","v":52655},7,{"$f":"IFERROR(RANK($J7,INDIRECT((\"$J$\"&\"1\"&\":$J$\"&$A$103)))+COUNTIF($J$1:J7,J7)-1,\"\")","v":""},"S.US.NNE","",{"$f":"RTD(\"cqg.rtd\", ,\"ContractData\",O7, \"LongDescription\",, \"T\")","v":"Obligatory parameter <contract>(position - 1) is not specified"},{"$f":"IFERROR(RTD(\"cqg.rtd\", ,\"ContractData\",O7, \"PerCentNetLastTrade\",, \"T\")/100,\"\")","v":""},{"$error":"#VALUE!"},null,"",{"$error":"#N/A"},"",{"$f":"IF(Q7<0,\"\",IFERROR(RTD(\"cqg.rtd\", ,\"ContractData\",O7, \"LongDescription\",, \"T\"),\"\"))","v":"Obligatory parameter <contract>(position - 1) is not specified"},null,null,"",null,{"$error":"#N/A"},{"$error":"#N/A"},{"$f":"IF(RTD(\"cqg.rtd\", ,\"ContractData\",AC7, \"PerCentNetLastTrade\",, \"T\")>0,\"\",IFERROR(RTD(\"cqg.rtd\", ,\"ContractData\",AC7, \"PerCentNetLastTrade\",, \"T\")/100,\"\"))","v":{"$error":"#N/A"}},{"$f":"IF(AD7>0,\"\",IFERROR(RTD(\"cqg.rtd\", ,\"ContractData\",AC7, \"LongDescription\",, \"T\"),\"\"))","v":{"$error":"#N/A"}},{"$f":"\"\"","v":""},{"$error":"#N/A"},{"$error":"#N/A"}]
[{"$f":"IF(Symbols!A8=\"\",\"\",Symbols!A8)","v":"S.US.NXE"},1,"S.US.NXE",{"$f":"IF(A8=\"\",\"\",RTD(\"cqg.rtd\", ,\"ContractData\",C8, \"LongDescription\",, \"T\"))","v":"Nexgen Energy Ltd."},null,null,null,{"$f":"IF(A8=\"\",\"\",RTD(\"cqg.rtd\", ,\"ContractData\",C8, \"LastTradeToday\",, \"T\"))","v":""},{"$f":"IF(A8=\"\",\"\",RTD(\"cqg.rtd\", ,\"ContractData\",C8, \"NetLastTradeToday\",, \"T\"))","v":""},{"$f":"IF(A8=\"\",\"\",IFERROR(RTD(\"cqg.rtd\", ,\"ContractData\",C8, \"PerCentNetLastTrade\",, \"T\")/100,\"\"))","v":""},{"$f":"IF(A8=\"\",\"\",RTD(\"cqg.rtd\", ,\"ContractData\", C8, \"T_CVol\",, \"T\"))","v":13593},8,{"$f":"IFERROR(RANK($J8,INDIRECT((\"$J$\"&\"1\"&\":$J$\"&$A$103)))+COUNTIF($J$1:J8,J8)-1,\"\")","v":""},"S.US.NXE","",{"$f":"RTD(\"cqg.rtd\", ,\"ContractData\",O8, \"LongDescription\",, \"T\")","v":"Obligatory parameter <contract>(position - 1) is not specified"},{"$f":"IFERROR(RTD(\"cqg.rtd\", ,\"ContractData\",O8, \"PerCentNetLastTrade\",, \"T\")/100,\"\")","v":""},{"$error":"#VALUE!"},null,"",{"$error":"#N/A"},"",{"$f":"IF(Q8<0,\"\",IFERROR(RTD(\"cqg.rtd\", ,\"ContractData\",O8, \"LongDescription\",, \"T\"),\"\"))","v":"Obligatory parameter <contract>(position - 1) is not specified"},null,null,"",null,{"$error":"#N/A"},{"$error":"#N/A"},{"$f":"IF(RTD(\"cqg.rtd\", ,\"ContractData\",AC8, \"PerCentNetLastTrade\",, \"T\")>0,\"\",IFERROR(RTD(\"cqg.rtd\", ,\"ContractData\",AC8, \"PerCentNetLastTrade\",, \"T\")/100,\"\"))","v":{"$error":"#N/A"}},{"$f":"IF(AD8>0,\"\",IFERROR(RTD(\"cqg.rtd\", ,\"ContractData\",AC8, \"LongDescription\",, \"T\"),\"\"))","v":{"$error":"#N/A"}},{"$f":"\"\"","v":""},{"$error":"#N/A"},{"$error":"#N/A"}]
[{"$f":"IF(Symbols!A9=\"\",\"\",Symbols!A9)","v":"S.US.OKLO"},1,"S.US.OKLO",{"$f":"IF(A9=\"\",\"\",RTD(\"cqg.rtd\", ,\"ContractData\",C9, \"LongDescription\",, \"T\"))","v":"Oklo Inc."},null,null,null,{"$f":"IF(A9=\"\",\"\",RTD(\"cqg.rtd\", ,\"ContractData\",C9, \"LastTradeToday\",, \"T\"))","v":""},{"$f":"IF(A9=\"\",\"\",RTD(\"cqg.rtd\", ,\"ContractData\",C9, \"NetLastTradeToday\",, \"T\"))","v":""},{"$f":"IF(A9=\"\",\"\",IFERROR(RTD(\"cqg.rtd\", ,\"ContractData\",C9, \"PerCentNetLastTrade\",, \"T\")/100,\"\"))","v":""},{"$f":"IF(A9=\"\",\"\",RTD(\"cqg.rtd\", ,\"ContractData\", C9, \"T_CVol\",, \"T\"))","v":634365},9,{"$f":"IFERROR(RANK($J9,INDIRECT((\"$J$\"&\"1\"&\":$J$\"&$A$103)))+COUNTIF($J$1:J9,J9)-1,\"\")","v":""},"S.US.OKLO","",{"$f":"RTD(\"cqg.rtd\", ,\"ContractData\",O9, \"LongDescription\",, \"T\")","v":"Obligatory parameter <contract>(position - 1) is not specified"},{"$f":"IFERROR(RTD(\"cqg.rtd\", ,\"ContractData\",O9, \"PerCentNetLastTrade\",, \"T\")/100,\"\")","v":""},{"$error":"#VALUE!"},null,"",{"$error":"#N/A"},"",{"$f":"IF(Q9<0,\"\",IFERROR(RTD(\"cqg.rtd\", ,\"ContractData\",O9, \"LongDescription\",, \"T\"),\"\"))","v":"Obligatory parameter <contract>(position - 1) is not specified"},null,null,"",null,{"$error":"#N/A"},{"$error":"#N/A"},{"$f":"IF(RTD(\"cqg.rtd\", ,\"ContractData\",AC9, \"PerCentNetLastTrade\",, \"T\")>0,\"\",IFERROR(RTD(\"cqg.rtd\", ,\"ContractData\",AC9, \"PerCentNetLastTrade\",, \"T\")/100,\"\"))","v":{"$error":"#N/A"}},{"$f":"IF(AD9>0,\"\",IFERROR(RTD(\"cqg.rtd\", ,\"ContractData\",AC9, \"LongDescription\",, \"T\"),\"\"))","v":{"$error":"#N/A"}},{"$f":"\"\"","v":""},{"$error":"#N/A"},{"$error":"#N/A"}]
[{"$f":"IF(Symbols!A10=\"\",\"\",Symbols!A10)","v":"S.US.PCG"},1,"S.US.PCG",{"$f":"IF(A10=\"\",\"\",RTD(\"cqg.rtd\", ,\"ContractData\",C10, \"LongDescription\",, \"T\"))","v":"PG&E Corp Hldg Co"},null,null,null,{"$f":"IF(A10=\"\",\"\",RTD(\"cqg.rtd\", ,\"ContractData\",C10, \"LastTradeToday\",, \"T\"))","v":""},{"$f":"IF(A10=\"\",\"\",RTD(\"cqg.rtd\", ,\"ContractData\",C10, \"NetLastTradeToday\",, \"T\"))","v":""},{"$f":"IF(A10=\"\",\"\",IFERROR(RTD(\"cqg.rtd\", ,\"ContractData\",C10, \"PerCentNetLastTrade\",, \"T\")/100,\"\"))","v":""},{"$f":"IF(A10=\"\",\"\",RTD(\"cqg.rtd\", ,\"ContractData\", C10, \"T_CVol\",, \"T\"))","v":5160},10,{"$f":"IFERROR(RANK($J10,INDIRECT((\"$J$\"&\"1\"&\":$J$\"&$A$103)))+COUNTIF($J$1:J10,J10)-1,\"\")","v":""},"S.US.PCG","",{"$f":"RTD(\"cqg.rtd\", ,\"ContractData\",O10, \"LongDescription\",, \"T\")","v":"Obligatory parameter <contract>(position - 1) is not specified"},{"$f":"IFERROR(RTD(\"cqg.rtd\", ,\"ContractData\",O10, \"PerCentNetLastTrade\",, \"T\")/100,\"\")","v":""},{"$error":"#VALUE!"},null,"",{"$error":"#N/A"},"",{"$f":"IF(Q10<0,\"\",IFERROR(RTD(\"cqg.rtd\", ,\"ContractData\",O10, \"LongDescription\",, \"T\"),\"\"))","v":"Obligatory parameter <contract>(position - 1) is not specified"},null,null,"",null,{"$error":"#N/A"},{"$error":"#N/A"},{"$f":"IF(RTD(\"cqg.rtd\", ,\"ContractData\",AC10, \"PerCentNetLastTrade\",, \"T\")>0,\"\",IFERROR(RTD(\"cqg.rtd\", ,\"ContractData\",AC10, \"PerCentNetLastTrade\",, \"T\")/100,\"\"))","v":{"$error":"#N/A"}},{"$f":"IF(AD10>0,\"\",IFERROR(RTD(\"cqg.rtd\", ,\"ContractData\",AC10, \"LongDescription\",, \"T\"),\"\"))","v":{"$error":"#N/A"}},{"$f":"\"\"","v":""},{"$error":"#N/A"},{"$error":"#N/A"}]
[{"$f":"IF(Symbols!A11=\"\",\"\",Symbols!A11)","v":"S.US.PEG"},1,"S.US.PEG",{"$f":"IF(A11=\"\",\"\",RTD(\"cqg.rtd\", ,\"ContractData\",C11, \"LongDescription\",, \"T\"))","v":"Pub Svc Entrpr Grp Inc"},null,null,null,{"$f":"IF(A11=\"\",\"\",RTD(\"cqg.rtd\", ,\"ContractData\",C11, \"LastTradeToday\",, \"T\"))","v":""},{"$f":"IF(A11=\"\",\"\",RTD(\"cqg.rtd\", ,\"ContractData\",C11, \"NetLastTradeToday\",, \"T\"))","v":""},{"$f":"IF(A11=\"\",\"\",IFERROR(RTD(\"cqg.rtd\", ,\"ContractData\",C11, \"PerCentNetLastTrade\",, \"T\")/100,\"\"))","v":""},{"$f":"IF(A11=\"\",\"\",RTD(\"cqg.rtd\", ,\"ContractData\", C11, \"T_CVol\",, \"T\"))","v":3},11,{"$f":"IFERROR(RANK($J11,INDIRECT((\"$J$\"&\"1\"&\":$J$\"&$A$103)))+COUNTIF($J$1:J11,J11)-1,\"\")","v":""},"S.US.PEG","",{"$f":"RTD(\"cqg.rtd\", ,\"ContractData\",O11, \"LongDescription\",, \"T\")","v":"Obligatory parameter <contract>(position - 1) is not specified"},{"$f":"IFERROR(RTD(\"cqg.rtd\", ,\"ContractData\",O11, \"PerCentNetLastTrade\",, \"T\")/100,\"\")","v":""},{"$error":"#VALUE!"},null,"",{"$error":"#N/A"},"",{"$f":"IF(Q11<0,\"\",IFERROR(RTD(\"cqg.rtd\", ,\"ContractData\",O11, \"LongDescription\",, \"T\"),\"\"))","v":"Obligatory parameter <contract>(position - 1) is not specified"},null,null,"",null,{"$error":"#N/A"},{"$error":"#N/A"},{"$f":"IF(RTD(\"cqg.rtd\", ,\"ContractData\",AC11, \"PerCentNetLastTrade\",, \"T\")>0,\"\",IFERROR(RTD(\"cqg.rtd\", ,\"ContractData\",AC11, \"PerCentNetLastTrade\",, \"T\")/100,\"\"))","v":{"$error":"#N/A"}},{"$f":"IF(AD11>0,\"\",IFERROR(RTD(\"cqg.rtd\", ,\"ContractData\",AC11, \"LongDescription\",, \"T\"),\"\"))","v":{"$error":"#N/A"}},{"$f":"\"\"","v":""},{"$error":"#N/A"},{"$error":"#N/A"}]
[{"$f":"IF(Symbols!A12=\"\",\"\",Symbols!A12)","v":"S.US.SMR"},1,"S.US.SMR",{"$f":"IF(A12=\"\",\"\",RTD(\"cqg.rtd\", ,\"ContractData\",C12, \"LongDescription\",, \"T\"))","v":"NuScale Power Corporation"},null,null,null,{"$f":"IF(A12=\"\",\"\",RTD(\"cqg.rtd\", ,\"ContractData\",C12, \"LastTradeToday\",, \"T\"))","v":""},{"$f":"IF(A12=\"\",\"\",RTD(\"cqg.rtd\", ,\"ContractData\",C12, \"NetLastTradeToday\",, \"T\"))","v":""},{"$f":"IF(A12=\"\",\"\",IFERROR(RTD(\"cqg.rtd\", ,\"ContractData\",C12, \"PerCentNetLastTrade\",, \"T\")/100,\"\"))","v":""},{"$f":"IF(A12=\"\",\"\",RTD(\"cqg.rtd\", ,\"ContractData\", C12, \"T_CVol\",, \"T\"))","v":1487260},12,{"$f":"IFERROR(RANK($J12,INDIRECT((\"$J$\"&\"1\"&\":$J$\"&$A$103)))+COUNTIF($J$1:J12,J12)-1,\"\")","v":""},"S.US.SMR","",{"$f":"RTD(\"cqg.rtd\", ,\"ContractData\",O12, \"LongDescription\",, \"T\")","v":"Obligatory parameter <contract>(position - 1) is not specified"},{"$f":"IFERROR(RTD(\"cqg.rtd\", ,\"ContractData\",O12, \"PerCentNetLastTrade\",, \"T\")/100,\"\")","v":""},{"$error":"#VALUE!"},null,"",{"$error":"#N/A"},"",{"$f":"IF(Q12<0,\"\",IFERROR(RTD(\"cqg.rtd\", ,\"ContractData\",O12, \"LongDescription\",, \"T\"),\"\"))","v":"Obligatory parameter <contract>(position - 1) is not specified"},null,null,"",null,{"$error":"#N/A"},{"$error":"#N/A"},{"$f":"IF(RTD(\"cqg.rtd\", ,\"ContractData\",AC12, \"PerCentNetLastTrade\",, \"T\")>0,\"\",IFERROR(RTD(\"cqg.rtd\", ,\"ContractData\",AC12, \"PerCentNetLastTrade\",, \"T\")/100,\"\"))","v":{"$error":"#N/A"}},{"$f":"IF(AD12>0,\"\",IFERROR(RTD(\"cqg.rtd\", ,\"ContractData\",AC12, \"LongDescription\",, \"T\"),\"\"))","v":{"$error":"#N/A"}},{"$f":"\"\"","v":""},{"$error":"#N/A"},{"$error":"#N/A"}]
[{"$f":"IF(Symbols!A13=\"\",\"\",Symbols!A13)","v":"S.US.UEC"},1,"S.US.UEC",{"$f":"IF(A13=\"\",\"\",RTD(\"cqg.rtd\", ,\"ContractData\",C13, \"LongDescription\",, \"T\"))","v":"Uranium Energy Corp"},null,null,null,{"$f":"IF(A13=\"\",\"\",RTD(\"cqg.rtd\", ,\"ContractData\",C13, \"LastTradeToday\",, \"T\"))","v":""},{"$f":"IF(A13=\"\",\"\",RTD(\"cqg.rtd\", ,\"ContractData\",C13, \"NetLastTradeToday\",, \"T\"))","v":""},{"$f":"IF(A13=\"\",\"\",IFERROR(RTD(\"cqg.rtd\", ,\"ContractData\",C13, \"PerCentNetLastTrade\",, \"T\")/100,\"\"))","v":""},{"$f":"IF(A13=\"\",\"\",RTD(\"cqg.rtd\", ,\"ContractData\", C13, \"T_CVol\",, \"T\"))","v":130153},13,{"$f":"IFERROR(RANK($J13,INDIRECT((\"$J$\"&\"1\"&\":$J$\"&$A$103)))+COUNTIF($J$1:J13,J13)-1,\"\")","v":""},"S.US.UEC","",{"$f":"RTD(\"cqg.rtd\", ,\"ContractData\",O13, \"LongDescription\",, \"T\")","v":"Obligatory parameter <contract>(position - 1) is not specified"},{"$f":"IFERROR(RTD(\"cqg.rtd\", ,\"ContractData\",O13, \"PerCentNetLastTrade\",, \"T\")/100,\"\")","v":""},{"$error":"#VALUE!"},null,"",{"$error":"#N/A"},"",{"$f":"IF(Q13<0,\"\",IFERROR(RTD(\"cqg.rtd\", ,\"ContractData\",O13, \"LongDescription\",, \"T\"),\"\"))","v":"Obligatory parameter <contract>(position - 1) is not specified"},null,null,"",null,{"$error":"#N/A"},{"$error":"#N/A"},{"$f":"IF(RTD(\"cqg.rtd\", ,\"ContractData\",AC13, \"PerCentNetLastTrade\",, \"T\")>0,\"\",IFERROR(RTD(\"cqg.rtd\", ,\"ContractData\",AC13, \"PerCentNetLastTrade\",, \"T\")/100,\"\"))","v":{"$error":"#N/A"}},{"$f":"IF(AD13>0,\"\",IFERROR(RTD(\"cqg.rtd\", ,\"ContractData\",AC13, \"LongDescription\",, \"T\"),\"\"))","v":{"$error":"#N/A"}},{"$f":"\"\"","v":""},{"$error":"#N/A"},{"$error":"#N/A"}]
[{"$f":"IF(Symbols!A14=\"\",\"\",Symbols!A14)","v":"S.US.UUUU"},1,"S.US.UUUU",{"$f":"IF(A14=\"\",\"\",RTD(\"cqg.rtd\", ,\"ContractData\",C14, \"LongDescription\",, \"T\"))","v":"Energy Fuels Inc."},null,null,null,{"$f":"IF(A14=\"\",\"\",RTD(\"cqg.rtd\", ,\"ContractData\",C14, \"LastTradeToday\",, \"T\"))","v":""},{"$f":"IF(A14=\"\",\"\",RTD(\"cqg.rtd\", ,\"ContractData\",C14, \"NetLastTradeToday\",, \"T\"))","v":""},{"$f":"IF(A14=\"\",\"\",IFERROR(RTD(\"cqg.rtd\", ,\"ContractData\",C14, \"PerCentNetLastTrade\",, \"T\")/100,\"\"))","v":""},{"$f":"IF(A14=\"\",\"\",RTD(\"cqg.rtd\", ,\"ContractData\", C14, \"T_CVol\",, \"T\"))","v":318065},14,{"$f":"IFERROR(RANK($J14,INDIRECT((\"$J$\"&\"1\"&\":$J$\"&$A$103)))+COUNTIF($J$1:J14,J14)-1,\"\")","v":""},"S.US.UUUU","",{"$f":"RTD(\"cqg.rtd\", ,\"ContractData\",O14, \"LongDescription\",, \"T\")","v":"Obligatory parameter <contract>(position - 1) is not specified"},{"$f":"IFERROR(RTD(\"cqg.rtd\", ,\"ContractData\",O14, \"PerCentNetLastTrade\",, \"T\")/100,\"\")","v":""},{"$error":"#VALUE!"},null,"",{"$error":"#N/A"},"",{"$f":"IF(Q14<0,\"\",IFERROR(RTD(\"cqg.rtd\", ,\"ContractData\",O14, \"LongDescription\",, \"T\"),\"\"))","v":"Obligatory parameter <contract>(position - 1) is not specified"},null,null,"",null,{"$error":"#N/A"},{"$error":"#N/A"},{"$f":"IF(RTD(\"cqg.rtd\", ,\"ContractData\",AC14, \"PerCentNetLastTrade\",, \"T\")>0,\"\",IFERROR(RTD(\"cqg.rtd\", ,\"ContractData\",AC14, \"PerCentNetLastTrade\",, \"T\")/100,\"\"))","v":{"$error":"#N/A"}},{"$f":"IF(AD14>0,\"\",IFERROR(RTD(\"cqg.rtd\", ,\"ContractData\",AC14, \"LongDescription\",, \"T\"),\"\"))","v":{"$error":"#N/A"}},{"$f":"\"\"","v":""},{"$error":"#N/A"},{"$error":"#N/A"}]
[{"$f":"IF(Symbols!A15=\"\",\"\",Symbols!A15)","v":"S.US.NLR"},1,"S.US.NLR",{"$f":"IF(A15=\"\",\"\",RTD(\"cqg.rtd\", ,\"ContractData\",C15, \"LongDescription\",, \"T\"))","v":"Market Vectors Uranium+Nuclear EnergyETF"},null,null,null,{"$f":"IF(A15=\"\",\"\",RTD(\"cqg.rtd\", ,\"ContractData\",C15, \"LastTradeToday\",, \"T\"))","v":""},{"$f":"IF(A15=\"\",\"\",RTD(\"cqg.rtd\", ,\"ContractData\",C15, \"NetLastTradeToday\",, \"T\"))","v":""},{"$f":"IF(A15=\"\",\"\",IFERROR(RTD(\"cqg.rtd\", ,\"ContractData\",C15, \"PerCentNetLastTrade\",, \"T\")/100,\"\"))","v":""},{"$f":"IF(A15=\"\",\"\",RTD(\"cqg.rtd\", ,\"ContractData\", C15, \"T_CVol\",, \"T\"))","v":2311},15,{"$f":"IFERROR(RANK($J15,INDIRECT((\"$J$\"&\"1\"&\":$J$\"&$A$103)))+COUNTIF($J$1:J15,J15)-1,\"\")","v":""},"S.US.NLR","",{"$f":"RTD(\"cqg.rtd\", ,\"ContractData\",O15, \"LongDescription\",, \"T\")","v":"Obligatory parameter <contract>(position - 1) is not specified"},{"$f":"IFERROR(RTD(\"cqg.rtd\", ,\"ContractData\",O15, \"PerCentNetLastTrade\",, \"T\")/100,\"\")","v":""},{"$error":"#VALUE!"},null,"",{"$f":"IF(Q15>=0,NA(),-1*Q15)","v":{"$error":"#N/A"}},null,{"$f":"IF(Q15<0,\"\",IFERROR(RTD(\"cqg.rtd\", ,\"ContractData\",O15, \"LongDescription\",, \"T\"),\"\"))","v":"Obligatory parameter <contract>(position - 1) is not specified"},null,null,"",null,{"$error":"#N/A"},{"$error":"#N/A"},{"$f":"IF(RTD(\"cqg.rtd\", ,\"ContractData\",AC15, \"PerCentNetLastTrade\",, \"T\")>0,\"\",IFERROR(RTD(\"cqg.rtd\", ,\"ContractData\",AC15, \"PerCentNetLastTrade\",, \"T\")/100,\"\"))","v":{"$error":"#N/A"}},{"$f":"IF(AD15>0,\"\",IFERROR(RTD(\"cqg.rtd\", ,\"ContractData\",AC15, \"LongDescription\",, \"T\"),\"\"))","v":{"$error":"#N/A"}},{"$f":"\"\"","v":""},{"$error":"#N/A"},{"$error":"#N/A"}]
[{"$f":"IF(Symbols!A16=\"\",\"\",Symbols!A16)","v":""},"","",{"$f":"IF(A16=\"\",\"\",RTD(\"cqg.rtd\", ,\"ContractData\",C16, \"LongDescription\",, \"T\"))","v":""},null,null,null,{"$f":"IF(A16=\"\",\"\",RTD(\"cqg.rtd\", ,\"ContractData\",C16, \"LastTradeToday\",, \"T\"))","v":""},{"$f":"IF(A16=\"\",\"\",RTD(\"cqg.rtd\", ,\"ContractData\",C16, \"NetLastTradeToday\",, \"T\"))","v":""},{"$f":"IF(A16=\"\",\"\",IFERROR(RTD(\"cqg.rtd\", ,\"ContractData\",C16, \"PerCentNetLastTrade\",, \"T\")/100,\"\"))","v":""},{"$f":"IF(A16=\"\",\"\",RTD(\"cqg.rtd\", ,\"ContractData\", C16, \"T_CVol\",, \"T\"))","v":""},16,{"$f":"IFERROR(RANK($J16,INDIRECT((\"$J$\"&\"1\"&\":$J$\"&$A$103)))+COUNTIF($J$1:J16,J16)-1,\"\")","v":""},"",""]
[{"$f":"IF(Symbols!A17=\"\",\"\",Symbols!A17)","v":""},"","",{"$f":"IF(A17=\"\",\"\",RTD(\"cqg.rtd\", ,\"ContractData\",C17, \"LongDescription\",, \"T\"))","v":""},null,null,null,{"$f":"IF(A17=\"\",\"\",RTD(\"cqg.rtd\", ,\"ContractData\",C17, \"LastTradeToday\",, \"T\"))","v":""},{"$f":"IF(A17=\"\",\"\",RTD(\"cqg.rtd\", ,\"ContractData\",C17, \"NetLastTradeToday\",, \"T\"))","v":""},{"$f":"IF(A17=\"\",\"\",IFERROR(RTD(\"cqg.rtd\", ,\"ContractData\",C17, \"PerCentNetLastTrade\",, \"T\")/100,\"\"))","v":""},{"$f":"IF(A17=\"\",\"\",RTD(\"cqg.rtd\", ,\"ContractData\", C17, \"T_CVol\",, \"T\"))","v":""},17,{"$f":"IFERROR(RANK($J17,INDIRECT((\"$J$\"&\"1\"&\":$J$\"&$A$103)))+COUNTIF($J$1:J17,J17)-1,\"\")","v":""},"",""]
[{"$f":"IF(Symbols!A18=\"\",\"\",Symbols!A18)","v":""},"","",{"$f":"IF(A18=\"\",\"\",RTD(\"cqg.rtd\", ,\"ContractData\",C18, \"LongDescription\",, \"T\"))","v":""},null,null,null,{"$f":"IF(A18=\"\",\"\",RTD(\"cqg.rtd\", ,\"ContractData\",C18, \"LastTradeToday\",, \"T\"))","v":""},{"$f":"IF(A18=\"\",\"\",RTD(\"cqg.rtd\", ,\"ContractData\",C18, \"NetLastTradeToday\",, \"T\"))","v":""},{"$f":"IF(A18=\"\",\"\",IFERROR(RTD(\"cqg.rtd\", ,\"ContractData\",C18, \"PerCentNetLastTrade\",, \"T\")/100,\"\"))","v":""},{"$f":"IF(A18=\"\",\"\",RTD(\"cqg.rtd\", ,\"ContractData\", C18, \"T_CVol\",, \"T\"))","v":""},18,{"$f":"IFERROR(RANK($J18,INDIRECT((\"$J$\"&\"1\"&\":$J$\"&$A$103)))+COUNTIF($J$1:J18,J18)-1,\"\")","v":""},"",""]
[{"$f":"IF(Symbols!A19=\"\",\"\",Symbols!A19)","v":""},"","",{"$f":"IF(A19=\"\",\"\",RTD(\"cqg.rtd\", ,\"ContractData\",C19, \"LongDescription\",, \"T\"))","v":""},null,null,null,{"$f":"IF(A19=\"\",\"\",RTD(\"cqg.rtd\", ,\"ContractData\",C19, \"LastTradeToday\",, \"T\"))","v":""},{"$f":"IF(A19=\"\",\"\",RTD(\"cqg.rtd\", ,\"ContractData\",C19, \"NetLastTradeToday\",, \"T\"))","v":""},{"$f":"IF(A19=\"\",\"\",IFERROR(RTD(\"cqg.rtd\", ,\"ContractData\",C19, \"PerCentNetLastTrade\",, \"T\")/100,\"\"))","v":""},{"$f":"IF(A19=\"\",\"\",RTD(\"cqg.rtd\", ,\"ContractData\", C19, \"T_CVol\",, \"T\"))","v":""},19,{"$f":"IFERROR(RANK($J19,INDIRECT((\"$J$\"&\"1\"&\":$J$\"&$A$103)))+COUNTIF($J$1:J19,J19)-1,\"\")","v":""},"",""]
[{"$f":"IF(Symbols!A20=\"\",\"\",Symbols!A20)","v":""},"","",{"$f":"IF(A20=\"\",\"\",RTD(\"cqg.rtd\", ,\"ContractData\",C20, \"LongDescription\",, \"T\"))","v":""},null,null,null,{"$f":"IF(A20=\"\",\"\",RTD(\"cqg.rtd\", ,\"ContractData\",C20, \"LastTradeToday\",, \"T\"))","v":""},{"$f":"IF(A20=\"\",\"\",RTD(\"cqg.rtd\", ,\"ContractData\",C20, \"NetLastTradeToday\",, \"T\"))","v":""},{"$f":"IF(A20=\"\",\"\",IFERROR(RTD(\"cqg.rtd\", ,\"ContractData\",C20, \"PerCentNetLastTrade\",, \"T\")/100,\"\"))","v":""},{"$f":"IF(A20=\"\",\"\",RTD(\"cqg.rtd\", ,\"ContractData\", C20, \"T_CVol\",, \"T\"))","v":""},20,{"$f":"IFERROR(RANK($J20,INDIRECT((\"$J$\"&\"1\"&\":$J$\"&$A$103)))+COUNTIF($J$1:J20,J20)-1,\"\")","v":""},"",""]
[{"$f":"IF(Symbols!A21=\"\",\"\",Symbols!A21)","v":""},"","",{"$f":"IF(A21=\"\",\"\",RTD(\"cqg.rtd\", ,\"ContractData\",C21, \"LongDescription\",, \"T\"))","v":""},null,null,null,{"$f":"IF(A21=\"\",\"\",RTD(\"cqg.rtd\", ,\"ContractData\",C21, \"LastTradeToday\",, \"T\"))","v":""},{"$f":"IF(A21=\"\",\"\",RTD(\"cqg.rtd\", ,\"ContractData\",C21, \"NetLastTradeToday\",, \"T\"))","v":""},{"$f":"IF(A21=\"\",\"\",IFERROR(RTD(\"cqg.rtd\", ,\"ContractData\",C21, \"PerCentNetLastTrade\",, \"T\")/100,\"\"))","v":""},{"$f":"IF(A21=\"\",\"\",RTD(\"cqg.rtd\", ,\"ContractData\", C21, \"T_CVol\",, \"T\"))","v":""},21,{"$f":"IFERROR(RANK($J21,INDIRECT((\"$J$\"&\"1\"&\":$J$\"&$A$103)))+COUNTIF($J$1:J21,J21)-1,\"\")","v":""},"",""]
[{"$f":"IF(Symbols!A22=\"\",\"\",Symbols!A22)","v":""},"","",{"$f":"IF(A22=\"\",\"\",RTD(\"cqg.rtd\", ,\"ContractData\",C22, \"LongDescription\",, \"T\"))","v":""},null,null,null,{"$f":"IF(A22=\"\",\"\",RTD(\"cqg.rtd\", ,\"ContractData\",C22, \"LastTradeToday\",, \"T\"))","v":""},{"$f":"IF(A22=\"\",\"\",RTD(\"cqg.rtd\", ,\"ContractData\",C22, \"NetLastTradeToday\",, \"T\"))","v":""},{"$f":"IF(A22=\"\",\"\",IFERROR(RTD(\"cqg.rtd\", ,\"ContractData\",C22, \"PerCentNetLastTrade\",, \"T\")/100,\"\"))","v":""},{"$f":"IF(A22=\"\",\"\",RTD(\"cqg.rtd\", ,\"ContractData\", C22, \"T_CVol\",, \"T\"))","v":""},22,{"$f":"IFERROR(RANK($J22,INDIRECT((\"$J$\"&\"1\"&\":$J$\"&$A$103)))+COUNTIF($J$1:J22,J22)-1,\"\")","v":""},"",""]
[{"$f":"IF(Symbols!A23=\"\",\"\",Symbols!A23)","v":""},"","",{"$f":"IF(A23=\"\",\"\",RTD(\"cqg.rtd\", ,\"ContractData\",C23, \"LongDescription\",, \"T\"))","v":""},null,null,null,{"$f":"IF(A23=\"\",\"\",RTD(\"cqg.rtd\", ,\"ContractData\",C23, \"LastTradeToday\",, \"T\"))","v":""},{"$f":"IF(A23=\"\",\"\",RTD(\"cqg.rtd\", ,\"ContractData\",C23, \"NetLastTradeToday\",, \"T\"))","v":""},{"$f":"IF(A23=\"\",\"\",IFERROR(RTD(\"cqg.rtd\", ,\"ContractData\",C23, \"PerCentNetLastTrade\",, \"T\")/100,\"\"))","v":""},{"$f":"IF(A23=\"\",\"\",RTD(\"cqg.rtd\", ,\"ContractData\", C23, \"T_CVol\",, \"T\"))","v":""},23,{"$f":"IFERROR(RANK($J23,INDIRECT((\"$J$\"&\"1\"&\":$J$\"&$A$103)))+COUNTIF($J$1:J23,J23)-1,\"\")","v":""},"",""]
[{"$f":"IF(Symbols!A24=\"\",\"\",Symbols!A24)","v":""},"","",{"$f":"IF(A24=\"\",\"\",RTD(\"cqg.rtd\", ,\"ContractData\",C24, \"LongDescription\",, \"T\"))","v":""},null,null,null,{"$f":"IF(A24=\"\",\"\",RTD(\"cqg.rtd\", ,\"ContractData\",C24, \"LastTradeToday\",, \"T\"))","v":""},{"$f":"IF(A24=\"\",\"\",RTD(\"cqg.rtd\", ,\"ContractData\",C24, \"NetLastTradeToday\",, \"T\"))","v":""},{"$f":"IF(A24=\"\",\"\",IFERROR(RTD(\"cqg.rtd\", ,\"ContractData\",C24, \"PerCentNetLastTrade\",, \"T\")/100,\"\"))","v":""},{"$f":"IF(A24=\"\",\"\",RTD(\"cqg.rtd\", ,\"ContractData\", C24, \"T_CVol\",, \"T\"))","v":""},24,{"$f":"IFERROR(RANK($J24,INDIRECT((\"$J$\"&\"1\"&\":$J$\"&$A$103)))+COUNTIF($J$1:J24,J24)-1,\"\")","v":""},"",""]
[{"$f":"IF(Symbols!A25=\"\",\"\",Symbols!A25)","v":""},"","",{"$f":"IF(A25=\"\",\"\",RTD(\"cqg.rtd\", ,\"ContractData\",C25, \"LongDescription\",, \"T\"))","v":""},null,null,null,{"$f":"IF(A25=\"\",\"\",RTD(\"cqg.rtd\", ,\"ContractData\",C25, \"LastTradeToday\",, \"T\"))","v":""},{"$f":"IF(A25=\"\",\"\",RTD(\"cqg.rtd\", ,\"ContractData\",C25, \"NetLastTradeToday\",, \"T\"))","v":""},{"$f":"IF(A25=\"\",\"\",IFERROR(RTD(\"cqg.rtd\", ,\"ContractData\",C25, \"PerCentNetLastTrade\",, \"T\")/100,\"\"))","v":""},{"$f":"IF(A25=\"\",\"\",RTD(\"cqg.rtd\", ,\"ContractData\", C25, \"T_CVol\",, \"T\"))","v":""},25,{"$f":"IFERROR(RANK($J25,INDIRECT((\"$J$\"&\"1\"&\":$J$\"&$A$103)))+COUNTIF($J$1:J25,J25)-1,\"\")","v":""},"",""]
[{"$f":"IF(Symbols!A26=\"\",\"\",Symbols!A26)","v":""},"","",{"$f":"IF(A26=\"\",\"\",RTD(\"cqg.rtd\", ,\"ContractData\",C26, \"LongDescription\",, \"T\"))","v":""},null,null,null,{"$f":"IF(A26=\"\",\"\",RTD(\"cqg.rtd\", ,\"ContractData\",C26, \"LastTradeToday\",, \"T\"))","v":""},{"$f":"IF(A26=\"\",\"\",RTD(\"cqg.rtd\", ,\"ContractData\",C26, \"NetLastTradeToday\",, \"T\"))","v":""},{"$f":"IF(A26=\"\",\"\",IFERROR(RTD(\"cqg.rtd\", ,\"ContractData\",C26, \"PerCentNetLastTrade\",, \"T\")/100,\"\"))","v":""},{"$f":"IF(A26=\"\",\"\",RTD(\"cqg.rtd\", ,\"ContractData\", C26, \"T_CVol\",, \"T\"))","v":""},26,{"$f":"IFERROR(RANK($J26,INDIRECT((\"$J$\"&\"1\"&\":$J$\"&$A$103)))+COUNTIF($J$1:J26,J26)-1,\"\")","v":""},"",""]
[{"$f":"IF(Symbols!A27=\"\",\"\",Symbols!A27)","v":""},"","",{"$f":"IF(A27=\"\",\"\",RTD(\"cqg.rtd\", ,\"ContractData\",C27, \"LongDescription\",, \"T\"))","v":""},null,null,null,{"$f":"IF(A27=\"\",\"\",RTD(\"cqg.rtd\", ,\"ContractData\",C27, \"LastTradeToday\",, \"T\"))","v":""},{"$f":"IF(A27=\"\",\"\",RTD(\"cqg.rtd\", ,\"ContractData\",C27, \"NetLastTradeToday\",, \"T\"))","v":""},{"$f":"IF(A27=\"\",\"\",IFERROR(RTD(\"cqg.rtd\", ,\"ContractData\",C27, \"PerCentNetLastTrade\",, \"T\")/100,\"\"))","v":""},{"$f":"IF(A27=\"\",\"\",RTD(\"cqg.rtd\", ,\"ContractData\", C27, \"T_CVol\",, \"T\"))","v":""},27,{"$f":"IFERROR(RANK($J27,INDIRECT((\"$J$\"&\"1\"&\":$J$\"&$A$103)))+COUNTIF($J$1:J27,J27)-1,\"\")","v":""},"",""]
[{"$f":"IF(Symbols!A28=\"\",\"\",Symbols!A28)","v":""},"","",{"$f":"IF(A28=\"\",\"\",RTD(\"cqg.rtd\", ,\"ContractData\",C28, \"LongDescription\",, \"T\"))","v":""},null,null,null,{"$f":"IF(A28=\"\",\"\",RTD(\"cqg.rtd\", ,\"ContractData\",C28, \"LastTradeToday\",, \"T\"))","v":""},{"$f":"IF(A28=\"\",\"\",RTD(\"cqg.rtd\", ,\"ContractData\",C28, \"NetLastTradeToday\",, \"T\"))","v":""},{"$f":"IF(A28=\"\",\"\",IFERROR(RTD(\"cqg.rtd\", ,\"ContractData\",C28, \"PerCentNetLastTrade\",, \"T\")/100,\"\"))","v":""},{"$f":"IF(A28=\"\",\"\",RTD(\"cqg.rtd\", ,\"ContractData\", C28, \"T_CVol\",, \"T\"))","v":""},28,{"$f":"IFERROR(RANK($J28,INDIRECT((\"$J$\"&\"1\"&\":$J$\"&$A$103)))+COUNTIF($J$1:J28,J28)-1,\"\")","v":""},"",""]
[{"$f":"IF(Symbols!A29=\"\",\"\",Symbols!A29)","v":""},"","",{"$f":"IF(A29=\"\",\"\",RTD(\"cqg.rtd\", ,\"ContractData\",C29, \"LongDescription\",, \"T\"))","v":""},null,null,null,{"$f":"IF(A29=\"\",\"\",RTD(\"cqg.rtd\", ,\"ContractData\",C29, \"LastTradeToday\",, \"T\"))","v":""},{"$f":"IF(A29=\"\",\"\",RTD(\"cqg.rtd\", ,\"ContractData\",C29, \"NetLastTradeToday\",, \"T\"))","v":""},{"$f":"IF(A29=\"\",\"\",IFERROR(RTD(\"cqg.rtd\", ,\"ContractData\",C29, \"PerCentNetLastTrade\",, \"T\")/100,\"\"))","v":""},{"$f":"IF(A29=\"\",\"\",RTD(\"cqg.rtd\", ,\"ContractData\", C29, \"T_CVol\",, \"T\"))","v":""},29,{"$f":"IFERROR(RANK($J29,INDIRECT((\"$J$\"&\"1\"&\":$J$\"&$A$103)))+COUNTIF($J$1:J29,J29)-1,\"\")","v":""},"",""]
[{"$f":"IF(Symbols!A30=\"\",\"\",Symbols!A30)","v":""},"","",{"$f":"IF(A30=\"\",\"\",RTD(\"cqg.rtd\", ,\"ContractData\",C30, \"LongDescription\",, \"T\"))","v":""},null,null,null,{"$f":"IF(A30=\"\",\"\",RTD(\"cqg.rtd\", ,\"ContractData\",C30, \"LastTradeToday\",, \"T\"))","v":""},{"$f":"IF(A30=\"\",\"\",RTD(\"cqg.rtd\", ,\"ContractData\",C30, \"NetLastTradeToday\",, \"T\"))","v":""},{"$f":"IF(A30=\"\",\"\",IFERROR(RTD(\"cqg.rtd\", ,\"ContractData\",C30, \"PerCentNetLastTrade\",, \"T\")/100,\"\"))","v":""},{"$f":"IF(A30=\"\",\"\",RTD(\"cqg.rtd\", ,\"ContractData\", C30, \"T_CVol\",, \"T\"))","v":""},30,{"$f":"IFERROR(RANK($J30,INDIRECT((\"$J$\"&\"1\"&\":$J$\"&$A$103)))+COUNTIF($J$1:J30,J30)-1,\"\")","v":""},"",""]
[{"$f":"IF(Symbols!A31=\"\",\"\",Symbols!A31)","v":""},"","",{"$f":"IF(A31=\"\",\"\",RTD(\"cqg.rtd\", ,\"ContractData\",C31, \"LongDescription\",, \"T\"))","v":""},null,null,null,{"$f":"IF(A31=\"\",\"\",RTD(\"cqg.rtd\", ,\"ContractData\",C31, \"LastTradeToday\",, \"T\"))","v":""},{"$f":"IF(A31=\"\",\"\",RTD(\"cqg.rtd\", ,\"ContractData\",C31, \"NetLastTradeToday\",, \"T\"))","v":""},{"$f":"IF(A31=\"\",\"\",IFERROR(RTD(\"cqg.rtd\", ,\"ContractData\",C31, \"PerCentNetLastTrade\",, \"T\")/100,\"\"))","v":""},{"$f":"IF(A31=\"\",\"\",RTD(\"cqg.rtd\", ,\"ContractData\", C31, \"T_CVol\",, \"T\"))","v":""},31,{"$f":"IFERROR(RANK($J31,INDIRECT((\"$J$\"&\"1\"&\":$J$\"&$A$103)))+COUNTIF($J$1:J31,J31)-1,\"\")","v":""},"",""]
[{"$f":"IF(Symbols!A32=\"\",\"\",Symbols!A32)","v":""},"","",{"$f":"IF(A32=\"\",\"\",RTD(\"cqg.rtd\", ,\"ContractData\",C32, \"LongDescription\",, \"T\"))","v":""},null,null,null,{"$f":"IF(A32=\"\",\"\",RTD(\"cqg.rtd\", ,\"ContractData\",C32, \"LastTradeToday\",, \"T\"))","v":""},{"$f":"IF(A32=\"\",\"\",RTD(\"cqg.rtd\", ,\"ContractData\",C32, \"NetLastTradeToday\",, \"T\"))","v":""},{"$f":"IF(A32=\"\",\"\",IFERROR(RTD(\"cqg.rtd\", ,\"ContractData\",C32, \"PerCentNetLastTrade\",, \"T\")/100,\"\"))","v":""},{"$f":"IF(A32=\"\",\"\",RTD(\"cqg.rtd\", ,\"ContractData\", C32, \"T_CVol\",, \"T\"))","v":""},32,{"$f":"IFERROR(RANK($J32,INDIRECT((\"$J$\"&\"1\"&\":$J$\"&$A$103)))+COUNTIF($J$1:J32,J32)-1,\"\")","v":""},"",""]
[{"$f":"IF(Symbols!A33=\"\",\"\",Symbols!A33)","v":""},"","",{"$f":"IF(A33=\"\",\"\",RTD(\"cqg.rtd\", ,\"ContractData\",C33, \"LongDescription\",, \"T\"))","v":""},null,null,null,{"$f":"IF(A33=\"\",\"\",RTD(\"cqg.rtd\", ,\"ContractData\",C33, \"LastTradeToday\",, \"T\"))","v":""},{"$f":"IF(A33=\"\",\"\",RTD(\"cqg.rtd\", ,\"ContractData\",C33, \"NetLastTradeToday\",, \"T\"))","v":""},{"$f":"IF(A33=\"\",\"\",IFERROR(RTD(\"cqg.rtd\", ,\"ContractData\",C33, \"PerCentNetLastTrade\",, \"T\")/100,\"\"))","v":""},{"$f":"IF(A33=\"\",\"\",RTD(\"cqg.rtd\", ,\"ContractData\", C33, \"T_CVol\",, \"T\"))","v":""},33,{"$f":"IFERROR(RANK($J33,INDIRECT((\"$J$\"&\"1\"&\":$J$\"&$A$103)))+COUNTIF($J$1:J33,J33)-1,\"\")","v":""},"",""]
[{"$f":"IF(Symbols!A34=\"\",\"\",Symbols!A34)","v":""},"","",{"$f":"IF(A34=\"\",\"\",RTD(\"cqg.rtd\", ,\"ContractData\",C34, \"LongDescription\",, \"T\"))","v":""},null,null,null,{"$f":"IF(A34=\"\",\"\",RTD(\"cqg.rtd\", ,\"ContractData\",C34, \"LastTradeToday\",, \"T\"))","v":""},{"$f":"IF(A34=\"\",\"\",RTD(\"cqg.rtd\", ,\"ContractData\",C34, \"NetLastTradeToday\",, \"T\"))","v":""},{"$f":"IF(A34=\"\",\"\",IFERROR(RTD(\"cqg.rtd\", ,\"ContractData\",C34, \"PerCentNetLastTrade\",, \"T\")/100,\"\"))","v":""},{"$f":"IF(A34=\"\",\"\",RTD(\"cqg.rtd\", ,\"ContractData\", C34, \"T_CVol\",, \"T\"))","v":""},34,{"$f":"IFERROR(RANK($J34,INDIRECT((\"$J$\"&\"1\"&\":$J$\"&$A$103)))+COUNTIF($J$1:J34,J34)-1,\"\")","v":""},"",""]
[{"$f":"IF(Symbols!A35=\"\",\"\",Symbols!A35)","v":""},"","",{"$f":"IF(A35=\"\",\"\",RTD(\"cqg.rtd\", ,\"ContractData\",C35, \"LongDescription\",, \"T\"))","v":""},null,null,null,{"$f":"IF(A35=\"\",\"\",RTD(\"cqg.rtd\", ,\"ContractData\",C35, \"LastTradeToday\",, \"T\"))","v":""},{"$f":"IF(A35=\"\",\"\",RTD(\"cqg.rtd\", ,\"ContractData\",C35, \"NetLastTradeToday\",, \"T\"))","v":""},{"$f":"IF(A35=\"\",\"\",IFERROR(RTD(\"cqg.rtd\", ,\"ContractData\",C35, \"PerCentNetLastTrade\",, \"T\")/100,\"\"))","v":""},{"$f":"IF(A35=\"\",\"\",RTD(\"cqg.rtd\", ,\"ContractData\", C35, \"T_CVol\",, \"T\"))","v":""},35,{"$f":"IFERROR(RANK($J35,INDIRECT((\"$J$\"&\"1\"&\":$J$\"&$A$103)))+COUNTIF($J$1:J35,J35)-1,\"\")","v":""},"",""]
[{"$f":"IF(Symbols!A36=\"\",\"\",Symbols!A36)","v":""},"","",{"$f":"IF(A36=\"\",\"\",RTD(\"cqg.rtd\", ,\"ContractData\",C36, \"LongDescription\",, \"T\"))","v":""},null,null,null,{"$f":"IF(A36=\"\",\"\",RTD(\"cqg.rtd\", ,\"ContractData\",C36, \"LastTradeToday\",, \"T\"))","v":""},{"$f":"IF(A36=\"\",\"\",RTD(\"cqg.rtd\", ,\"ContractData\",C36, \"NetLastTradeToday\",, \"T\"))","v":""},{"$f":"IF(A36=\"\",\"\",IFERROR(RTD(\"cqg.rtd\", ,\"ContractData\",C36, \"PerCentNetLastTrade\",, \"T\")/100,\"\"))","v":""},{"$f":"IF(A36=\"\",\"\",RTD(\"cqg.rtd\", ,\"ContractData\", C36, \"T_CVol\",, \"T\"))","v":""},36,{"$f":"IFERROR(RANK($J36,INDIRECT((\"$J$\"&\"1\"&\":$J$\"&$A$103)))+COUNTIF($J$1:J36,J36)-1,\"\")","v":""},"",""]
[{"$f":"IF(Symbols!A37=\"\",\"\",Symbols!A37)","v":""},"","",{"$f":"IF(A37=\"\",\"\",RTD(\"cqg.rtd\", ,\"ContractData\",C37, \"LongDescription\",, \"T\"))","v":""},null,null,null,{"$f":"IF(A37=\"\",\"\",RTD(\"cqg.rtd\", ,\"ContractData\",C37, \"LastTradeToday\",, \"T\"))","v":""},{"$f":"IF(A37=\"\",\"\",RTD(\"cqg.rtd\", ,\"ContractData\",C37, \"NetLastTradeToday\",, \"T\"))","v":""},{"$f":"IF(A37=\"\",\"\",IFERROR(RTD(\"cqg.rtd\", ,\"ContractData\",C37, \"PerCentNetLastTrade\",, \"T\")/100,\"\"))","v":""},{"$f":"IF(A37=\"\",\"\",RTD(\"cqg.rtd\", ,\"ContractData\", C37, \"T_CVol\",, \"T\"))","v":""},37,{"$f":"IFERROR(RANK($J37,INDIRECT((\"$J$\"&\"1\"&\":$J$\"&$A$103)))+COUNTIF($J$1:J37,J37)-1,\"\")","v":""},"",""]
[{"$f":"IF(Symbols!A38=\"\",\"\",Symbols!A38)","v":""},"","",{"$f":"IF(A38=\"\",\"\",RTD(\"cqg.rtd\", ,\"ContractData\",C38, \"LongDescription\",, \"T\"))","v":""},null,null,null,{"$f":"IF(A38=\"\",\"\",RTD(\"cqg.rtd\", ,\"ContractData\",C38, \"LastTradeToday\",, \"T\"))","v":""},{"$f":"IF(A38=\"\",\"\",RTD(\"cqg.rtd\", ,\"ContractData\",C38, \"NetLastTradeToday\",, \"T\"))","v":""},{"$f":"IF(A38=\"\",\"\",IFERROR(RTD(\"cqg.rtd\", ,\"ContractData\",C38, \"PerCentNetLastTrade\",, \"T\")/100,\"\"))","v":""},{"$f":"IF(A38=\"\",\"\",RTD(\"cqg.rtd\", ,\"ContractData\", C38, \"T_CVol\",, \"T\"))","v":""},38,{"$f":"IFERROR(RANK($J38,INDIRECT((\"$J$\"&\"1\"&\":$J$\"&$A$103)))+COUNTIF($J$1:J38,J38)-1,\"\")","v":""},"",""]
[{"$f":"IF(Symbols!A39=\"\",\"\",Symbols!A39)","v":""},"","",{"$f":"IF(A39=\"\",\"\",RTD(\"cqg.rtd\", ,\"ContractData\",C39, \"LongDescription\",, \"T\"))","v":""},null,null,null,{"$f":"IF(A39=\"\",\"\",RTD(\"cqg.rtd\", ,\"ContractData\",C39, \"LastTradeToday\",, \"T\"))","v":""},{"$f":"IF(A39=\"\",\"\",RTD(\"cqg.rtd\", ,\"ContractData\",C39, \"NetLastTradeToday\",, \"T\"))","v":""},{"$f":"IF(A39=\"\",\"\",IFERROR(RTD(\"cqg.rtd\", ,\"ContractData\",C39, \"PerCentNetLastTrade\",, \"T\")/100,\"\"))","v":""},{"$f":"IF(A39=\"\",\"\",RTD(\"cqg.rtd\", ,\"ContractData\", C39, \"T_CVol\",, \"T\"))","v":""},39,{"$f":"IFERROR(RANK($J39,INDIRECT((\"$J$\"&\"1\"&\":$J$\"&$A$103)))+COUNTIF($J$1:J39,J39)-1,\"\")","v":""},"",""]
[{"$f":"IF(Symbols!A40=\"\",\"\",Symbols!A40)","v":""},"","",{"$f":"IF(A40=\"\",\"\",RTD(\"cqg.rtd\", ,\"ContractData\",C40, \"LongDescription\",, \"T\"))","v":""},null,null,null,{"$f":"IF(A40=\"\",\"\",RTD(\"cqg.rtd\", ,\"ContractData\",C40, \"LastTradeToday\",, \"T\"))","v":""},{"$f":"IF(A40=\"\",\"\",RTD(\"cqg.rtd\", ,\"ContractData\",C40, \"NetLastTradeToday\",, \"T\"))","v":""},{"$f":"IF(A40=\"\",\"\",IFERROR(RTD(\"cqg.rtd\", ,\"ContractData\",C40, \"PerCentNetLastTrade\",, \"T\")/100,\"\"))","v":""},{"$f":"IF(A40=\"\",\"\",RTD(\"cqg.rtd\", ,\"ContractData\", C40, \"T_CVol\",, \"T\"))","v":""},40,{"$f":"IFERROR(RANK($J40,INDIRECT((\"$J$\"&\"1\"&\":$J$\"&$A$103)))+COUNTIF($J$1:J40,J40)-1,\"\")","v":""},"",""]
[{"$f":"IF(Symbols!A41=\"\",\"\",Symbols!A41)","v":""},"","",{"$f":"IF(A41=\"\",\"\",RTD(\"cqg.rtd\", ,\"ContractData\",C41, \"LongDescription\",, \"T\"))","v":""},null,null,null,{"$f":"IF(A41=\"\",\"\",RTD(\"cqg.rtd\", ,\"ContractData\",C41, \"LastTradeToday\",, \"T\"))","v":""},{"$f":"IF(A41=\"\",\"\",RTD(\"cqg.rtd\", ,\"ContractData\",C41, \"NetLastTradeToday\",, \"T\"))","v":""},{"$f":"IF(A41=\"\",\"\",IFERROR(RTD(\"cqg.rtd\", ,\"ContractData\",C41, \"PerCentNetLastTrade\",, \"T\")/100,\"\"))","v":""},{"$f":"IF(A41=\"\",\"\",RTD(\"cqg.rtd\", ,\"ContractData\", C41, \"T_CVol\",, \"T\"))","v":""},41,{"$f":"IFERROR(RANK($J41,INDIRECT((\"$J$\"&\"1\"&\":$J$\"&$A$103)))+COUNTIF($J$1:J41,J41)-1,\"\")","v":""},"",""]
[{"$f":"IF(Symbols!A42=\"\",\"\",Symbols!A42)","v":""},"","",{"$f":"IF(A42=\"\",\"\",RTD(\"cqg.rtd\", ,\"ContractData\",C42, \"LongDescription\",, \"T\"))","v":""},null,null,null,{"$f":"IF(A42=\"\",\"\",RTD(\"cqg.rtd\", ,\"ContractData\",C42, \"LastTradeToday\",, \"T\"))","v":""},{"$f":"IF(A42=\"\",\"\",RTD(\"cqg.rtd\", ,\"ContractData\",C42, \"NetLastTradeToday\",, \"T\"))","v":""},{"$f":"IF(A42=\"\",\"\",IFERROR(RTD(\"cqg.rtd\", ,\"ContractData\",C42, \"PerCentNetLastTrade\",, \"T\")/100,\"\"))","v":""},{"$f":"IF(A42=\"\",\"\",RTD(\"cqg.rtd\", ,\"ContractData\", C42, \"T_CVol\",, \"T\"))","v":""},42,{"$f":"IFERROR(RANK($J42,INDIRECT((\"$J$\"&\"1\"&\":$J$\"&$A$103)))+COUNTIF($J$1:J42,J42)-1,\"\")","v":""},"",""]
[{"$f":"IF(Symbols!A43=\"\",\"\",Symbols!A43)","v":""},"","",{"$f":"IF(A43=\"\",\"\",RTD(\"cqg.rtd\", ,\"ContractData\",C43, \"LongDescription\",, \"T\"))","v":""},null,null,null,{"$f":"IF(A43=\"\",\"\",RTD(\"cqg.rtd\", ,\"ContractData\",C43, \"LastTradeToday\",, \"T\"))","v":""},{"$f":"IF(A43=\"\",\"\",RTD(\"cqg.rtd\", ,\"ContractData\",C43, \"NetLastTradeToday\",, \"T\"))","v":""},{"$f":"IF(A43=\"\",\"\",IFERROR(RTD(\"cqg.rtd\", ,\"ContractData\",C43, \"PerCentNetLastTrade\",, \"T\")/100,\"\"))","v":""},{"$f":"IF(A43=\"\",\"\",RTD(\"cqg.rtd\", ,\"ContractData\", C43, \"T_CVol\",, \"T\"))","v":""},43,{"$f":"IFERROR(RANK($J43,INDIRECT((\"$J$\"&\"1\"&\":$J$\"&$A$103)))+COUNTIF($J$1:J43,J43)-1,\"\")","v":""},"",""]
[{"$f":"IF(Symbols!A44=\"\",\"\",Symbols!A44)","v":""},"","",{"$f":"IF(A44=\"\",\"\",RTD(\"cqg.rtd\", ,\"ContractData\",C44, \"LongDescription\",, \"T\"))","v":""},null,null,null,{"$f":"IF(A44=\"\",\"\",RTD(\"cqg.rtd\", ,\"ContractData\",C44, \"LastTradeToday\",, \"T\"))","v":""},{"$f":"IF(A44=\"\",\"\",RTD(\"cqg.rtd\", ,\"ContractData\",C44, \"NetLastTradeToday\",, \"T\"))","v":""},{"$f":"IF(A44=\"\",\"\",IFERROR(RTD(\"cqg.rtd\", ,\"ContractData\",C44, \"PerCentNetLastTrade\",, \"T\")/100,\"\"))","v":""},{"$f":"IF(A44=\"\",\"\",RTD(\"cqg.rtd\", ,\"ContractData\", C44, \"T_CVol\",, \"T\"))","v":""},44,{"$f":"IFERROR(RANK($J44,INDIRECT((\"$J$\"&\"1\"&\":$J$\"&$A$103)))+COUNTIF($J$1:J44,J44)-1,\"\")","v":""},"",""]
[{"$f":"IF(Symbols!A45=\"\",\"\",Symbols!A45)","v":""},"","",{"$f":"IF(A45=\"\",\"\",RTD(\"cqg.rtd\", ,\"ContractData\",C45, \"LongDescription\",, \"T\"))","v":""},null,null,null,{"$f":"IF(A45=\"\",\"\",RTD(\"cqg.rtd\", ,\"ContractData\",C45, \"LastTradeToday\",, \"T\"))","v":""},{"$f":"IF(A45=\"\",\"\",RTD(\"cqg.rtd\", ,\"ContractData\",C45, \"NetLastTradeToday\",, \"T\"))","v":""},{"$f":"IF(A45=\"\",\"\",IFERROR(RTD(\"cqg.rtd\", ,\"ContractData\",C45, \"PerCentNetLastTrade\",, \"T\")/100,\"\"))","v":""},{"$f":"IF(A45=\"\",\"\",RTD(\"cqg.rtd\", ,\"ContractData\", C45, \"T_CVol\",, \"T\"))","v":""},45,{"$f":"IFERROR(RANK($J45,INDIRECT((\"$J$\"&\"1\"&\":$J$\"&$A$103)))+COUNTIF($J$1:J45,J45)-1,\"\")","v":""},"",""]
[{"$f":"IF(Symbols!A46=\"\",\"\",Symbols!A46)","v":""},"","",{"$f":"IF(A46=\"\",\"\",RTD(\"cqg.rtd\", ,\"ContractData\",C46, \"LongDescription\",, \"T\"))","v":""},null,null,null,{"$f":"IF(A46=\"\",\"\",RTD(\"cqg.rtd\", ,\"ContractData\",C46, \"LastTradeToday\",, \"T\"))","v":""},{"$f":"IF(A46=\"\",\"\",RTD(\"cqg.rtd\", ,\"ContractData\",C46, \"NetLastTradeToday\",, \"T\"))","v":""},{"$f":"IF(A46=\"\",\"\",IFERROR(RTD(\"cqg.rtd\", ,\"ContractData\",C46, \"PerCentNetLastTrade\",, \"T\")/100,\"\"))","v":""},{"$f":"IF(A46=\"\",\"\",RTD(\"cqg.rtd\", ,\"ContractData\", C46, \"T_CVol\",, \"T\"))","v":""},46,{"$f":"IFERROR(RANK($J46,INDIRECT((\"$J$\"&\"1\"&\":$J$\"&$A$103)))+COUNTIF($J$1:J46,J46)-1,\"\")","v":""},"",""]
[{"$f":"IF(Symbols!A47=\"\",\"\",Symbols!A47)","v":""},"","",{"$f":"IF(A47=\"\",\"\",RTD(\"cqg.rtd\", ,\"ContractData\",C47, \"LongDescription\",, \"T\"))","v":""},null,null,null,{"$f":"IF(A47=\"\",\"\",RTD(\"cqg.rtd\", ,\"ContractData\",C47, \"LastTradeToday\",, \"T\"))","v":""},{"$f":"IF(A47=\"\",\"\",RTD(\"cqg.rtd\", ,\"ContractData\",C47, \"NetLastTradeToday\",, \"T\"))","v":""},{"$f":"IF(A47=\"\",\"\",IFERROR(RTD(\"cqg.rtd\", ,\"ContractData\",C47, \"PerCentNetLastTrade\",, \"T\")/100,\"\"))","v":""},{"$f":"IF(A47=\"\",\"\",RTD(\"cqg.rtd\", ,\"ContractData\", C47, \"T_CVol\",, \"T\"))","v":""},47,{"$f":"IFERROR(RANK($J47,INDIRECT((\"$J$\"&\"1\"&\":$J$\"&$A$103)))+COUNTIF($J$1:J47,J47)-1,\"\")","v":""},"",""]
[{"$f":"IF(Symbols!A48=\"\",\"\",Symbols!A48)","v":""},"","",{"$f":"IF(A48=\"\",\"\",RTD(\"cqg.rtd\", ,\"ContractData\",C48, \"LongDescription\",, \"T\"))","v":""},null,null,null,{"$f":"IF(A48=\"\",\"\",RTD(\"cqg.rtd\", ,\"ContractData\",C48, \"LastTradeToday\",, \"T\"))","v":""},{"$f":"IF(A48=\"\",\"\",RTD(\"cqg.rtd\", ,\"ContractData\",C48, \"NetLastTradeToday\",, \"T\"))","v":""},{"$f":"IF(A48=\"\",\"\",IFERROR(RTD(\"cqg.rtd\", ,\"ContractData\",C48, \"PerCentNetLastTrade\",, \"T\")/100,\"\"))","v":""},{"$f":"IF(A48=\"\",\"\",RTD(\"cqg.rtd\", ,\"ContractData\", C48, \"T_CVol\",, \"T\"))","v":""},48,{"$f":"IFERROR(RANK($J48,INDIRECT((\"$J$\"&\"1\"&\":$J$\"&$A$103)))+COUNTIF($J$1:J48,J48)-1,\"\")","v":""},"",""]
[{"$f":"IF(Symbols!A49=\"\",\"\",Symbols!A49)","v":""},"","",{"$f":"IF(A49=\"\",\"\",RTD(\"cqg.rtd\", ,\"ContractData\",C49, \"LongDescription\",, \"T\"))","v":""},null,null,null,{"$f":"IF(A49=\"\",\"\",RTD(\"cqg.rtd\", ,\"ContractData\",C49, \"LastTradeToday\",, \"T\"))","v":""},{"$f":"IF(A49=\"\",\"\",RTD(\"cqg.rtd\", ,\"ContractData\",C49, \"NetLastTradeToday\",, \"T\"))","v":""},{"$f":"IF(A49=\"\",\"\",IFERROR(RTD(\"cqg.rtd\", ,\"ContractData\",C49, \"PerCentNetLastTrade\",, \"T\")/100,\"\"))","v":""},{"$f":"IF(A49=\"\",\"\",RTD(\"cqg.rtd\", ,\"ContractData\", C49, \"T_CVol\",, \"T\"))","v":""},49,{"$f":"IFERROR(RANK($J49,INDIRECT((\"$J$\"&\"1\"&\":$J$\"&$A$103)))+COUNTIF($J$1:J49,J49)-1,\"\")","v":""},"",""]
[{"$f":"IF(Symbols!A50=\"\",\"\",Symbols!A50)","v":""},"","",{"$f":"IF(A50=\"\",\"\",RTD(\"cqg.rtd\", ,\"ContractData\",C50, \"LongDescription\",, \"T\"))","v":""},null,null,null,{"$f":"IF(A50=\"\",\"\",RTD(\"cqg.rtd\", ,\"ContractData\",C50, \"LastTradeToday\",, \"T\"))","v":""},{"$f":"IF(A50=\"\",\"\",RTD(\"cqg.rtd\", ,\"ContractData\",C50, \"NetLastTradeToday\",, \"T\"))","v":""},{"$f":"IF(A50=\"\",\"\",IFERROR(RTD(\"cqg.rtd\", ,\"ContractData\",C50, \"PerCentNetLastTrade\",, \"T\")/100,\"\"))","v":""},{"$f":"IF(A50=\"\",\"\",RTD(\"cqg.rtd\", ,\"ContractData\", C50, \"T_CVol\",, \"T\"))","v":""},50,{"$f":"IFERROR(RANK($J50,INDIRECT((\"$J$\"&\"1\"&\":$J$\"&$A$103)))+COUNTIF($J$1:J50,J50)-1,\"\")","v":""},"",""]
[{"$f":"IF(Symbols!A51=\"\",\"\",Symbols!A51)","v":""},"","",{"$f":"IF(A51=\"\",\"\",RTD(\"cqg.rtd\", ,\"ContractData\",C51, \"LongDescription\",, \"T\"))","v":""},null,null,null,{"$f":"IF(A51=\"\",\"\",RTD(\"cqg.rtd\", ,\"ContractData\",C51, \"LastTradeToday\",, \"T\"))","v":""},{"$f":"IF(A51=\"\",\"\",RTD(\"cqg.rtd\", ,\"ContractData\",C51, \"NetLastTradeToday\",, \"T\"))","v":""},{"$f":"IF(A51=\"\",\"\",IFERROR(RTD(\"cqg.rtd\", ,\"ContractData\",C51, \"PerCentNetLastTrade\",, \"T\")/100,\"\"))","v":""},{"$f":"IF(A51=\"\",\"\",RTD(\"cqg.rtd\", ,\"ContractData\", C51, \"T_CVol\",, \"T\"))","v":""},51,{"$f":"IFERROR(RANK($J51,INDIRECT((\"$J$\"&\"1\"&\":$J$\"&$A$103)))+COUNTIF($J$1:J51,J51)-1,\"\")","v":""},"",""]
[{"$f":"IF(Symbols!A52=\"\",\"\",Symbols!A52)","v":""},"","",{"$f":"IF(A52=\"\",\"\",RTD(\"cqg.rtd\", ,\"ContractData\",C52, \"LongDescription\",, \"T\"))","v":""},null,null,null,{"$f":"IF(A52=\"\",\"\",RTD(\"cqg.rtd\", ,\"ContractData\",C52, \"LastTradeToday\",, \"T\"))","v":""},{"$f":"IF(A52=\"\",\"\",RTD(\"cqg.rtd\", ,\"ContractData\",C52, \"NetLastTradeToday\",, \"T\"))","v":""},{"$f":"IF(A52=\"\",\"\",IFERROR(RTD(\"cqg.rtd\", ,\"ContractData\",C52, \"PerCentNetLastTrade\",, \"T\")/100,\"\"))","v":""},{"$f":"IF(A52=\"\",\"\",RTD(\"cqg.rtd\", ,\"ContractData\", C52, \"T_CVol\",, \"T\"))","v":""},52,{"$f":"IFERROR(RANK($J52,INDIRECT((\"$J$\"&\"1\"&\":$J$\"&$A$103)))+COUNTIF($J$1:J52,J52)-1,\"\")","v":""},"",""]
[{"$f":"IF(Symbols!A53=\"\",\"\",Symbols!A53)","v":""},"","",{"$f":"IF(A53=\"\",\"\",RTD(\"cqg.rtd\", ,\"ContractData\",C53, \"LongDescription\",, \"T\"))","v":""},null,null,null,{"$f":"IF(A53=\"\",\"\",RTD(\"cqg.rtd\", ,\"ContractData\",C53, \"LastTradeToday\",, \"T\"))","v":""},{"$f":"IF(A53=\"\",\"\",RTD(\"cqg.rtd\", ,\"ContractData\",C53, \"NetLastTradeToday\",, \"T\"))","v":""},{"$f":"IF(A53=\"\",\"\",IFERROR(RTD(\"cqg.rtd\", ,\"ContractData\",C53, \"PerCentNetLastTrade\",, \"T\")/100,\"\"))","v":""},{"$f":"IF(A53=\"\",\"\",RTD(\"cqg.rtd\", ,\"ContractData\", C53, \"T_CVol\",, \"T\"))","v":""},53,{"$f":"IFERROR(RANK($J53,INDIRECT((\"$J$\"&\"1\"&\":$J$\"&$A$103)))+COUNTIF($J$1:J53,J53)-1,\"\")","v":""},"",""]
[{"$f":"IF(Symbols!A54=\"\",\"\",Symbols!A54)","v":""},"","",{"$f":"IF(A54=\"\",\"\",RTD(\"cqg.rtd\", ,\"ContractData\",C54, \"LongDescription\",, \"T\"))","v":""},null,null,null,{"$f":"IF(A54=\"\",\"\",RTD(\"cqg.rtd\", ,\"ContractData\",C54, \"LastTradeToday\",, \"T\"))","v":""},{"$f":"IF(A54=\"\",\"\",RTD(\"cqg.rtd\", ,\"ContractData\",C54, \"NetLastTradeToday\",, \"T\"))","v":""},{"$f":"IF(A54=\"\",\"\",IFERROR(RTD(\"cqg.rtd\", ,\"ContractData\",C54, \"PerCentNetLastTrade\",, \"T\")/100,\"\"))","v":""},{"$f":"IF(A54=\"\",\"\",RTD(\"cqg.rtd\", ,\"ContractData\", C54, \"T_CVol\",, \"T\"))","v":""},54,{"$f":"IFERROR(RANK($J54,INDIRECT((\"$J$\"&\"1\"&\":$J$\"&$A$103)))+COUNTIF($J$1:J54,J54)-1,\"\")","v":""},"",""]
[{"$f":"IF(Symbols!A55=\"\",\"\",Symbols!A55)","v":""},"","",{"$f":"IF(A55=\"\",\"\",RTD(\"cqg.rtd\", ,\"ContractData\",C55, \"LongDescription\",, \"T\"))","v":""},null,null,null,{"$f":"IF(A55=\"\",\"\",RTD(\"cqg.rtd\", ,\"ContractData\",C55, \"LastTradeToday\",, \"T\"))","v":""},{"$f":"IF(A55=\"\",\"\",RTD(\"cqg.rtd\", ,\"ContractData\",C55, \"NetLastTradeToday\",, \"T\"))","v":""},{"$f":"IF(A55=\"\",\"\",IFERROR(RTD(\"cqg.rtd\", ,\"ContractData\",C55, \"PerCentNetLastTrade\",, \"T\")/100,\"\"))","v":""},{"$f":"IF(A55=\"\",\"\",RTD(\"cqg.rtd\", ,\"ContractData\", C55, \"T_CVol\",, \"T\"))","v":""},55,{"$f":"IFERROR(RANK($J55,INDIRECT((\"$J$\"&\"1\"&\":$J$\"&$A$103)))+COUNTIF($J$1:J55,J55)-1,\"\")","v":""},"",""]
[{"$f":"IF(Symbols!A56=\"\",\"\",Symbols!A56)","v":""},"","",{"$f":"IF(A56=\"\",\"\",RTD(\"cqg.rtd\", ,\"ContractData\",C56, \"LongDescription\",, \"T\"))","v":""},null,null,null,{"$f":"IF(A56=\"\",\"\",RTD(\"cqg.rtd\", ,\"ContractData\",C56, \"LastTradeToday\",, \"T\"))","v":""},{"$f":"IF(A56=\"\",\"\",RTD(\"cqg.rtd\", ,\"ContractData\",C56, \"NetLastTradeToday\",, \"T\"))","v":""},{"$f":"IF(A56=\"\",\"\",IFERROR(RTD(\"cqg.rtd\", ,\"ContractData\",C56, \"PerCentNetLastTrade\",, \"T\")/100,\"\"))","v":""},{"$f":"IF(A56=\"\",\"\",RTD(\"cqg.rtd\", ,\"ContractData\", C56, \"T_CVol\",, \"T\"))","v":""},56,{"$f":"IFERROR(RANK($J56,INDIRECT((\"$J$\"&\"1\"&\":$J$\"&$A$103)))+COUNTIF($J$1:J56,J56)-1,\"\")","v":""},"",""]
[{"$f":"IF(Symbols!A57=\"\",\"\",Symbols!A57)","v":""},"","",{"$f":"IF(A57=\"\",\"\",RTD(\"cqg.rtd\", ,\"ContractData\",C57, \"LongDescription\",, \"T\"))","v":""},null,null,null,{"$f":"IF(A57=\"\",\"\",RTD(\"cqg.rtd\", ,\"ContractData\",C57, \"LastTradeToday\",, \"T\"))","v":""},{"$f":"IF(A57=\"\",\"\",RTD(\"cqg.rtd\", ,\"ContractData\",C57, \"NetLastTradeToday\",, \"T\"))","v":""},{"$f":"IF(A57=\"\",\"\",IFERROR(RTD(\"cqg.rtd\", ,\"ContractData\",C57, \"PerCentNetLastTrade\",, \"T\")/100,\"\"))","v":""},{"$f":"IF(A57=\"\",\"\",RTD(\"cqg.rtd\", ,\"ContractData\", C57, \"T_CVol\",, \"T\"))","v":""},57,{"$f":"IFERROR(RANK($J57,INDIRECT((\"$J$\"&\"1\"&\":$J$\"&$A$103)))+COUNTIF($J$1:J57,J57)-1,\"\")","v":""},"",""]
[{"$f":"IF(Symbols!A58=\"\",\"\",Symbols!A58)","v":""},"","",{"$f":"IF(A58=\"\",\"\",RTD(\"cqg.rtd\", ,\"ContractData\",C58, \"LongDescription\",, \"T\"))","v":""},null,null,null,{"$f":"IF(A58=\"\",\"\",RTD(\"cqg.rtd\", ,\"ContractData\",C58, \"LastTradeToday\",, \"T\"))","v":""},{"$f":"IF(A58=\"\",\"\",RTD(\"cqg.rtd\", ,\"ContractData\",C58, \"NetLastTradeToday\",, \"T\"))","v":""},{"$f":"IF(A58=\"\",\"\",IFERROR(RTD(\"cqg.rtd\", ,\"ContractData\",C58, \"PerCentNetLastTrade\",, \"T\")/100,\"\"))","v":""},{"$f":"IF(A58=\"\",\"\",RTD(\"cqg.rtd\", ,\"ContractData\", C58, \"T_CVol\",, \"T\"))","v":""},58,{"$f":"IFERROR(RANK($J58,INDIRECT((\"$J$\"&\"1\"&\":$J$\"&$A$103)))+COUNTIF($J$1:J58,J58)-1,\"\")","v":""},"",""]
[{"$f":"IF(Symbols!A59=\"\",\"\",Symbols!A59)","v":""},"","",{"$f":"IF(A59=\"\",\"\",RTD(\"cqg.rtd\", ,\"ContractData\",C59, \"LongDescription\",, \"T\"))","v":""},null,null,null,{"$f":"IF(A59=\"\",\"\",RTD(\"cqg.rtd\", ,\"ContractData\",C59, \"LastTradeToday\",, \"T\"))","v":""},{"$f":"IF(A59=\"\",\"\",RTD(\"cqg.rtd\", ,\"ContractData\",C59, \"NetLastTradeToday\",, \"T\"))","v":""},{"$f":"IF(A59=\"\",\"\",IFERROR(RTD(\"cqg.rtd\", ,\"ContractData\",C59, \"PerCentNetLastTrade\",, \"T\")/100,\"\"))","v":""},{"$f":"IF(A59=\"\",\"\",RTD(\"cqg.rtd\", ,\"ContractData\", C59, \"T_CVol\",, \"T\"))","v":""},59,{"$f":"IFERROR(RANK($J59,INDIRECT((\"$J$\"&\"1\"&\":$J$\"&$A$103)))+COUNTIF($J$1:J59,J59)-1,\"\")","v":""},"",""]
[{"$f":"IF(Symbols!A60=\"\",\"\",Symbols!A60)","v":""},"","",{"$f":"IF(A60=\"\",\"\",RTD(\"cqg.rtd\", ,\"ContractData\",C60, \"LongDescription\",, \"T\"))","v":""},null,null,null,{"$f":"IF(A60=\"\",\"\",RTD(\"cqg.rtd\", ,\"ContractData\",C60, \"LastTradeToday\",, \"T\"))","v":""},{"$f":"IF(A60=\"\",\"\",RTD(\"cqg.rtd\", ,\"ContractData\",C60, \"NetLastTradeToday\",, \"T\"))","v":""},{"$f":"IF(A60=\"\",\"\",IFERROR(RTD(\"cqg.rtd\", ,\"ContractData\",C60, \"PerCentNetLastTrade\",, \"T\")/100,\"\"))","v":""},{"$f":"IF(A60=\"\",\"\",RTD(\"cqg.rtd\", ,\"ContractData\", C60, \"T_CVol\",, \"T\"))","v":""},60,{"$f":"IFERROR(RANK($J60,INDIRECT((\"$J$\"&\"1\"&\":$J$\"&$A$103)))+COUNTIF($J$1:J60,J60)-1,\"\")","v":""},"",""]
[]
[]
[]
[]
[]
[]
[]
[]
[]
[]
[]
[]
[]
[]
[]
[]
[]
[]
[]
[]
[]
[]
[]
[]
[]
[]
[]
[]
[]
[]
[]
[]
[]
[]
[]
[]
[]
[]
[]
[]
[]
[]
[{"$f":"60-COUNTIF(A1:A60,\"\")","v":15},{"$f":"SUM(B1:B101)/A103","v":1}]
[{"$f":"\"$J$1:$J$\"&A103","v":"$J$1:$J$15"}]

{"sheet":"NLR 2","index":2,"n_rows":104,"n_cols":34,"rows_kept":104,"cut":false,"hidden":false,"merged":[]}
[{"$f":"IF(Symbols!A1=\"\",\"\",Symbols!A1)","v":"S.US.BWXT"},{"$f":"IF(A1=\"\",\"\",IF(J1>0,1,0))","v":1},{"$f":"A1","v":"S.US.BWXT"},{"$f":"IF(A1=\"\",\"\",RTD(\"cqg.rtd\", ,\"ContractData\",C1, \"LongDescription\",, \"T\"))","v":"BWX Technologies, Inc."},null,{"$f":"(\"$J$\"&\"1\"&\":$J$\"&A103)","v":"$J$1:$J$15"},null,{"$f":"IF(A1=\"\",\"\",RTD(\"cqg.rtd\", ,\"ContractData\",C1, \"LastTradeToday\",, \"T\"))","v":""},{"$f":"IF(A1=\"\",\"\",RTD(\"cqg.rtd\", ,\"ContractData\",C1, \"NetLastTradeToday\",, \"T\"))","v":""},{"$f":"IF(A1=\"\",\"\",IFERROR(RTD(\"cqg.rtd\",,\"StudyData\",A1, \"PCB\",\"BaseType=Index,Index=1\", \"Close\", \"A\",,\"all\",,,,\"T\")/100,\"\"))","v":0.63353981506418899},{"$f":"IF(A1=\"\",\"\",RTD(\"cqg.rtd\", ,\"ContractData\", C1, \"T_CVol\",, \"T\"))","v":2377},1,{"$f":"IFERROR(RANK($J1,INDIRECT((\"$J$\"&\"1\"&\":$J$\"&$A$103)))+COUNTIF($J$1:J1,J1)-1,\"\")","v":8},{"$f":"C1","v":"S.US.BWXT"},{"$f":"IFERROR(VLOOKUP($L1,$M$1:$N$101,2,FALSE),\"\")","v":"S.US.OKLO"},{"$f":"RTD(\"cqg.rtd\", ,\"ContractData\",O1, \"LongDescription\",, \"T\")","v":"Oklo Inc."},{"$f":"IFERROR(RTD(\"cqg.rtd\",,\"StudyData\",O1, \"PCB\",\"BaseType=Index,Index=1\", \"Close\", \"A\",,\"all\",,,,\"T\")/100,\"\")","v":4.4879886952425814},{"$f":"\"https://finance.yahoo.com/quote/\"&RIGHT(O1,(LEN(O1)-5))","v":"https://finance.yahoo.com/quote/OKLO"},null,{"$f":"IF(Q1>=0,Q1,NA())","v":4.4879886952425814},{"$f":"IF(Q1>=0,NA(),Q1)","v":{"$error":"#N/A"}},{"$f":"IF(ISERROR(T1),U1,T1)","v":4.4879886952425814},{"$f":"IF(Q1<0,\"\",IFERROR(RTD(\"cqg.rtd\", ,\"ContractData\",O1, \"LongDescription\",, \"T\"),\"\"))","v":"Oklo Inc."},null,null,{"$f":"IF(W1=\"\",\"\",IFERROR(T1,Q1))","v":4.4879886952425814},{"$f":"MIN(J1:J101)","v":-0.25371655104063423},{"$f":"VLOOKUP(AA1,J1:O98,4,FALSE)","v":15},{"$f":"VLOOKUP($AB1,$M$1:$N$101,2,FALSE)","v":"S.US.PCG"},{"$f":"IF(RTD(\"cqg.rtd\", ,\"ContractData\",AC1, \"PerCentNetLastTrade\",, \"T\")>0,\"\",IFERROR(RTD(\"cqg.rtd\", ,\"ContractData\",AC1, \"PerCentNetLastTrade\",, \"T\")/100,\"\"))","v":""},{"$f":"IF(AD1>0,\"\",IFERROR(RTD(\"cqg.rtd\", ,\"ContractData\",AC1, \"LongDescription\",, \"T\"),\"\"))","v":""},{"$f":"\"\"","v":""},{"$f":"IF(AD1>0,\"\",IFERROR(AD1*-1,\"\"))","v":""},{"$f":"\"https://finance.yahoo.com/quote/\"&RIGHT(AC1,(LEN(AC1)-5))","v":"https://finance.yahoo.com/quote/PCG"}]
[{"$f":"IF(Symbols!A2=\"\",\"\",Symbols!A2)","v":"S.US.CCJ"},{"$f":"IF(A2=\"\",\"\",IF(J2>0,1,0))","v":1},{"$f":"A2","v":"S.US.CCJ"},{"$f":"IF(A2=\"\",\"\",RTD(\"cqg.rtd\", ,\"ContractData\",C2, \"LongDescription\",, \"T\"))","v":"Cameco Corp"},null,null,null,{"$f":"IF(A2=\"\",\"\",RTD(\"cqg.rtd\", ,\"ContractData\",C2, \"LastTradeToday\",, \"T\"))","v":""},{"$f":"IF(A2=\"\",\"\",RTD(\"cqg.rtd\", ,\"ContractData\",C2, \"NetLastTradeToday\",, \"T\"))","v":""},{"$f":"IF(A2=\"\",\"\",IFERROR(RTD(\"cqg.rtd\",,\"StudyData\",A2, \"PCB\",\"BaseType=Index,Index=1\", \"Close\", \"A\",,\"all\",,,,\"T\")/100,\"\"))","v":0.64351041058571723},{"$f":"IF(A2=\"\",\"\",RTD(\"cqg.rtd\", ,\"ContractData\", C2, \"T_CVol\",, \"T\"))","v":18454},{"$f":"L1+1","v":2},{"$f":"IFERROR(RANK($J2,INDIRECT((\"$J$\"&\"1\"&\":$J$\"&$A$103)))+COUNTIF($J$1:J2,J2)-1,\"\")","v":7},{"$f":"C2","v":"S.US.CCJ"},{"$f":"IFERROR(VLOOKUP($L2,$M$1:$N$101,2,FALSE),\"\")","v":"S.US.LEU"},{"$f":"RTD(\"cqg.rtd\", ,\"ContractData\",O2, \"LongDescription\",, \"T\")","v":"Centrus Energy Corp."},{"$f":"IFERROR(RTD(\"cqg.rtd\",,\"StudyData\",O2, \"PCB\",\"BaseType=Index,Index=1\", \"Close\", \"A\",,\"all\",,,,\"T\")/100,\"\")","v":3.7383275784416754},{"$f":"\"https://finance.yahoo.com/quote/\"&RIGHT(O2,(LEN(O2)-5))","v":"https://finance.yahoo.com/quote/LEU"},null,{"$f":"IF(Q2>=0,Q2,NA())","v":3.7383275784416754},{"$f":"IF(Q2>=0,NA(),Q2)","v":{"$error":"#N/A"}},{"$f":"IF(ISERROR(T2),U2,T2)","v":3.7383275784416754},{"$f":"IF(Q2<0,\"\",IFERROR(RTD(\"cqg.rtd\", ,\"ContractData\",O2, \"LongDescription\",, \"T\"),\"\"))","v":"Centrus Energy Corp."},null,null,{"$f":"IF(W2=\"\",\"\",IFERROR(T2,Q2))","v":3.7383275784416754},null,{"$f":"AB1-1","v":14},{"$f":"VLOOKUP($AB2,$M$1:$N$101,2,FALSE)","v":"S.US.EU"},{"$f":"IF(RTD(\"cqg.rtd\", ,\"ContractData\",AC2, \"PerCentNetLastTrade\",, \"T\")>0,\"\",IFERROR(RTD(\"cqg.rtd\", ,\"ContractData\",AC2, \"PerCentNetLastTrade\",, \"T\")/100,\"\"))","v":""},{"$f":"IF(AD2>0,\"\",IFERROR(RTD(\"cqg.rtd\", ,\"ContractData\",AC2, \"LongDescription\",, \"T\"),\"\"))","v":""},{"$f":"\"\"","v":""},{"$f":"IF(AD2>0,\"\",IFERROR(AD2*-1,\"\"))","v":""},{"$f":"\"https://finance.yahoo.com/quote/\"&RIGHT(AC2,(LEN(AC2)-5))","v":"https://finance.yahoo.com/quote/EU"}]
[{"$f":"IF(Symbols!A3=\"\",\"\",Symbols!A3)","v":"S.US.CEG"},1,"S.US.CEG",{"$f":"IF(A3=\"\",\"\",RTD(\"cqg.rtd\", ,\"ContractData\",C3, \"LongDescription\",, \"T\"))","v":"Constellation Energy Corporation"},null,null,null,{"$f":"IF(A3=\"\",\"\",RTD(\"cqg.rtd\", ,\"ContractData\",C3, \"LastTradeToday\",, \"T\"))","v":""},{"$f":"IF(A3=\"\",\"\",RTD(\"cqg.rtd\", ,\"ContractData\",C3, \"NetLastTradeToday\",, \"T\"))","v":""},{"$f":"IF(A3=\"\",\"\",IFERROR(RTD(\"cqg.rtd\",,\"StudyData\",A3, \"PCB\",\"BaseType=Index,Index=1\", \"Close\", \"A\",,\"all\",,,,\"T\")/100,\"\"))","v":0.49416655491484496},{"$f":"IF(A3=\"\",\"\",RTD(\"cqg.rtd\", ,\"ContractData\", C3, \"T_CVol\",, \"T\"))","v":4682},{"$f":"L2+1","v":3},{"$f":"IFERROR(RANK($J3,INDIRECT((\"$J$\"&\"1\"&\":$J$\"&$A$103)))+COUNTIF($J$1:J3,J3)-1,\"\")","v":11},"S.US.CEG","S.US.UUUU",{"$f":"RTD(\"cqg.rtd\", ,\"ContractData\",O3, \"LongDescription\",, \"T\")","v":"Energy Fuels Inc."},{"$f":"IFERROR(RTD(\"cqg.rtd\",,\"StudyData\",O3, \"PCB\",\"BaseType=Index,Index=1\", \"Close\", \"A\",,\"all\",,,,\"T\")/100,\"\")","v":2.2202729044834308},"https://finance.yahoo.com/quote/UUUU",null,2.2202729044834308,{"$error":"#N/A"},2.2202729044834308,{"$f":"IF(Q3<0,\"\",IFERROR(RTD(\"cqg.rtd\", ,\"ContractData\",O3, \"LongDescription\",, \"T\"),\"\"))","v":"Energy Fuels Inc."},null,null,2.2202729044834308,null,{"$f":"AB2-1","v":13},"S.US.PEG",{"$f":"IF(RTD(\"cqg.rtd\", ,\"ContractData\",AC3, \"PerCentNetLastTrade\",, \"T\")>0,\"\",IFERROR(RTD(\"cqg.rtd\", ,\"ContractData\",AC3, \"PerCentNetLastTrade\",, \"T\")/100,\"\"))","v":""},{"$f":"IF(AD3>0,\"\",IFERROR(RTD(\"cqg.rtd\", ,\"ContractData\",AC3, \"LongDescription\",, \"T\"),\"\"))","v":""},{"$f":"\"\"","v":""},"","https://finance.yahoo.com/quote/PEG"]
[{"$f":"IF(Symbols!A4=\"\",\"\",Symbols!A4)","v":"S.US.DNN"},1,"S.US.DNN",{"$f":"IF(A4=\"\",\"\",RTD(\"cqg.rtd\", ,\"ContractData\",C4, \"LongDescription\",, \"T\"))","v":"Denison Mines Corp"},null,null,null,{"$f":"IF(A4=\"\",\"\",RTD(\"cqg.rtd\", ,\"ContractData\",C4, \"LastTradeToday\",, \"T\"))","v":""},{"$f":"IF(A4=\"\",\"\",RTD(\"cqg.rtd\", ,\"ContractData\",C4, \"NetLastTradeToday\",, \"T\"))","v":""},{"$f":"IF(A4=\"\",\"\",IFERROR(RTD(\"cqg.rtd\",,\"StudyData\",A4, \"PCB\",\"BaseType=Index,Index=1\", \"Close\", \"A\",,\"all\",,,,\"T\")/100,\"\"))","v":0.55000000000000004},{"$f":"IF(A4=\"\",\"\",RTD(\"cqg.rtd\", ,\"ContractData\", C4, \"T_CVol\",, \"T\"))","v":68693},4,{"$f":"IFERROR(RANK($J4,INDIRECT((\"$J$\"&\"1\"&\":$J$\"&$A$103)))+COUNTIF($J$1:J4,J4)-1,\"\")","v":10},"S.US.DNN","S.US.SMR",{"$f":"RTD(\"cqg.rtd\", ,\"ContractData\",O4, \"LongDescription\",, \"T\")","v":"NuScale Power Corporation"},{"$f":"IFERROR(RTD(\"cqg.rtd\",,\"StudyData\",O4, \"PCB\",\"BaseType=Index,Index=1\", \"Close\", \"A\",,\"all\",,,,\"T\")/100,\"\")","v":1.1282766313441162},"https://finance.yahoo.com/quote/SMR",null,1.1282766313441162,{"$error":"#N/A"},1.1282766313441162,{"$f":"IF(Q4<0,\"\",IFERROR(RTD(\"cqg.rtd\", ,\"ContractData\",O4, \"LongDescription\",, \"T\"),\"\"))","v":"NuScale Power Corporation"},null,null,1.1282766313441162,null,12,"S.US.NXE",{"$f":"IF(RTD(\"cqg.rtd\", ,\"ContractData\",AC4, \"PerCentNetLastTrade\",, \"T\")>0,\"\",IFERROR(RTD(\"cqg.rtd\", ,\"ContractData\",AC4, \"PerCentNetLastTrade\",, \"T\")/100,\"\"))","v":""},{"$f":"IF(AD4>0,\"\",IFERROR(RTD(\"cqg.rtd\", ,\"ContractData\",AC4, \"LongDescription\",, \"T\"),\"\"))","v":""},{"$f":"\"\"","v":""},"","https://finance.yahoo.com/quote/NXE"]
[{"$f":"IF(Symbols!A5=\"\",\"\",Symbols!A5)","v":"S.US.EU"},0,"S.US.EU",{"$f":"IF(A5=\"\",\"\",RTD(\"cqg.rtd\", ,\"ContractData\",C5, \"LongDescription\",, \"T\"))","v":"enCore Energy Corp."},null,null,null,{"$f":"IF(A5=\"\",\"\",RTD(\"cqg.rtd\", ,\"ContractData\",C5, \"LastTradeToday\",, \"T\"))","v":""},{"$f":"IF(A5=\"\",\"\",RTD(\"cqg.rtd\", ,\"ContractData\",C5, \"NetLastTradeToday\",, \"T\"))","v":""},{"$f":"IF(A5=\"\",\"\",IFERROR(RTD(\"cqg.rtd\",,\"StudyData\",A5, \"PCB\",\"BaseType=Index,Index=1\", \"Close\", \"A\",,\"all\",,,,\"T\")/100,\"\"))","v":-9.3841642228739086E-2},{"$f":"IF(A5=\"\",\"\",RTD(\"cqg.rtd\", ,\"ContractData\", C5, \"T_CVol\",, \"T\"))","v":5264},5,{"$f":"IFERROR(RANK($J5,INDIRECT((\"$J$\"&\"1\"&\":$J$\"&$A$103)))+COUNTIF($J$1:J5,J5)-1,\"\")","v":14},"S.US.EU","S.US.UEC",{"$f":"RTD(\"cqg.rtd\", ,\"ContractData\",O5, \"LongDescription\",, \"T\")","v":"Uranium Energy Corp"},{"$f":"IFERROR(RTD(\"cqg.rtd\",,\"StudyData\",O5, \"PCB\",\"BaseType=Index,Index=1\", \"Close\", \"A\",,\"all\",,,,\"T\")/100,\"\")","v":1.0762331838565022},"https://finance.yahoo.com/quote/UEC",null,1.0762331838565022,{"$error":"#N/A"},1.0762331838565022,{"$f":"IF(Q5<0,\"\",IFERROR(RTD(\"cqg.rtd\", ,\"ContractData\",O5, \"LongDescription\",, \"T\"),\"\"))","v":"Uranium Energy Corp"},null,null,1.0762331838565022,null,11,"S.US.CEG",{"$f":"IF(RTD(\"cqg.rtd\", ,\"ContractData\",AC5, \"PerCentNetLastTrade\",, \"T\")>0,\"\",IFERROR(RTD(\"cqg.rtd\", ,\"ContractData\",AC5, \"PerCentNetLastTrade\",, \"T\")/100,\"\"))","v":""},{"$f":"IF(AD5>0,\"\",IFERROR(RTD(\"cqg.rtd\", ,\"ContractData\",AC5, \"LongDescription\",, \"T\"),\"\"))","v":""},{"$f":"\"\"","v":""},"","https://finance.yahoo.com/quote/CEG"]
[{"$f":"IF(Symbols!A6=\"\",\"\",Symbols!A6)","v":"S.US.LEU"},1,"S.US.LEU",{"$f":"IF(A6=\"\",\"\",RTD(\"cqg.rtd\", ,\"ContractData\",C6, \"LongDescription\",, \"T\"))","v":"Centrus Energy Corp."},null,null,null,{"$f":"IF(A6=\"\",\"\",RTD(\"cqg.rtd\", ,\"ContractData\",C6, \"LastTradeToday\",, \"T\"))","v":""},{"$f":"IF(A6=\"\",\"\",RTD(\"cqg.rtd\", ,\"ContractData\",C6, \"NetLastTradeToday\",, \"T\"))","v":""},{"$f":"IF(A6=\"\",\"\",IFERROR(RTD(\"cqg.rtd\",,\"StudyData\",A6, \"PCB\",\"BaseType=Index,Index=1\", \"Close\", \"A\",,\"all\",,,,\"T\")/100,\"\"))","v":3.7383275784416754},{"$f":"IF(A6=\"\",\"\",RTD(\"cqg.rtd\", ,\"ContractData\", C6, \"T_CVol\",, \"T\"))","v":12936},6,{"$f":"IFERROR(RANK($J6,INDIRECT((\"$J$\"&\"1\"&\":$J$\"&$A$103)))+COUNTIF($J$1:J6,J6)-1,\"\")","v":2},"S.US.LEU","S.US.NLR",{"$f":"RTD(\"cqg.rtd\", ,\"ContractData\",O6, \"LongDescription\",, \"T\")","v":"Market Vectors Uranium+Nuclear EnergyETF"},{"$f":"IFERROR(RTD(\"cqg.rtd\",,\"StudyData\",O6, \"PCB\",\"BaseType=Index,Index=1\", \"Close\", \"A\",,\"all\",,,,\"T\")/100,\"\")","v":0.68133759527907534},"https://finance.yahoo.com/quote/NLR",null,0.68133759527907534,{"$error":"#N/A"},0.68133759527907534,{"$f":"IF(Q6<0,\"\",IFERROR(RTD(\"cqg.rtd\", ,\"ContractData\",O6, \"LongDescription\",, \"T\"),\"\"))","v":"Market Vectors Uranium+Nuclear EnergyETF"},null,null,0.68133759527907534,null,10,"S.US.DNN",{"$f":"IF(RTD(\"cqg.rtd\", ,\"ContractData\",AC6, \"PerCentNetLastTrade\",, \"T\")>0,\"\",IFERROR(RTD(\"cqg.rtd\", ,\"ContractData\",AC6, \"PerCentNetLastTrade\",, \"T\")/100,\"\"))","v":""},{"$f":"IF(AD6>0,\"\",IFERROR(RTD(\"cqg.rtd\", ,\"ContractData\",AC6, \"LongDescription\",, \"T\"),\"\"))","v":""},{"$f":"\"\"","v":""},"","https://finance.yahoo.com/quote/DNN"]
[{"$f":"IF(Symbols!A7=\"\",\"\",Symbols!A7)","v":"S.US.NNE"},1,"S.US.NNE",{"$f":"IF(A7=\"\",\"\",RTD(\"cqg.rtd\", ,\"ContractData\",C7, \"LongDescription\",, \"T\"))","v":"Nano Nuclear Energy Inc."},null,null,null,{"$f":"IF(A7=\"\",\"\",RTD(\"cqg.rtd\", ,\"ContractData\",C7, \"LastTradeToday\",, \"T\"))","v":""},{"$f":"IF(A7=\"\",\"\",RTD(\"cqg.rtd\", ,\"ContractData\",C7, \"NetLastTradeToday\",, \"T\"))","v":""},{"$f":"IF(A7=\"\",\"\",IFERROR(RTD(\"cqg.rtd\",,\"StudyData\",A7, \"PCB\",\"BaseType=Index,Index=1\", \"Close\", \"A\",,\"all\",,,,\"T\")/100,\"\"))","v":0.5725190839694656},{"$f":"IF(A7=\"\",\"\",RTD(\"cqg.rtd\", ,\"ContractData\", C7, \"T_CVol\",, \"T\"))","v":52655},7,{"$f":"IFERROR(RANK($J7,INDIRECT((\"$J$\"&\"1\"&\":$J$\"&$A$103)))+COUNTIF($J$1:J7,J7)-1,\"\")","v":9},"S.US.NNE","S.US.CCJ",{"$f":"RTD(\"cqg.rtd\", ,\"ContractData\",O7, \"LongDescription\",, \"T\")","v":"Cameco Corp"},{"$f":"IFERROR(RTD(\"cqg.rtd\",,\"StudyData\",O7, \"PCB\",\"BaseType=Index,Index=1\", \"Close\", \"A\",,\"all\",,,,\"T\")/100,\"\")","v":0.64351041058571723},"https://finance.yahoo.com/quote/CCJ",null,0.64351041058571723,{"$error":"#N/A"},0.64351041058571723,{"$f":"IF(Q7<0,\"\",IFERROR(RTD(\"cqg.rtd\", ,\"ContractData\",O7, \"LongDescription\",, \"T\"),\"\"))","v":"Cameco Corp"},null,null,0.64351041058571723,null,9,"S.US.NNE",{"$f":"IF(RTD(\"cqg.rtd\", ,\"ContractData\",AC7, \"PerCentNetLastTrade\",, \"T\")>0,\"\",IFERROR(RTD(\"cqg.rtd\", ,\"ContractData\",AC7, \"PerCentNetLastTrade\",, \"T\")/100,\"\"))","v":""},{"$f":"IF(AD7>0,\"\",IFERROR(RTD(\"cqg.rtd\", ,\"ContractData\",AC7, \"LongDescription\",, \"T\"),\"\"))","v":""},{"$f":"\"\"","v":""},"","https://finance.yahoo.com/quote/NNE"]
[{"$f":"IF(Symbols!A8=\"\",\"\",Symbols!A8)","v":"S.US.NXE"},1,"S.US.NXE",{"$f":"IF(A8=\"\",\"\",RTD(\"cqg.rtd\", ,\"ContractData\",C8, \"LongDescription\",, \"T\"))","v":"Nexgen Energy Ltd."},null,null,null,{"$f":"IF(A8=\"\",\"\",RTD(\"cqg.rtd\", ,\"ContractData\",C8, \"LastTradeToday\",, \"T\"))","v":""},{"$f":"IF(A8=\"\",\"\",RTD(\"cqg.rtd\", ,\"ContractData\",C8, \"NetLastTradeToday\",, \"T\"))","v":""},{"$f":"IF(A8=\"\",\"\",IFERROR(RTD(\"cqg.rtd\",,\"StudyData\",A8, \"PCB\",\"BaseType=Index,Index=1\", \"Close\", \"A\",,\"all\",,,,\"T\")/100,\"\"))","v":0.365151515151515},{"$f":"IF(A8=\"\",\"\",RTD(\"cqg.rtd\", ,\"ContractData\", C8, \"T_CVol\",, \"T\"))","v":13593},8,{"$f":"IFERROR(RANK($J8,INDIRECT((\"$J$\"&\"1\"&\":$J$\"&$A$103)))+COUNTIF($J$1:J8,J8)-1,\"\")","v":12},"S.US.NXE","S.US.BWXT",{"$f":"RTD(\"cqg.rtd\", ,\"ContractData\",O8, \"LongDescription\",, \"T\")","v":"BWX Technologies, Inc."},{"$f":"IFERROR(RTD(\"cqg.rtd\",,\"StudyData\",O8, \"PCB\",\"BaseType=Index,Index=1\", \"Close\", \"A\",,\"all\",,,,\"T\")/100,\"\")","v":0.63353981506418899},"https://finance.yahoo.com/quote/BWXT",null,0.63353981506418899,{"$error":"#N/A"},0.63353981506418899,{"$f":"IF(Q8<0,\"\",IFERROR(RTD(\"cqg.rtd\", ,\"ContractData\",O8, \"LongDescription\",, \"T\"),\"\"))","v":"BWX Technologies, Inc."},null,null,0.63353981506418899,null,8,"S.US.BWXT",{"$f":"IF(RTD(\"cqg.rtd\", ,\"ContractData\",AC8, \"PerCentNetLastTrade\",, \"T\")>0,\"\",IFERROR(RTD(\"cqg.rtd\", ,\"ContractData\",AC8, \"PerCentNetLastTrade\",, \"T\")/100,\"\"))","v":""},{"$f":"IF(AD8>0,\"\",IFERROR(RTD(\"cqg.rtd\", ,\"ContractData\",AC8, \"LongDescription\",, \"T\"),\"\"))","v":""},{"$f":"\"\"","v":""},"","https://finance.yahoo.com/quote/BWXT"]
[{"$f":"IF(Symbols!A9=\"\",\"\",Symbols!A9)","v":"S.US.OKLO"},1,"S.US.OKLO",{"$f":"IF(A9=\"\",\"\",RTD(\"cqg.rtd\", ,\"ContractData\",C9, \"LongDescription\",, \"T\"))","v":"Oklo Inc."},null,null,null,{"$f":"IF(A9=\"\",\"\",RTD(\"cqg.rtd\", ,\"ContractData\",C9, \"LastTradeToday\",, \"T\"))","v":""},{"$f":"IF(A9=\"\",\"\",RTD(\"cqg.rtd\", ,\"ContractData\",C9, \"NetLastTradeToday\",, \"T\"))","v":""},{"$f":"IF(A9=\"\",\"\",IFERROR(RTD(\"cqg.rtd\",,\"StudyData\",A9, \"PCB\",\"BaseType=Index,Index=1\", \"Close\", \"A\",,\"all\",,,,\"T\")/100,\"\"))","v":4.4879886952425814},{"$f":"IF(A9=\"\",\"\",RTD(\"cqg.rtd\", ,\"ContractData\", C9, \"T_CVol\",, \"T\"))","v":634365},9,{"$f":"IFERROR(RANK($J9,INDIRECT((\"$J$\"&\"1\"&\":$J$\"&$A$103)))+COUNTIF($J$1:J9,J9)-1,\"\")","v":1},"S.US.OKLO","S.US.NNE",{"$f":"RTD(\"cqg.rtd\", ,\"ContractData\",O9, \"LongDescription\",, \"T\")","v":"Nano Nuclear Energy Inc."},{"$f":"IFERROR(RTD(\"cqg.rtd\",,\"StudyData\",O9, \"PCB\",\"BaseType=Index,Index=1\", \"Close\", \"A\",,\"all\",,,,\"T\")/100,\"\")","v":0.5725190839694656},"https://finance.yahoo.com/quote/NNE",null,0.5725190839694656,{"$error":"#N/A"},0.5725190839694656,{"$f":"IF(Q9<0,\"\",IFERROR(RTD(\"cqg.rtd\", ,\"ContractData\",O9, \"LongDescription\",, \"T\"),\"\"))","v":"Nano Nuclear Energy Inc."},null,null,0.5725190839694656,null,7,"S.US.CCJ",{"$f":"IF(RTD(\"cqg.rtd\", ,\"ContractData\",AC9, \"PerCentNetLastTrade\",, \"T\")>0,\"\",IFERROR(RTD(\"cqg.rtd\", ,\"ContractData\",AC9, \"PerCentNetLastTrade\",, \"T\")/100,\"\"))","v":""},{"$f":"IF(AD9>0,\"\",IFERROR(RTD(\"cqg.rtd\", ,\"ContractData\",AC9, \"LongDescription\",, \"T\"),\"\"))","v":""},{"$f":"\"\"","v":""},"","https://finance.yahoo.com/quote/CCJ"]
[{"$f":"IF(Symbols!A10=\"\",\"\",Symbols!A10)","v":"S.US.PCG"},0,"S.US.PCG",{"$f":"IF(A10=\"\",\"\",RTD(\"cqg.rtd\", ,\"ContractData\",C10, \"LongDescription\",, \"T\"))","v":"PG&E Corp Hldg Co"},null,null,null,{"$f":"IF(A10=\"\",\"\",RTD(\"cqg.rtd\", ,\"ContractData\",C10, \"LastTradeToday\",, \"T\"))","v":""},{"$f":"IF(A10=\"\",\"\",RTD(\"cqg.rtd\", ,\"ContractData\",C10, \"NetLastTradeToday\",, \"T\"))","v":""},{"$f":"IF(A10=\"\",\"\",IFERROR(RTD(\"cqg.rtd\",,\"StudyData\",A10, \"PCB\",\"BaseType=Index,Index=1\", \"Close\", \"A\",,\"all\",,,,\"T\")/100,\"\"))","v":-0.25371655104063423},{"$f":"IF(A10=\"\",\"\",RTD(\"cqg.rtd\", ,\"ContractData\", C10, \"T_CVol\",, \"T\"))","v":5160},10,{"$f":"IFERROR(RANK($J10,INDIRECT((\"$J$\"&\"1\"&\":$J$\"&$A$103)))+COUNTIF($J$1:J10,J10)-1,\"\")","v":15},"S.US.PCG","S.US.DNN",{"$f":"RTD(\"cqg.rtd\", ,\"ContractData\",O10, \"LongDescription\",, \"T\")","v":"Denison Mines Corp"},{"$f":"IFERROR(RTD(\"cqg.rtd\",,\"StudyData\",O10, \"PCB\",\"BaseType=Index,Index=1\", \"Close\", \"A\",,\"all\",,,,\"T\")/100,\"\")","v":0.55000000000000004},"https://finance.yahoo.com/quote/DNN",null,0.55000000000000004,{"$error":"#N/A"},0.55000000000000004,{"$f":"IF(Q10<0,\"\",IFERROR(RTD(\"cqg.rtd\", ,\"ContractData\",O10, \"LongDescription\",, \"T\"),\"\"))","v":"Denison Mines Corp"},null,null,0.55000000000000004,null,6,"S.US.NLR",{"$f":"IF(RTD(\"cqg.rtd\", ,\"ContractData\",AC10, \"PerCentNetLastTrade\",, \"T\")>0,\"\",IFERROR(RTD(\"cqg.rtd\", ,\"ContractData\",AC10, \"PerCentNetLastTrade\",, \"T\")/100,\"\"))","v":""},{"$f":"IF(AD10>0,\"\",IFERROR(RTD(\"cqg.rtd\", ,\"ContractData\",AC10, \"LongDescription\",, \"T\"),\"\"))","v":""},{"$f":"\"\"","v":""},"","https://finance.yahoo.com/quote/NLR"]
[{"$f":"IF(Symbols!A11=\"\",\"\",Symbols!A11)","v":"S.US.PEG"},0,"S.US.PEG",{"$f":"IF(A11=\"\",\"\",RTD(\"cqg.rtd\", ,\"ContractData\",C11, \"LongDescription\",, \"T\"))","v":"Pub Svc Entrpr Grp Inc"},null,null,null,{"$f":"IF(A11=\"\",\"\",RTD(\"cqg.rtd\", ,\"ContractData\",C11, \"LastTradeToday\",, \"T\"))","v":""},{"$f":"IF(A11=\"\",\"\",RTD(\"cqg.rtd\", ,\"ContractData\",C11, \"NetLastTradeToday\",, \"T\"))","v":""},{"$f":"IF(A11=\"\",\"\",IFERROR(RTD(\"cqg.rtd\",,\"StudyData\",A11, \"PCB\",\"BaseType=Index,Index=1\", \"Close\", \"A\",,\"all\",,,,\"T\")/100,\"\"))","v":-1.716179429518273E-2},{"$f":"IF(A11=\"\",\"\",RTD(\"cqg.rtd\", ,\"ContractData\", C11, \"T_CVol\",, \"T\"))","v":3},11,{"$f":"IFERROR(RANK($J11,INDIRECT((\"$J$\"&\"1\"&\":$J$\"&$A$103)))+COUNTIF($J$1:J11,J11)-1,\"\")","v":13},"S.US.PEG","S.US.CEG",{"$f":"RTD(\"cqg.rtd\", ,\"ContractData\",O11, \"LongDescription\",, \"T\")","v":"Constellation Energy Corporation"},{"$f":"IFERROR(RTD(\"cqg.rtd\",,\"StudyData\",O11, \"PCB\",\"BaseType=Index,Index=1\", \"Close\", \"A\",,\"all\",,,,\"T\")/100,\"\")","v":0.49416655491484496},"https://finance.yahoo.com/quote/CEG",null,0.49416655491484496,{"$error":"#N/A"},0.49416655491484496,{"$f":"IF(Q11<0,\"\",IFERROR(RTD(\"cqg.rtd\", ,\"ContractData\",O11, \"LongDescription\",, \"T\"),\"\"))","v":"Constellation Energy Corporation"},null,null,0.49416655491484496,null,5,"S.US.UEC",{"$f":"IF(RTD(\"cqg.rtd\", ,\"ContractData\",AC11, \"PerCentNetLastTrade\",, \"T\")>0,\"\",IFERROR(RTD(\"cqg.rtd\", ,\"ContractData\",AC11, \"PerCentNetLastTrade\",, \"T\")/100,\"\"))","v":""},{"$f":"IF(AD11>0,\"\",IFERROR(RTD(\"cqg.rtd\", ,\"ContractData\",AC11, \"LongDescription\",, \"T\"),\"\"))","v":""},{"$f":"\"\"","v":""},"","https://finance.yahoo.com/quote/UEC"]
[{"$f":"IF(Symbols!A12=\"\",\"\",Symbols!A12)","v":"S.US.SMR"},1,"S.US.SMR",{"$f":"IF(A12=\"\",\"\",RTD(\"cqg.rtd\", ,\"ContractData\",C12, \"LongDescription\",, \"T\"))","v":"NuScale Power Corporation"},null,null,null,{"$f":"IF(A12=\"\",\"\",RTD(\"cqg.rtd\", ,\"ContractData\",C12, \"LastTradeToday\",, \"T\"))","v":""},{"$f":"IF(A12=\"\",\"\",RTD(\"cqg.rtd\", ,\"ContractData\",C12, \"NetLastTradeToday\",, \"T\"))","v":""},{"$f":"IF(A12=\"\",\"\",IFERROR(RTD(\"cqg.rtd\",,\"StudyData\",A12, \"PCB\",\"BaseType=Index,Index=1\", \"Close\", \"A\",,\"all\",,,,\"T\")/100,\"\"))","v":1.1282766313441162},{"$f":"IF(A12=\"\",\"\",RTD(\"cqg.rtd\", ,\"ContractData\", C12, \"T_CVol\",, \"T\"))","v":1487260},12,{"$f":"IFERROR(RANK($J12,INDIRECT((\"$J$\"&\"1\"&\":$J$\"&$A$103)))+COUNTIF($J$1:J12,J12)-1,\"\")","v":4},"S.US.SMR","S.US.NXE",{"$f":"RTD(\"cqg.rtd\", ,\"ContractData\",O12, \"LongDescription\",, \"T\")","v":"Nexgen Energy Ltd."},{"$f":"IFERROR(RTD(\"cqg.rtd\",,\"StudyData\",O12, \"PCB\",\"BaseType=Index,Index=1\", \"Close\", \"A\",,\"all\",,,,\"T\")/100,\"\")","v":0.365151515151515},"https://finance.yahoo.com/quote/NXE",null,0.365151515151515,{"$error":"#N/A"},0.365151515151515,{"$f":"IF(Q12<0,\"\",IFERROR(RTD(\"cqg.rtd\", ,\"ContractData\",O12, \"LongDescription\",, \"T\"),\"\"))","v":"Nexgen Energy Ltd."},null,null,0.365151515151515,null,4,"S.US.SMR",{"$f":"IF(RTD(\"cqg.rtd\", ,\"ContractData\",AC12, \"PerCentNetLastTrade\",, \"T\")>0,\"\",IFERROR(RTD(\"cqg.rtd\", ,\"ContractData\",AC12, \"PerCentNetLastTrade\",, \"T\")/100,\"\"))","v":""},{"$f":"IF(AD12>0,\"\",IFERROR(RTD(\"cqg.rtd\", ,\"ContractData\",AC12, \"LongDescription\",, \"T\"),\"\"))","v":""},{"$f":"\"\"","v":""},"","https://finance.yahoo.com/quote/SMR"]
[{"$f":"IF(Symbols!A13=\"\",\"\",Symbols!A13)","v":"S.US.UEC"},1,"S.US.UEC",{"$f":"IF(A13=\"\",\"\",RTD(\"cqg.rtd\", ,\"ContractData\",C13, \"LongDescription\",, \"T\"))","v":"Uranium Energy Corp"},null,null,null,{"$f":"IF(A13=\"\",\"\",RTD(\"cqg.rtd\", ,\"ContractData\",C13, \"LastTradeToday\",, \"T\"))","v":""},{"$f":"IF(A13=\"\",\"\",RTD(\"cqg.rtd\", ,\"ContractData\",C13, \"NetLastTradeToday\",, \"T\"))","v":""},{"$f":"IF(A13=\"\",\"\",IFERROR(RTD(\"cqg.rtd\",,\"StudyData\",A13, \"PCB\",\"BaseType=Index,Index=1\", \"Close\", \"A\",,\"all\",,,,\"T\")/100,\"\"))","v":1.0762331838565022},{"$f":"IF(A13=\"\",\"\",RTD(\"cqg.rtd\", ,\"ContractData\", C13, \"T_CVol\",, \"T\"))","v":130153},13,{"$f":"IFERROR(RANK($J13,INDIRECT((\"$J$\"&\"1\"&\":$J$\"&$A$103)))+COUNTIF($J$1:J13,J13)-1,\"\")","v":5},"S.US.UEC","S.US.PEG",{"$f":"RTD(\"cqg.rtd\", ,\"ContractData\",O13, \"LongDescription\",, \"T\")","v":"Pub Svc Entrpr Grp Inc"},{"$f":"IFERROR(RTD(\"cqg.rtd\",,\"StudyData\",O13, \"PCB\",\"BaseType=Index,Index=1\", \"Close\", \"A\",,\"all\",,,,\"T\")/100,\"\")","v":-1.716179429518273E-2},"https://finance.yahoo.com/quote/PEG",null,{"$error":"#N/A"},-1.716179429518273E-2,-1.716179429518273E-2,{"$f":"IF(Q13<0,\"\",IFERROR(RTD(\"cqg.rtd\", ,\"ContractData\",O13, \"LongDescription\",, \"T\"),\"\"))","v":""},null,null,"",null,3,"S.US.UUUU",{"$f":"IF(RTD(\"cqg.rtd\", ,\"ContractData\",AC13, \"PerCentNetLastTrade\",, \"T\")>0,\"\",IFERROR(RTD(\"cqg.rtd\", ,\"ContractData\",AC13, \"PerCentNetLastTrade\",, \"T\")/100,\"\"))","v":""},{"$f":"IF(AD13>0,\"\",IFERROR(RTD(\"cqg.rtd\", ,\"ContractData\",AC13, \"LongDescription\",, \"T\"),\"\"))","v":""},{"$f":"\"\"","v":""},"","https://finance.yahoo.com/quote/UUUU"]
[{"$f":"IF(Symbols!A14=\"\",\"\",Symbols!A14)","v":"S.US.UUUU"},1,"S.US.UUUU",{"$f":"IF(A14=\"\",\"\",RTD(\"cqg.rtd\", ,\"ContractData\",C14, \"LongDescription\",, \"T\"))","v":"Energy Fuels Inc."},null,null,null,{"$f":"IF(A14=\"\",\"\",RTD(\"cqg.rtd\", ,\"ContractData\",C14, \"LastTradeToday\",, \"T\"))","v":""},{"$f":"IF(A14=\"\",\"\",RTD(\"cqg.rtd\", ,\"ContractData\",C14, \"NetLastTradeToday\",, \"T\"))","v":""},{"$f":"IF(A14=\"\",\"\",IFERROR(RTD(\"cqg.rtd\",,\"StudyData\",A14, \"PCB\",\"BaseType=Index,Index=1\", \"Close\", \"A\",,\"all\",,,,\"T\")/100,\"\"))","v":2.2202729044834308},{"$f":"IF(A14=\"\",\"\",RTD(\"cqg.rtd\", ,\"ContractData\", C14, \"T_CVol\",, \"T\"))","v":318065},14,{"$f":"IFERROR(RANK($J14,INDIRECT((\"$J$\"&\"1\"&\":$J$\"&$A$103)))+COUNTIF($J$1:J14,J14)-1,\"\")","v":3},"S.US.UUUU","S.US.EU",{"$f":"RTD(\"cqg.rtd\", ,\"ContractData\",O14, \"LongDescription\",, \"T\")","v":"enCore Energy Corp."},{"$f":"IFERROR(RTD(\"cqg.rtd\",,\"StudyData\",O14, \"PCB\",\"BaseType=Index,Index=1\", \"Close\", \"A\",,\"all\",,,,\"T\")/100,\"\")","v":-9.3841642228739086E-2},"https://finance.yahoo.com/quote/EU",null,{"$error":"#N/A"},-9.3841642228739086E-2,-9.3841642228739086E-2,{"$f":"IF(Q14<0,\"\",IFERROR(RTD(\"cqg.rtd\", ,\"ContractData\",O14, \"LongDescription\",, \"T\"),\"\"))","v":""},null,null,"",null,2,"S.US.LEU",{"$f":"IF(RTD(\"cqg.rtd\", ,\"ContractData\",AC14, \"PerCentNetLastTrade\",, \"T\")>0,\"\",IFERROR(RTD(\"cqg.rtd\", ,\"ContractData\",AC14, \"PerCentNetLastTrade\",, \"T\")/100,\"\"))","v":""},{"$f":"IF(AD14>0,\"\",IFERROR(RTD(\"cqg.rtd\", ,\"ContractData\",AC14, \"LongDescription\",, \"T\"),\"\"))","v":""},{"$f":"\"\"","v":""},"","https://finance.yahoo.com/quote/LEU"]
[{"$f":"IF(Symbols!A15=\"\",\"\",Symbols!A15)","v":"S.US.NLR"},1,"S.US.NLR",{"$f":"IF(A15=\"\",\"\",RTD(\"cqg.rtd\", ,\"ContractData\",C15, \"LongDescription\",, \"T\"))","v":"Market Vectors Uranium+Nuclear EnergyETF"},null,null,null,{"$f":"IF(A15=\"\",\"\",RTD(\"cqg.rtd\", ,\"ContractData\",C15, \"LastTradeToday\",, \"T\"))","v":""},{"$f":"IF(A15=\"\",\"\",RTD(\"cqg.rtd\", ,\"ContractData\",C15, \"NetLastTradeToday\",, \"T\"))","v":""},{"$f":"IF(A15=\"\",\"\",IFERROR(RTD(\"cqg.rtd\",,\"StudyData\",A15, \"PCB\",\"BaseType=Index,Index=1\", \"Close\", \"A\",,\"all\",,,,\"T\")/100,\"\"))","v":0.68133759527907534},{"$f":"IF(A15=\"\",\"\",RTD(\"cqg.rtd\", ,\"ContractData\", C15, \"T_CVol\",, \"T\"))","v":2311},15,{"$f":"IFERROR(RANK($J15,INDIRECT((\"$J$\"&\"1\"&\":$J$\"&$A$103)))+COUNTIF($J$1:J15,J15)-1,\"\")","v":6},"S.US.NLR","S.US.PCG",{"$f":"RTD(\"cqg.rtd\", ,\"ContractData\",O15, \"LongDescription\",, \"T\")","v":"PG&E Corp Hldg Co"},{"$f":"IFERROR(RTD(\"cqg.rtd\",,\"StudyData\",O15, \"PCB\",\"BaseType=Index,Index=1\", \"Close\", \"A\",,\"all\",,,,\"T\")/100,\"\")","v":-0.25371655104063423},"https://finance.yahoo.com/quote/PCG",null,{"$error":"#N/A"},-0.25371655104063423,-0.25371655104063423,{"$f":"IF(Q15<0,\"\",IFERROR(RTD(\"cqg.rtd\", ,\"ContractData\",O15, \"LongDescription\",, \"T\"),\"\"))","v":""},null,null,"",null,1,"S.US.OKLO",{"$f":"IF(RTD(\"cqg.rtd\", ,\"ContractData\",AC15, \"PerCentNetLastTrade\",, \"T\")>0,\"\",IFERROR(RTD(\"cqg.rtd\", ,\"ContractData\",AC15, \"PerCentNetLastTrade\",, \"T\")/100,\"\"))","v":""},{"$f":"IF(AD15>0,\"\",IFERROR(RTD(\"cqg.rtd\", ,\"ContractData\",AC15, \"LongDescription\",, \"T\"),\"\"))","v":""},{"$f":"\"\"","v":""},"","https://finance.yahoo.com/quote/OKLO"]
[{"$f":"IF(Symbols!A16=\"\",\"\",Symbols!A16)","v":""},"","",{"$f":"IF(A16=\"\",\"\",RTD(\"cqg.rtd\", ,\"ContractData\",C16, \"LongDescription\",, \"T\"))","v":""},null,null,null,{"$f":"IF(A16=\"\",\"\",RTD(\"cqg.rtd\", ,\"ContractData\",C16, \"LastTradeToday\",, \"T\"))","v":""},{"$f":"IF(A16=\"\",\"\",RTD(\"cqg.rtd\", ,\"ContractData\",C16, \"NetLastTradeToday\",, \"T\"))","v":""},{"$f":"IF(A16=\"\",\"\",IFERROR(RTD(\"cqg.rtd\",,\"StudyData\",A16, \"PCB\",\"BaseType=Index,Index=1\", \"Close\", \"A\",,\"all\",,,,\"T\")/100,\"\"))","v":""},{"$f":"IF(A16=\"\",\"\",RTD(\"cqg.rtd\", ,\"ContractData\", C16, \"T_CVol\",, \"T\"))","v":""},16,{"$f":"IFERROR(RANK($J16,INDIRECT((\"$J$\"&\"1\"&\":$J$\"&$A$103)))+COUNTIF($J$1:J16,J16)-1,\"\")","v":""},"",""]
[{"$f":"IF(Symbols!A17=\"\",\"\",Symbols!A17)","v":""},"","",{"$f":"IF(A17=\"\",\"\",RTD(\"cqg.rtd\", ,\"ContractData\",C17, \"LongDescription\",, \"T\"))","v":""},null,null,null,{"$f":"IF(A17=\"\",\"\",RTD(\"cqg.rtd\", ,\"ContractData\",C17, \"LastTradeToday\",, \"T\"))","v":""},{"$f":"IF(A17=\"\",\"\",RTD(\"cqg.rtd\", ,\"ContractData\",C17, \"NetLastTradeToday\",, \"T\"))","v":""},{"$f":"IF(A17=\"\",\"\",IFERROR(RTD(\"cqg.rtd\",,\"StudyData\",A17, \"PCB\",\"BaseType=Index,Index=1\", \"Close\", \"A\",,\"all\",,,,\"T\")/100,\"\"))","v":""},{"$f":"IF(A17=\"\",\"\",RTD(\"cqg.rtd\", ,\"ContractData\", C17, \"T_CVol\",, \"T\"))","v":""},17,{"$f":"IFERROR(RANK($J17,INDIRECT((\"$J$\"&\"1\"&\":$J$\"&$A$103)))+COUNTIF($J$1:J17,J17)-1,\"\")","v":""},"",""]
[{"$f":"IF(Symbols!A18=\"\",\"\",Symbols!A18)","v":""},"","",{"$f":"IF(A18=\"\",\"\",RTD(\"cqg.rtd\", ,\"ContractData\",C18, \"LongDescription\",, \"T\"))","v":""},null,null,null,{"$f":"IF(A18=\"\",\"\",RTD(\"cqg.rtd\", ,\"ContractData\",C18, \"LastTradeToday\",, \"T\"))","v":""},{"$f":"IF(A18=\"\",\"\",RTD(\"cqg.rtd\", ,\"ContractData\",C18, \"NetLastTradeToday\",, \"T\"))","v":""},{"$f":"IF(A18=\"\",\"\",IFERROR(RTD(\"cqg.rtd\",,\"StudyData\",A18, \"PCB\",\"BaseType=Index,Index=1\", \"Close\", \"A\",,\"all\",,,,\"T\")/100,\"\"))","v":""},{"$f":"IF(A18=\"\",\"\",RTD(\"cqg.rtd\", ,\"ContractData\", C18, \"T_CVol\",, \"T\"))","v":""},18,{"$f":"IFERROR(RANK($J18,INDIRECT((\"$J$\"&\"1\"&\":$J$\"&$A$103)))+COUNTIF($J$1:J18,J18)-1,\"\")","v":""},"",""]
[{"$f":"IF(Symbols!A19=\"\",\"\",Symbols!A19)","v":""},"","",{"$f":"IF(A19=\"\",\"\",RTD(\"cqg.rtd\", ,\"ContractData\",C19, \"LongDescription\",, \"T\"))","v":""},null,null,null,{"$f":"IF(A19=\"\",\"\",RTD(\"cqg.rtd\", ,\"ContractData\",C19, \"LastTradeToday\",, \"T\"))","v":""},{"$f":"IF(A19=\"\",\"\",RTD(\"cqg.rtd\", ,\"ContractData\",C19, \"NetLastTradeToday\",, \"T\"))","v":""},{"$f":"IF(A19=\"\",\"\",IFERROR(RTD(\"cqg.rtd\",,\"StudyData\",A19, \"PCB\",\"BaseType=Index,Index=1\", \"Close\", \"A\",,\"all\",,,,\"T\")/100,\"\"))","v":""},{"$f":"IF(A19=\"\",\"\",RTD(\"cqg.rtd\", ,\"ContractData\", C19, \"T_CVol\",, \"T\"))","v":""},19,{"$f":"IFERROR(RANK($J19,INDIRECT((\"$J$\"&\"1\"&\":$J$\"&$A$103)))+COUNTIF($J$1:J19,J19)-1,\"\")","v":""},"",""]
[{"$f":"IF(Symbols!A20=\"\",\"\",Symbols!A20)","v":""},"","",{"$f":"IF(A20=\"\",\"\",RTD(\"cqg.rtd\", ,\"ContractData\",C20, \"LongDescription\",, \"T\"))","v":""},null,null,null,{"$f":"IF(A20=\"\",\"\",RTD(\"cqg.rtd\", ,\"ContractData\",C20, \"LastTradeToday\",, \"T\"))","v":""},{"$f":"IF(A20=\"\",\"\",RTD(\"cqg.rtd\", ,\"ContractData\",C20, \"NetLastTradeToday\",, \"T\"))","v":""},{"$f":"IF(A20=\"\",\"\",IFERROR(RTD(\"cqg.rtd\",,\"StudyData\",A20, \"PCB\",\"BaseType=Index,Index=1\", \"Close\", \"A\",,\"all\",,,,\"T\")/100,\"\"))","v":""},{"$f":"IF(A20=\"\",\"\",RTD(\"cqg.rtd\", ,\"ContractData\", C20, \"T_CVol\",, \"T\"))","v":""},20,{"$f":"IFERROR(RANK($J20,INDIRECT((\"$J$\"&\"1\"&\":$J$\"&$A$103)))+COUNTIF($J$1:J20,J20)-1,\"\")","v":""},"",""]
[{"$f":"IF(Symbols!A21=\"\",\"\",Symbols!A21)","v":""},"","",{"$f":"IF(A21=\"\",\"\",RTD(\"cqg.rtd\", ,\"ContractData\",C21, \"LongDescription\",, \"T\"))","v":""},null,null,null,{"$f":"IF(A21=\"\",\"\",RTD(\"cqg.rtd\", ,\"ContractData\",C21, \"LastTradeToday\",, \"T\"))","v":""},{"$f":"IF(A21=\"\",\"\",RTD(\"cqg.rtd\", ,\"ContractData\",C21, \"NetLastTradeToday\",, \"T\"))","v":""},{"$f":"IF(A21=\"\",\"\",IFERROR(RTD(\"cqg.rtd\",,\"StudyData\",A21, \"PCB\",\"BaseType=Index,Index=1\", \"Close\", \"A\",,\"all\",,,,\"T\")/100,\"\"))","v":""},{"$f":"IF(A21=\"\",\"\",RTD(\"cqg.rtd\", ,\"ContractData\", C21, \"T_CVol\",, \"T\"))","v":""},21,{"$f":"IFERROR(RANK($J21,INDIRECT((\"$J$\"&\"1\"&\":$J$\"&$A$103)))+COUNTIF($J$1:J21,J21)-1,\"\")","v":""},"",""]
[{"$f":"IF(Symbols!A22=\"\",\"\",Symbols!A22)","v":""},"","",{"$f":"IF(A22=\"\",\"\",RTD(\"cqg.rtd\", ,\"ContractData\",C22, \"LongDescription\",, \"T\"))","v":""},null,null,null,{"$f":"IF(A22=\"\",\"\",RTD(\"cqg.rtd\", ,\"ContractData\",C22, \"LastTradeToday\",, \"T\"))","v":""},{"$f":"IF(A22=\"\",\"\",RTD(\"cqg.rtd\", ,\"ContractData\",C22, \"NetLastTradeToday\",, \"T\"))","v":""},{"$f":"IF(A22=\"\",\"\",IFERROR(RTD(\"cqg.rtd\",,\"StudyData\",A22, \"PCB\",\"BaseType=Index,Index=1\", \"Close\", \"A\",,\"all\",,,,\"T\")/100,\"\"))","v":""},{"$f":"IF(A22=\"\",\"\",RTD(\"cqg.rtd\", ,\"ContractData\", C22, \"T_CVol\",, \"T\"))","v":""},22,{"$f":"IFERROR(RANK($J22,INDIRECT((\"$J$\"&\"1\"&\":$J$\"&$A$103)))+COUNTIF($J$1:J22,J22)-1,\"\")","v":""},"",""]
[{"$f":"IF(Symbols!A23=\"\",\"\",Symbols!A23)","v":""},"","",{"$f":"IF(A23=\"\",\"\",RTD(\"cqg.rtd\", ,\"ContractData\",C23, \"LongDescription\",, \"T\"))","v":""},null,null,null,{"$f":"IF(A23=\"\",\"\",RTD(\"cqg.rtd\", ,\"ContractData\",C23, \"LastTradeToday\",, \"T\"))","v":""},{"$f":"IF(A23=\"\",\"\",RTD(\"cqg.rtd\", ,\"ContractData\",C23, \"NetLastTradeToday\",, \"T\"))","v":""},{"$f":"IF(A23=\"\",\"\",IFERROR(RTD(\"cqg.rtd\",,\"StudyData\",A23, \"PCB\",\"BaseType=Index,Index=1\", \"Close\", \"A\",,\"all\",,,,\"T\")/100,\"\"))","v":""},{"$f":"IF(A23=\"\",\"\",RTD(\"cqg.rtd\", ,\"ContractData\", C23, \"T_CVol\",, \"T\"))","v":""},23,{"$f":"IFERROR(RANK($J23,INDIRECT((\"$J$\"&\"1\"&\":$J$\"&$A$103)))+COUNTIF($J$1:J23,J23)-1,\"\")","v":""},"",""]
[{"$f":"IF(Symbols!A24=\"\",\"\",Symbols!A24)","v":""},"","",{"$f":"IF(A24=\"\",\"\",RTD(\"cqg.rtd\", ,\"ContractData\",C24, \"LongDescription\",, \"T\"))","v":""},null,null,null,{"$f":"IF(A24=\"\",\"\",RTD(\"cqg.rtd\", ,\"ContractData\",C24, \"LastTradeToday\",, \"T\"))","v":""},{"$f":"IF(A24=\"\",\"\",RTD(\"cqg.rtd\", ,\"ContractData\",C24, \"NetLastTradeToday\",, \"T\"))","v":""},{"$f":"IF(A24=\"\",\"\",IFERROR(RTD(\"cqg.rtd\",,\"StudyData\",A24, \"PCB\",\"BaseType=Index,Index=1\", \"Close\", \"A\",,\"all\",,,,\"T\")/100,\"\"))","v":""},{"$f":"IF(A24=\"\",\"\",RTD(\"cqg.rtd\", ,\"ContractData\", C24, \"T_CVol\",, \"T\"))","v":""},24,{"$f":"IFERROR(RANK($J24,INDIRECT((\"$J$\"&\"1\"&\":$J$\"&$A$103)))+COUNTIF($J$1:J24,J24)-1,\"\")","v":""},"",""]
[{"$f":"IF(Symbols!A25=\"\",\"\",Symbols!A25)","v":""},"","",{"$f":"IF(A25=\"\",\"\",RTD(\"cqg.rtd\", ,\"ContractData\",C25, \"LongDescription\",, \"T\"))","v":""},null,null,null,{"$f":"IF(A25=\"\",\"\",RTD(\"cqg.rtd\", ,\"ContractData\",C25, \"LastTradeToday\",, \"T\"))","v":""},{"$f":"IF(A25=\"\",\"\",RTD(\"cqg.rtd\", ,\"ContractData\",C25, \"NetLastTradeToday\",, \"T\"))","v":""},{"$f":"IF(A25=\"\",\"\",IFERROR(RTD(\"cqg.rtd\",,\"StudyData\",A25, \"PCB\",\"BaseType=Index,Index=1\", \"Close\", \"A\",,\"all\",,,,\"T\")/100,\"\"))","v":""},{"$f":"IF(A25=\"\",\"\",RTD(\"cqg.rtd\", ,\"ContractData\", C25, \"T_CVol\",, \"T\"))","v":""},25,{"$f":"IFERROR(RANK($J25,INDIRECT((\"$J$\"&\"1\"&\":$J$\"&$A$103)))+COUNTIF($J$1:J25,J25)-1,\"\")","v":""},"",""]
[{"$f":"IF(Symbols!A26=\"\",\"\",Symbols!A26)","v":""},"","",{"$f":"IF(A26=\"\",\"\",RTD(\"cqg.rtd\", ,\"ContractData\",C26, \"LongDescription\",, \"T\"))","v":""},null,null,null,{"$f":"IF(A26=\"\",\"\",RTD(\"cqg.rtd\", ,\"ContractData\",C26, \"LastTradeToday\",, \"T\"))","v":""},{"$f":"IF(A26=\"\",\"\",RTD(\"cqg.rtd\", ,\"ContractData\",C26, \"NetLastTradeToday\",, \"T\"))","v":""},{"$f":"IF(A26=\"\",\"\",IFERROR(RTD(\"cqg.rtd\",,\"StudyData\",A26, \"PCB\",\"BaseType=Index,Index=1\", \"Close\", \"A\",,\"all\",,,,\"T\")/100,\"\"))","v":""},{"$f":"IF(A26=\"\",\"\",RTD(\"cqg.rtd\", ,\"ContractData\", C26, \"T_CVol\",, \"T\"))","v":""},26,{"$f":"IFERROR(RANK($J26,INDIRECT((\"$J$\"&\"1\"&\":$J$\"&$A$103)))+COUNTIF($J$1:J26,J26)-1,\"\")","v":""},"",""]
[{"$f":"IF(Symbols!A27=\"\",\"\",Symbols!A27)","v":""},"","",{"$f":"IF(A27=\"\",\"\",RTD(\"cqg.rtd\", ,\"ContractData\",C27, \"LongDescription\",, \"T\"))","v":""},null,null,null,{"$f":"IF(A27=\"\",\"\",RTD(\"cqg.rtd\", ,\"ContractData\",C27, \"LastTradeToday\",, \"T\"))","v":""},{"$f":"IF(A27=\"\",\"\",RTD(\"cqg.rtd\", ,\"ContractData\",C27, \"NetLastTradeToday\",, \"T\"))","v":""},{"$f":"IF(A27=\"\",\"\",IFERROR(RTD(\"cqg.rtd\",,\"StudyData\",A27, \"PCB\",\"BaseType=Index,Index=1\", \"Close\", \"A\",,\"all\",,,,\"T\")/100,\"\"))","v":""},{"$f":"IF(A27=\"\",\"\",RTD(\"cqg.rtd\", ,\"ContractData\", C27, \"T_CVol\",, \"T\"))","v":""},27,{"$f":"IFERROR(RANK($J27,INDIRECT((\"$J$\"&\"1\"&\":$J$\"&$A$103)))+COUNTIF($J$1:J27,J27)-1,\"\")","v":""},"",""]
[{"$f":"IF(Symbols!A28=\"\",\"\",Symbols!A28)","v":""},"","",{"$f":"IF(A28=\"\",\"\",RTD(\"cqg.rtd\", ,\"ContractData\",C28, \"LongDescription\",, \"T\"))","v":""},null,null,null,{"$f":"IF(A28=\"\",\"\",RTD(\"cqg.rtd\", ,\"ContractData\",C28, \"LastTradeToday\",, \"T\"))","v":""},{"$f":"IF(A28=\"\",\"\",RTD(\"cqg.rtd\", ,\"ContractData\",C28, \"NetLastTradeToday\",, \"T\"))","v":""},{"$f":"IF(A28=\"\",\"\",IFERROR(RTD(\"cqg.rtd\",,\"StudyData\",A28, \"PCB\",\"BaseType=Index,Index=1\", \"Close\", \"A\",,\"all\",,,,\"T\")/100,\"\"))","v":""},{"$f":"IF(A28=\"\",\"\",RTD(\"cqg.rtd\", ,\"ContractData\", C28, \"T_CVol\",, \"T\"))","v":""},28,{"$f":"IFERROR(RANK($J28,INDIRECT((\"$J$\"&\"1\"&\":$J$\"&$A$103)))+COUNTIF($J$1:J28,J28)-1,\"\")","v":""},"",""]
[{"$f":"IF(Symbols!A29=\"\",\"\",Symbols!A29)","v":""},"","",{"$f":"IF(A29=\"\",\"\",RTD(\"cqg.rtd\", ,\"ContractData\",C29, \"LongDescription\",, \"T\"))","v":""},null,null,null,{"$f":"IF(A29=\"\",\"\",RTD(\"cqg.rtd\", ,\"ContractData\",C29, \"LastTradeToday\",, \"T\"))","v":""},{"$f":"IF(A29=\"\",\"\",RTD(\"cqg.rtd\", ,\"ContractData\",C29, \"NetLastTradeToday\",, \"T\"))","v":""},{"$f":"IF(A29=\"\",\"\",IFERROR(RTD(\"cqg.rtd\",,\"StudyData\",A29, \"PCB\",\"BaseType=Index,Index=1\", \"Close\", \"A\",,\"all\",,,,\"T\")/100,\"\"))","v":""},{"$f":"IF(A29=\"\",\"\",RTD(\"cqg.rtd\", ,\"ContractData\", C29, \"T_CVol\",, \"T\"))","v":""},29,{"$f":"IFERROR(RANK($J29,INDIRECT((\"$J$\"&\"1\"&\":$J$\"&$A$103)))+COUNTIF($J$1:J29,J29)-1,\"\")","v":""},"",""]
[{"$f":"IF(Symbols!A30=\"\",\"\",Symbols!A30)","v":""},"","",{"$f":"IF(A30=\"\",\"\",RTD(\"cqg.rtd\", ,\"ContractData\",C30, \"LongDescription\",, \"T\"))","v":""},null,null,null,{"$f":"IF(A30=\"\",\"\",RTD(\"cqg.rtd\", ,\"ContractData\",C30, \"LastTradeToday\",, \"T\"))","v":""},{"$f":"IF(A30=\"\",\"\",RTD(\"cqg.rtd\", ,\"ContractData\",C30, \"NetLastTradeToday\",, \"T\"))","v":""},{"$f":"IF(A30=\"\",\"\",IFERROR(RTD(\"cqg.rtd\",,\"StudyData\",A30, \"PCB\",\"BaseType=Index,Index=1\", \"Close\", \"A\",,\"all\",,,,\"T\")/100,\"\"))","v":""},{"$f":"IF(A30=\"\",\"\",RTD(\"cqg.rtd\", ,\"ContractData\", C30, \"T_CVol\",, \"T\"))","v":""},30,{"$f":"IFERROR(RANK($J30,INDIRECT((\"$J$\"&\"1\"&\":$J$\"&$A$103)))+COUNTIF($J$1:J30,J30)-1,\"\")","v":""},"",""]
[{"$f":"IF(Symbols!A31=\"\",\"\",Symbols!A31)","v":""},"","",{"$f":"IF(A31=\"\",\"\",RTD(\"cqg.rtd\", ,\"ContractData\",C31, \"LongDescription\",, \"T\"))","v":""},null,null,null,{"$f":"IF(A31=\"\",\"\",RTD(\"cqg.rtd\", ,\"ContractData\",C31, \"LastTradeToday\",, \"T\"))","v":""},{"$f":"IF(A31=\"\",\"\",RTD(\"cqg.rtd\", ,\"ContractData\",C31, \"NetLastTradeToday\",, \"T\"))","v":""},{"$f":"IF(A31=\"\",\"\",IFERROR(RTD(\"cqg.rtd\",,\"StudyData\",A31, \"PCB\",\"BaseType=Index,Index=1\", \"Close\", \"A\",,\"all\",,,,\"T\")/100,\"\"))","v":""},{"$f":"IF(A31=\"\",\"\",RTD(\"cqg.rtd\", ,\"ContractData\", C31, \"T_CVol\",, \"T\"))","v":""},31,{"$f":"IFERROR(RANK($J31,INDIRECT((\"$J$\"&\"1\"&\":$J$\"&$A$103)))+COUNTIF($J$1:J31,J31)-1,\"\")","v":""},"",""]
[{"$f":"IF(Symbols!A32=\"\",\"\",Symbols!A32)","v":""},"","",{"$f":"IF(A32=\"\",\"\",RTD(\"cqg.rtd\", ,\"ContractData\",C32, \"LongDescription\",, \"T\"))","v":""},null,null,null,{"$f":"IF(A32=\"\",\"\",RTD(\"cqg.rtd\", ,\"ContractData\",C32, \"LastTradeToday\",, \"T\"))","v":""},{"$f":"IF(A32=\"\",\"\",RTD(\"cqg.rtd\", ,\"ContractData\",C32, \"NetLastTradeToday\",, \"T\"))","v":""},{"$f":"IF(A32=\"\",\"\",IFERROR(RTD(\"cqg.rtd\",,\"StudyData\",A32, \"PCB\",\"BaseType=Index,Index=1\", \"Close\", \"A\",,\"all\",,,,\"T\")/100,\"\"))","v":""},{"$f":"IF(A32=\"\",\"\",RTD(\"cqg.rtd\", ,\"ContractData\", C32, \"T_CVol\",, \"T\"))","v":""},32,{"$f":"IFERROR(RANK($J32,INDIRECT((\"$J$\"&\"1\"&\":$J$\"&$A$103)))+COUNTIF($J$1:J32,J32)-1,\"\")","v":""},"",""]
[{"$f":"IF(Symbols!A33=\"\",\"\",Symbols!A33)","v":""},"","",{"$f":"IF(A33=\"\",\"\",RTD(\"cqg.rtd\", ,\"ContractData\",C33, \"LongDescription\",, \"T\"))","v":""},null,null,null,{"$f":"IF(A33=\"\",\"\",RTD(\"cqg.rtd\", ,\"ContractData\",C33, \"LastTradeToday\",, \"T\"))","v":""},{"$f":"IF(A33=\"\",\"\",RTD(\"cqg.rtd\", ,\"ContractData\",C33, \"NetLastTradeToday\",, \"T\"))","v":""},{"$f":"IF(A33=\"\",\"\",IFERROR(RTD(\"cqg.rtd\",,\"StudyData\",A33, \"PCB\",\"BaseType=Index,Index=1\", \"Close\", \"A\",,\"all\",,,,\"T\")/100,\"\"))","v":""},{"$f":"IF(A33=\"\",\"\",RTD(\"cqg.rtd\", ,\"ContractData\", C33, \"T_CVol\",, \"T\"))","v":""},33,{"$f":"IFERROR(RANK($J33,INDIRECT((\"$J$\"&\"1\"&\":$J$\"&$A$103)))+COUNTIF($J$1:J33,J33)-1,\"\")","v":""},"",""]
[{"$f":"IF(Symbols!A34=\"\",\"\",Symbols!A34)","v":""},"","",{"$f":"IF(A34=\"\",\"\",RTD(\"cqg.rtd\", ,\"ContractData\",C34, \"LongDescription\",, \"T\"))","v":""},null,null,null,{"$f":"IF(A34=\"\",\"\",RTD(\"cqg.rtd\", ,\"ContractData\",C34, \"LastTradeToday\",, \"T\"))","v":""},{"$f":"IF(A34=\"\",\"\",RTD(\"cqg.rtd\", ,\"ContractData\",C34, \"NetLastTradeToday\",, \"T\"))","v":""},{"$f":"IF(A34=\"\",\"\",IFERROR(RTD(\"cqg.rtd\",,\"StudyData\",A34, \"PCB\",\"BaseType=Index,Index=1\", \"Close\", \"A\",,\"all\",,,,\"T\")/100,\"\"))","v":""},{"$f":"IF(A34=\"\",\"\",RTD(\"cqg.rtd\", ,\"ContractData\", C34, \"T_CVol\",, \"T\"))","v":""},34,{"$f":"IFERROR(RANK($J34,INDIRECT((\"$J$\"&\"1\"&\":$J$\"&$A$103)))+COUNTIF($J$1:J34,J34)-1,\"\")","v":""},"",""]
[{"$f":"IF(Symbols!A35=\"\",\"\",Symbols!A35)","v":""},"","",{"$f":"IF(A35=\"\",\"\",RTD(\"cqg.rtd\", ,\"ContractData\",C35, \"LongDescription\",, \"T\"))","v":""},null,null,null,{"$f":"IF(A35=\"\",\"\",RTD(\"cqg.rtd\", ,\"ContractData\",C35, \"LastTradeToday\",, \"T\"))","v":""},{"$f":"IF(A35=\"\",\"\",RTD(\"cqg.rtd\", ,\"ContractData\",C35, \"NetLastTradeToday\",, \"T\"))","v":""},{"$f":"IF(A35=\"\",\"\",IFERROR(RTD(\"cqg.rtd\",,\"StudyData\",A35, \"PCB\",\"BaseType=Index,Index=1\", \"Close\", \"A\",,\"all\",,,,\"T\")/100,\"\"))","v":""},{"$f":"IF(A35=\"\",\"\",RTD(\"cqg.rtd\", ,\"ContractData\", C35, \"T_CVol\",, \"T\"))","v":""},35,{"$f":"IFERROR(RANK($J35,INDIRECT((\"$J$\"&\"1\"&\":$J$\"&$A$103)))+COUNTIF($J$1:J35,J35)-1,\"\")","v":""},"",""]
[{"$f":"IF(Symbols!A36=\"\",\"\",Symbols!A36)","v":""},"","",{"$f":"IF(A36=\"\",\"\",RTD(\"cqg.rtd\", ,\"ContractData\",C36, \"LongDescription\",, \"T\"))","v":""},null,null,null,{"$f":"IF(A36=\"\",\"\",RTD(\"cqg.rtd\", ,\"ContractData\",C36, \"LastTradeToday\",, \"T\"))","v":""},{"$f":"IF(A36=\"\",\"\",RTD(\"cqg.rtd\", ,\"ContractData\",C36, \"NetLastTradeToday\",, \"T\"))","v":""},{"$f":"IF(A36=\"\",\"\",IFERROR(RTD(\"cqg.rtd\",,\"StudyData\",A36, \"PCB\",\"BaseType=Index,Index=1\", \"Close\", \"A\",,\"all\",,,,\"T\")/100,\"\"))","v":""},{"$f":"IF(A36=\"\",\"\",RTD(\"cqg.rtd\", ,\"ContractData\", C36, \"T_CVol\",, \"T\"))","v":""},36,{"$f":"IFERROR(RANK($J36,INDIRECT((\"$J$\"&\"1\"&\":$J$\"&$A$103)))+COUNTIF($J$1:J36,J36)-1,\"\")","v":""},"",""]
[{"$f":"IF(Symbols!A37=\"\",\"\",Symbols!A37)","v":""},"","",{"$f":"IF(A37=\"\",\"\",RTD(\"cqg.rtd\", ,\"ContractData\",C37, \"LongDescription\",, \"T\"))","v":""},null,null,null,{"$f":"IF(A37=\"\",\"\",RTD(\"cqg.rtd\", ,\"ContractData\",C37, \"LastTradeToday\",, \"T\"))","v":""},{"$f":"IF(A37=\"\",\"\",RTD(\"cqg.rtd\", ,\"ContractData\",C37, \"NetLastTradeToday\",, \"T\"))","v":""},{"$f":"IF(A37=\"\",\"\",IFERROR(RTD(\"cqg.rtd\",,\"StudyData\",A37, \"PCB\",\"BaseType=Index,Index=1\", \"Close\", \"A\",,\"all\",,,,\"T\")/100,\"\"))","v":""},{"$f":"IF(A37=\"\",\"\",RTD(\"cqg.rtd\", ,\"ContractData\", C37, \"T_CVol\",, \"T\"))","v":""},37,{"$f":"IFERROR(RANK($J37,INDIRECT((\"$J$\"&\"1\"&\":$J$\"&$A$103)))+COUNTIF($J$1:J37,J37)-1,\"\")","v":""},"",""]
[{"$f":"IF(Symbols!A38=\"\",\"\",Symbols!A38)","v":""},"","",{"$f":"IF(A38=\"\",\"\",RTD(\"cqg.rtd\", ,\"ContractData\",C38, \"LongDescription\",, \"T\"))","v":""},null,null,null,{"$f":"IF(A38=\"\",\"\",RTD(\"cqg.rtd\", ,\"ContractData\",C38, \"LastTradeToday\",, \"T\"))","v":""},{"$f":"IF(A38=\"\",\"\",RTD(\"cqg.rtd\", ,\"ContractData\",C38, \"NetLastTradeToday\",, \"T\"))","v":""},{"$f":"IF(A38=\"\",\"\",IFERROR(RTD(\"cqg.rtd\",,\"StudyData\",A38, \"PCB\",\"BaseType=Index,Index=1\", \"Close\", \"A\",,\"all\",,,,\"T\")/100,\"\"))","v":""},{"$f":"IF(A38=\"\",\"\",RTD(\"cqg.rtd\", ,\"ContractData\", C38, \"T_CVol\",, \"T\"))","v":""},38,{"$f":"IFERROR(RANK($J38,INDIRECT((\"$J$\"&\"1\"&\":$J$\"&$A$103)))+COUNTIF($J$1:J38,J38)-1,\"\")","v":""},"",""]
[{"$f":"IF(Symbols!A39=\"\",\"\",Symbols!A39)","v":""},"","",{"$f":"IF(A39=\"\",\"\",RTD(\"cqg.rtd\", ,\"ContractData\",C39, \"LongDescription\",, \"T\"))","v":""},null,null,null,{"$f":"IF(A39=\"\",\"\",RTD(\"cqg.rtd\", ,\"ContractData\",C39, \"LastTradeToday\",, \"T\"))","v":""},{"$f":"IF(A39=\"\",\"\",RTD(\"cqg.rtd\", ,\"ContractData\",C39, \"NetLastTradeToday\",, \"T\"))","v":""},{"$f":"IF(A39=\"\",\"\",IFERROR(RTD(\"cqg.rtd\",,\"StudyData\",A39, \"PCB\",\"BaseType=Index,Index=1\", \"Close\", \"A\",,\"all\",,,,\"T\")/100,\"\"))","v":""},{"$f":"IF(A39=\"\",\"\",RTD(\"cqg.rtd\", ,\"ContractData\", C39, \"T_CVol\",, \"T\"))","v":""},39,{"$f":"IFERROR(RANK($J39,INDIRECT((\"$J$\"&\"1\"&\":$J$\"&$A$103)))+COUNTIF($J$1:J39,J39)-1,\"\")","v":""},"",""]
[{"$f":"IF(Symbols!A40=\"\",\"\",Symbols!A40)","v":""},"","",{"$f":"IF(A40=\"\",\"\",RTD(\"cqg.rtd\", ,\"ContractData\",C40, \"LongDescription\",, \"T\"))","v":""},null,null,null,{"$f":"IF(A40=\"\",\"\",RTD(\"cqg.rtd\", ,\"ContractData\",C40, \"LastTradeToday\",, \"T\"))","v":""},{"$f":"IF(A40=\"\",\"\",RTD(\"cqg.rtd\", ,\"ContractData\",C40, \"NetLastTradeToday\",, \"T\"))","v":""},{"$f":"IF(A40=\"\",\"\",IFERROR(RTD(\"cqg.rtd\",,\"StudyData\",A40, \"PCB\",\"BaseType=Index,Index=1\", \"Close\", \"A\",,\"all\",,,,\"T\")/100,\"\"))","v":""},{"$f":"IF(A40=\"\",\"\",RTD(\"cqg.rtd\", ,\"ContractData\", C40, \"T_CVol\",, \"T\"))","v":""},40,{"$f":"IFERROR(RANK($J40,INDIRECT((\"$J$\"&\"1\"&\":$J$\"&$A$103)))+COUNTIF($J$1:J40,J40)-1,\"\")","v":""},"",""]
[{"$f":"IF(Symbols!A41=\"\",\"\",Symbols!A41)","v":""},"","",{"$f":"IF(A41=\"\",\"\",RTD(\"cqg.rtd\", ,\"ContractData\",C41, \"LongDescription\",, \"T\"))","v":""},null,null,null,{"$f":"IF(A41=\"\",\"\",RTD(\"cqg.rtd\", ,\"ContractData\",C41, \"LastTradeToday\",, \"T\"))","v":""},{"$f":"IF(A41=\"\",\"\",RTD(\"cqg.rtd\", ,\"ContractData\",C41, \"NetLastTradeToday\",, \"T\"))","v":""},{"$f":"IF(A41=\"\",\"\",IFERROR(RTD(\"cqg.rtd\",,\"StudyData\",A41, \"PCB\",\"BaseType=Index,Index=1\", \"Close\", \"A\",,\"all\",,,,\"T\")/100,\"\"))","v":""},{"$f":"IF(A41=\"\",\"\",RTD(\"cqg.rtd\", ,\"ContractData\", C41, \"T_CVol\",, \"T\"))","v":""},41,{"$f":"IFERROR(RANK($J41,INDIRECT((\"$J$\"&\"1\"&\":$J$\"&$A$103)))+COUNTIF($J$1:J41,J41)-1,\"\")","v":""},"",""]
[{"$f":"IF(Symbols!A42=\"\",\"\",Symbols!A42)","v":""},"","",{"$f":"IF(A42=\"\",\"\",RTD(\"cqg.rtd\", ,\"ContractData\",C42, \"LongDescription\",, \"T\"))","v":""},null,null,null,{"$f":"IF(A42=\"\",\"\",RTD(\"cqg.rtd\", ,\"ContractData\",C42, \"LastTradeToday\",, \"T\"))","v":""},{"$f":"IF(A42=\"\",\"\",RTD(\"cqg.rtd\", ,\"ContractData\",C42, \"NetLastTradeToday\",, \"T\"))","v":""},{"$f":"IF(A42=\"\",\"\",IFERROR(RTD(\"cqg.rtd\",,\"StudyData\",A42, \"PCB\",\"BaseType=Index,Index=1\", \"Close\", \"A\",,\"all\",,,,\"T\")/100,\"\"))","v":""},{"$f":"IF(A42=\"\",\"\",RTD(\"cqg.rtd\", ,\"ContractData\", C42, \"T_CVol\",, \"T\"))","v":""},42,{"$f":"IFERROR(RANK($J42,INDIRECT((\"$J$\"&\"1\"&\":$J$\"&$A$103)))+COUNTIF($J$1:J42,J42)-1,\"\")","v":""},"",""]
[{"$f":"IF(Symbols!A43=\"\",\"\",Symbols!A43)","v":""},"","",{"$f":"IF(A43=\"\",\"\",RTD(\"cqg.rtd\", ,\"ContractData\",C43, \"LongDescription\",, \"T\"))","v":""},null,null,null,{"$f":"IF(A43=\"\",\"\",RTD(\"cqg.rtd\", ,\"ContractData\",C43, \"LastTradeToday\",, \"T\"))","v":""},{"$f":"IF(A43=\"\",\"\",RTD(\"cqg.rtd\", ,\"ContractData\",C43, \"NetLastTradeToday\",, \"T\"))","v":""},{"$f":"IF(A43=\"\",\"\",IFERROR(RTD(\"cqg.rtd\",,\"StudyData\",A43, \"PCB\",\"BaseType=Index,Index=1\", \"Close\", \"A\",,\"all\",,,,\"T\")/100,\"\"))","v":""},{"$f":"IF(A43=\"\",\"\",RTD(\"cqg.rtd\", ,\"ContractData\", C43, \"T_CVol\",, \"T\"))","v":""},43,{"$f":"IFERROR(RANK($J43,INDIRECT((\"$J$\"&\"1\"&\":$J$\"&$A$103)))+COUNTIF($J$1:J43,J43)-1,\"\")","v":""},"",""]
[{"$f":"IF(Symbols!A44=\"\",\"\",Symbols!A44)","v":""},"","",{"$f":"IF(A44=\"\",\"\",RTD(\"cqg.rtd\", ,\"ContractData\",C44, \"LongDescription\",, \"T\"))","v":""},null,null,null,{"$f":"IF(A44=\"\",\"\",RTD(\"cqg.rtd\", ,\"ContractData\",C44, \"LastTradeToday\",, \"T\"))","v":""},{"$f":"IF(A44=\"\",\"\",RTD(\"cqg.rtd\", ,\"ContractData\",C44, \"NetLastTradeToday\",, \"T\"))","v":""},{"$f":"IF(A44=\"\",\"\",IFERROR(RTD(\"cqg.rtd\",,\"StudyData\",A44, \"PCB\",\"BaseType=Index,Index=1\", \"Close\", \"A\",,\"all\",,,,\"T\")/100,\"\"))","v":""},{"$f":"IF(A44=\"\",\"\",RTD(\"cqg.rtd\", ,\"ContractData\", C44, \"T_CVol\",, \"T\"))","v":""},44,{"$f":"IFERROR(RANK($J44,INDIRECT((\"$J$\"&\"1\"&\":$J$\"&$A$103)))+COUNTIF($J$1:J44,J44)-1,\"\")","v":""},"",""]
[{"$f":"IF(Symbols!A45=\"\",\"\",Symbols!A45)","v":""},"","",{"$f":"IF(A45=\"\",\"\",RTD(\"cqg.rtd\", ,\"ContractData\",C45, \"LongDescription\",, \"T\"))","v":""},null,null,null,{"$f":"IF(A45=\"\",\"\",RTD(\"cqg.rtd\", ,\"ContractData\",C45, \"LastTradeToday\",, \"T\"))","v":""},{"$f":"IF(A45=\"\",\"\",RTD(\"cqg.rtd\", ,\"ContractData\",C45, \"NetLastTradeToday\",, \"T\"))","v":""},{"$f":"IF(A45=\"\",\"\",IFERROR(RTD(\"cqg.rtd\",,\"StudyData\",A45, \"PCB\",\"BaseType=Index,Index=1\", \"Close\", \"A\",,\"all\",,,,\"T\")/100,\"\"))","v":""},{"$f":"IF(A45=\"\",\"\",RTD(\"cqg.rtd\", ,\"ContractData\", C45, \"T_CVol\",, \"T\"))","v":""},45,{"$f":"IFERROR(RANK($J45,INDIRECT((\"$J$\"&\"1\"&\":$J$\"&$A$103)))+COUNTIF($J$1:J45,J45)-1,\"\")","v":""},"",""]
[{"$f":"IF(Symbols!A46=\"\",\"\",Symbols!A46)","v":""},"","",{"$f":"IF(A46=\"\",\"\",RTD(\"cqg.rtd\", ,\"ContractData\",C46, \"LongDescription\",, \"T\"))","v":""},null,null,null,{"$f":"IF(A46=\"\",\"\",RTD(\"cqg.rtd\", ,\"ContractData\",C46, \"LastTradeToday\",, \"T\"))","v":""},{"$f":"IF(A46=\"\",\"\",RTD(\"cqg.rtd\", ,\"ContractData\",C46, \"NetLastTradeToday\",, \"T\"))","v":""},{"$f":"IF(A46=\"\",\"\",IFERROR(RTD(\"cqg.rtd\",,\"StudyData\",A46, \"PCB\",\"BaseType=Index,Index=1\", \"Close\", \"A\",,\"all\",,,,\"T\")/100,\"\"))","v":""},{"$f":"IF(A46=\"\",\"\",RTD(\"cqg.rtd\", ,\"ContractData\", C46, \"T_CVol\",, \"T\"))","v":""},46,{"$f":"IFERROR(RANK($J46,INDIRECT((\"$J$\"&\"1\"&\":$J$\"&$A$103)))+COUNTIF($J$1:J46,J46)-1,\"\")","v":""},"",""]
[{"$f":"IF(Symbols!A47=\"\",\"\",Symbols!A47)","v":""},"","",{"$f":"IF(A47=\"\",\"\",RTD(\"cqg.rtd\", ,\"ContractData\",C47, \"LongDescription\",, \"T\"))","v":""},null,null,null,{"$f":"IF(A47=\"\",\"\",RTD(\"cqg.rtd\", ,\"ContractData\",C47, \"LastTradeToday\",, \"T\"))","v":""},{"$f":"IF(A47=\"\",\"\",RTD(\"cqg.rtd\", ,\"ContractData\",C47, \"NetLastTradeToday\",, \"T\"))","v":""},{"$f":"IF(A47=\"\",\"\",IFERROR(RTD(\"cqg.rtd\",,\"StudyData\",A47, \"PCB\",\"BaseType=Index,Index=1\", \"Close\", \"A\",,\"all\",,,,\"T\")/100,\"\"))","v":""},{"$f":"IF(A47=\"\",\"\",RTD(\"cqg.rtd\", ,\"ContractData\", C47, \"T_CVol\",, \"T\"))","v":""},47,{"$f":"IFERROR(RANK($J47,INDIRECT((\"$J$\"&\"1\"&\":$J$\"&$A$103)))+COUNTIF($J$1:J47,J47)-1,\"\")","v":""},"",""]
[{"$f":"IF(Symbols!A48=\"\",\"\",Symbols!A48)","v":""},"","",{"$f":"IF(A48=\"\",\"\",RTD(\"cqg.rtd\", ,\"ContractData\",C48, \"LongDescription\",, \"T\"))","v":""},null,null,null,{"$f":"IF(A48=\"\",\"\",RTD(\"cqg.rtd\", ,\"ContractData\",C48, \"LastTradeToday\",, \"T\"))","v":""},{"$f":"IF(A48=\"\",\"\",RTD(\"cqg.rtd\", ,\"ContractData\",C48, \"NetLastTradeToday\",, \"T\"))","v":""},{"$f":"IF(A48=\"\",\"\",IFERROR(RTD(\"cqg.rtd\",,\"StudyData\",A48, \"PCB\",\"BaseType=Index,Index=1\", \"Close\", \"A\",,\"all\",,,,\"T\")/100,\"\"))","v":""},{"$f":"IF(A48=\"\",\"\",RTD(\"cqg.rtd\", ,\"ContractData\", C48, \"T_CVol\",, \"T\"))","v":""},48,{"$f":"IFERROR(RANK($J48,INDIRECT((\"$J$\"&\"1\"&\":$J$\"&$A$103)))+COUNTIF($J$1:J48,J48)-1,\"\")","v":""},"",""]
[{"$f":"IF(Symbols!A49=\"\",\"\",Symbols!A49)","v":""},"","",{"$f":"IF(A49=\"\",\"\",RTD(\"cqg.rtd\", ,\"ContractData\",C49, \"LongDescription\",, \"T\"))","v":""},null,null,null,{"$f":"IF(A49=\"\",\"\",RTD(\"cqg.rtd\", ,\"ContractData\",C49, \"LastTradeToday\",, \"T\"))","v":""},{"$f":"IF(A49=\"\",\"\",RTD(\"cqg.rtd\", ,\"ContractData\",C49, \"NetLastTradeToday\",, \"T\"))","v":""},{"$f":"IF(A49=\"\",\"\",IFERROR(RTD(\"cqg.rtd\",,\"StudyData\",A49, \"PCB\",\"BaseType=Index,Index=1\", \"Close\", \"A\",,\"all\",,,,\"T\")/100,\"\"))","v":""},{"$f":"IF(A49=\"\",\"\",RTD(\"cqg.rtd\", ,\"ContractData\", C49, \"T_CVol\",, \"T\"))","v":""},49,{"$f":"IFERROR(RANK($J49,INDIRECT((\"$J$\"&\"1\"&\":$J$\"&$A$103)))+COUNTIF($J$1:J49,J49)-1,\"\")","v":""},"",""]
[{"$f":"IF(Symbols!A50=\"\",\"\",Symbols!A50)","v":""},"","",{"$f":"IF(A50=\"\",\"\",RTD(\"cqg.rtd\", ,\"ContractData\",C50, \"LongDescription\",, \"T\"))","v":""},null,null,null,{"$f":"IF(A50=\"\",\"\",RTD(\"cqg.rtd\", ,\"ContractData\",C50, \"LastTradeToday\",, \"T\"))","v":""},{"$f":"IF(A50=\"\",\"\",RTD(\"cqg.rtd\", ,\"ContractData\",C50, \"NetLastTradeToday\",, \"T\"))","v":""},{"$f":"IF(A50=\"\",\"\",IFERROR(RTD(\"cqg.rtd\",,\"StudyData\",A50, \"PCB\",\"BaseType=Index,Index=1\", \"Close\", \"A\",,\"all\",,,,\"T\")/100,\"\"))","v":""},{"$f":"IF(A50=\"\",\"\",RTD(\"cqg.rtd\", ,\"ContractData\", C50, \"T_CVol\",, \"T\"))","v":""},50,{"$f":"IFERROR(RANK($J50,INDIRECT((\"$J$\"&\"1\"&\":$J$\"&$A$103)))+COUNTIF($J$1:J50,J50)-1,\"\")","v":""},"",""]
[{"$f":"IF(Symbols!A51=\"\",\"\",Symbols!A51)","v":""},"","",{"$f":"IF(A51=\"\",\"\",RTD(\"cqg.rtd\", ,\"ContractData\",C51, \"LongDescription\",, \"T\"))","v":""},null,null,null,{"$f":"IF(A51=\"\",\"\",RTD(\"cqg.rtd\", ,\"ContractData\",C51, \"LastTradeToday\",, \"T\"))","v":""},{"$f":"IF(A51=\"\",\"\",RTD(\"cqg.rtd\", ,\"ContractData\",C51, \"NetLastTradeToday\",, \"T\"))","v":""},{"$f":"IF(A51=\"\",\"\",IFERROR(RTD(\"cqg.rtd\",,\"StudyData\",A51, \"PCB\",\"BaseType=Index,Index=1\", \"Close\", \"A\",,\"all\",,,,\"T\")/100,\"\"))","v":""},{"$f":"IF(A51=\"\",\"\",RTD(\"cqg.rtd\", ,\"ContractData\", C51, \"T_CVol\",, \"T\"))","v":""},51,{"$f":"IFERROR(RANK($J51,INDIRECT((\"$J$\"&\"1\"&\":$J$\"&$A$103)))+COUNTIF($J$1:J51,J51)-1,\"\")","v":""},"",""]
[{"$f":"IF(Symbols!A52=\"\",\"\",Symbols!A52)","v":""},"","",{"$f":"IF(A52=\"\",\"\",RTD(\"cqg.rtd\", ,\"ContractData\",C52, \"LongDescription\",, \"T\"))","v":""},null,null,null,{"$f":"IF(A52=\"\",\"\",RTD(\"cqg.rtd\", ,\"ContractData\",C52, \"LastTradeToday\",, \"T\"))","v":""},{"$f":"IF(A52=\"\",\"\",RTD(\"cqg.rtd\", ,\"ContractData\",C52, \"NetLastTradeToday\",, \"T\"))","v":""},{"$f":"IF(A52=\"\",\"\",IFERROR(RTD(\"cqg.rtd\",,\"StudyData\",A52, \"PCB\",\"BaseType=Index,Index=1\", \"Close\", \"A\",,\"all\",,,,\"T\")/100,\"\"))","v":""},{"$f":"IF(A52=\"\",\"\",RTD(\"cqg.rtd\", ,\"ContractData\", C52, \"T_CVol\",, \"T\"))","v":""},52,{"$f":"IFERROR(RANK($J52,INDIRECT((\"$J$\"&\"1\"&\":$J$\"&$A$103)))+COUNTIF($J$1:J52,J52)-1,\"\")","v":""},"",""]
[{"$f":"IF(Symbols!A53=\"\",\"\",Symbols!A53)","v":""},"","",{"$f":"IF(A53=\"\",\"\",RTD(\"cqg.rtd\", ,\"ContractData\",C53, \"LongDescription\",, \"T\"))","v":""},null,null,null,{"$f":"IF(A53=\"\",\"\",RTD(\"cqg.rtd\", ,\"ContractData\",C53, \"LastTradeToday\",, \"T\"))","v":""},{"$f":"IF(A53=\"\",\"\",RTD(\"cqg.rtd\", ,\"ContractData\",C53, \"NetLastTradeToday\",, \"T\"))","v":""},{"$f":"IF(A53=\"\",\"\",IFERROR(RTD(\"cqg.rtd\",,\"StudyData\",A53, \"PCB\",\"BaseType=Index,Index=1\", \"Close\", \"A\",,\"all\",,,,\"T\")/100,\"\"))","v":""},{"$f":"IF(A53=\"\",\"\",RTD(\"cqg.rtd\", ,\"ContractData\", C53, \"T_CVol\",, \"T\"))","v":""},53,{"$f":"IFERROR(RANK($J53,INDIRECT((\"$J$\"&\"1\"&\":$J$\"&$A$103)))+COUNTIF($J$1:J53,J53)-1,\"\")","v":""},"",""]
[{"$f":"IF(Symbols!A54=\"\",\"\",Symbols!A54)","v":""},"","",{"$f":"IF(A54=\"\",\"\",RTD(\"cqg.rtd\", ,\"ContractData\",C54, \"LongDescription\",, \"T\"))","v":""},null,null,null,{"$f":"IF(A54=\"\",\"\",RTD(\"cqg.rtd\", ,\"ContractData\",C54, \"LastTradeToday\",, \"T\"))","v":""},{"$f":"IF(A54=\"\",\"\",RTD(\"cqg.rtd\", ,\"ContractData\",C54, \"NetLastTradeToday\",, \"T\"))","v":""},{"$f":"IF(A54=\"\",\"\",IFERROR(RTD(\"cqg.rtd\",,\"StudyData\",A54, \"PCB\",\"BaseType=Index,Index=1\", \"Close\", \"A\",,\"all\",,,,\"T\")/100,\"\"))","v":""},{"$f":"IF(A54=\"\",\"\",RTD(\"cqg.rtd\", ,\"ContractData\", C54, \"T_CVol\",, \"T\"))","v":""},54,{"$f":"IFERROR(RANK($J54,INDIRECT((\"$J$\"&\"1\"&\":$J$\"&$A$103)))+COUNTIF($J$1:J54,J54)-1,\"\")","v":""},"",""]
[{"$f":"IF(Symbols!A55=\"\",\"\",Symbols!A55)","v":""},"","",{"$f":"IF(A55=\"\",\"\",RTD(\"cqg.rtd\", ,\"ContractData\",C55, \"LongDescription\",, \"T\"))","v":""},null,null,null,{"$f":"IF(A55=\"\",\"\",RTD(\"cqg.rtd\", ,\"ContractData\",C55, \"LastTradeToday\",, \"T\"))","v":""},{"$f":"IF(A55=\"\",\"\",RTD(\"cqg.rtd\", ,\"ContractData\",C55, \"NetLastTradeToday\",, \"T\"))","v":""},{"$f":"IF(A55=\"\",\"\",IFERROR(RTD(\"cqg.rtd\",,\"StudyData\",A55, \"PCB\",\"BaseType=Index,Index=1\", \"Close\", \"A\",,\"all\",,,,\"T\")/100,\"\"))","v":""},{"$f":"IF(A55=\"\",\"\",RTD(\"cqg.rtd\", ,\"ContractData\", C55, \"T_CVol\",, \"T\"))","v":""},55,{"$f":"IFERROR(RANK($J55,INDIRECT((\"$J$\"&\"1\"&\":$J$\"&$A$103)))+COUNTIF($J$1:J55,J55)-1,\"\")","v":""},"",""]
[{"$f":"IF(Symbols!A56=\"\",\"\",Symbols!A56)","v":""},"","",{"$f":"IF(A56=\"\",\"\",RTD(\"cqg.rtd\", ,\"ContractData\",C56, \"LongDescription\",, \"T\"))","v":""},null,null,null,{"$f":"IF(A56=\"\",\"\",RTD(\"cqg.rtd\", ,\"ContractData\",C56, \"LastTradeToday\",, \"T\"))","v":""},{"$f":"IF(A56=\"\",\"\",RTD(\"cqg.rtd\", ,\"ContractData\",C56, \"NetLastTradeToday\",, \"T\"))","v":""},{"$f":"IF(A56=\"\",\"\",IFERROR(RTD(\"cqg.rtd\",,\"StudyData\",A56, \"PCB\",\"BaseType=Index,Index=1\", \"Close\", \"A\",,\"all\",,,,\"T\")/100,\"\"))","v":""},{"$f":"IF(A56=\"\",\"\",RTD(\"cqg.rtd\", ,\"ContractData\", C56, \"T_CVol\",, \"T\"))","v":""},56,{"$f":"IFERROR(RANK($J56,INDIRECT((\"$J$\"&\"1\"&\":$J$\"&$A$103)))+COUNTIF($J$1:J56,J56)-1,\"\")","v":""},"",""]
[{"$f":"IF(Symbols!A57=\"\",\"\",Symbols!A57)","v":""},"","",{"$f":"IF(A57=\"\",\"\",RTD(\"cqg.rtd\", ,\"ContractData\",C57, \"LongDescription\",, \"T\"))","v":""},null,null,null,{"$f":"IF(A57=\"\",\"\",RTD(\"cqg.rtd\", ,\"ContractData\",C57, \"LastTradeToday\",, \"T\"))","v":""},{"$f":"IF(A57=\"\",\"\",RTD(\"cqg.rtd\", ,\"ContractData\",C57, \"NetLastTradeToday\",, \"T\"))","v":""},{"$f":"IF(A57=\"\",\"\",IFERROR(RTD(\"cqg.rtd\",,\"StudyData\",A57, \"PCB\",\"BaseType=Index,Index=1\", \"Close\", \"A\",,\"all\",,,,\"T\")/100,\"\"))","v":""},{"$f":"IF(A57=\"\",\"\",RTD(\"cqg.rtd\", ,\"ContractData\", C57, \"T_CVol\",, \"T\"))","v":""},57,{"$f":"IFERROR(RANK($J57,INDIRECT((\"$J$\"&\"1\"&\":$J$\"&$A$103)))+COUNTIF($J$1:J57,J57)-1,\"\")","v":""},"",""]
[{"$f":"IF(Symbols!A58=\"\",\"\",Symbols!A58)","v":""},"","",{"$f":"IF(A58=\"\",\"\",RTD(\"cqg.rtd\", ,\"ContractData\",C58, \"LongDescription\",, \"T\"))","v":""},null,null,null,{"$f":"IF(A58=\"\",\"\",RTD(\"cqg.rtd\", ,\"ContractData\",C58, \"LastTradeToday\",, \"T\"))","v":""},{"$f":"IF(A58=\"\",\"\",RTD(\"cqg.rtd\", ,\"ContractData\",C58, \"NetLastTradeToday\",, \"T\"))","v":""},{"$f":"IF(A58=\"\",\"\",IFERROR(RTD(\"cqg.rtd\",,\"StudyData\",A58, \"PCB\",\"BaseType=Index,Index=1\", \"Close\", \"A\",,\"all\",,,,\"T\")/100,\"\"))","v":""},{"$f":"IF(A58=\"\",\"\",RTD(\"cqg.rtd\", ,\"ContractData\", C58, \"T_CVol\",, \"T\"))","v":""},58,{"$f":"IFERROR(RANK($J58,INDIRECT((\"$J$\"&\"1\"&\":$J$\"&$A$103)))+COUNTIF($J$1:J58,J58)-1,\"\")","v":""},"",""]
[{"$f":"IF(Symbols!A59=\"\",\"\",Symbols!A59)","v":""},"","",{"$f":"IF(A59=\"\",\"\",RTD(\"cqg.rtd\", ,\"ContractData\",C59, \"LongDescription\",, \"T\"))","v":""},null,null,null,{"$f":"IF(A59=\"\",\"\",RTD(\"cqg.rtd\", ,\"ContractData\",C59, \"LastTradeToday\",, \"T\"))","v":""},{"$f":"IF(A59=\"\",\"\",RTD(\"cqg.rtd\", ,\"ContractData\",C59, \"NetLastTradeToday\",, \"T\"))","v":""},{"$f":"IF(A59=\"\",\"\",IFERROR(RTD(\"cqg.rtd\",,\"StudyData\",A59, \"PCB\",\"BaseType=Index,Index=1\", \"Close\", \"A\",,\"all\",,,,\"T\")/100,\"\"))","v":""},{"$f":"IF(A59=\"\",\"\",RTD(\"cqg.rtd\", ,\"ContractData\", C59, \"T_CVol\",, \"T\"))","v":""},59,{"$f":"IFERROR(RANK($J59,INDIRECT((\"$J$\"&\"1\"&\":$J$\"&$A$103)))+COUNTIF($J$1:J59,J59)-1,\"\")","v":""},"",""]
[{"$f":"IF(Symbols!A60=\"\",\"\",Symbols!A60)","v":""},"","",{"$f":"IF(A60=\"\",\"\",RTD(\"cqg.rtd\", ,\"ContractData\",C60, \"LongDescription\",, \"T\"))","v":""},null,null,null,{"$f":"IF(A60=\"\",\"\",RTD(\"cqg.rtd\", ,\"ContractData\",C60, \"LastTradeToday\",, \"T\"))","v":""},{"$f":"IF(A60=\"\",\"\",RTD(\"cqg.rtd\", ,\"ContractData\",C60, \"NetLastTradeToday\",, \"T\"))","v":""},{"$f":"IF(A60=\"\",\"\",IFERROR(RTD(\"cqg.rtd\",,\"StudyData\",A60, \"PCB\",\"BaseType=Index,Index=1\", \"Close\", \"A\",,\"all\",,,,\"T\")/100,\"\"))","v":""},{"$f":"IF(A60=\"\",\"\",RTD(\"cqg.rtd\", ,\"ContractData\", C60, \"T_CVol\",, \"T\"))","v":""},60,{"$f":"IFERROR(RANK($J60,INDIRECT((\"$J$\"&\"1\"&\":$J$\"&$A$103)))+COUNTIF($J$1:J60,J60)-1,\"\")","v":""},"",""]
[]
[]
[]
[]
[]
[]
[]
[]
[]
[]
[]
[]
[]
[]
[]
[]
[]
[]
[]
[]
[]
[]
[]
[]
[]
[]
[]
[]
[]
[]
[]
[]
[]
[]
[]
[]
[]
[]
[]
[]
[]
[]
[{"$f":"60-COUNTIF(A1:A60,\"\")","v":15},{"$f":"SUM(B1:B101)/A103","v":0.8}]
[{"$f":"\"$J$1:$J$\"&A103","v":"$J$1:$J$15"}]

{"sheet":"Symbols","index":3,"n_rows":60,"n_cols":8,"rows_kept":60,"cut":false,"hidden":false,"merged":[[0,6,0,10]]}
["S.US.BWXT",{"$f":"IF(A1=\"\",\"\",RTD(\"cqg.rtd\", ,\"ContractData\",A1, \"LongDescription\",, \"T\"))","v":"BWX Technologies, Inc."},"1) From their Web site download",null,null,null,"https://www.ark-funds.com/funds/arkk"]
["S.US.CCJ",{"$f":"IF(A2=\"\",\"\",RTD(\"cqg.rtd\", ,\"ContractData\",A2, \"LongDescription\",, \"T\"))","v":"Cameco Corp"},"the CSV File."]
["S.US.CEG",{"$f":"IF(A3=\"\",\"\",RTD(\"cqg.rtd\", ,\"ContractData\",A3, \"LongDescription\",, \"T\"))","v":"Constellation Energy Corporation"}]
["S.US.DNN",{"$f":"IF(A4=\"\",\"\",RTD(\"cqg.rtd\", ,\"ContractData\",A4, \"LongDescription\",, \"T\"))","v":"Denison Mines Corp"}]
["S.US.EU",{"$f":"IF(A5=\"\",\"\",RTD(\"cqg.rtd\", ,\"ContractData\",A5, \"LongDescription\",, \"T\"))","v":"enCore Energy Corp."}]
["S.US.LEU",{"$f":"IF(A6=\"\",\"\",RTD(\"cqg.rtd\", ,\"ContractData\",A6, \"LongDescription\",, \"T\"))","v":"Centrus Energy Corp."}]
["S.US.NNE",{"$f":"IF(A7=\"\",\"\",RTD(\"cqg.rtd\", ,\"ContractData\",A7, \"LongDescription\",, \"T\"))","v":"Nano Nuclear Energy Inc."}]
["S.US.NXE",{"$f":"IF(A8=\"\",\"\",RTD(\"cqg.rtd\", ,\"ContractData\",A8, \"LongDescription\",, \"T\"))","v":"Nexgen Energy Ltd."}]
["S.US.OKLO",{"$f":"IF(A9=\"\",\"\",RTD(\"cqg.rtd\", ,\"ContractData\",A9, \"LongDescription\",, \"T\"))","v":"Oklo Inc."}]
["S.US.PCG",{"$f":"IF(A10=\"\",\"\",RTD(\"cqg.rtd\", ,\"ContractData\",A10, \"LongDescription\",, \"T\"))","v":"PG&E Corp Hldg Co"}]
["S.US.PEG",{"$f":"IF(A11=\"\",\"\",RTD(\"cqg.rtd\", ,\"ContractData\",A11, \"LongDescription\",, \"T\"))","v":"Pub Svc Entrpr Grp Inc"}]
["S.US.SMR",{"$f":"IF(A12=\"\",\"\",RTD(\"cqg.rtd\", ,\"ContractData\",A12, \"LongDescription\",, \"T\"))","v":"NuScale Power Corporation"}]
["S.US.UEC",{"$f":"IF(A13=\"\",\"\",RTD(\"cqg.rtd\", ,\"ContractData\",A13, \"LongDescription\",, \"T\"))","v":"Uranium Energy Corp"}]
["S.US.UUUU",{"$f":"IF(A14=\"\",\"\",RTD(\"cqg.rtd\", ,\"ContractData\",A14, \"LongDescription\",, \"T\"))","v":"Energy Fuels Inc."}]
["S.US.NLR",{"$f":"IF(A15=\"\",\"\",RTD(\"cqg.rtd\", ,\"ContractData\",A15, \"LongDescription\",, \"T\"))","v":"Market Vectors Uranium+Nuclear EnergyETF"}]
[null,{"$f":"IF(A16=\"\",\"\",RTD(\"cqg.rtd\", ,\"ContractData\",A16, \"LongDescription\",, \"T\"))","v":""}]
[null,{"$f":"IF(A17=\"\",\"\",RTD(\"cqg.rtd\", ,\"ContractData\",A17, \"LongDescription\",, \"T\"))","v":""}]
[null,{"$f":"IF(A18=\"\",\"\",RTD(\"cqg.rtd\", ,\"ContractData\",A18, \"LongDescription\",, \"T\"))","v":""}]
[null,{"$f":"IF(A19=\"\",\"\",RTD(\"cqg.rtd\", ,\"ContractData\",A19, \"LongDescription\",, \"T\"))","v":""}]
[null,{"$f":"IF(A20=\"\",\"\",RTD(\"cqg.rtd\", ,\"ContractData\",A20, \"LongDescription\",, \"T\"))","v":""}]
[null,{"$f":"IF(A21=\"\",\"\",RTD(\"cqg.rtd\", ,\"ContractData\",A21, \"LongDescription\",, \"T\"))","v":""}]
[null,{"$f":"IF(A22=\"\",\"\",RTD(\"cqg.rtd\", ,\"ContractData\",A22, \"LongDescription\",, \"T\"))","v":""}]
[null,{"$f":"IF(A23=\"\",\"\",RTD(\"cqg.rtd\", ,\"ContractData\",A23, \"LongDescription\",, \"T\"))","v":""}]
[null,{"$f":"IF(A24=\"\",\"\",RTD(\"cqg.rtd\", ,\"ContractData\",A24, \"LongDescription\",, \"T\"))","v":""}]
[null,{"$f":"IF(A25=\"\",\"\",RTD(\"cqg.rtd\", ,\"ContractData\",A25, \"LongDescription\",, \"T\"))","v":""},"2) Copy the Tickers from the file."]
[null,{"$f":"IF(A26=\"\",\"\",RTD(\"cqg.rtd\", ,\"ContractData\",A26, \"LongDescription\",, \"T\"))","v":""},"Merge \"S.US.\" to the Tickers. =\"S.US.\"&H26",null,null,null,null,"NVDA"]
[null,{"$f":"IF(A27=\"\",\"\",RTD(\"cqg.rtd\", ,\"ContractData\",A27, \"LongDescription\",, \"T\"))","v":""},null,null,null,null,{"$f":"\"S.US.\"&H26","v":"S.US.NVDA"}]
[null,{"$f":"IF(A28=\"\",\"\",RTD(\"cqg.rtd\", ,\"ContractData\",A28, \"LongDescription\",, \"T\"))","v":""}]
[null,{"$f":"IF(A29=\"\",\"\",RTD(\"cqg.rtd\", ,\"ContractData\",A29, \"LongDescription\",, \"T\"))","v":""},"3) Remove money market fund tickers."]
[null,{"$f":"IF(A30=\"\",\"\",RTD(\"cqg.rtd\", ,\"ContractData\",A30, \"LongDescription\",, \"T\"))","v":""}]
[null,{"$f":"IF(A31=\"\",\"\",RTD(\"cqg.rtd\", ,\"ContractData\",A31, \"LongDescription\",, \"T\"))","v":""},"4) Copy and Paste \"As Values\" the updated Ticker List to column A."]
[null,{"$f":"IF(A32=\"\",\"\",RTD(\"cqg.rtd\", ,\"ContractData\",A32, \"LongDescription\",, \"T\"))","v":""}]
[null,{"$f":"IF(A33=\"\",\"\",RTD(\"cqg.rtd\", ,\"ContractData\",A33, \"LongDescription\",, \"T\"))","v":""}]
[null,{"$f":"IF(A34=\"\",\"\",RTD(\"cqg.rtd\", ,\"ContractData\",A34, \"LongDescription\",, \"T\"))","v":""}]
[null,{"$f":"IF(A35=\"\",\"\",RTD(\"cqg.rtd\", ,\"ContractData\",A35, \"LongDescription\",, \"T\"))","v":""}]
[null,{"$f":"IF(A36=\"\",\"\",RTD(\"cqg.rtd\", ,\"ContractData\",A36, \"LongDescription\",, \"T\"))","v":""}]
[null,{"$f":"IF(A37=\"\",\"\",RTD(\"cqg.rtd\", ,\"ContractData\",A37, \"LongDescription\",, \"T\"))","v":""}]
[null,{"$f":"IF(A38=\"\",\"\",RTD(\"cqg.rtd\", ,\"ContractData\",A38, \"LongDescription\",, \"T\"))","v":""}]
[null,{"$f":"IF(A39=\"\",\"\",RTD(\"cqg.rtd\", ,\"ContractData\",A39, \"LongDescription\",, \"T\"))","v":""}]
[null,{"$f":"IF(A40=\"\",\"\",RTD(\"cqg.rtd\", ,\"ContractData\",A40, \"LongDescription\",, \"T\"))","v":""}]
[null,{"$f":"IF(A41=\"\",\"\",RTD(\"cqg.rtd\", ,\"ContractData\",A41, \"LongDescription\",, \"T\"))","v":""}]
[null,{"$f":"IF(A42=\"\",\"\",RTD(\"cqg.rtd\", ,\"ContractData\",A42, \"LongDescription\",, \"T\"))","v":""}]
[null,{"$f":"IF(A43=\"\",\"\",RTD(\"cqg.rtd\", ,\"ContractData\",A43, \"LongDescription\",, \"T\"))","v":""}]
[null,{"$f":"IF(A44=\"\",\"\",RTD(\"cqg.rtd\", ,\"ContractData\",A44, \"LongDescription\",, \"T\"))","v":""}]
[null,{"$f":"IF(A45=\"\",\"\",RTD(\"cqg.rtd\", ,\"ContractData\",A45, \"LongDescription\",, \"T\"))","v":""}]
[null,{"$f":"IF(A46=\"\",\"\",RTD(\"cqg.rtd\", ,\"ContractData\",A46, \"LongDescription\",, \"T\"))","v":""}]
[null,{"$f":"IF(A47=\"\",\"\",RTD(\"cqg.rtd\", ,\"ContractData\",A47, \"LongDescription\",, \"T\"))","v":""}]
[null,{"$f":"IF(A48=\"\",\"\",RTD(\"cqg.rtd\", ,\"ContractData\",A48, \"LongDescription\",, \"T\"))","v":""}]
[null,{"$f":"IF(A49=\"\",\"\",RTD(\"cqg.rtd\", ,\"ContractData\",A49, \"LongDescription\",, \"T\"))","v":""}]
[null,{"$f":"IF(A50=\"\",\"\",RTD(\"cqg.rtd\", ,\"ContractData\",A50, \"LongDescription\",, \"T\"))","v":""}]
[null,{"$f":"IF(A51=\"\",\"\",RTD(\"cqg.rtd\", ,\"ContractData\",A51, \"LongDescription\",, \"T\"))","v":""}]
[null,{"$f":"IF(A52=\"\",\"\",RTD(\"cqg.rtd\", ,\"ContractData\",A52, \"LongDescription\",, \"T\"))","v":""}]
[null,{"$f":"IF(A53=\"\",\"\",RTD(\"cqg.rtd\", ,\"ContractData\",A53, \"LongDescription\",, \"T\"))","v":""}]
[null,{"$f":"IF(A54=\"\",\"\",RTD(\"cqg.rtd\", ,\"ContractData\",A54, \"LongDescription\",, \"T\"))","v":""}]
[null,{"$f":"IF(A55=\"\",\"\",RTD(\"cqg.rtd\", ,\"ContractData\",A55, \"LongDescription\",, \"T\"))","v":""}]
[null,{"$f":"IF(A56=\"\",\"\",RTD(\"cqg.rtd\", ,\"ContractData\",A56, \"LongDescription\",, \"T\"))","v":""}]
[null,{"$f":"IF(A57=\"\",\"\",RTD(\"cqg.rtd\", ,\"ContractData\",A57, \"LongDescription\",, \"T\"))","v":""}]
[null,{"$f":"IF(A58=\"\",\"\",RTD(\"cqg.rtd\", ,\"ContractData\",A58, \"LongDescription\",, \"T\"))","v":""}]
[null,{"$f":"IF(A59=\"\",\"\",RTD(\"cqg.rtd\", ,\"ContractData\",A59, \"LongDescription\",, \"T\"))","v":""}]
[null,{"$f":"IF(A60=\"\",\"\",RTD(\"cqg.rtd\", ,\"ContractData\",A60, \"LongDescription\",, \"T\"))","v":""}]