{"text_format":"1","workbook":"xlsx","n_sheets":3,"sheets":["Display","ARKW","Symbols"],"not_rendered":{"charts":2,"images":4,"macros":1,"external_links":0,"defined_names":1,"comments":0,"pivot_tables":0},"unopened":[],"bounds":{"document_bytes":16777216,"sheet_cells":100000,"rows_first":2000,"rows_last":500,"rows_between":2000,"halvings":0,"cell_chars":16384,"cell_head_chars":4096},"cells_cut":0,"cells_raw":0,"read":"whole","date_system":"1900"}

{"sheet":"Display","index":0,"n_rows":52,"n_cols":28,"rows_kept":52,"cut":false,"hidden":false,"merged":[[48,25,48,30],[35,2,35,6],[35,14,35,15],[36,2,36,6],[36,14,36,15],[48,9,48,24],[46,2,46,6],[46,14,46,15],[47,2,47,6],[47,14,47,15],[37,2,37,6],[37,14,37,15],[38,2,38,6],[38,14,38,15],[39,2,39,6],[39,14,39,15],[44,2,44,6],[44,14,44,15],[45,2,45,6],[45,14,45,15],[40,2,40,6],[40,14,40,15],[42,2,42,6],[42,14,42,15],[41,2,41,6],[41,14,41,15],[43,2,43,6],[43,14,43,15],[31,2,31,6],[31,14,31,15],[33,2,33,6],[33,14,33,15],[34,2,34,6],[34,14,34,15],[32,2,32,6],[32,14,32,15],[28,2,28,6],[28,14,28,15],[29,2,29,6],[29,14,29,15],[30,2,30,6],[30,14,30,15],[25,2,25,6],[25,14,25,15],[26,2,26,6],[26,14,26,15],[27,2,27,6],[27,14,27,15],[22,2,22,6],[22,14,22,15],[23,2,23,6],[23,14,23,15],[24,2,24,6],[24,14,24,15],[5,14,5,15],[4,1,4,16],[18,2,18,6],[18,14,18,15],[19,2,19,6],[19,14,19,15],[16,2,16,6],[16,14,16,15],[1,1,2,4],[1,27,2,30],[1,5,2,26],[4,18,4,30],[17,2,17,6],[17,14,17,15],[15,2,15,6],[5,2,5,6],[15,14,15,15],[14,14,14,15],[13,14,13,15],[12,14,12,15],[11,14,11,15],[10,14,10,15],[9,14,9,15],[9,2,9,6],[26,18,26,30],[6,2,6,6],[7,2,7,6],[8,2,8,6],[14,2,14,6],[10,2,10,6],[11,2,11,6],[12,2,12,6],[13,2,13,6],[8,14,8,15],[7,14,7,15],[6,14,6,15],[20,2,20,6],[20,14,20,15],[21,2,21,6],[21,14,21,15]]}
[]
[null,null,null,null,null,"CQG ARK Next Generation Internet ETF",null,null,null,null,null,null,null,null,null,null,null,null,null,null,null,null,null,null,null,null,null,{"$f":"RTD(\"cqg.rtd\", ,\"SystemInfo\", \"Linetime\")","v":45981.294571759259}]
[]
[]
[null,"Exchange Traded Funds Performance",null,null,null,null,null,null,null,null,null,null,null,null,null,null,null,null,"Top 15 Positive Performing Companies "]
[null,"Symbol","Description",null,null,null,null,"Last","NC","%NC","NC/ATR","Open","High","Low","Volume",null,"Ratio"]
[null,"ARKW",{"$f":"RTD(\"cqg.rtd\", ,\"ContractData\",B7, \"LongDescription\",, \"T\")","v":"ARK Next Generation Internet ETF"},null,null,null,null,{"$f":"RTD(\"cqg.rtd\", ,\"ContractData\",B7, \"LastTradeToday\",, \"T\")","v":""},{"$f":"RTD(\"cqg.rtd\", ,\"ContractData\",B7, \"NetLastTradeToday\",, \"T\")","v":""},{"$f":"IFERROR(RTD(\"cqg.rtd\", ,\"ContractData\",B7, \"PerCentNetLastTrade\",, \"T\")/100,\"\")","v":""},{"$f":"IFERROR(I7/RTD(\"cqg.rtd\",,\"StudyData\",B7, \"ATR\", \"MaType=Sim,Period=10\", \"ATR\",\"D\",\"-1\",\"ALL\",,,\"FALSE\",\"T\")/100,\"\")","v":""},{"$f":"RTD(\"cqg.rtd\", ,\"ContractData\",B7, \"OPen\",, \"T\")","v":""},{"$f":"RTD(\"cqg.rtd\", ,\"ContractData\", B7, \"HIgh\",, \"T\")","v":""},{"$f":"RTD(\"cqg.rtd\", ,\"ContractData\",B7, \"LOw\",, \"T\")","v":""},{"$f":"RTD(\"cqg.rtd\", ,\"ContractData\",B7, \"T_CVol\",, \"T\")","v":658},null,{"$f":" IFERROR(O7/RTD(\"cqg.rtd\",,\"StudyData\",B7, \"MA\", \"InputChoice=Vol,MAType=Sim,Period=21\", \"MA\",\"D\",\"-1\",\"all\",,,,\"T\"),\"\")","v":3.3198884817312426E-3}]
[null,"SPY",{"$f":"RTD(\"cqg.rtd\", ,\"ContractData\",B8, \"LongDescription\",, \"T\")","v":"SPDR S&P 500"},null,null,null,null,{"$f":"RTD(\"cqg.rtd\", ,\"ContractData\",B8, \"LastTradeToday\",, \"T\")","v":""},{"$f":"RTD(\"cqg.rtd\", ,\"ContractData\",B8, \"NetLastTradeToday\",, \"T\")","v":""},{"$f":"IFERROR(RTD(\"cqg.rtd\", ,\"ContractData\",B8, \"PerCentNetLastTrade\",, \"T\")/100,\"\")","v":""},{"$f":"IFERROR(I8/RTD(\"cqg.rtd\",,\"StudyData\",B8, \"ATR\", \"MaType=Sim,Period=10\", \"ATR\",\"D\",\"-1\",\"ALL\",,,\"FALSE\",\"T\")/100,\"\")","v":""},{"$f":"RTD(\"cqg.rtd\", ,\"ContractData\",B8, \"OPen\",, \"T\")","v":""},{"$f":"RTD(\"cqg.rtd\", ,\"ContractData\", B8, \"HIgh\",, \"T\")","v":""},{"$f":"RTD(\"cqg.rtd\", ,\"ContractData\",B8, \"LOw\",, \"T\")","v":""},{"$f":"RTD(\"cqg.rtd\", ,\"ContractData\",B8, \"T_CVol\",, \"T\")","v":818063},null,{"$f":" IFERROR(O8/RTD(\"cqg.rtd\",,\"StudyData\",B8, \"MA\", \"InputChoice=Vol,MAType=Sim,Period=21\", \"MA\",\"D\",\"-1\",\"all\",,,,\"T\"),\"\")","v":1.018273023131387E-2}]
[null,"XLF",{"$f":"RTD(\"cqg.rtd\", ,\"ContractData\",B9, \"LongDescription\",, \"T\")","v":"Financial Select Sector SPDR"},null,null,null,null,{"$f":"RTD(\"cqg.rtd\", ,\"ContractData\",B9, \"LastTradeToday\",, \"T\")","v":""},{"$f":"RTD(\"cqg.rtd\", ,\"ContractData\",B9, \"NetLastTradeToday\",, \"T\")","v":""},{"$f":"IFERROR(RTD(\"cqg.rtd\", ,\"ContractData\",B9, \"PerCentNetLastTrade\",, \"T\")/100,\"\")","v":""},{"$f":"IFERROR(I9/RTD(\"cqg.rtd\",,\"StudyData\",B9, \"ATR\", \"MaType=Sim,Period=10\", \"ATR\",\"D\",\"-1\",\"ALL\",,,\"FALSE\",\"T\")/100,\"\")","v":""},{"$f":"RTD(\"cqg.rtd\", ,\"ContractData\",B9, \"OPen\",, \"T\")","v":""},{"$f":"RTD(\"cqg.rtd\", ,\"ContractData\", B9, \"HIgh\",, \"T\")","v":""},{"$f":"RTD(\"cqg.rtd\", ,\"ContractData\",B9, \"LOw\",, \"T\")","v":""},{"$f":"RTD(\"cqg.rtd\", ,\"ContractData\",B9, \"T_CVol\",, \"T\")","v":65864},null,{"$f":" IFERROR(O9/RTD(\"cqg.rtd\",,\"StudyData\",B9, \"MA\", \"InputChoice=Vol,MAType=Sim,Period=21\", \"MA\",\"D\",\"-1\",\"all\",,,,\"T\"),\"\")","v":1.4811738199933665E-3}]
[null,"S.XLY",{"$f":"RTD(\"cqg.rtd\", ,\"ContractData\",B10, \"LongDescription\",, \"T\")","v":"Consumer Discretionary Select SectorSPDR"},null,null,null,null,{"$f":"RTD(\"cqg.rtd\", ,\"ContractData\",B10, \"LastTradeToday\",, \"T\")","v":""},{"$f":"RTD(\"cqg.rtd\", ,\"ContractData\",B10, \"NetLastTradeToday\",, \"T\")","v":""},{"$f":"IFERROR(RTD(\"cqg.rtd\", ,\"ContractData\",B10, \"PerCentNetLastTrade\",, \"T\")/100,\"\")","v":""},{"$f":"IFERROR(I10/RTD(\"cqg.rtd\",,\"StudyData\",B10, \"ATR\", \"MaType=Sim,Period=10\", \"ATR\",\"D\",\"-1\",\"ALL\",,,\"FALSE\",\"T\")/100,\"\")","v":""},{"$f":"RTD(\"cqg.rtd\", ,\"ContractData\",B10, \"OPen\",, \"T\")","v":""},{"$f":"RTD(\"cqg.rtd\", ,\"ContractData\", B10, \"HIgh\",, \"T\")","v":""},{"$f":"RTD(\"cqg.rtd\", ,\"ContractData\",B10, \"LOw\",, \"T\")","v":""},{"$f":"RTD(\"cqg.rtd\", ,\"ContractData\",B10, \"T_CVol\",, \"T\")","v":1693},null,{"$f":" IFERROR(O10/RTD(\"cqg.rtd\",,\"StudyData\",B10, \"MA\", \"InputChoice=Vol,MAType=Sim,Period=21\", \"MA\",\"D\",\"-1\",\"all\",,,,\"T\"),\"\")","v":2.664139941284611E-4}]
[null,"S.FXI",{"$f":"RTD(\"cqg.rtd\", ,\"ContractData\",B11, \"LongDescription\",, \"T\")","v":"iShares China Large-Cap ETF"},null,null,null,null,{"$f":"RTD(\"cqg.rtd\", ,\"ContractData\",B11, \"LastTradeToday\",, \"T\")","v":""},{"$f":"RTD(\"cqg.rtd\", ,\"ContractData\",B11, \"NetLastTradeToday\",, \"T\")","v":""},{"$f":"IFERROR(RTD(\"cqg.rtd\", ,\"ContractData\",B11, \"PerCentNetLastTrade\",, \"T\")/100,\"\")","v":""},{"$f":"IFERROR(I11/RTD(\"cqg.rtd\",,\"StudyData\",B11, \"ATR\", \"MaType=Sim,Period=10\", \"ATR\",\"D\",\"-1\",\"ALL\",,,\"FALSE\",\"T\")/100,\"\")","v":""},{"$f":"RTD(\"cqg.rtd\", ,\"ContractData\",B11, \"OPen\",, \"T\")","v":""},{"$f":"RTD(\"cqg.rtd\", ,\"ContractData\", B11, \"HIgh\",, \"T\")","v":""},{"$f":"RTD(\"cqg.rtd\", ,\"ContractData\",B11, \"LOw\",, \"T\")","v":""},{"$f":"RTD(\"cqg.rtd\", ,\"ContractData\",B11, \"T_CVol\",, \"T\")","v":146426},null,{"$f":" IFERROR(O11/RTD(\"cqg.rtd\",,\"StudyData\",B11, \"MA\", \"InputChoice=Vol,MAType=Sim,Period=21\", \"MA\",\"D\",\"-1\",\"all\",,,,\"T\"),\"\")","v":5.0483034507293372E-3}]
[null,"IWF",{"$f":"RTD(\"cqg.rtd\", ,\"ContractData\",B12, \"LongDescription\",, \"T\")","v":"iShares Russell 1000 Growth ETF"},null,null,null,null,{"$f":"RTD(\"cqg.rtd\", ,\"ContractData\",B12, \"LastTradeToday\",, \"T\")","v":""},{"$f":"RTD(\"cqg.rtd\", ,\"ContractData\",B12, \"NetLastTradeToday\",, \"T\")","v":""},{"$f":"IFERROR(RTD(\"cqg.rtd\", ,\"ContractData\",B12, \"PerCentNetLastTrade\",, \"T\")/100,\"\")","v":""},{"$f":"IFERROR(I12/RTD(\"cqg.rtd\",,\"StudyData\",B12, \"ATR\", \"MaType=Sim,Period=10\", \"ATR\",\"D\",\"-1\",\"ALL\",,,\"FALSE\",\"T\")/100,\"\")","v":""},{"$f":"RTD(\"cqg.rtd\", ,\"ContractData\",B12, \"OPen\",, \"T\")","v":""},{"$f":"RTD(\"cqg.rtd\", ,\"ContractData\", B12, \"HIgh\",, \"T\")","v":""},{"$f":"RTD(\"cqg.rtd\", ,\"ContractData\",B12, \"LOw\",, \"T\")","v":""},{"$f":"RTD(\"cqg.rtd\", ,\"ContractData\",B12, \"T_CVol\",, \"T\")","v":57},null,{"$f":" IFERROR(O12/RTD(\"cqg.rtd\",,\"StudyData\",B12, \"MA\", \"InputChoice=Vol,MAType=Sim,Period=21\", \"MA\",\"D\",\"-1\",\"all\",,,,\"T\"),\"\")","v":4.3409557058236213E-5}]
[null,"IWO",{"$f":"RTD(\"cqg.rtd\", ,\"ContractData\",B13, \"LongDescription\",, \"T\")","v":"iShares Russell 2000 Growth ETF"},null,null,null,null,{"$f":"RTD(\"cqg.rtd\", ,\"ContractData\",B13, \"LastTradeToday\",, \"T\")","v":""},{"$f":"RTD(\"cqg.rtd\", ,\"ContractData\",B13, \"NetLastTradeToday\",, \"T\")","v":""},{"$f":"IFERROR(RTD(\"cqg.rtd\", ,\"ContractData\",B13, \"PerCentNetLastTrade\",, \"T\")/100,\"\")","v":""},{"$f":"IFERROR(I13/RTD(\"cqg.rtd\",,\"StudyData\",B13, \"ATR\", \"MaType=Sim,Period=10\", \"ATR\",\"D\",\"-1\",\"ALL\",,,\"FALSE\",\"T\")/100,\"\")","v":""},{"$f":"RTD(\"cqg.rtd\", ,\"ContractData\",B13, \"OPen\",, \"T\")","v":""},{"$f":"RTD(\"cqg.rtd\", ,\"ContractData\", B13, \"HIgh\",, \"T\")","v":""},{"$f":"RTD(\"cqg.rtd\", ,\"ContractData\",B13, \"LOw\",, \"T\")","v":""},{"$f":"RTD(\"cqg.rtd\", ,\"ContractData\",B13, \"T_CVol\",, \"T\")","v":5},null,{"$f":" IFERROR(O13/RTD(\"cqg.rtd\",,\"StudyData\",B13, \"MA\", \"InputChoice=Vol,MAType=Sim,Period=21\", \"MA\",\"D\",\"-1\",\"all\",,,,\"T\"),\"\")","v":1.2489254780440681E-5}]
[null,"EP",{"$f":"RTD(\"cqg.rtd\", ,\"ContractData\",B14, \"LongDescription\",, \"T\")","v":"E-Mini S&P 500, Dec 25"},null,null,null,null,{"$f":"RTD(\"cqg.rtd\", ,\"ContractData\",B14, \"LastTradeToday\",, \"T\")","v":6750.25},{"$f":"RTD(\"cqg.rtd\", ,\"ContractData\",B14, \"NetLastTradeToday\",, \"T\")","v":88.75},{"$f":"IFERROR(RTD(\"cqg.rtd\", ,\"ContractData\",B14, \"PerCentNetLastTrade\",, \"T\")/100,\"\")","v":1.3322825189521879E-2},{"$f":"IFERROR(I14/RTD(\"cqg.rtd\",,\"StudyData\",B14, \"ATR\", \"MaType=Sim,Period=10\", \"ATR\",\"D\",\"-1\",\"ALL\",,,\"FALSE\",\"T\")/100,\"\")","v":8.3608101742816757E-3},{"$f":"RTD(\"cqg.rtd\", ,\"ContractData\",B14, \"OPen\",, \"T\")","v":6697.5},{"$f":"RTD(\"cqg.rtd\", ,\"ContractData\", B14, \"HIgh\",, \"T\")","v":6757},{"$f":"RTD(\"cqg.rtd\", ,\"ContractData\",B14, \"LOw\",, \"T\")","v":6694},{"$f":"RTD(\"cqg.rtd\", ,\"ContractData\",B14, \"T_CVol\",, \"T\")","v":194307},null,{"$f":" IFERROR(O14/RTD(\"cqg.rtd\",,\"StudyData\",B14, \"MA\", \"InputChoice=Vol,MAType=Sim,Period=21\", \"MA\",\"D\",\"-1\",\"all\",,,,\"T\"),\"\")","v":0.1145718051649208}]
[null,"XLE",{"$f":"RTD(\"cqg.rtd\", ,\"ContractData\",B15, \"LongDescription\",, \"T\")","v":"Energy Select Sector SPDR"},null,null,null,null,{"$f":"RTD(\"cqg.rtd\", ,\"ContractData\",B15, \"LastTradeToday\",, \"T\")","v":""},{"$f":"RTD(\"cqg.rtd\", ,\"ContractData\",B15, \"NetLastTradeToday\",, \"T\")","v":""},{"$f":"IFERROR(RTD(\"cqg.rtd\", ,\"ContractData\",B15, \"PerCentNetLastTrade\",, \"T\")/100,\"\")","v":""},{"$f":"IFERROR(I15/RTD(\"cqg.rtd\",,\"StudyData\",B15, \"ATR\", \"MaType=Sim,Period=10\", \"ATR\",\"D\",\"-1\",\"ALL\",,,\"FALSE\",\"T\")/100,\"\")","v":""},{"$f":"RTD(\"cqg.rtd\", ,\"ContractData\",B15, \"OPen\",, \"T\")","v":""},{"$f":"RTD(\"cqg.rtd\", ,\"ContractData\", B15, \"HIgh\",, \"T\")","v":""},{"$f":"RTD(\"cqg.rtd\", ,\"ContractData\",B15, \"LOw\",, \"T\")","v":""},{"$f":"RTD(\"cqg.rtd\", ,\"ContractData\",B15, \"T_CVol\",, \"T\")","v":12275},null,{"$f":" IFERROR(O15/RTD(\"cqg.rtd\",,\"StudyData\",B15, \"MA\", \"InputChoice=Vol,MAType=Sim,Period=21\", \"MA\",\"D\",\"-1\",\"all\",,,,\"T\"),\"\")","v":8.0469483142176271E-4}]
[null,"USO",{"$f":"RTD(\"cqg.rtd\", ,\"ContractData\",B16, \"LongDescription\",, \"T\")","v":"United States Oil Fund"},null,null,null,null,{"$f":"RTD(\"cqg.rtd\", ,\"ContractData\",B16, \"LastTradeToday\",, \"T\")","v":""},{"$f":"RTD(\"cqg.rtd\", ,\"ContractData\",B16, \"NetLastTradeToday\",, \"T\")","v":""},{"$f":"IFERROR(RTD(\"cqg.rtd\", ,\"ContractData\",B16, \"PerCentNetLastTrade\",, \"T\")/100,\"\")","v":""},{"$f":"IFERROR(I16/RTD(\"cqg.rtd\",,\"StudyData\",B16, \"ATR\", \"MaType=Sim,Period=10\", \"ATR\",\"D\",\"-1\",\"ALL\",,,\"FALSE\",\"T\")/100,\"\")","v":""},{"$f":"RTD(\"cqg.rtd\", ,\"ContractData\",B16, \"OPen\",, \"T\")","v":""},{"$f":"RTD(\"cqg.rtd\", ,\"ContractData\", B16, \"HIgh\",, \"T\")","v":""},{"$f":"RTD(\"cqg.rtd\", ,\"ContractData\",B16, \"LOw\",, \"T\")","v":""},{"$f":"RTD(\"cqg.rtd\", ,\"ContractData\",B16, \"T_CVol\",, \"T\")","v":39226},null,{"$f":" IFERROR(O16/RTD(\"cqg.rtd\",,\"StudyData\",B16, \"MA\", \"InputChoice=Vol,MAType=Sim,Period=21\", \"MA\",\"D\",\"-1\",\"all\",,,,\"T\"),\"\")","v":7.8019168230648792E-3}]
[null,null,"Top 15 Description",null,null,null,null,"Last","NC","%NC","NC/ATR","Open","High","Low","Volume",null,"Ratio"]
[{"$f":"TRIM(ARKW!O1)","v":""},"News",{"$f":"IFERROR(RTD(\"cqg.rtd\", ,\"ContractData\",A18, \"LongDescription\",, \"T\")&\" (\"&RIGHT(A18,LEN(A18)-5)&\")\",\"\")","v":""},null,null,null,null,{"$f":"IF(C18=\"\",\"\",IFERROR(RTD(\"cqg.rtd\", ,\"ContractData\",A18, \"LastTradeToday\",, \"T\"),\"\"))","v":""},{"$f":"IF(C18=\"\",\"\",IFERROR(RTD(\"cqg.rtd\", ,\"ContractData\",A18, \"NetLastTradeToday\",, \"T\"),\"\"))","v":""},{"$f":"IFERROR(RTD(\"cqg.rtd\", ,\"ContractData\",A18, \"PerCentNetLastTrade\",, \"T\")/100,\"\")","v":""},{"$f":"IFERROR(I18/RTD(\"cqg.rtd\",,\"StudyData\",A18, \"ATR\", \"MaType=Sim,Period=10\", \"ATR\",\"D\",\"-1\",\"ALL\",,,\"FALSE\",\"T\")/100,\"\")","v":""},{"$f":"IF(C18=\"\",\"\",IFERROR(RTD(\"cqg.rtd\", ,\"ContractData\",A18, \"OPen\",, \"T\"),\"\"))","v":""},{"$f":"IF(C18=\"\",\"\",IFERROR(RTD(\"cqg.rtd\", ,\"ContractData\", A18, \"HIgh\",, \"T\"),\"\"))","v":""},{"$f":"IF(C18=\"\",\"\",IFERROR(RTD(\"cqg.rtd\", ,\"ContractData\",A18, \"LOw\",, \"T\"),\"\"))","v":""},{"$f":"IF(C18=\"\",\"\",IFERROR(RTD(\"cqg.rtd\", ,\"ContractData\",A18, \"T_CVol\",, \"T\"),\"\"))","v":""},null,{"$f":" IFERROR(O18/RTD(\"cqg.rtd\",,\"StudyData\",A18, \"MA\", \"InputChoice=Vol,MAType=Sim,Period=21\", \"MA\",\"D\",\"-1\",\"all\",,,,\"T\"),\"\")","v":""},{"$f":"ARKW!R1","v":""}]
[{"$f":"TRIM(ARKW!O2)","v":""},"News",{"$f":"IFERROR(RTD(\"cqg.rtd\", ,\"ContractData\",A19, \"LongDescription\",, \"T\")&\" (\"&RIGHT(A19,LEN(A19)-5)&\")\",\"\")","v":""},null,null,null,null,{"$f":"IF(C19=\"\",\"\",IFERROR(RTD(\"cqg.rtd\", ,\"ContractData\",A19, \"LastTradeToday\",, \"T\"),\"\"))","v":""},{"$f":"IF(C19=\"\",\"\",IFERROR(RTD(\"cqg.rtd\", ,\"ContractData\",A19, \"NetLastTradeToday\",, \"T\"),\"\"))","v":""},{"$f":"IFERROR(RTD(\"cqg.rtd\", ,\"ContractData\",A19, \"PerCentNetLastTrade\",, \"T\")/100,\"\")","v":""},{"$f":"IFERROR(I19/RTD(\"cqg.rtd\",,\"StudyData\",A19, \"ATR\", \"MaType=Sim,Period=10\", \"ATR\",\"D\",\"-1\",\"ALL\",,,\"FALSE\",\"T\")/100,\"\")","v":""},{"$f":"IF(C19=\"\",\"\",IFERROR(RTD(\"cqg.rtd\", ,\"ContractData\",A19, \"OPen\",, \"T\"),\"\"))","v":""},{"$f":"IF(C19=\"\",\"\",IFERROR(RTD(\"cqg.rtd\", ,\"ContractData\", A19, \"HIgh\",, \"T\"),\"\"))","v":""},{"$f":"IF(C19=\"\",\"\",IFERROR(RTD(\"cqg.rtd\", ,\"ContractData\",A19, \"LOw\",, \"T\"),\"\"))","v":""},{"$f":"IF(C19=\"\",\"\",IFERROR(RTD(\"cqg.rtd\", ,\"ContractData\",A19, \"T_CVol\",, \"T\"),\"\"))","v":""},null,{"$f":" IFERROR(O19/RTD(\"cqg.rtd\",,\"StudyData\",A19, \"MA\", \"InputChoice=Vol,MAType=Sim,Period=21\", \"MA\",\"D\",\"-1\",\"all\",,,,\"T\"),\"\")","v":""},{"$f":"ARKW!R2","v":""}]
[{"$f":"TRIM(ARKW!O3)","v":""},"News",{"$f":"IFERROR(RTD(\"cqg.rtd\", ,\"ContractData\",A20, \"LongDescription\",, \"T\")&\" (\"&RIGHT(A20,LEN(A20)-5)&\")\",\"\")","v":""},null,null,null,null,{"$f":"IF(C20=\"\",\"\",IFERROR(RTD(\"cqg.rtd\", ,\"ContractData\",A20, \"LastTradeToday\",, \"T\"),\"\"))","v":""},{"$f":"IF(C20=\"\",\"\",IFERROR(RTD(\"cqg.rtd\", ,\"ContractData\",A20, \"NetLastTradeToday\",, \"T\"),\"\"))","v":""},{"$f":"IFERROR(RTD(\"cqg.rtd\", ,\"ContractData\",A20, \"PerCentNetLastTrade\",, \"T\")/100,\"\")","v":""},{"$f":"IFERROR(I20/RTD(\"cqg.rtd\",,\"StudyData\",A20, \"ATR\", \"MaType=Sim,Period=10\", \"ATR\",\"D\",\"-1\",\"ALL\",,,\"FALSE\",\"T\")/100,\"\")","v":""},{"$f":"IF(C20=\"\",\"\",IFERROR(RTD(\"cqg.rtd\", ,\"ContractData\",A20, \"OPen\",, \"T\"),\"\"))","v":""},{"$f":"IF(C20=\"\",\"\",IFERROR(RTD(\"cqg.rtd\", ,\"ContractData\", A20, \"HIgh\",, \"T\"),\"\"))","v":""},{"$f":"IF(C20=\"\",\"\",IFERROR(RTD(\"cqg.rtd\", ,\"ContractData\",A20, \"LOw\",, \"T\"),\"\"))","v":""},{"$f":"IF(C20=\"\",\"\",IFERROR(RTD(\"cqg.rtd\", ,\"ContractData\",A20, \"T_CVol\",, \"T\"),\"\"))","v":""},null,{"$f":" IFERROR(O20/RTD(\"cqg.rtd\",,\"StudyData\",A20, \"MA\", \"InputChoice=Vol,MAType=Sim,Period=21\", \"MA\",\"D\",\"-1\",\"all\",,,,\"T\"),\"\")","v":""},{"$f":"ARKW!R3","v":""}]
[{"$f":"TRIM(ARKW!O4)","v":""},"News",{"$f":"IFERROR(RTD(\"cqg.rtd\", ,\"ContractData\",A21, \"LongDescription\",, \"T\")&\" (\"&RIGHT(A21,LEN(A21)-5)&\")\",\"\")","v":""},null,null,null,null,{"$f":"IF(C21=\"\",\"\",IFERROR(RTD(\"cqg.rtd\", ,\"ContractData\",A21, \"LastTradeToday\",, \"T\"),\"\"))","v":""},{"$f":"IF(C21=\"\",\"\",IFERROR(RTD(\"cqg.rtd\", ,\"ContractData\",A21, \"NetLastTradeToday\",, \"T\"),\"\"))","v":""},{"$f":"IFERROR(RTD(\"cqg.rtd\", ,\"ContractData\",A21, \"PerCentNetLastTrade\",, \"T\")/100,\"\")","v":""},{"$f":"IFERROR(I21/RTD(\"cqg.rtd\",,\"StudyData\",A21, \"ATR\", \"MaType=Sim,Period=10\", \"ATR\",\"D\",\"-1\",\"ALL\",,,\"FALSE\",\"T\")/100,\"\")","v":""},{"$f":"IF(C21=\"\",\"\",IFERROR(RTD(\"cqg.rtd\", ,\"ContractData\",A21, \"OPen\",, \"T\"),\"\"))","v":""},{"$f":"IF(C21=\"\",\"\",IFERROR(RTD(\"cqg.rtd\", ,\"ContractData\", A21, \"HIgh\",, \"T\"),\"\"))","v":""},{"$f":"IF(C21=\"\",\"\",IFERROR(RTD(\"cqg.rtd\", ,\"ContractData\",A21, \"LOw\",, \"T\"),\"\"))","v":""},{"$f":"IF(C21=\"\",\"\",IFERROR(RTD(\"cqg.rtd\", ,\"ContractData\",A21, \"T_CVol\",, \"T\"),\"\"))","v":""},null,{"$f":" IFERROR(O21/RTD(\"cqg.rtd\",,\"StudyData\",A21, \"MA\", \"InputChoice=Vol,MAType=Sim,Period=21\", \"MA\",\"D\",\"-1\",\"all\",,,,\"T\"),\"\")","v":""},{"$f":"ARKW!R4","v":""}]
[{"$f":"TRIM(ARKW!O5)","v":""},"News",{"$f":"IFERROR(RTD(\"cqg.rtd\", ,\"ContractData\",A22, \"LongDescription\",, \"T\")&\" (\"&RIGHT(A22,LEN(A22)-5)&\")\",\"\")","v":""},null,null,null,null,{"$f":"IF(C22=\"\",\"\",IFERROR(RTD(\"cqg.rtd\", ,\"ContractData\",A22, \"LastTradeToday\",, \"T\"),\"\"))","v":""},{"$f":"IF(C22=\"\",\"\",IFERROR(RTD(\"cqg.rtd\", ,\"ContractData\",A22, \"NetLastTradeToday\",, \"T\"),\"\"))","v":""},{"$f":"IFERROR(RTD(\"cqg.rtd\", ,\"ContractData\",A22, \"PerCentNetLastTrade\",, \"T\")/100,\"\")","v":""},{"$f":"IFERROR(I22/RTD(\"cqg.rtd\",,\"StudyData\",A22, \"ATR\", \"MaType=Sim,Period=10\", \"ATR\",\"D\",\"-1\",\"ALL\",,,\"FALSE\",\"T\")/100,\"\")","v":""},{"$f":"IF(C22=\"\",\"\",IFERROR(RTD(\"cqg.rtd\", ,\"ContractData\",A22, \"OPen\",, \"T\"),\"\"))","v":""},{"$f":"IF(C22=\"\",\"\",IFERROR(RTD(\"cqg.rtd\", ,\"ContractData\", A22, \"HIgh\",, \"T\"),\"\"))","v":""},{"$f":"IF(C22=\"\",\"\",IFERROR(RTD(\"cqg.rtd\", ,\"ContractData\",A22, \"LOw\",, \"T\"),\"\"))","v":""},{"$f":"IF(C22=\"\",\"\",IFERROR(RTD(\"cqg.rtd\", ,\"ContractData\",A22, \"T_CVol\",, \"T\"),\"\"))","v":""},null,{"$f":" IFERROR(O22/RTD(\"cqg.rtd\",,\"StudyData\",A22, \"MA\", \"InputChoice=Vol,MAType=Sim,Period=21\", \"MA\",\"D\",\"-1\",\"all\",,,,\"T\"),\"\")","v":""},{"$f":"ARKW!R5","v":""}]
[{"$f":"TRIM(ARKW!O6)","v":""},"News",{"$f":"IFERROR(RTD(\"cqg.rtd\", ,\"ContractData\",A23, \"LongDescription\",, \"T\")&\" (\"&RIGHT(A23,LEN(A23)-5)&\")\",\"\")","v":""},null,null,null,null,{"$f":"IF(C23=\"\",\"\",IFERROR(RTD(\"cqg.rtd\", ,\"ContractData\",A23, \"LastTradeToday\",, \"T\"),\"\"))","v":""},{"$f":"IF(C23=\"\",\"\",IFERROR(RTD(\"cqg.rtd\", ,\"ContractData\",A23, \"NetLastTradeToday\",, \"T\"),\"\"))","v":""},{"$f":"IFERROR(RTD(\"cqg.rtd\", ,\"ContractData\",A23, \"PerCentNetLastTrade\",, \"T\")/100,\"\")","v":""},{"$f":"IFERROR(I23/RTD(\"cqg.rtd\",,\"StudyData\",A23, \"ATR\", \"MaType=Sim,Period=10\", \"ATR\",\"D\",\"-1\",\"ALL\",,,\"FALSE\",\"T\")/100,\"\")","v":""},{"$f":"IF(C23=\"\",\"\",IFERROR(RTD(\"cqg.rtd\", ,\"ContractData\",A23, \"OPen\",, \"T\"),\"\"))","v":""},{"$f":"IF(C23=\"\",\"\",IFERROR(RTD(\"cqg.rtd\", ,\"ContractData\", A23, \"HIgh\",, \"T\"),\"\"))","v":""},{"$f":"IF(C23=\"\",\"\",IFERROR(RTD(\"cqg.rtd\", ,\"ContractData\",A23, \"LOw\",, \"T\"),\"\"))","v":""},{"$f":"IF(C23=\"\",\"\",IFERROR(RTD(\"cqg.rtd\", ,\"ContractData\",A23, \"T_CVol\",, \"T\"),\"\"))","v":""},null,{"$f":" IFERROR(O23/RTD(\"cqg.rtd\",,\"StudyData\",A23, \"MA\", \"InputChoice=Vol,MAType=Sim,Period=21\", \"MA\",\"D\",\"-1\",\"all\",,,,\"T\"),\"\")","v":""},{"$f":"ARKW!R6","v":""}]
[{"$f":"TRIM(ARKW!O7)","v":""},"News",{"$f":"IFERROR(RTD(\"cqg.rtd\", ,\"ContractData\",A24, \"LongDescription\",, \"T\")&\" (\"&RIGHT(A24,LEN(A24)-5)&\")\",\"\")","v":""},null,null,null,null,{"$f":"IF(C24=\"\",\"\",IFERROR(RTD(\"cqg.rtd\", ,\"ContractData\",A24, \"LastTradeToday\",, \"T\"),\"\"))","v":""},{"$f":"IF(C24=\"\",\"\",IFERROR(RTD(\"cqg.rtd\", ,\"ContractData\",A24, \"NetLastTradeToday\",, \"T\"),\"\"))","v":""},{"$f":"IFERROR(RTD(\"cqg.rtd\", ,\"ContractData\",A24, \"PerCentNetLastTrade\",, \"T\")/100,\"\")","v":""},{"$f":"IFERROR(I24/RTD(\"cqg.rtd\",,\"StudyData\",A24, \"ATR\", \"MaType=Sim,Period=10\", \"ATR\",\"D\",\"-1\",\"ALL\",,,\"FALSE\",\"T\")/100,\"\")","v":""},{"$f":"IF(C24=\"\",\"\",IFERROR(RTD(\"cqg.rtd\", ,\"ContractData\",A24, \"OPen\",, \"T\"),\"\"))","v":""},{"$f":"IF(C24=\"\",\"\",IFERROR(RTD(\"cqg.rtd\", ,\"ContractData\", A24, \"HIgh\",, \"T\"),\"\"))","v":""},{"$f":"IF(C24=\"\",\"\",IFERROR(RTD(\"cqg.rtd\", ,\"ContractData\",A24, \"LOw\",, \"T\"),\"\"))","v":""},{"$f":"IF(C24=\"\",\"\",IFERROR(RTD(\"cqg.rtd\", ,\"ContractData\",A24, \"T_CVol\",, \"T\"),\"\"))","v":""},null,{"$f":" IFERROR(O24/RTD(\"cqg.rtd\",,\"StudyData\",A24, \"MA\", \"InputChoice=Vol,MAType=Sim,Period=21\", \"MA\",\"D\",\"-1\",\"all\",,,,\"T\"),\"\")","v":""},{"$f":"ARKW!R7","v":""}]
[{"$f":"TRIM(ARKW!O8)","v":""},"News",{"$f":"IFERROR(RTD(\"cqg.rtd\", ,\"ContractData\",A25, \"LongDescription\",, \"T\")&\" (\"&RIGHT(A25,LEN(A25)-5)&\")\",\"\")","v":""},null,null,null,null,{"$f":"IF(C25=\"\",\"\",IFERROR(RTD(\"cqg.rtd\", ,\"ContractData\",A25, \"LastTradeToday\",, \"T\"),\"\"))","v":""},{"$f":"IF(C25=\"\",\"\",IFERROR(RTD(\"cqg.rtd\", ,\"ContractData\",A25, \"NetLastTradeToday\",, \"T\"),\"\"))","v":""},{"$f":"IFERROR(RTD(\"cqg.rtd\", ,\"ContractData\",A25, \"PerCentNetLastTrade\",, \"T\")/100,\"\")","v":""},{"$f":"IFERROR(I25/RTD(\"cqg.rtd\",,\"StudyData\",A25, \"ATR\", \"MaType=Sim,Period=10\", \"ATR\",\"D\",\"-1\",\"ALL\",,,\"FALSE\",\"T\")/100,\"\")","v":""},{"$f":"IF(C25=\"\",\"\",IFERROR(RTD(\"cqg.rtd\", ,\"ContractData\",A25, \"OPen\",, \"T\"),\"\"))","v":""},{"$f":"IF(C25=\"\",\"\",IFERROR(RTD(\"cqg.rtd\", ,\"ContractData\", A25, \"HIgh\",, \"T\"),\"\"))","v":""},{"$f":"IF(C25=\"\",\"\",IFERROR(RTD(\"cqg.rtd\", ,\"ContractData\",A25, \"LOw\",, \"T\"),\"\"))","v":""},{"$f":"IF(C25=\"\",\"\",IFERROR(RTD(\"cqg.rtd\", ,\"ContractData\",A25, \"T_CVol\",, \"T\"),\"\"))","v":""},null,{"$f":" IFERROR(O25/RTD(\"cqg.rtd\",,\"StudyData\",A25, \"MA\", \"InputChoice=Vol,MAType=Sim,Period=21\", \"MA\",\"D\",\"-1\",\"all\",,,,\"T\"),\"\")","v":""},{"$f":"ARKW!R8","v":""}]
[{"$f":"TRIM(ARKW!O9)","v":""},"News",{"$f":"IFERROR(RTD(\"cqg.rtd\", ,\"ContractData\",A26, \"LongDescription\",, \"T\")&\" (\"&RIGHT(A26,LEN(A26)-5)&\")\",\"\")","v":""},null,null,null,null,{"$f":"IF(C26=\"\",\"\",IFERROR(RTD(\"cqg.rtd\", ,\"ContractData\",A26, \"LastTradeToday\",, \"T\"),\"\"))","v":""},{"$f":"IF(C26=\"\",\"\",IFERROR(RTD(\"cqg.rtd\", ,\"ContractData\",A26, \"NetLastTradeToday\",, \"T\"),\"\"))","v":""},{"$f":"IFERROR(RTD(\"cqg.rtd\", ,\"ContractData\",A26, \"PerCentNetLastTrade\",, \"T\")/100,\"\")","v":""},{"$f":"IFERROR(I26/RTD(\"cqg.rtd\",,\"StudyData\",A26, \"ATR\", \"MaType=Sim,Period=10\", \"ATR\",\"D\",\"-1\",\"ALL\",,,\"FALSE\",\"T\")/100,\"\")","v":""},{"$f":"IF(C26=\"\",\"\",IFERROR(RTD(\"cqg.rtd\", ,\"ContractData\",A26, \"OPen\",, \"T\"),\"\"))","v":""},{"$f":"IF(C26=\"\",\"\",IFERROR(RTD(\"cqg.rtd\", ,\"ContractData\", A26, \"HIgh\",, \"T\"),\"\"))","v":""},{"$f":"IF(C26=\"\",\"\",IFERROR(RTD(\"cqg.rtd\", ,\"ContractData\",A26, \"LOw\",, \"T\"),\"\"))","v":""},{"$f":"IF(C26=\"\",\"\",IFERROR(RTD(\"cqg.rtd\", ,\"ContractData\",A26, \"T_CVol\",, \"T\"),\"\"))","v":""},null,{"$f":" IFERROR(O26/RTD(\"cqg.rtd\",,\"StudyData\",A26, \"MA\", \"InputChoice=Vol,MAType=Sim,Period=21\", \"MA\",\"D\",\"-1\",\"all\",,,,\"T\"),\"\")","v":""},{"$f":"ARKW!R9","v":""}]
[{"$f":"TRIM(ARKW!O10)","v":""},"News",{"$f":"IFERROR(RTD(\"cqg.rtd\", ,\"ContractData\",A27, \"LongDescription\",, \"T\")&\" (\"&RIGHT(A27,LEN(A27)-5)&\")\",\"\")","v":""},null,null,null,null,{"$f":"IF(C27=\"\",\"\",IFERROR(RTD(\"cqg.rtd\", ,\"ContractData\",A27, \"LastTradeToday\",, \"T\"),\"\"))","v":""},{"$f":"IF(C27=\"\",\"\",IFERROR(RTD(\"cqg.rtd\", ,\"ContractData\",A27, \"NetLastTradeToday\",, \"T\"),\"\"))","v":""},{"$f":"IFERROR(RTD(\"cqg.rtd\", ,\"ContractData\",A27, \"PerCentNetLastTrade\",, \"T\")/100,\"\")","v":""},{"$f":"IFERROR(I27/RTD(\"cqg.rtd\",,\"StudyData\",A27, \"ATR\", \"MaType=Sim,Period=10\", \"ATR\",\"D\",\"-1\",\"ALL\",,,\"FALSE\",\"T\")/100,\"\")","v":""},{"$f":"IF(C27=\"\",\"\",IFERROR(RTD(\"cqg.rtd\", ,\"ContractData\",A27, \"OPen\",, \"T\"),\"\"))","v":""},{"$f":"IF(C27=\"\",\"\",IFERROR(RTD(\"cqg.rtd\", ,\"ContractData\", A27, \"HIgh\",, \"T\"),\"\"))","v":""},{"$f":"IF(C27=\"\",\"\",IFERROR(RTD(\"cqg.rtd\", ,\"ContractData\",A27, \"LOw\",, \"T\"),\"\"))","v":""},{"$f":"IF(C27=\"\",\"\",IFERROR(RTD(\"cqg.rtd\", ,\"ContractData\",A27, \"T_CVol\",, \"T\"),\"\"))","v":""},null,{"$f":" IFERROR(O27/RTD(\"cqg.rtd\",,\"StudyData\",A27, \"MA\", \"InputChoice=Vol,MAType=Sim,Period=21\", \"MA\",\"D\",\"-1\",\"all\",,,,\"T\"),\"\")","v":""},{"$f":"ARKW!R10","v":""},"Bottom 15 Negative Performing Companies "]
[{"$f":"TRIM(ARKW!O11)","v":""},"News",{"$f":"IFERROR(RTD(\"cqg.rtd\", ,\"ContractData\",A28, \"LongDescription\",, \"T\")&\" (\"&RIGHT(A28,LEN(A28)-5)&\")\",\"\")","v":""},null,null,null,null,{"$f":"IF(C28=\"\",\"\",IFERROR(RTD(\"cqg.rtd\", ,\"ContractData\",A28, \"LastTradeToday\",, \"T\"),\"\"))","v":""},{"$f":"IF(C28=\"\",\"\",IFERROR(RTD(\"cqg.rtd\", ,\"ContractData\",A28, \"NetLastTradeToday\",, \"T\"),\"\"))","v":""},{"$f":"IFERROR(RTD(\"cqg.rtd\", ,\"ContractData\",A28, \"PerCentNetLastTrade\",, \"T\")/100,\"\")","v":""},{"$f":"IFERROR(I28/RTD(\"cqg.rtd\",,\"StudyData\",A28, \"ATR\", \"MaType=Sim,Period=10\", \"ATR\",\"D\",\"-1\",\"ALL\",,,\"FALSE\",\"T\")/100,\"\")","v":""},{"$f":"IF(C28=\"\",\"\",IFERROR(RTD(\"cqg.rtd\", ,\"ContractData\",A28, \"OPen\",, \"T\"),\"\"))","v":""},{"$f":"IF(C28=\"\",\"\",IFERROR(RTD(\"cqg.rtd\", ,\"ContractData\", A28, \"HIgh\",, \"T\"),\"\"))","v":""},{"$f":"IF(C28=\"\",\"\",IFERROR(RTD(\"cqg.rtd\", ,\"ContractData\",A28, \"LOw\",, \"T\"),\"\"))","v":""},{"$f":"IF(C28=\"\",\"\",IFERROR(RTD(\"cqg.rtd\", ,\"ContractData\",A28, \"T_CVol\",, \"T\"),\"\"))","v":""},null,{"$f":" IFERROR(O28/RTD(\"cqg.rtd\",,\"StudyData\",A28, \"MA\", \"InputChoice=Vol,MAType=Sim,Period=21\", \"MA\",\"D\",\"-1\",\"all\",,,,\"T\"),\"\")","v":""},{"$f":"ARKW!R11","v":""}]
[{"$f":"TRIM(ARKW!O12)","v":""},"News",{"$f":"IFERROR(RTD(\"cqg.rtd\", ,\"ContractData\",A29, \"LongDescription\",, \"T\")&\" (\"&RIGHT(A29,LEN(A29)-5)&\")\",\"\")","v":""},null,null,null,null,{"$f":"IF(C29=\"\",\"\",IFERROR(RTD(\"cqg.rtd\", ,\"ContractData\",A29, \"LastTradeToday\",, \"T\"),\"\"))","v":""},{"$f":"IF(C29=\"\",\"\",IFERROR(RTD(\"cqg.rtd\", ,\"ContractData\",A29, \"NetLastTradeToday\",, \"T\"),\"\"))","v":""},{"$f":"IFERROR(RTD(\"cqg.rtd\", ,\"ContractData\",A29, \"PerCentNetLastTrade\",, \"T\")/100,\"\")","v":""},{"$f":"IFERROR(I29/RTD(\"cqg.rtd\",,\"StudyData\",A29, \"ATR\", \"MaType=Sim,Period=10\", \"ATR\",\"D\",\"-1\",\"ALL\",,,\"FALSE\",\"T\")/100,\"\")","v":""},{"$f":"IF(C29=\"\",\"\",IFERROR(RTD(\"cqg.rtd\", ,\"ContractData\",A29, \"OPen\",, \"T\"),\"\"))","v":""},{"$f":"IF(C29=\"\",\"\",IFERROR(RTD(\"cqg.rtd\", ,\"ContractData\", A29, \"HIgh\",, \"T\"),\"\"))","v":""},{"$f":"IF(C29=\"\",\"\",IFERROR(RTD(\"cqg.rtd\", ,\"ContractData\",A29, \"LOw\",, \"T\"),\"\"))","v":""},{"$f":"IF(C29=\"\",\"\",IFERROR(RTD(\"cqg.rtd\", ,\"ContractData\",A29, \"T_CVol\",, \"T\"),\"\"))","v":""},null,{"$f":" IFERROR(O29/RTD(\"cqg.rtd\",,\"StudyData\",A29, \"MA\", \"InputChoice=Vol,MAType=Sim,Period=21\", \"MA\",\"D\",\"-1\",\"all\",,,,\"T\"),\"\")","v":""},{"$f":"ARKW!R12","v":""}]
[{"$f":"TRIM(ARKW!O13)","v":""},"News",{"$f":"IFERROR(RTD(\"cqg.rtd\", ,\"ContractData\",A30, \"LongDescription\",, \"T\")&\" (\"&RIGHT(A30,LEN(A30)-5)&\")\",\"\")","v":""},null,null,null,null,{"$f":"IF(C30=\"\",\"\",IFERROR(RTD(\"cqg.rtd\", ,\"ContractData\",A30, \"LastTradeToday\",, \"T\"),\"\"))","v":""},{"$f":"IF(C30=\"\",\"\",IFERROR(RTD(\"cqg.rtd\", ,\"ContractData\",A30, \"NetLastTradeToday\",, \"T\"),\"\"))","v":""},{"$f":"IFERROR(RTD(\"cqg.rtd\", ,\"ContractData\",A30, \"PerCentNetLastTrade\",, \"T\")/100,\"\")","v":""},{"$f":"IFERROR(I30/RTD(\"cqg.rtd\",,\"StudyData\",A30, \"ATR\", \"MaType=Sim,Period=10\", \"ATR\",\"D\",\"-1\",\"ALL\",,,\"FALSE\",\"T\")/100,\"\")","v":""},{"$f":"IF(C30=\"\",\"\",IFERROR(RTD(\"cqg.rtd\", ,\"ContractData\",A30, \"OPen\",, \"T\"),\"\"))","v":""},{"$f":"IF(C30=\"\",\"\",IFERROR(RTD(\"cqg.rtd\", ,\"ContractData\", A30, \"HIgh\",, \"T\"),\"\"))","v":""},{"$f":"IF(C30=\"\",\"\",IFERROR(RTD(\"cqg.rtd\", ,\"ContractData\",A30, \"LOw\",, \"T\"),\"\"))","v":""},{"$f":"IF(C30=\"\",\"\",IFERROR(RTD(\"cqg.rtd\", ,\"ContractData\",A30, \"T_CVol\",, \"T\"),\"\"))","v":""},null,{"$f":" IFERROR(O30/RTD(\"cqg.rtd\",,\"StudyData\",A30, \"MA\", \"InputChoice=Vol,MAType=Sim,Period=21\", \"MA\",\"D\",\"-1\",\"all\",,,,\"T\"),\"\")","v":""},{"$f":"ARKW!R13","v":""}]
[{"$f":"TRIM(ARKW!O14)","v":""},"News",{"$f":"IFERROR(RTD(\"cqg.rtd\", ,\"ContractData\",A31, \"LongDescription\",, \"T\")&\" (\"&RIGHT(A31,LEN(A31)-5)&\")\",\"\")","v":""},null,null,null,null,{"$f":"IF(C31=\"\",\"\",IFERROR(RTD(\"cqg.rtd\", ,\"ContractData\",A31, \"LastTradeToday\",, \"T\"),\"\"))","v":""},{"$f":"IF(C31=\"\",\"\",IFERROR(RTD(\"cqg.rtd\", ,\"ContractData\",A31, \"NetLastTradeToday\",, \"T\"),\"\"))","v":""},{"$f":"IFERROR(RTD(\"cqg.rtd\", ,\"ContractData\",A31, \"PerCentNetLastTrade\",, \"T\")/100,\"\")","v":""},{"$f":"IFERROR(I31/RTD(\"cqg.rtd\",,\"StudyData\",A31, \"ATR\", \"MaType=Sim,Period=10\", \"ATR\",\"D\",\"-1\",\"ALL\",,,\"FALSE\",\"T\")/100,\"\")","v":""},{"$f":"IF(C31=\"\",\"\",IFERROR(RTD(\"cqg.rtd\", ,\"ContractData\",A31, \"OPen\",, \"T\"),\"\"))","v":""},{"$f":"IF(C31=\"\",\"\",IFERROR(RTD(\"cqg.rtd\", ,\"ContractData\", A31, \"HIgh\",, \"T\"),\"\"))","v":""},{"$f":"IF(C31=\"\",\"\",IFERROR(RTD(\"cqg.rtd\", ,\"ContractData\",A31, \"LOw\",, \"T\"),\"\"))","v":""},{"$f":"IF(C31=\"\",\"\",IFERROR(RTD(\"cqg.rtd\", ,\"ContractData\",A31, \"T_CVol\",, \"T\"),\"\"))","v":""},null,{"$f":" IFERROR(O31/RTD(\"cqg.rtd\",,\"StudyData\",A31, \"MA\", \"InputChoice=Vol,MAType=Sim,Period=21\", \"MA\",\"D\",\"-1\",\"all\",,,,\"T\"),\"\")","v":""},{"$f":"ARKW!R14","v":""}]
[{"$f":"TRIM(ARKW!O15)","v":""},"News",{"$f":"IFERROR(RTD(\"cqg.rtd\", ,\"ContractData\",A32, \"LongDescription\",, \"T\")&\" (\"&RIGHT(A32,LEN(A32)-5)&\")\",\"\")","v":""},null,null,null,null,{"$f":"IF(C32=\"\",\"\",IFERROR(RTD(\"cqg.rtd\", ,\"ContractData\",A32, \"LastTradeToday\",, \"T\"),\"\"))","v":""},{"$f":"IF(C32=\"\",\"\",IFERROR(RTD(\"cqg.rtd\", ,\"ContractData\",A32, \"NetLastTradeToday\",, \"T\"),\"\"))","v":""},{"$f":"IFERROR(RTD(\"cqg.rtd\", ,\"ContractData\",A32, \"PerCentNetLastTrade\",, \"T\")/100,\"\")","v":""},{"$f":"IFERROR(I32/RTD(\"cqg.rtd\",,\"StudyData\",A32, \"ATR\", \"MaType=Sim,Period=10\", \"ATR\",\"D\",\"-1\",\"ALL\",,,\"FALSE\",\"T\")/100,\"\")","v":""},{"$f":"IF(C32=\"\",\"\",IFERROR(RTD(\"cqg.rtd\", ,\"ContractData\",A32, \"OPen\",, \"T\"),\"\"))","v":""},{"$f":"IF(C32=\"\",\"\",IFERROR(RTD(\"cqg.rtd\", ,\"ContractData\", A32, \"HIgh\",, \"T\"),\"\"))","v":""},{"$f":"IF(C32=\"\",\"\",IFERROR(RTD(\"cqg.rtd\", ,\"ContractData\",A32, \"LOw\",, \"T\"),\"\"))","v":""},{"$f":"IF(C32=\"\",\"\",IFERROR(RTD(\"cqg.rtd\", ,\"ContractData\",A32, \"T_CVol\",, \"T\"),\"\"))","v":""},null,{"$f":" IFERROR(O32/RTD(\"cqg.rtd\",,\"StudyData\",A32, \"MA\", \"InputChoice=Vol,MAType=Sim,Period=21\", \"MA\",\"D\",\"-1\",\"all\",,,,\"T\"),\"\")","v":""},{"$f":"ARKW!R15","v":""}]
[null,null,"Bottom 15 Description",null,null,null,null,"Last","NC","%NC","NC/ATR","Open","High","Low","Volume",null,"Ratio"]
[{"$f":"TRIM(ARKW!AC1)","v":""},"News",{"$f":"IFERROR(RTD(\"cqg.rtd\", ,\"ContractData\",A34, \"LongDescription\",, \"T\")&\" (\"&RIGHT(A34,LEN(A34)-5)&\")\",\"\")","v":""},null,null,null,null,{"$f":"IF(C34=\"\",\"\",IFERROR(RTD(\"cqg.rtd\", ,\"ContractData\",A34, \"LastTradeToday\",, \"T\"),\"\"))","v":""},{"$f":"IF(C34=\"\",\"\",IFERROR(RTD(\"cqg.rtd\", ,\"ContractData\",A34, \"NetLastTradeToday\",, \"T\"),\"\"))","v":""},{"$f":"IFERROR(RTD(\"cqg.rtd\", ,\"ContractData\",A34, \"PerCentNetLastTrade\",, \"T\")/100,\"\")","v":""},{"$f":"IFERROR(I34/RTD(\"cqg.rtd\",,\"StudyData\",A34, \"ATR\", \"MaType=Sim,Period=10\", \"ATR\",\"D\",\"-1\",\"ALL\",,,\"FALSE\",\"T\")/100,\"\")","v":""},{"$f":"IF(C34=\"\",\"\",IFERROR(RTD(\"cqg.rtd\", ,\"ContractData\",A34, \"OPen\",, \"T\"),\"\"))","v":""},{"$f":"IF(C34=\"\",\"\",IFERROR(RTD(\"cqg.rtd\", ,\"ContractData\", A34, \"HIgh\",, \"T\"),\"\"))","v":""},{"$f":"IF(C34=\"\",\"\",IFERROR(RTD(\"cqg.rtd\", ,\"ContractData\",A34, \"LOw\",, \"T\"),\"\"))","v":""},{"$f":"IF(C34=\"\",\"\",IFERROR(RTD(\"cqg.rtd\", ,\"ContractData\",A34, \"T_CVol\",, \"T\"),\"\"))","v":""},null,{"$f":" IFERROR(O34/RTD(\"cqg.rtd\",,\"StudyData\",A34, \"MA\", \"InputChoice=Vol,MAType=Sim,Period=21\", \"MA\",\"D\",\"-1\",\"all\",,,,\"T\"),\"\")","v":""},{"$f":"ARKW!AH1","v":""}]
[{"$f":"TRIM(ARKW!AC2)","v":""},"News",{"$f":"IFERROR(RTD(\"cqg.rtd\", ,\"ContractData\",A35, \"LongDescription\",, \"T\")&\" (\"&RIGHT(A35,LEN(A35)-5)&\")\",\"\")","v":""},null,null,null,null,{"$f":"IF(C35=\"\",\"\",IFERROR(RTD(\"cqg.rtd\", ,\"ContractData\",A35, \"LastTradeToday\",, \"T\"),\"\"))","v":""},{"$f":"IF(C35=\"\",\"\",IFERROR(RTD(\"cqg.rtd\", ,\"ContractData\",A35, \"NetLastTradeToday\",, \"T\"),\"\"))","v":""},{"$f":"IFERROR(RTD(\"cqg.rtd\", ,\"ContractData\",A35, \"PerCentNetLastTrade\",, \"T\")/100,\"\")","v":""},{"$f":"IFERROR(I35/RTD(\"cqg.rtd\",,\"StudyData\",A35, \"ATR\", \"MaType=Sim,Period=10\", \"ATR\",\"D\",\"-1\",\"ALL\",,,\"FALSE\",\"T\")/100,\"\")","v":""},{"$f":"IF(C35=\"\",\"\",IFERROR(RTD(\"cqg.rtd\", ,\"ContractData\",A35, \"OPen\",, \"T\"),\"\"))","v":""},{"$f":"IF(C35=\"\",\"\",IFERROR(RTD(\"cqg.rtd\", ,\"ContractData\", A35, \"HIgh\",, \"T\"),\"\"))","v":""},{"$f":"IF(C35=\"\",\"\",IFERROR(RTD(\"cqg.rtd\", ,\"ContractData\",A35, \"LOw\",, \"T\"),\"\"))","v":""},{"$f":"IF(C35=\"\",\"\",IFERROR(RTD(\"cqg.rtd\", ,\"ContractData\",A35, \"T_CVol\",, \"T\"),\"\"))","v":""},null,{"$f":" IFERROR(O35/RTD(\"cqg.rtd\",,\"StudyData\",A35, \"MA\", \"InputChoice=Vol,MAType=Sim,Period=21\", \"MA\",\"D\",\"-1\",\"all\",,,,\"T\"),\"\")","v":""},{"$f":"ARKW!AH2","v":""}]
[{"$f":"TRIM(ARKW!AC3)","v":""},"News",{"$f":"IFERROR(RTD(\"cqg.rtd\", ,\"ContractData\",A36, \"LongDescription\",, \"T\")&\" (\"&RIGHT(A36,LEN(A36)-5)&\")\",\"\")","v":""},null,null,null,null,{"$f":"IF(C36=\"\",\"\",IFERROR(RTD(\"cqg.rtd\", ,\"ContractData\",A36, \"LastTradeToday\",, \"T\"),\"\"))","v":""},{"$f":"IF(C36=\"\",\"\",IFERROR(RTD(\"cqg.rtd\", ,\"ContractData\",A36, \"NetLastTradeToday\",, \"T\"),\"\"))","v":""},{"$f":"IFERROR(RTD(\"cqg.rtd\", ,\"ContractData\",A36, \"PerCentNetLastTrade\",, \"T\")/100,\"\")","v":""},{"$f":"IFERROR(I36/RTD(\"cqg.rtd\",,\"StudyData\",A36, \"ATR\", \"MaType=Sim,Period=10\", \"ATR\",\"D\",\"-1\",\"ALL\",,,\"FALSE\",\"T\")/100,\"\")","v":""},{"$f":"IF(C36=\"\",\"\",IFERROR(RTD(\"cqg.rtd\", ,\"ContractData\",A36, \"OPen\",, \"T\"),\"\"))","v":""},{"$f":"IF(C36=\"\",\"\",IFERROR(RTD(\"cqg.rtd\", ,\"ContractData\", A36, \"HIgh\",, \"T\"),\"\"))","v":""},{"$f":"IF(C36=\"\",\"\",IFERROR(RTD(\"cqg.rtd\", ,\"ContractData\",A36, \"LOw\",, \"T\"),\"\"))","v":""},{"$f":"IF(C36=\"\",\"\",IFERROR(RTD(\"cqg.rtd\", ,\"ContractData\",A36, \"T_CVol\",, \"T\"),\"\"))","v":""},null,{"$f":" IFERROR(O36/RTD(\"cqg.rtd\",,\"StudyData\",A36, \"MA\", \"InputChoice=Vol,MAType=Sim,Period=21\", \"MA\",\"D\",\"-1\",\"all\",,,,\"T\"),\"\")","v":""},{"$f":"ARKW!AH3","v":""}]
[{"$f":"TRIM(ARKW!AC4)","v":""},"News",{"$f":"IFERROR(RTD(\"cqg.rtd\", ,\"ContractData\",A37, \"LongDescription\",, \"T\")&\" (\"&RIGHT(A37,LEN(A37)-5)&\")\",\"\")","v":""},null,null,null,null,{"$f":"IF(C37=\"\",\"\",IFERROR(RTD(\"cqg.rtd\", ,\"ContractData\",A37, \"LastTradeToday\",, \"T\"),\"\"))","v":""},{"$f":"IF(C37=\"\",\"\",IFERROR(RTD(\"cqg.rtd\", ,\"ContractData\",A37, \"NetLastTradeToday\",, \"T\"),\"\"))","v":""},{"$f":"IFERROR(RTD(\"cqg.rtd\", ,\"ContractData\",A37, \"PerCentNetLastTrade\",, \"T\")/100,\"\")","v":""},{"$f":"IFERROR(I37/RTD(\"cqg.rtd\",,\"StudyData\",A37, \"ATR\", \"MaType=Sim,Period=10\", \"ATR\",\"D\",\"-1\",\"ALL\",,,\"FALSE\",\"T\")/100,\"\")","v":""},{"$f":"IF(C37=\"\",\"\",IFERROR(RTD(\"cqg.rtd\", ,\"ContractData\",A37, \"OPen\",, \"T\"),\"\"))","v":""},{"$f":"IF(C37=\"\",\"\",IFERROR(RTD(\"cqg.rtd\", ,\"ContractData\", A37, \"HIgh\",, \"T\"),\"\"))","v":""},{"$f":"IF(C37=\"\",\"\",IFERROR(RTD(\"cqg.rtd\", ,\"ContractData\",A37, \"LOw\",, \"T\"),\"\"))","v":""},{"$f":"IF(C37=\"\",\"\",IFERROR(RTD(\"cqg.rtd\", ,\"ContractData\",A37, \"T_CVol\",, \"T\"),\"\"))","v":""},null,{"$f":" IFERROR(O37/RTD(\"cqg.rtd\",,\"StudyData\",A37, \"MA\", \"InputChoice=Vol,MAType=Sim,Period=21\", \"MA\",\"D\",\"-1\",\"all\",,,,\"T\"),\"\")","v":""},{"$f":"ARKW!AH4","v":""}]
[{"$f":"TRIM(ARKW!AC5)","v":""},"News",{"$f":"IFERROR(RTD(\"cqg.rtd\", ,\"ContractData\",A38, \"LongDescription\",, \"T\")&\" (\"&RIGHT(A38,LEN(A38)-5)&\")\",\"\")","v":""},null,null,null,null,{"$f":"IF(C38=\"\",\"\",IFERROR(RTD(\"cqg.rtd\", ,\"ContractData\",A38, \"LastTradeToday\",, \"T\"),\"\"))","v":""},{"$f":"IF(C38=\"\",\"\",IFERROR(RTD(\"cqg.rtd\", ,\"ContractData\",A38, \"NetLastTradeToday\",, \"T\"),\"\"))","v":""},{"$f":"IFERROR(RTD(\"cqg.rtd\", ,\"ContractData\",A38, \"PerCentNetLastTrade\",, \"T\")/100,\"\")","v":""},{"$f":"IFERROR(I38/RTD(\"cqg.rtd\",,\"StudyData\",A38, \"ATR\", \"MaType=Sim,Period=10\", \"ATR\",\"D\",\"-1\",\"ALL\",,,\"FALSE\",\"T\")/100,\"\")","v":""},{"$f":"IF(C38=\"\",\"\",IFERROR(RTD(\"cqg.rtd\", ,\"ContractData\",A38, \"OPen\",, \"T\"),\"\"))","v":""},{"$f":"IF(C38=\"\",\"\",IFERROR(RTD(\"cqg.rtd\", ,\"ContractData\", A38, \"HIgh\",, \"T\"),\"\"))","v":""},{"$f":"IF(C38=\"\",\"\",IFERROR(RTD(\"cqg.rtd\", ,\"ContractData\",A38, \"LOw\",, \"T\"),\"\"))","v":""},{"$f":"IF(C38=\"\",\"\",IFERROR(RTD(\"cqg.rtd\", ,\"ContractData\",A38, \"T_CVol\",, \"T\"),\"\"))","v":""},null,{"$f":" IFERROR(O38/RTD(\"cqg.rtd\",,\"StudyData\",A38, \"MA\", \"InputChoice=Vol,MAType=Sim,Period=21\", \"MA\",\"D\",\"-1\",\"all\",,,,\"T\"),\"\")","v":""},{"$f":"ARKW!AH5","v":""}]
[{"$f":"TRIM(ARKW!AC6)","v":""},"News",{"$f":"IFERROR(RTD(\"cqg.rtd\", ,\"ContractData\",A39, \"LongDescription\",, \"T\")&\" (\"&RIGHT(A39,LEN(A39)-5)&\")\",\"\")","v":""},null,null,null,null,{"$f":"IF(C39=\"\",\"\",IFERROR(RTD(\"cqg.rtd\", ,\"ContractData\",A39, \"LastTradeToday\",, \"T\"),\"\"))","v":""},{"$f":"IF(C39=\"\",\"\",IFERROR(RTD(\"cqg.rtd\", ,\"ContractData\",A39, \"NetLastTradeToday\",, \"T\"),\"\"))","v":""},{"$f":"IFERROR(RTD(\"cqg.rtd\", ,\"ContractData\",A39, \"PerCentNetLastTrade\",, \"T\")/100,\"\")","v":""},{"$f":"IFERROR(I39/RTD(\"cqg.rtd\",,\"StudyData\",A39, \"ATR\", \"MaType=Sim,Period=10\", \"ATR\",\"D\",\"-1\",\"ALL\",,,\"FALSE\",\"T\")/100,\"\")","v":""},{"$f":"IF(C39=\"\",\"\",IFERROR(RTD(\"cqg.rtd\", ,\"ContractData\",A39, \"OPen\",, \"T\"),\"\"))","v":""},{"$f":"IF(C39=\"\",\"\",IFERROR(RTD(\"cqg.rtd\", ,\"ContractData\", A39, \"HIgh\",, \"T\"),\"\"))","v":""},{"$f":"IF(C39=\"\",\"\",IFERROR(RTD(\"cqg.rtd\", ,\"ContractData\",A39, \"LOw\",, \"T\"),\"\"))","v":""},{"$f":"IF(C39=\"\",\"\",IFERROR(RTD(\"cqg.rtd\", ,\"ContractData\",A39, \"T_CVol\",, \"T\"),\"\"))","v":""},null,{"$f":" IFERROR(O39/RTD(\"cqg.rtd\",,\"StudyData\",A39, \"MA\", \"InputChoice=Vol,MAType=Sim,Period=21\", \"MA\",\"D\",\"-1\",\"all\",,,,\"T\"),\"\")","v":""},{"$f":"ARKW!AH6","v":""}]
[{"$f":"TRIM(ARKW!AC7)","v":""},"News",{"$f":"IFERROR(RTD(\"cqg.rtd\", ,\"ContractData\",A40, \"LongDescription\",, \"T\")&\" (\"&RIGHT(A40,LEN(A40)-5)&\")\",\"\")","v":""},null,null,null,null,{"$f":"IF(C40=\"\",\"\",IFERROR(RTD(\"cqg.rtd\", ,\"ContractData\",A40, \"LastTradeToday\",, \"T\"),\"\"))","v":""},{"$f":"IF(C40=\"\",\"\",IFERROR(RTD(\"cqg.rtd\", ,\"ContractData\",A40, \"NetLastTradeToday\",, \"T\"),\"\"))","v":""},{"$f":"IFERROR(RTD(\"cqg.rtd\", ,\"ContractData\",A40, \"PerCentNetLastTrade\",, \"T\")/100,\"\")","v":""},{"$f":"IFERROR(I40/RTD(\"cqg.rtd\",,\"StudyData\",A40, \"ATR\", \"MaType=Sim,Period=10\", \"ATR\",\"D\",\"-1\",\"ALL\",,,\"FALSE\",\"T\")/100,\"\")","v":""},{"$f":"IF(C40=\"\",\"\",IFERROR(RTD(\"cqg.rtd\", ,\"ContractData\",A40, \"OPen\",, \"T\"),\"\"))","v":""},{"$f":"IF(C40=\"\",\"\",IFERROR(RTD(\"cqg.rtd\", ,\"ContractData\", A40, \"HIgh\",, \"T\"),\"\"))","v":""},{"$f":"IF(C40=\"\",\"\",IFERROR(RTD(\"cqg.rtd\", ,\"ContractData\",A40, \"LOw\",, \"T\"),\"\"))","v":""},{"$f":"IF(C40=\"\",\"\",IFERROR(RTD(\"cqg.rtd\", ,\"ContractData\",A40, \"T_CVol\",, \"T\"),\"\"))","v":""},null,{"$f":" IFERROR(O40/RTD(\"cqg.rtd\",,\"StudyData\",A40, \"MA\", \"InputChoice=Vol,MAType=Sim,Period=21\", \"MA\",\"D\",\"-1\",\"all\",,,,\"T\"),\"\")","v":""},{"$f":"ARKW!AH7","v":""}]
[{"$f":"TRIM(ARKW!AC8)","v":""},"News",{"$f":"IFERROR(RTD(\"cqg.rtd\", ,\"ContractData\",A41, \"LongDescription\",, \"T\")&\" (\"&RIGHT(A41,LEN(A41)-5)&\")\",\"\")","v":""},null,null,null,null,{"$f":"IF(C41=\"\",\"\",IFERROR(RTD(\"cqg.rtd\", ,\"ContractData\",A41, \"LastTradeToday\",, \"T\"),\"\"))","v":""},{"$f":"IF(C41=\"\",\"\",IFERROR(RTD(\"cqg.rtd\", ,\"ContractData\",A41, \"NetLastTradeToday\",, \"T\"),\"\"))","v":""},{"$f":"IFERROR(RTD(\"cqg.rtd\", ,\"ContractData\",A41, \"PerCentNetLastTrade\",, \"T\")/100,\"\")","v":""},{"$f":"IFERROR(I41/RTD(\"cqg.rtd\",,\"StudyData\",A41, \"ATR\", \"MaType=Sim,Period=10\", \"ATR\",\"D\",\"-1\",\"ALL\",,,\"FALSE\",\"T\")/100,\"\")","v":""},{"$f":"IF(C41=\"\",\"\",IFERROR(RTD(\"cqg.rtd\", ,\"ContractData\",A41, \"OPen\",, \"T\"),\"\"))","v":""},{"$f":"IF(C41=\"\",\"\",IFERROR(RTD(\"cqg.rtd\", ,\"ContractData\", A41, \"HIgh\",, \"T\"),\"\"))","v":""},{"$f":"IF(C41=\"\",\"\",IFERROR(RTD(\"cqg.rtd\", ,\"ContractData\",A41, \"LOw\",, \"T\"),\"\"))","v":""},{"$f":"IF(C41=\"\",\"\",IFERROR(RTD(\"cqg.rtd\", ,\"ContractData\",A41, \"T_CVol\",, \"T\"),\"\"))","v":""},null,{"$f":" IFERROR(O41/RTD(\"cqg.rtd\",,\"StudyData\",A41, \"MA\", \"InputChoice=Vol,MAType=Sim,Period=21\", \"MA\",\"D\",\"-1\",\"all\",,,,\"T\"),\"\")","v":""},{"$f":"ARKW!AH8","v":""}]
[{"$f":"TRIM(ARKW!AC9)","v":""},"News",{"$f":"IFERROR(RTD(\"cqg.rtd\", ,\"ContractData\",A42, \"LongDescription\",, \"T\")&\" (\"&RIGHT(A42,LEN(A42)-5)&\")\",\"\")","v":""},null,null,null,null,{"$f":"IF(C42=\"\",\"\",IFERROR(RTD(\"cqg.rtd\", ,\"ContractData\",A42, \"LastTradeToday\",, \"T\"),\"\"))","v":""},{"$f":"IF(C42=\"\",\"\",IFERROR(RTD(\"cqg.rtd\", ,\"ContractData\",A42, \"NetLastTradeToday\",, \"T\"),\"\"))","v":""},{"$f":"IFERROR(RTD(\"cqg.rtd\", ,\"ContractData\",A42, \"PerCentNetLastTrade\",, \"T\")/100,\"\")","v":""},{"$f":"IFERROR(I42/RTD(\"cqg.rtd\",,\"StudyData\",A42, \"ATR\", \"MaType=Sim,Period=10\", \"ATR\",\"D\",\"-1\",\"ALL\",,,\"FALSE\",\"T\")/100,\"\")","v":""},{"$f":"IF(C42=\"\",\"\",IFERROR(RTD(\"cqg.rtd\", ,\"ContractData\",A42, \"OPen\",, \"T\"),\"\"))","v":""},{"$f":"IF(C42=\"\",\"\",IFERROR(RTD(\"cqg.rtd\", ,\"ContractData\", A42, \"HIgh\",, \"T\"),\"\"))","v":""},{"$f":"IF(C42=\"\",\"\",IFERROR(RTD(\"cqg.rtd\", ,\"ContractData\",A42, \"LOw\",, \"T\"),\"\"))","v":""},{"$f":"IF(C42=\"\",\"\",IFERROR(RTD(\"cqg.rtd\", ,\"ContractData\",A42, \"T_CVol\",, \"T\"),\"\"))","v":""},null,{"$f":" IFERROR(O42/RTD(\"cqg.rtd\",,\"StudyData\",A42, \"MA\", \"InputChoice=Vol,MAType=Sim,Period=21\", \"MA\",\"D\",\"-1\",\"all\",,,,\"T\"),\"\")","v":""},{"$f":"ARKW!AH9","v":""}]
[{"$f":"TRIM(ARKW!AC10)","v":""},"News",{"$f":"IFERROR(RTD(\"cqg.rtd\", ,\"ContractData\",A43, \"LongDescription\",, \"T\")&\" (\"&RIGHT(A43,LEN(A43)-5)&\")\",\"\")","v":""},null,null,null,null,{"$f":"IF(C43=\"\",\"\",IFERROR(RTD(\"cqg.rtd\", ,\"ContractData\",A43, \"LastTradeToday\",, \"T\"),\"\"))","v":""},{"$f":"IF(C43=\"\",\"\",IFERROR(RTD(\"cqg.rtd\", ,\"ContractData\",A43, \"NetLastTradeToday\",, \"T\"),\"\"))","v":""},{"$f":"IFERROR(RTD(\"cqg.rtd\", ,\"ContractData\",A43, \"PerCentNetLastTrade\",, \"T\")/100,\"\")","v":""},{"$f":"IFERROR(I43/RTD(\"cqg.rtd\",,\"StudyData\",A43, \"ATR\", \"MaType=Sim,Period=10\", \"ATR\",\"D\",\"-1\",\"ALL\",,,\"FALSE\",\"T\")/100,\"\")","v":""},{"$f":"IF(C43=\"\",\"\",IFERROR(RTD(\"cqg.rtd\", ,\"ContractData\",A43, \"OPen\",, \"T\"),\"\"))","v":""},{"$f":"IF(C43=\"\",\"\",IFERROR(RTD(\"cqg.rtd\", ,\"ContractData\", A43, \"HIgh\",, \"T\"),\"\"))","v":""},{"$f":"IF(C43=\"\",\"\",IFERROR(RTD(\"cqg.rtd\", ,\"ContractData\",A43, \"LOw\",, \"T\"),\"\"))","v":""},{"$f":"IF(C43=\"\",\"\",IFERROR(RTD(\"cqg.rtd\", ,\"ContractData\",A43, \"T_CVol\",, \"T\"),\"\"))","v":""},null,{"$f":" IFERROR(O43/RTD(\"cqg.rtd\",,\"StudyData\",A43, \"MA\", \"InputChoice=Vol,MAType=Sim,Period=21\", \"MA\",\"D\",\"-1\",\"all\",,,,\"T\"),\"\")","v":""},{"$f":"ARKW!AH10","v":""}]
[{"$f":"TRIM(ARKW!AC11)","v":""},"News",{"$f":"IFERROR(RTD(\"cqg.rtd\", ,\"ContractData\",A44, \"LongDescription\",, \"T\")&\" (\"&RIGHT(A44,LEN(A44)-5)&\")\",\"\")","v":""},null,null,null,null,{"$f":"IF(C44=\"\",\"\",IFERROR(RTD(\"cqg.rtd\", ,\"ContractData\",A44, \"LastTradeToday\",, \"T\"),\"\"))","v":""},{"$f":"IF(C44=\"\",\"\",IFERROR(RTD(\"cqg.rtd\", ,\"ContractData\",A44, \"NetLastTradeToday\",, \"T\"),\"\"))","v":""},{"$f":"IFERROR(RTD(\"cqg.rtd\", ,\"ContractData\",A44, \"PerCentNetLastTrade\",, \"T\")/100,\"\")","v":""},{"$f":"IFERROR(I44/RTD(\"cqg.rtd\",,\"StudyData\",A44, \"ATR\", \"MaType=Sim,Period=10\", \"ATR\",\"D\",\"-1\",\"ALL\",,,\"FALSE\",\"T\")/100,\"\")","v":""},{"$f":"IF(C44=\"\",\"\",IFERROR(RTD(\"cqg.rtd\", ,\"ContractData\",A44, \"OPen\",, \"T\"),\"\"))","v":""},{"$f":"IF(C44=\"\",\"\",IFERROR(RTD(\"cqg.rtd\", ,\"ContractData\", A44, \"HIgh\",, \"T\"),\"\"))","v":""},{"$f":"IF(C44=\"\",\"\",IFERROR(RTD(\"cqg.rtd\", ,\"ContractData\",A44, \"LOw\",, \"T\"),\"\"))","v":""},{"$f":"IF(C44=\"\",\"\",IFERROR(RTD(\"cqg.rtd\", ,\"ContractData\",A44, \"T_CVol\",, \"T\"),\"\"))","v":""},null,{"$f":" IFERROR(O44/RTD(\"cqg.rtd\",,\"StudyData\",A44, \"MA\", \"InputChoice=Vol,MAType=Sim,Period=21\", \"MA\",\"D\",\"-1\",\"all\",,,,\"T\"),\"\")","v":""},{"$f":"ARKW!AH11","v":""}]
[{"$f":"TRIM(ARKW!AC12)","v":""},"News",{"$f":"IFERROR(RTD(\"cqg.rtd\", ,\"ContractData\",A45, \"LongDescription\",, \"T\")&\" (\"&RIGHT(A45,LEN(A45)-5)&\")\",\"\")","v":""},null,null,null,null,{"$f":"IF(C45=\"\",\"\",IFERROR(RTD(\"cqg.rtd\", ,\"ContractData\",A45, \"LastTradeToday\",, \"T\"),\"\"))","v":""},{"$f":"IF(C45=\"\",\"\",IFERROR(RTD(\"cqg.rtd\", ,\"ContractData\",A45, \"NetLastTradeToday\",, \"T\"),\"\"))","v":""},{"$f":"IFERROR(RTD(\"cqg.rtd\", ,\"ContractData\",A45, \"PerCentNetLastTrade\",, \"T\")/100,\"\")","v":""},{"$f":"IFERROR(I45/RTD(\"cqg.rtd\",,\"StudyData\",A45, \"ATR\", \"MaType=Sim,Period=10\", \"ATR\",\"D\",\"-1\",\"ALL\",,,\"FALSE\",\"T\")/100,\"\")","v":""},{"$f":"IF(C45=\"\",\"\",IFERROR(RTD(\"cqg.rtd\", ,\"ContractData\",A45, \"OPen\",, \"T\"),\"\"))","v":""},{"$f":"IF(C45=\"\",\"\",IFERROR(RTD(\"cqg.rtd\", ,\"ContractData\", A45, \"HIgh\",, \"T\"),\"\"))","v":""},{"$f":"IF(C45=\"\",\"\",IFERROR(RTD(\"cqg.rtd\", ,\"ContractData\",A45, \"LOw\",, \"T\"),\"\"))","v":""},{"$f":"IF(C45=\"\",\"\",IFERROR(RTD(\"cqg.rtd\", ,\"ContractData\",A45, \"T_CVol\",, \"T\"),\"\"))","v":""},null,{"$f":" IFERROR(O45/RTD(\"cqg.rtd\",,\"StudyData\",A45, \"MA\", \"InputChoice=Vol,MAType=Sim,Period=21\", \"MA\",\"D\",\"-1\",\"all\",,,,\"T\"),\"\")","v":""},{"$f":"ARKW!AH12","v":""}]
[{"$f":"TRIM(ARKW!AC13)","v":""},"News",{"$f":"IFERROR(RTD(\"cqg.rtd\", ,\"ContractData\",A46, \"LongDescription\",, \"T\")&\" (\"&RIGHT(A46,LEN(A46)-5)&\")\",\"\")","v":""},null,null,null,null,{"$f":"IF(C46=\"\",\"\",IFERROR(RTD(\"cqg.rtd\", ,\"ContractData\",A46, \"LastTradeToday\",, \"T\"),\"\"))","v":""},{"$f":"IF(C46=\"\",\"\",IFERROR(RTD(\"cqg.rtd\", ,\"ContractData\",A46, \"NetLastTradeToday\",, \"T\"),\"\"))","v":""},{"$f":"IFERROR(RTD(\"cqg.rtd\", ,\"ContractData\",A46, \"PerCentNetLastTrade\",, \"T\")/100,\"\")","v":""},{"$f":"IFERROR(I46/RTD(\"cqg.rtd\",,\"StudyData\",A46, \"ATR\", \"MaType=Sim,Period=10\", \"ATR\",\"D\",\"-1\",\"ALL\",,,\"FALSE\",\"T\")/100,\"\")","v":""},{"$f":"IF(C46=\"\",\"\",IFERROR(RTD(\"cqg.rtd\", ,\"ContractData\",A46, \"OPen\",, \"T\"),\"\"))","v":""},{"$f":"IF(C46=\"\",\"\",IFERROR(RTD(\"cqg.rtd\", ,\"ContractData\", A46, \"HIgh\",, \"T\"),\"\"))","v":""},{"$f":"IF(C46=\"\",\"\",IFERROR(RTD(\"cqg.rtd\", ,\"ContractData\",A46, \"LOw\",, \"T\"),\"\"))","v":""},{"$f":"IF(C46=\"\",\"\",IFERROR(RTD(\"cqg.rtd\", ,\"ContractData\",A46, \"T_CVol\",, \"T\"),\"\"))","v":""},null,{"$f":" IFERROR(O46/RTD(\"cqg.rtd\",,\"StudyData\",A46, \"MA\", \"InputChoice=Vol,MAType=Sim,Period=21\", \"MA\",\"D\",\"-1\",\"all\",,,,\"T\"),\"\")","v":""},{"$f":"ARKW!AH13","v":""}]
[{"$f":"TRIM(ARKW!AC14)","v":""},"News",{"$f":"IFERROR(RTD(\"cqg.rtd\", ,\"ContractData\",A47, \"LongDescription\",, \"T\")&\" (\"&RIGHT(A47,LEN(A47)-5)&\")\",\"\")","v":""},null,null,null,null,{"$f":"IF(C47=\"\",\"\",IFERROR(RTD(\"cqg.rtd\", ,\"ContractData\",A47, \"LastTradeToday\",, \"T\"),\"\"))","v":""},{"$f":"IF(C47=\"\",\"\",IFERROR(RTD(\"cqg.rtd\", ,\"ContractData\",A47, \"NetLastTradeToday\",, \"T\"),\"\"))","v":""},{"$f":"IFERROR(RTD(\"cqg.rtd\", ,\"ContractData\",A47, \"PerCentNetLastTrade\",, \"T\")/100,\"\")","v":""},{"$f":"IFERROR(I47/RTD(\"cqg.rtd\",,\"StudyData\",A47, \"ATR\", \"MaType=Sim,Period=10\", \"ATR\",\"D\",\"-1\",\"ALL\",,,\"FALSE\",\"T\")/100,\"\")","v":""},{"$f":"IF(C47=\"\",\"\",IFERROR(RTD(\"cqg.rtd\", ,\"ContractData\",A47, \"OPen\",, \"T\"),\"\"))","v":""},{"$f":"IF(C47=\"\",\"\",IFERROR(RTD(\"cqg.rtd\", ,\"ContractData\", A47, \"HIgh\",, \"T\"),\"\"))","v":""},{"$f":"IF(C47=\"\",\"\",IFERROR(RTD(\"cqg.rtd\", ,\"ContractData\",A47, \"LOw\",, \"T\"),\"\"))","v":""},{"$f":"IF(C47=\"\",\"\",IFERROR(RTD(\"cqg.rtd\", ,\"ContractData\",A47, \"T_CVol\",, \"T\"),\"\"))","v":""},null,{"$f":" IFERROR(O47/RTD(\"cqg.rtd\",,\"StudyData\",A47, \"MA\", \"InputChoice=Vol,MAType=Sim,Period=21\", \"MA\",\"D\",\"-1\",\"all\",,,,\"T\"),\"\")","v":""},{"$f":"ARKW!AH14","v":""}]
[{"$f":"TRIM(ARKW!AC15)","v":""},"News",{"$f":"IFERROR(RTD(\"cqg.rtd\", ,\"ContractData\",A48, \"LongDescription\",, \"T\")&\" (\"&RIGHT(A48,LEN(A48)-5)&\")\",\"\")","v":""},null,null,null,null,{"$f":"IF(C48=\"\",\"\",IFERROR(RTD(\"cqg.rtd\", ,\"ContractData\",A48, \"LastTradeToday\",, \"T\"),\"\"))","v":""},{"$f":"IF(C48=\"\",\"\",IFERROR(RTD(\"cqg.rtd\", ,\"ContractData\",A48, \"NetLastTradeToday\",, \"T\"),\"\"))","v":""},{"$f":"IFERROR(RTD(\"cqg.rtd\", ,\"ContractData\",A48, \"PerCentNetLastTrade\",, \"T\")/100,\"\")","v":""},{"$f":"IFERROR(I48/RTD(\"cqg.rtd\",,\"StudyData\",A48, \"ATR\", \"MaType=Sim,Period=10\", \"ATR\",\"D\",\"-1\",\"ALL\",,,\"FALSE\",\"T\")/100,\"\")","v":""},{"$f":"IF(C48=\"\",\"\",IFERROR(RTD(\"cqg.rtd\", ,\"ContractData\",A48, \"OPen\",, \"T\"),\"\"))","v":""},{"$f":"IF(C48=\"\",\"\",IFERROR(RTD(\"cqg.rtd\", ,\"ContractData\", A48, \"HIgh\",, \"T\"),\"\"))","v":""},{"$f":"IF(C48=\"\",\"\",IFERROR(RTD(\"cqg.rtd\", ,\"ContractData\",A48, \"LOw\",, \"T\"),\"\"))","v":""},{"$f":"IF(C48=\"\",\"\",IFERROR(RTD(\"cqg.rtd\", ,\"ContractData\",A48, \"T_CVol\",, \"T\"),\"\"))","v":""},null,{"$f":" IFERROR(O48/RTD(\"cqg.rtd\",,\"StudyData\",A48, \"MA\", \"InputChoice=Vol,MAType=Sim,Period=21\", \"MA\",\"D\",\"-1\",\"all\",,,,\"T\"),\"\")","v":""},{"$f":"ARKW!AH15","v":""}]
[null,null,"CQG Inc.,   Copyright © 2025",null,null,null,"Designed by Thom Hartle",null,null,"From their website: \"ARK Funds seek to offer access to disruptive innovation and transformational companies.\"",null,null,null,null,null,null,null,null,null,null,null,null,null,null,null,{"$f":"Z52","v":"100% of the stocks in the ETF are higher today"}]
[]
[null,null,null,null,null,null,null,null,null,null,null,null,null,null,null,null,null,null,null,null,null,null,null,null,null,{"$f":"ARKW!B103","v":1},"of the stocks in the ETF are higher today"]
[null,null,null,null,null,null,null,null,null,null,null,null,null,null,null,null,null,null,null,null,null,null,null,null,null,{"$f":"TEXT(Display!Z51,\"0%\")&\" \"&Display!AA51","v":"100% of the stocks in the ETF are higher today"}]

{"sheet":"ARKW","index":1,"n_rows":104,"n_cols":34,"rows_kept":104,"cut":false,"hidden":true,"merged":[]}
[{"$f":"IF(Symbols!A1=\"\",\"\",Symbols!A1)","v":"S.US.TSLA"},{"$f":"IF(A1=\"\",\"\",IF(J1>0,1,0))","v":1},{"$f":"A1","v":"S.US.TSLA"},{"$f":"IF(A1=\"\",\"\",RTD(\"cqg.rtd\", ,\"ContractData\",C1, \"LongDescription\",, \"T\"))","v":"TESLA, INC."},null,{"$f":"(\"$J$\"&\"1\"&\":$J$\"&A103)","v":"$J$1:$J$48"},null,{"$f":"IF(A1=\"\",\"\",RTD(\"cqg.rtd\", ,\"ContractData\",C1, \"LastTradeToday\",, \"T\"))","v":""},{"$f":"IF(A1=\"\",\"\",RTD(\"cqg.rtd\", ,\"ContractData\",C1, \"NetLastTradeToday\",, \"T\"))","v":""},{"$f":"IF(A1=\"\",\"\",IFERROR(RTD(\"cqg.rtd\", ,\"ContractData\",C1, \"PerCentNetLastTrade\",, \"T\")/100,\"\"))","v":""},{"$f":"IF(A1=\"\",\"\",RTD(\"cqg.rtd\", ,\"ContractData\", C1, \"T_CVol\",, \"T\"))","v":1062646},1,{"$f":"IFERROR(RANK($J1,INDIRECT((\"$J$\"&\"1\"&\":$J$\"&$A$103)))+COUNTIF($J$1:J1,J1)-1,\"\")","v":""},{"$f":"C1","v":"S.US.TSLA"},{"$f":"IFERROR(VLOOKUP($L1,$M$1:$N$101,2,FALSE),\"\")","v":""},{"$f":"IF(O1=\"\",\"\",RTD(\"cqg.rtd\", ,\"ContractData\",O1, \"LongDescription\",, \"T\"))","v":""},{"$f":"IFERROR(RTD(\"cqg.rtd\", ,\"ContractData\",O1, \"PerCentNetLastTrade\",, \"T\")/100,\"\")","v":""},{"$f":"IFERROR(\"https://finance.yahoo.com/quote/\"&RIGHT(O1,(LEN(O1)-5)),\"\")","v":""},null,{"$f":"IF(Q1>=0,Q1,NA())","v":""},{"$f":"IFERROR(IF(Q1>=0,NA(),-1*Q1),\"\")","v":""},null,{"$f":"IF(Q1=\"\",\"\",IF(Q1<0,\"\",IFERROR(RTD(\"cqg.rtd\", ,\"ContractData\",O1, \"LongDescription\",, \"T\"),\"\")))","v":""},null,null,{"$f":"IF(W1=\"\",\"\",IFERROR(T1,Q1))","v":""},{"$f":"MIN(J1:J101)","v":0},{"$f":"IFERROR(VLOOKUP(AA1,J1:O98,4,FALSE),\"\")","v":""},{"$f":"IF(AB1=\"\",\"\",VLOOKUP($AB1,$M$1:$N$101,2,FALSE))","v":""},{"$f":"IF(RTD(\"cqg.rtd\", ,\"ContractData\",AC1, \"PerCentNetLastTrade\",, \"T\")>0,\"\",IFERROR(RTD(\"cqg.rtd\", ,\"ContractData\",AC1, \"PerCentNetLastTrade\",, \"T\")/100,\"\"))","v":""},{"$f":"IF(AD1>0,\"\",IFERROR(RTD(\"cqg.rtd\", ,\"ContractData\",AC1, \"LongDescription\",, \"T\"),\"\"))","v":""},{"$f":"\"\"","v":""},{"$f":"IF(AD1>0,\"\",IFERROR(AD1*-1,\"\"))","v":""},{"$f":"IFERROR(\"https://finance.yahoo.com/quote/\"&RIGHT(AC1,(LEN(AC1)-5)),\"\")","v":""}]
[{"$f":"IF(Symbols!A2=\"\",\"\",Symbols!A2)","v":"S.US.AMD"},{"$f":"IF(A2=\"\",\"\",IF(J2>0,1,0))","v":1},{"$f":"A2","v":"S.US.AMD"},{"$f":"IF(A2=\"\",\"\",RTD(\"cqg.rtd\", ,\"ContractData\",C2, \"LongDescription\",, \"T\"))","v":"ADV MICRO DEVICES"},null,null,null,{"$f":"IF(A2=\"\",\"\",RTD(\"cqg.rtd\", ,\"ContractData\",C2, \"LastTradeToday\",, \"T\"))","v":""},{"$f":"IF(A2=\"\",\"\",RTD(\"cqg.rtd\", ,\"ContractData\",C2, \"NetLastTradeToday\",, \"T\"))","v":""},{"$f":"IF(A2=\"\",\"\",IFERROR(RTD(\"cqg.rtd\", ,\"ContractData\",C2, \"PerCentNetLastTrade\",, \"T\")/100,\"\"))","v":""},{"$f":"IF(A2=\"\",\"\",RTD(\"cqg.rtd\", ,\"ContractData\", C2, \"T_CVol\",, \"T\"))","v":858195},{"$f":"L1+1","v":2},{"$f":"IFERROR(RANK($J2,INDIRECT((\"$J$\"&\"1\"&\":$J$\"&$A$103)))+COUNTIF($J$1:J2,J2)-1,\"\")","v":""},{"$f":"C2","v":"S.US.AMD"},{"$f":"IFERROR(VLOOKUP($L2,$M$1:$N$101,2,FALSE),\"\")","v":""},{"$f":"IF(O2=\"\",\"\",RTD(\"cqg.rtd\", ,\"ContractData\",O2, \"LongDescription\",, \"T\"))","v":""},{"$f":"IFERROR(RTD(\"cqg.rtd\", ,\"ContractData\",O2, \"PerCentNetLastTrade\",, \"T\")/100,\"\")","v":""},{"$f":"IFERROR(\"https://finance.yahoo.com/quote/\"&RIGHT(O2,(LEN(O2)-5)),\"\")","v":""},null,{"$f":"IF(Q2>=0,Q2,NA())","v":""},{"$f":"IFERROR(IF(Q2>=0,NA(),-1*Q2),\"\")","v":""},null,{"$f":"IF(Q2=\"\",\"\",IF(Q2<0,\"\",IFERROR(RTD(\"cqg.rtd\", ,\"ContractData\",O2, \"LongDescription\",, \"T\"),\"\")))","v":""},null,null,{"$f":"IF(W2=\"\",\"\",IFERROR(T2,Q2))","v":""},null,{"$f":"IFERROR(AB1-1,\"\")","v":""},{"$f":"IF(AB2=\"\",\"\",VLOOKUP($AB2,$M$1:$N$101,2,FALSE))","v":""},{"$f":"IF(RTD(\"cqg.rtd\", ,\"ContractData\",AC2, \"PerCentNetLastTrade\",, \"T\")>0,\"\",IFERROR(RTD(\"cqg.rtd\", ,\"ContractData\",AC2, \"PerCentNetLastTrade\",, \"T\")/100,\"\"))","v":""},{"$f":"IF(AD2>0,\"\",IFERROR(RTD(\"cqg.rtd\", ,\"ContractData\",AC2, \"LongDescription\",, \"T\"),\"\"))","v":""},{"$f":"\"\"","v":""},{"$f":"IF(AD2>0,\"\",IFERROR(AD2*-1,\"\"))","v":""},{"$f":"IFERROR(\"https://finance.yahoo.com/quote/\"&RIGHT(AC2,(LEN(AC2)-5)),\"\")","v":""}]
[{"$f":"IF(Symbols!A3=\"\",\"\",Symbols!A3)","v":"S.US.ARKW"},1,"S.US.ARKW",{"$f":"IF(A3=\"\",\"\",RTD(\"cqg.rtd\", ,\"ContractData\",C3, \"LongDescription\",, \"T\"))","v":"ARK Next Generation Internet ETF"},null,null,null,{"$f":"IF(A3=\"\",\"\",RTD(\"cqg.rtd\", ,\"ContractData\",C3, \"LastTradeToday\",, \"T\"))","v":""},{"$f":"IF(A3=\"\",\"\",RTD(\"cqg.rtd\", ,\"ContractData\",C3, \"NetLastTradeToday\",, \"T\"))","v":""},{"$f":"IF(A3=\"\",\"\",IFERROR(RTD(\"cqg.rtd\", ,\"ContractData\",C3, \"PerCentNetLastTrade\",, \"T\")/100,\"\"))","v":""},{"$f":"IF(A3=\"\",\"\",RTD(\"cqg.rtd\", ,\"ContractData\", C3, \"T_CVol\",, \"T\"))","v":658},{"$f":"L2+1","v":3},{"$f":"IFERROR(RANK($J3,INDIRECT((\"$J$\"&\"1\"&\":$J$\"&$A$103)))+COUNTIF($J$1:J3,J3)-1,\"\")","v":""},"S.US.ARKW","",{"$f":"IF(O3=\"\",\"\",RTD(\"cqg.rtd\", ,\"ContractData\",O3, \"LongDescription\",, \"T\"))","v":""},{"$f":"IFERROR(RTD(\"cqg.rtd\", ,\"ContractData\",O3, \"PerCentNetLastTrade\",, \"T\")/100,\"\")","v":""},"",null,"","",null,{"$f":"IF(Q3=\"\",\"\",IF(Q3<0,\"\",IFERROR(RTD(\"cqg.rtd\", ,\"ContractData\",O3, \"LongDescription\",, \"T\"),\"\")))","v":""},null,null,"",null,{"$f":"IFERROR(AB2-1,\"\")","v":""},"",{"$f":"IF(RTD(\"cqg.rtd\", ,\"ContractData\",AC3, \"PerCentNetLastTrade\",, \"T\")>0,\"\",IFERROR(RTD(\"cqg.rtd\", ,\"ContractData\",AC3, \"PerCentNetLastTrade\",, \"T\")/100,\"\"))","v":""},{"$f":"IF(AD3>0,\"\",IFERROR(RTD(\"cqg.rtd\", ,\"ContractData\",AC3, \"LongDescription\",, \"T\"),\"\"))","v":""},{"$f":"\"\"","v":""},"",""]
[{"$f":"IF(Symbols!A4=\"\",\"\",Symbols!A4)","v":"S.US.ROKU"},1,"S.US.ROKU",{"$f":"IF(A4=\"\",\"\",RTD(\"cqg.rtd\", ,\"ContractData\",C4, \"LongDescription\",, \"T\"))","v":"ROKU, INC. A CMN"},null,null,null,{"$f":"IF(A4=\"\",\"\",RTD(\"cqg.rtd\", ,\"ContractData\",C4, \"LastTradeToday\",, \"T\"))","v":""},{"$f":"IF(A4=\"\",\"\",RTD(\"cqg.rtd\", ,\"ContractData\",C4, \"NetLastTradeToday\",, \"T\"))","v":""},{"$f":"IF(A4=\"\",\"\",IFERROR(RTD(\"cqg.rtd\", ,\"ContractData\",C4, \"PerCentNetLastTrade\",, \"T\")/100,\"\"))","v":""},{"$f":"IF(A4=\"\",\"\",RTD(\"cqg.rtd\", ,\"ContractData\", C4, \"T_CVol\",, \"T\"))","v":7703},4,{"$f":"IFERROR(RANK($J4,INDIRECT((\"$J$\"&\"1\"&\":$J$\"&$A$103)))+COUNTIF($J$1:J4,J4)-1,\"\")","v":""},"S.US.ROKU","",{"$f":"IF(O4=\"\",\"\",RTD(\"cqg.rtd\", ,\"ContractData\",O4, \"LongDescription\",, \"T\"))","v":""},{"$f":"IFERROR(RTD(\"cqg.rtd\", ,\"ContractData\",O4, \"PerCentNetLastTrade\",, \"T\")/100,\"\")","v":""},"",null,"","",null,{"$f":"IF(Q4=\"\",\"\",IF(Q4<0,\"\",IFERROR(RTD(\"cqg.rtd\", ,\"ContractData\",O4, \"LongDescription\",, \"T\"),\"\")))","v":""},null,null,"",null,"","",{"$f":"IF(RTD(\"cqg.rtd\", ,\"ContractData\",AC4, \"PerCentNetLastTrade\",, \"T\")>0,\"\",IFERROR(RTD(\"cqg.rtd\", ,\"ContractData\",AC4, \"PerCentNetLastTrade\",, \"T\")/100,\"\"))","v":""},{"$f":"IF(AD4>0,\"\",IFERROR(RTD(\"cqg.rtd\", ,\"ContractData\",AC4, \"LongDescription\",, \"T\"),\"\"))","v":""},{"$f":"\"\"","v":""},"",""]
[{"$f":"IF(Symbols!A5=\"\",\"\",Symbols!A5)","v":"S.US.COIN"},1,"S.US.COIN",{"$f":"IF(A5=\"\",\"\",RTD(\"cqg.rtd\", ,\"ContractData\",C5, \"LongDescription\",, \"T\"))","v":"COINBASE GLB CL A CM"},null,null,null,{"$f":"IF(A5=\"\",\"\",RTD(\"cqg.rtd\", ,\"ContractData\",C5, \"LastTradeToday\",, \"T\"))","v":""},{"$f":"IF(A5=\"\",\"\",RTD(\"cqg.rtd\", ,\"ContractData\",C5, \"NetLastTradeToday\",, \"T\"))","v":""},{"$f":"IF(A5=\"\",\"\",IFERROR(RTD(\"cqg.rtd\", ,\"ContractData\",C5, \"PerCentNetLastTrade\",, \"T\")/100,\"\"))","v":""},{"$f":"IF(A5=\"\",\"\",RTD(\"cqg.rtd\", ,\"ContractData\", C5, \"T_CVol\",, \"T\"))","v":214252},5,{"$f":"IFERROR(RANK($J5,INDIRECT((\"$J$\"&\"1\"&\":$J$\"&$A$103)))+COUNTIF($J$1:J5,J5)-1,\"\")","v":""},"S.US.COIN","",{"$f":"IF(O5=\"\",\"\",RTD(\"cqg.rtd\", ,\"ContractData\",O5, \"LongDescription\",, \"T\"))","v":""},{"$f":"IFERROR(RTD(\"cqg.rtd\", ,\"ContractData\",O5, \"PerCentNetLastTrade\",, \"T\")/100,\"\")","v":""},"",null,"","",null,{"$f":"IF(Q5=\"\",\"\",IF(Q5<0,\"\",IFERROR(RTD(\"cqg.rtd\", ,\"ContractData\",O5, \"LongDescription\",, \"T\"),\"\")))","v":""},null,null,"",null,"","",{"$f":"IF(RTD(\"cqg.rtd\", ,\"ContractData\",AC5, \"PerCentNetLastTrade\",, \"T\")>0,\"\",IFERROR(RTD(\"cqg.rtd\", ,\"ContractData\",AC5, \"PerCentNetLastTrade\",, \"T\")/100,\"\"))","v":""},{"$f":"IF(AD5>0,\"\",IFERROR(RTD(\"cqg.rtd\", ,\"ContractData\",AC5, \"LongDescription\",, \"T\"),\"\"))","v":""},{"$f":"\"\"","v":""},"",""]
[{"$f":"IF(Symbols!A6=\"\",\"\",Symbols!A6)","v":"S.US.SHOP"},1,"S.US.SHOP",{"$f":"IF(A6=\"\",\"\",RTD(\"cqg.rtd\", ,\"ContractData\",C6, \"LongDescription\",, \"T\"))","v":"Shopify Inc."},null,null,null,{"$f":"IF(A6=\"\",\"\",RTD(\"cqg.rtd\", ,\"ContractData\",C6, \"LastTradeToday\",, \"T\"))","v":""},{"$f":"IF(A6=\"\",\"\",RTD(\"cqg.rtd\", ,\"ContractData\",C6, \"NetLastTradeToday\",, \"T\"))","v":""},{"$f":"IF(A6=\"\",\"\",IFERROR(RTD(\"cqg.rtd\", ,\"ContractData\",C6, \"PerCentNetLastTrade\",, \"T\")/100,\"\"))","v":""},{"$f":"IF(A6=\"\",\"\",RTD(\"cqg.rtd\", ,\"ContractData\", C6, \"T_CVol\",, \"T\"))","v":82697},6,{"$f":"IFERROR(RANK($J6,INDIRECT((\"$J$\"&\"1\"&\":$J$\"&$A$103)))+COUNTIF($J$1:J6,J6)-1,\"\")","v":""},"S.US.SHOP","",{"$f":"IF(O6=\"\",\"\",RTD(\"cqg.rtd\", ,\"ContractData\",O6, \"LongDescription\",, \"T\"))","v":""},{"$f":"IFERROR(RTD(\"cqg.rtd\", ,\"ContractData\",O6, \"PerCentNetLastTrade\",, \"T\")/100,\"\")","v":""},"",null,"","",null,{"$f":"IF(Q6=\"\",\"\",IF(Q6<0,\"\",IFERROR(RTD(\"cqg.rtd\", ,\"ContractData\",O6, \"LongDescription\",, \"T\"),\"\")))","v":""},null,null,"",null,"","",{"$f":"IF(RTD(\"cqg.rtd\", ,\"ContractData\",AC6, \"PerCentNetLastTrade\",, \"T\")>0,\"\",IFERROR(RTD(\"cqg.rtd\", ,\"ContractData\",AC6, \"PerCentNetLastTrade\",, \"T\")/100,\"\"))","v":""},{"$f":"IF(AD6>0,\"\",IFERROR(RTD(\"cqg.rtd\", ,\"ContractData\",AC6, \"LongDescription\",, \"T\"),\"\"))","v":""},{"$f":"\"\"","v":""},"",""]
[{"$f":"IF(Symbols!A7=\"\",\"\",Symbols!A7)","v":"S.US.HOOD"},1,"S.US.HOOD",{"$f":"IF(A7=\"\",\"\",RTD(\"cqg.rtd\", ,\"ContractData\",C7, \"LongDescription\",, \"T\"))","v":"ROBINHOOD MK CL A CS"},null,null,null,{"$f":"IF(A7=\"\",\"\",RTD(\"cqg.rtd\", ,\"ContractData\",C7, \"LastTradeToday\",, \"T\"))","v":""},{"$f":"IF(A7=\"\",\"\",RTD(\"cqg.rtd\", ,\"ContractData\",C7, \"NetLastTradeToday\",, \"T\"))","v":""},{"$f":"IF(A7=\"\",\"\",IFERROR(RTD(\"cqg.rtd\", ,\"ContractData\",C7, \"PerCentNetLastTrade\",, \"T\")/100,\"\"))","v":""},{"$f":"IF(A7=\"\",\"\",RTD(\"cqg.rtd\", ,\"ContractData\", C7, \"T_CVol\",, \"T\"))","v":307298},7,{"$f":"IFERROR(RANK($J7,INDIRECT((\"$J$\"&\"1\"&\":$J$\"&$A$103)))+COUNTIF($J$1:J7,J7)-1,\"\")","v":""},"S.US.HOOD","",{"$f":"IF(O7=\"\",\"\",RTD(\"cqg.rtd\", ,\"ContractData\",O7, \"LongDescription\",, \"T\"))","v":""},{"$f":"IFERROR(RTD(\"cqg.rtd\", ,\"ContractData\",O7, \"PerCentNetLastTrade\",, \"T\")/100,\"\")","v":""},"",null,"","",null,{"$f":"IF(Q7=\"\",\"\",IF(Q7<0,\"\",IFERROR(RTD(\"cqg.rtd\", ,\"ContractData\",O7, \"LongDescription\",, \"T\"),\"\")))","v":""},null,null,"",null,"","",{"$f":"IF(RTD(\"cqg.rtd\", ,\"ContractData\",AC7, \"PerCentNetLastTrade\",, \"T\")>0,\"\",IFERROR(RTD(\"cqg.rtd\", ,\"ContractData\",AC7, \"PerCentNetLastTrade\",, \"T\")/100,\"\"))","v":""},{"$f":"IF(AD7>0,\"\",IFERROR(RTD(\"cqg.rtd\", ,\"ContractData\",AC7, \"LongDescription\",, \"T\"),\"\"))","v":""},{"$f":"\"\"","v":""},"",""]
[{"$f":"IF(Symbols!A8=\"\",\"\",Symbols!A8)","v":"S.US.PLTR"},1,"S.US.PLTR",{"$f":"IF(A8=\"\",\"\",RTD(\"cqg.rtd\", ,\"ContractData\",C8, \"LongDescription\",, \"T\"))","v":"PALANTIR TECH CL A"},null,null,null,{"$f":"IF(A8=\"\",\"\",RTD(\"cqg.rtd\", ,\"ContractData\",C8, \"LastTradeToday\",, \"T\"))","v":""},{"$f":"IF(A8=\"\",\"\",RTD(\"cqg.rtd\", ,\"ContractData\",C8, \"NetLastTradeToday\",, \"T\"))","v":""},{"$f":"IF(A8=\"\",\"\",IFERROR(RTD(\"cqg.rtd\", ,\"ContractData\",C8, \"PerCentNetLastTrade\",, \"T\")/100,\"\"))","v":""},{"$f":"IF(A8=\"\",\"\",RTD(\"cqg.rtd\", ,\"ContractData\", C8, \"T_CVol\",, \"T\"))","v":707815},8,{"$f":"IFERROR(RANK($J8,INDIRECT((\"$J$\"&\"1\"&\":$J$\"&$A$103)))+COUNTIF($J$1:J8,J8)-1,\"\")","v":""},"S.US.PLTR","",{"$f":"IF(O8=\"\",\"\",RTD(\"cqg.rtd\", ,\"ContractData\",O8, \"LongDescription\",, \"T\"))","v":""},{"$f":"IFERROR(RTD(\"cqg.rtd\", ,\"ContractData\",O8, \"PerCentNetLastTrade\",, \"T\")/100,\"\")","v":""},"",null,"","",null,{"$f":"IF(Q8=\"\",\"\",IF(Q8<0,\"\",IFERROR(RTD(\"cqg.rtd\", ,\"ContractData\",O8, \"LongDescription\",, \"T\"),\"\")))","v":""},null,null,"",null,"","",{"$f":"IF(RTD(\"cqg.rtd\", ,\"ContractData\",AC8, \"PerCentNetLastTrade\",, \"T\")>0,\"\",IFERROR(RTD(\"cqg.rtd\", ,\"ContractData\",AC8, \"PerCentNetLastTrade\",, \"T\")/100,\"\"))","v":""},{"$f":"IF(AD8>0,\"\",IFERROR(RTD(\"cqg.rtd\", ,\"ContractData\",AC8, \"LongDescription\",, \"T\"),\"\"))","v":""},{"$f":"\"\"","v":""},"",""]
[{"$f":"IF(Symbols!A9=\"\",\"\",Symbols!A9)","v":"S.US.RBLX"},1,"S.US.RBLX",{"$f":"IF(A9=\"\",\"\",RTD(\"cqg.rtd\", ,\"ContractData\",C9, \"LongDescription\",, \"T\"))","v":"Roblox Corp"},null,null,null,{"$f":"IF(A9=\"\",\"\",RTD(\"cqg.rtd\", ,\"ContractData\",C9, \"LastTradeToday\",, \"T\"))","v":""},{"$f":"IF(A9=\"\",\"\",RTD(\"cqg.rtd\", ,\"ContractData\",C9, \"NetLastTradeToday\",, \"T\"))","v":""},{"$f":"IF(A9=\"\",\"\",IFERROR(RTD(\"cqg.rtd\", ,\"ContractData\",C9, \"PerCentNetLastTrade\",, \"T\")/100,\"\"))","v":""},{"$f":"IF(A9=\"\",\"\",RTD(\"cqg.rtd\", ,\"ContractData\", C9, \"T_CVol\",, \"T\"))","v":17309},9,{"$f":"IFERROR(RANK($J9,INDIRECT((\"$J$\"&\"1\"&\":$J$\"&$A$103)))+COUNTIF($J$1:J9,J9)-1,\"\")","v":""},"S.US.RBLX","",{"$f":"IF(O9=\"\",\"\",RTD(\"cqg.rtd\", ,\"ContractData\",O9, \"LongDescription\",, \"T\"))","v":""},{"$f":"IFERROR(RTD(\"cqg.rtd\", ,\"ContractData\",O9, \"PerCentNetLastTrade\",, \"T\")/100,\"\")","v":""},"",null,"","",null,{"$f":"IF(Q9=\"\",\"\",IF(Q9<0,\"\",IFERROR(RTD(\"cqg.rtd\", ,\"ContractData\",O9, \"LongDescription\",, \"T\"),\"\")))","v":""},null,null,"",null,"","",{"$f":"IF(RTD(\"cqg.rtd\", ,\"ContractData\",AC9, \"PerCentNetLastTrade\",, \"T\")>0,\"\",IFERROR(RTD(\"cqg.rtd\", ,\"ContractData\",AC9, \"PerCentNetLastTrade\",, \"T\")/100,\"\"))","v":""},{"$f":"IF(AD9>0,\"\",IFERROR(RTD(\"cqg.rtd\", ,\"ContractData\",AC9, \"LongDescription\",, \"T\"),\"\"))","v":""},{"$f":"\"\"","v":""},"",""]
[{"$f":"IF(Symbols!A10=\"\",\"\",Symbols!A10)","v":"S.US.CRCL"},1,"S.US.CRCL",{"$f":"IF(A10=\"\",\"\",RTD(\"cqg.rtd\", ,\"ContractData\",C10, \"LongDescription\",, \"T\"))","v":"Circle Internet Group"},null,null,null,{"$f":"IF(A10=\"\",\"\",RTD(\"cqg.rtd\", ,\"ContractData\",C10, \"LastTradeToday\",, \"T\"))","v":""},{"$f":"IF(A10=\"\",\"\",RTD(\"cqg.rtd\", ,\"ContractData\",C10, \"NetLastTradeToday\",, \"T\"))","v":""},{"$f":"IF(A10=\"\",\"\",IFERROR(RTD(\"cqg.rtd\", ,\"ContractData\",C10, \"PerCentNetLastTrade\",, \"T\")/100,\"\"))","v":""},{"$f":"IF(A10=\"\",\"\",RTD(\"cqg.rtd\", ,\"ContractData\", C10, \"T_CVol\",, \"T\"))","v":545240},10,{"$f":"IFERROR(RANK($J10,INDIRECT((\"$J$\"&\"1\"&\":$J$\"&$A$103)))+COUNTIF($J$1:J10,J10)-1,\"\")","v":""},"S.US.CRCL","",{"$f":"IF(O10=\"\",\"\",RTD(\"cqg.rtd\", ,\"ContractData\",O10, \"LongDescription\",, \"T\"))","v":""},{"$f":"IFERROR(RTD(\"cqg.rtd\", ,\"ContractData\",O10, \"PerCentNetLastTrade\",, \"T\")/100,\"\")","v":""},"",null,"","",null,{"$f":"IF(Q10=\"\",\"\",IF(Q10<0,\"\",IFERROR(RTD(\"cqg.rtd\", ,\"ContractData\",O10, \"LongDescription\",, \"T\"),\"\")))","v":""},null,null,"",null,"","",{"$f":"IF(RTD(\"cqg.rtd\", ,\"ContractData\",AC10, \"PerCentNetLastTrade\",, \"T\")>0,\"\",IFERROR(RTD(\"cqg.rtd\", ,\"ContractData\",AC10, \"PerCentNetLastTrade\",, \"T\")/100,\"\"))","v":""},{"$f":"IF(AD10>0,\"\",IFERROR(RTD(\"cqg.rtd\", ,\"ContractData\",AC10, \"LongDescription\",, \"T\"),\"\"))","v":""},{"$f":"\"\"","v":""},"",""]
[{"$f":"IF(Symbols!A11=\"\",\"\",Symbols!A11)","v":"S.US.TSM"},1,"S.US.TSM",{"$f":"IF(A11=\"\",\"\",RTD(\"cqg.rtd\", ,\"ContractData\",C11, \"LongDescription\",, \"T\"))","v":"Taiwan Semiconductor Manufacturing Co"},null,null,null,{"$f":"IF(A11=\"\",\"\",RTD(\"cqg.rtd\", ,\"ContractData\",C11, \"LastTradeToday\",, \"T\"))","v":""},{"$f":"IF(A11=\"\",\"\",RTD(\"cqg.rtd\", ,\"ContractData\",C11, \"NetLastTradeToday\",, \"T\"))","v":""},{"$f":"IF(A11=\"\",\"\",IFERROR(RTD(\"cqg.rtd\", ,\"ContractData\",C11, \"PerCentNetLastTrade\",, \"T\")/100,\"\"))","v":""},{"$f":"IF(A11=\"\",\"\",RTD(\"cqg.rtd\", ,\"ContractData\", C11, \"T_CVol\",, \"T\"))","v":146211},11,{"$f":"IFERROR(RANK($J11,INDIRECT((\"$J$\"&\"1\"&\":$J$\"&$A$103)))+COUNTIF($J$1:J11,J11)-1,\"\")","v":""},"S.US.TSM","",{"$f":"IF(O11=\"\",\"\",RTD(\"cqg.rtd\", ,\"ContractData\",O11, \"LongDescription\",, \"T\"))","v":""},{"$f":"IFERROR(RTD(\"cqg.rtd\", ,\"ContractData\",O11, \"PerCentNetLastTrade\",, \"T\")/100,\"\")","v":""},"",null,"","",null,{"$f":"IF(Q11=\"\",\"\",IF(Q11<0,\"\",IFERROR(RTD(\"cqg.rtd\", ,\"ContractData\",O11, \"LongDescription\",, \"T\"),\"\")))","v":""},null,null,"",null,"","",{"$f":"IF(RTD(\"cqg.rtd\", ,\"ContractData\",AC11, \"PerCentNetLastTrade\",, \"T\")>0,\"\",IFERROR(RTD(\"cqg.rtd\", ,\"ContractData\",AC11, \"PerCentNetLastTrade\",, \"T\")/100,\"\"))","v":""},{"$f":"IF(AD11>0,\"\",IFERROR(RTD(\"cqg.rtd\", ,\"ContractData\",AC11, \"LongDescription\",, \"T\"),\"\"))","v":""},{"$f":"\"\"","v":""},"",""]
[{"$f":"IF(Symbols!A12=\"\",\"\",Symbols!A12)","v":"S.US.BMNR"},1,"S.US.BMNR",{"$f":"IF(A12=\"\",\"\",RTD(\"cqg.rtd\", ,\"ContractData\",C12, \"LongDescription\",, \"T\"))","v":"BitMine Immersion Technologies Inc."},null,null,null,{"$f":"IF(A12=\"\",\"\",RTD(\"cqg.rtd\", ,\"ContractData\",C12, \"LastTradeToday\",, \"T\"))","v":""},{"$f":"IF(A12=\"\",\"\",RTD(\"cqg.rtd\", ,\"ContractData\",C12, \"NetLastTradeToday\",, \"T\"))","v":""},{"$f":"IF(A12=\"\",\"\",IFERROR(RTD(\"cqg.rtd\", ,\"ContractData\",C12, \"PerCentNetLastTrade\",, \"T\")/100,\"\"))","v":""},{"$f":"IF(A12=\"\",\"\",RTD(\"cqg.rtd\", ,\"ContractData\", C12, \"T_CVol\",, \"T\"))","v":1032231},12,{"$f":"IFERROR(RANK($J12,INDIRECT((\"$J$\"&\"1\"&\":$J$\"&$A$103)))+COUNTIF($J$1:J12,J12)-1,\"\")","v":""},"S.US.BMNR","",{"$f":"IF(O12=\"\",\"\",RTD(\"cqg.rtd\", ,\"ContractData\",O12, \"LongDescription\",, \"T\"))","v":""},{"$f":"IFERROR(RTD(\"cqg.rtd\", ,\"ContractData\",O12, \"PerCentNetLastTrade\",, \"T\")/100,\"\")","v":""},"",null,"","",null,{"$f":"IF(Q12=\"\",\"\",IF(Q12<0,\"\",IFERROR(RTD(\"cqg.rtd\", ,\"ContractData\",O12, \"LongDescription\",, \"T\"),\"\")))","v":""},null,null,"",null,"","",{"$f":"IF(RTD(\"cqg.rtd\", ,\"ContractData\",AC12, \"PerCentNetLastTrade\",, \"T\")>0,\"\",IFERROR(RTD(\"cqg.rtd\", ,\"ContractData\",AC12, \"PerCentNetLastTrade\",, \"T\")/100,\"\"))","v":""},{"$f":"IF(AD12>0,\"\",IFERROR(RTD(\"cqg.rtd\", ,\"ContractData\",AC12, \"LongDescription\",, \"T\"),\"\"))","v":""},{"$f":"\"\"","v":""},"",""]
[{"$f":"IF(Symbols!A13=\"\",\"\",Symbols!A13)","v":"S.US.META"},1,"S.US.META",{"$f":"IF(A13=\"\",\"\",RTD(\"cqg.rtd\", ,\"ContractData\",C13, \"LongDescription\",, \"T\"))","v":"Meta Platforms, Inc."},null,null,null,{"$f":"IF(A13=\"\",\"\",RTD(\"cqg.rtd\", ,\"ContractData\",C13, \"LastTradeToday\",, \"T\"))","v":""},{"$f":"IF(A13=\"\",\"\",RTD(\"cqg.rtd\", ,\"ContractData\",C13, \"NetLastTradeToday\",, \"T\"))","v":""},{"$f":"IF(A13=\"\",\"\",IFERROR(RTD(\"cqg.rtd\", ,\"ContractData\",C13, \"PerCentNetLastTrade\",, \"T\")/100,\"\"))","v":""},{"$f":"IF(A13=\"\",\"\",RTD(\"cqg.rtd\", ,\"ContractData\", C13, \"T_CVol\",, \"T\"))","v":286894},13,{"$f":"IFERROR(RANK($J13,INDIRECT((\"$J$\"&\"1\"&\":$J$\"&$A$103)))+COUNTIF($J$1:J13,J13)-1,\"\")","v":""},"S.US.META","",{"$f":"IF(O13=\"\",\"\",RTD(\"cqg.rtd\", ,\"ContractData\",O13, \"LongDescription\",, \"T\"))","v":""},{"$f":"IFERROR(RTD(\"cqg.rtd\", ,\"ContractData\",O13, \"PerCentNetLastTrade\",, \"T\")/100,\"\")","v":""},"",null,"","",null,{"$f":"IF(Q13=\"\",\"\",IF(Q13<0,\"\",IFERROR(RTD(\"cqg.rtd\", ,\"ContractData\",O13, \"LongDescription\",, \"T\"),\"\")))","v":""},null,null,"",null,"","",{"$f":"IF(RTD(\"cqg.rtd\", ,\"ContractData\",AC13, \"PerCentNetLastTrade\",, \"T\")>0,\"\",IFERROR(RTD(\"cqg.rtd\", ,\"ContractData\",AC13, \"PerCentNetLastTrade\",, \"T\")/100,\"\"))","v":""},{"$f":"IF(AD13>0,\"\",IFERROR(RTD(\"cqg.rtd\", ,\"ContractData\",AC13, \"LongDescription\",, \"T\"),\"\"))","v":""},{"$f":"\"\"","v":""},"",""]
[{"$f":"IF(Symbols!A14=\"\",\"\",Symbols!A14)","v":"S.US.GOOG"},1,"S.US.GOOG",{"$f":"IF(A14=\"\",\"\",RTD(\"cqg.rtd\", ,\"ContractData\",C14, \"LongDescription\",, \"T\"))","v":"ALPHABET CL C CAP"},null,null,null,{"$f":"IF(A14=\"\",\"\",RTD(\"cqg.rtd\", ,\"ContractData\",C14, \"LastTradeToday\",, \"T\"))","v":""},{"$f":"IF(A14=\"\",\"\",RTD(\"cqg.rtd\", ,\"ContractData\",C14, \"NetLastTradeToday\",, \"T\"))","v":""},{"$f":"IF(A14=\"\",\"\",IFERROR(RTD(\"cqg.rtd\", ,\"ContractData\",C14, \"PerCentNetLastTrade\",, \"T\")/100,\"\"))","v":""},{"$f":"IF(A14=\"\",\"\",RTD(\"cqg.rtd\", ,\"ContractData\", C14, \"T_CVol\",, \"T\"))","v":599197},14,{"$f":"IFERROR(RANK($J14,INDIRECT((\"$J$\"&\"1\"&\":$J$\"&$A$103)))+COUNTIF($J$1:J14,J14)-1,\"\")","v":""},"S.US.GOOG","",{"$f":"IF(O14=\"\",\"\",RTD(\"cqg.rtd\", ,\"ContractData\",O14, \"LongDescription\",, \"T\"))","v":""},{"$f":"IFERROR(RTD(\"cqg.rtd\", ,\"ContractData\",O14, \"PerCentNetLastTrade\",, \"T\")/100,\"\")","v":""},"",null,"","",null,{"$f":"IF(Q14=\"\",\"\",IF(Q14<0,\"\",IFERROR(RTD(\"cqg.rtd\", ,\"ContractData\",O14, \"LongDescription\",, \"T\"),\"\")))","v":""},null,null,"",null,"","",{"$f":"IF(RTD(\"cqg.rtd\", ,\"ContractData\",AC14, \"PerCentNetLastTrade\",, \"T\")>0,\"\",IFERROR(RTD(\"cqg.rtd\", ,\"ContractData\",AC14, \"PerCentNetLastTrade\",, \"T\")/100,\"\"))","v":""},{"$f":"IF(AD14>0,\"\",IFERROR(RTD(\"cqg.rtd\", ,\"ContractData\",AC14, \"LongDescription\",, \"T\"),\"\"))","v":""},{"$f":"\"\"","v":""},"",""]
[{"$f":"IF(Symbols!A15=\"\",\"\",Symbols!A15)","v":"S.US.CRWD"},1,"S.US.CRWD",{"$f":"IF(A15=\"\",\"\",RTD(\"cqg.rtd\", ,\"ContractData\",C15, \"LongDescription\",, \"T\"))","v":"CROWDSTRIKE HLD CM A"},null,null,null,{"$f":"IF(A15=\"\",\"\",RTD(\"cqg.rtd\", ,\"ContractData\",C15, \"LastTradeToday\",, \"T\"))","v":""},{"$f":"IF(A15=\"\",\"\",RTD(\"cqg.rtd\", ,\"ContractData\",C15, \"NetLastTradeToday\",, \"T\"))","v":""},{"$f":"IF(A15=\"\",\"\",IFERROR(RTD(\"cqg.rtd\", ,\"ContractData\",C15, \"PerCentNetLastTrade\",, \"T\")/100,\"\"))","v":""},{"$f":"IF(A15=\"\",\"\",RTD(\"cqg.rtd\", ,\"ContractData\", C15, \"T_CVol\",, \"T\"))","v":8552},15,{"$f":"IFERROR(RANK($J15,INDIRECT((\"$J$\"&\"1\"&\":$J$\"&$A$103)))+COUNTIF($J$1:J15,J15)-1,\"\")","v":""},"S.US.CRWD","",{"$f":"IF(O15=\"\",\"\",RTD(\"cqg.rtd\", ,\"ContractData\",O15, \"LongDescription\",, \"T\"))","v":""},{"$f":"IFERROR(RTD(\"cqg.rtd\", ,\"ContractData\",O15, \"PerCentNetLastTrade\",, \"T\")/100,\"\")","v":""},"",null,"","",null,{"$f":"IF(Q15=\"\",\"\",IF(Q15<0,\"\",IFERROR(RTD(\"cqg.rtd\", ,\"ContractData\",O15, \"LongDescription\",, \"T\"),\"\")))","v":""},null,null,"",null,"","",{"$f":"IF(RTD(\"cqg.rtd\", ,\"ContractData\",AC15, \"PerCentNetLastTrade\",, \"T\")>0,\"\",IFERROR(RTD(\"cqg.rtd\", ,\"ContractData\",AC15, \"PerCentNetLastTrade\",, \"T\")/100,\"\"))","v":""},{"$f":"IF(AD15>0,\"\",IFERROR(RTD(\"cqg.rtd\", ,\"ContractData\",AC15, \"LongDescription\",, \"T\"),\"\"))","v":""},{"$f":"\"\"","v":""},"",""]
[{"$f":"IF(Symbols!A16=\"\",\"\",Symbols!A16)","v":"S.US.XYZ"},1,"S.US.XYZ",{"$f":"IF(A16=\"\",\"\",RTD(\"cqg.rtd\", ,\"ContractData\",C16, \"LongDescription\",, \"T\"))","v":"Square, Inc"},null,null,null,{"$f":"IF(A16=\"\",\"\",RTD(\"cqg.rtd\", ,\"ContractData\",C16, \"LastTradeToday\",, \"T\"))","v":""},{"$f":"IF(A16=\"\",\"\",RTD(\"cqg.rtd\", ,\"ContractData\",C16, \"NetLastTradeToday\",, \"T\"))","v":""},{"$f":"IF(A16=\"\",\"\",IFERROR(RTD(\"cqg.rtd\", ,\"ContractData\",C16, \"PerCentNetLastTrade\",, \"T\")/100,\"\"))","v":""},{"$f":"IF(A16=\"\",\"\",RTD(\"cqg.rtd\", ,\"ContractData\", C16, \"T_CVol\",, \"T\"))","v":38614},16,{"$f":"IFERROR(RANK($J16,INDIRECT((\"$J$\"&\"1\"&\":$J$\"&$A$103)))+COUNTIF($J$1:J16,J16)-1,\"\")","v":""},"S.US.XYZ",""]
[{"$f":"IF(Symbols!A17=\"\",\"\",Symbols!A17)","v":"S.US.GTLB"},1,"S.US.GTLB",{"$f":"IF(A17=\"\",\"\",RTD(\"cqg.rtd\", ,\"ContractData\",C17, \"LongDescription\",, \"T\"))","v":"GITLAB INC."},null,null,null,{"$f":"IF(A17=\"\",\"\",RTD(\"cqg.rtd\", ,\"ContractData\",C17, \"LastTradeToday\",, \"T\"))","v":""},{"$f":"IF(A17=\"\",\"\",RTD(\"cqg.rtd\", ,\"ContractData\",C17, \"NetLastTradeToday\",, \"T\"))","v":""},{"$f":"IF(A17=\"\",\"\",IFERROR(RTD(\"cqg.rtd\", ,\"ContractData\",C17, \"PerCentNetLastTrade\",, \"T\")/100,\"\"))","v":""},{"$f":"IF(A17=\"\",\"\",RTD(\"cqg.rtd\", ,\"ContractData\", C17, \"T_CVol\",, \"T\"))","v":2175},17,{"$f":"IFERROR(RANK($J17,INDIRECT((\"$J$\"&\"1\"&\":$J$\"&$A$103)))+COUNTIF($J$1:J17,J17)-1,\"\")","v":""},"S.US.GTLB",""]
[{"$f":"IF(Symbols!A18=\"\",\"\",Symbols!A18)","v":"S.US.AMZN"},1,"S.US.AMZN",{"$f":"IF(A18=\"\",\"\",RTD(\"cqg.rtd\", ,\"ContractData\",C18, \"LongDescription\",, \"T\"))","v":"Amazon.com Inc"},null,null,null,{"$f":"IF(A18=\"\",\"\",RTD(\"cqg.rtd\", ,\"ContractData\",C18, \"LastTradeToday\",, \"T\"))","v":""},{"$f":"IF(A18=\"\",\"\",RTD(\"cqg.rtd\", ,\"ContractData\",C18, \"NetLastTradeToday\",, \"T\"))","v":""},{"$f":"IF(A18=\"\",\"\",IFERROR(RTD(\"cqg.rtd\", ,\"ContractData\",C18, \"PerCentNetLastTrade\",, \"T\")/100,\"\"))","v":""},{"$f":"IF(A18=\"\",\"\",RTD(\"cqg.rtd\", ,\"ContractData\", C18, \"T_CVol\",, \"T\"))","v":482352},18,{"$f":"IFERROR(RANK($J18,INDIRECT((\"$J$\"&\"1\"&\":$J$\"&$A$103)))+COUNTIF($J$1:J18,J18)-1,\"\")","v":""},"S.US.AMZN",""]
[{"$f":"IF(Symbols!A19=\"\",\"\",Symbols!A19)","v":"S.US.NET"},1,"S.US.NET",{"$f":"IF(A19=\"\",\"\",RTD(\"cqg.rtd\", ,\"ContractData\",C19, \"LongDescription\",, \"T\"))","v":"Cloudflare, Inc."},null,null,null,{"$f":"IF(A19=\"\",\"\",RTD(\"cqg.rtd\", ,\"ContractData\",C19, \"LastTradeToday\",, \"T\"))","v":""},{"$f":"IF(A19=\"\",\"\",RTD(\"cqg.rtd\", ,\"ContractData\",C19, \"NetLastTradeToday\",, \"T\"))","v":""},{"$f":"IF(A19=\"\",\"\",IFERROR(RTD(\"cqg.rtd\", ,\"ContractData\",C19, \"PerCentNetLastTrade\",, \"T\")/100,\"\"))","v":""},{"$f":"IF(A19=\"\",\"\",RTD(\"cqg.rtd\", ,\"ContractData\", C19, \"T_CVol\",, \"T\"))","v":20447},19,{"$f":"IFERROR(RANK($J19,INDIRECT((\"$J$\"&\"1\"&\":$J$\"&$A$103)))+COUNTIF($J$1:J19,J19)-1,\"\")","v":""},"S.US.NET",""]
[{"$f":"IF(Symbols!A20=\"\",\"\",Symbols!A20)","v":"S.US.DDOG"},1,"S.US.DDOG",{"$f":"IF(A20=\"\",\"\",RTD(\"cqg.rtd\", ,\"ContractData\",C20, \"LongDescription\",, \"T\"))","v":"DATADOG INC.L A CM"},null,null,null,{"$f":"IF(A20=\"\",\"\",RTD(\"cqg.rtd\", ,\"ContractData\",C20, \"LastTradeToday\",, \"T\"))","v":""},{"$f":"IF(A20=\"\",\"\",RTD(\"cqg.rtd\", ,\"ContractData\",C20, \"NetLastTradeToday\",, \"T\"))","v":""},{"$f":"IF(A20=\"\",\"\",IFERROR(RTD(\"cqg.rtd\", ,\"ContractData\",C20, \"PerCentNetLastTrade\",, \"T\")/100,\"\"))","v":""},{"$f":"IF(A20=\"\",\"\",RTD(\"cqg.rtd\", ,\"ContractData\", C20, \"T_CVol\",, \"T\"))","v":19559},20,{"$f":"IFERROR(RANK($J20,INDIRECT((\"$J$\"&\"1\"&\":$J$\"&$A$103)))+COUNTIF($J$1:J20,J20)-1,\"\")","v":""},"S.US.DDOG",""]
[{"$f":"IF(Symbols!A21=\"\",\"\",Symbols!A21)","v":"S.US.CRWV"},1,"S.US.CRWV",{"$f":"IF(A21=\"\",\"\",RTD(\"cqg.rtd\", ,\"ContractData\",C21, \"LongDescription\",, \"T\"))","v":"COREWEAVE CL A CS"},null,null,null,{"$f":"IF(A21=\"\",\"\",RTD(\"cqg.rtd\", ,\"ContractData\",C21, \"LastTradeToday\",, \"T\"))","v":""},{"$f":"IF(A21=\"\",\"\",RTD(\"cqg.rtd\", ,\"ContractData\",C21, \"NetLastTradeToday\",, \"T\"))","v":""},{"$f":"IF(A21=\"\",\"\",IFERROR(RTD(\"cqg.rtd\", ,\"ContractData\",C21, \"PerCentNetLastTrade\",, \"T\")/100,\"\"))","v":""},{"$f":"IF(A21=\"\",\"\",RTD(\"cqg.rtd\", ,\"ContractData\", C21, \"T_CVol\",, \"T\"))","v":969257},21,{"$f":"IFERROR(RANK($J21,INDIRECT((\"$J$\"&\"1\"&\":$J$\"&$A$103)))+COUNTIF($J$1:J21,J21)-1,\"\")","v":""},"S.US.CRWV",""]
[{"$f":"IF(Symbols!A22=\"\",\"\",Symbols!A22)","v":"S.US.U"},1,"S.US.U",{"$f":"IF(A22=\"\",\"\",RTD(\"cqg.rtd\", ,\"ContractData\",C22, \"LongDescription\",, \"T\"))","v":"Unity Software Inc."},null,null,null,{"$f":"IF(A22=\"\",\"\",RTD(\"cqg.rtd\", ,\"ContractData\",C22, \"LastTradeToday\",, \"T\"))","v":""},{"$f":"IF(A22=\"\",\"\",RTD(\"cqg.rtd\", ,\"ContractData\",C22, \"NetLastTradeToday\",, \"T\"))","v":""},{"$f":"IF(A22=\"\",\"\",IFERROR(RTD(\"cqg.rtd\", ,\"ContractData\",C22, \"PerCentNetLastTrade\",, \"T\")/100,\"\"))","v":""},{"$f":"IF(A22=\"\",\"\",RTD(\"cqg.rtd\", ,\"ContractData\", C22, \"T_CVol\",, \"T\"))","v":63810},22,{"$f":"IFERROR(RANK($J22,INDIRECT((\"$J$\"&\"1\"&\":$J$\"&$A$103)))+COUNTIF($J$1:J22,J22)-1,\"\")","v":""},"S.US.U",""]
[{"$f":"IF(Symbols!A23=\"\",\"\",Symbols!A23)","v":"S.US.DKNG"},1,"S.US.DKNG",{"$f":"IF(A23=\"\",\"\",RTD(\"cqg.rtd\", ,\"ContractData\",C23, \"LongDescription\",, \"T\"))","v":"DRAFTKINGS INC. CL A"},null,null,null,{"$f":"IF(A23=\"\",\"\",RTD(\"cqg.rtd\", ,\"ContractData\",C23, \"LastTradeToday\",, \"T\"))","v":""},{"$f":"IF(A23=\"\",\"\",RTD(\"cqg.rtd\", ,\"ContractData\",C23, \"NetLastTradeToday\",, \"T\"))","v":""},{"$f":"IF(A23=\"\",\"\",IFERROR(RTD(\"cqg.rtd\", ,\"ContractData\",C23, \"PerCentNetLastTrade\",, \"T\")/100,\"\"))","v":""},{"$f":"IF(A23=\"\",\"\",RTD(\"cqg.rtd\", ,\"ContractData\", C23, \"T_CVol\",, \"T\"))","v":7203},23,{"$f":"IFERROR(RANK($J23,INDIRECT((\"$J$\"&\"1\"&\":$J$\"&$A$103)))+COUNTIF($J$1:J23,J23)-1,\"\")","v":""},"S.US.DKNG",""]
[{"$f":"IF(Symbols!A24=\"\",\"\",Symbols!A24)","v":"S.US.NVDA"},1,"S.US.NVDA",{"$f":"IF(A24=\"\",\"\",RTD(\"cqg.rtd\", ,\"ContractData\",C24, \"LongDescription\",, \"T\"))","v":"NVIDIA CORPORATION"},null,null,null,{"$f":"IF(A24=\"\",\"\",RTD(\"cqg.rtd\", ,\"ContractData\",C24, \"LastTradeToday\",, \"T\"))","v":""},{"$f":"IF(A24=\"\",\"\",RTD(\"cqg.rtd\", ,\"ContractData\",C24, \"NetLastTradeToday\",, \"T\"))","v":""},{"$f":"IF(A24=\"\",\"\",IFERROR(RTD(\"cqg.rtd\", ,\"ContractData\",C24, \"PerCentNetLastTrade\",, \"T\")/100,\"\"))","v":""},{"$f":"IF(A24=\"\",\"\",RTD(\"cqg.rtd\", ,\"ContractData\", C24, \"T_CVol\",, \"T\"))","v":7280443},24,{"$f":"IFERROR(RANK($J24,INDIRECT((\"$J$\"&\"1\"&\":$J$\"&$A$103)))+COUNTIF($J$1:J24,J24)-1,\"\")","v":""},"S.US.NVDA",""]
[{"$f":"IF(Symbols!A25=\"\",\"\",Symbols!A25)","v":"S.US.BLSH"},1,"S.US.BLSH",{"$f":"IF(A25=\"\",\"\",RTD(\"cqg.rtd\", ,\"ContractData\",C25, \"LongDescription\",, \"T\"))","v":"Bullish"},null,null,null,{"$f":"IF(A25=\"\",\"\",RTD(\"cqg.rtd\", ,\"ContractData\",C25, \"LastTradeToday\",, \"T\"))","v":""},{"$f":"IF(A25=\"\",\"\",RTD(\"cqg.rtd\", ,\"ContractData\",C25, \"NetLastTradeToday\",, \"T\"))","v":""},{"$f":"IF(A25=\"\",\"\",IFERROR(RTD(\"cqg.rtd\", ,\"ContractData\",C25, \"PerCentNetLastTrade\",, \"T\")/100,\"\"))","v":""},{"$f":"IF(A25=\"\",\"\",RTD(\"cqg.rtd\", ,\"ContractData\", C25, \"T_CVol\",, \"T\"))","v":71206},25,{"$f":"IFERROR(RANK($J25,INDIRECT((\"$J$\"&\"1\"&\":$J$\"&$A$103)))+COUNTIF($J$1:J25,J25)-1,\"\")","v":""},"S.US.BLSH",""]
[{"$f":"IF(Symbols!A26=\"\",\"\",Symbols!A26)","v":"S.US.DASH"},1,"S.US.DASH",{"$f":"IF(A26=\"\",\"\",RTD(\"cqg.rtd\", ,\"ContractData\",C26, \"LongDescription\",, \"T\"))","v":"DOORDASH, INC. CL A"},null,null,null,{"$f":"IF(A26=\"\",\"\",RTD(\"cqg.rtd\", ,\"ContractData\",C26, \"LastTradeToday\",, \"T\"))","v":""},{"$f":"IF(A26=\"\",\"\",RTD(\"cqg.rtd\", ,\"ContractData\",C26, \"NetLastTradeToday\",, \"T\"))","v":""},{"$f":"IF(A26=\"\",\"\",IFERROR(RTD(\"cqg.rtd\", ,\"ContractData\",C26, \"PerCentNetLastTrade\",, \"T\")/100,\"\"))","v":""},{"$f":"IF(A26=\"\",\"\",RTD(\"cqg.rtd\", ,\"ContractData\", C26, \"T_CVol\",, \"T\"))","v":9061},26,{"$f":"IFERROR(RANK($J26,INDIRECT((\"$J$\"&\"1\"&\":$J$\"&$A$103)))+COUNTIF($J$1:J26,J26)-1,\"\")","v":""},"S.US.DASH",""]
[{"$f":"IF(Symbols!A27=\"\",\"\",Symbols!A27)","v":"S.US.RBRK"},1,"S.US.RBRK",{"$f":"IF(A27=\"\",\"\",RTD(\"cqg.rtd\", ,\"ContractData\",C27, \"LongDescription\",, \"T\"))","v":"Rubrik, Inc."},null,null,null,{"$f":"IF(A27=\"\",\"\",RTD(\"cqg.rtd\", ,\"ContractData\",C27, \"LastTradeToday\",, \"T\"))","v":""},{"$f":"IF(A27=\"\",\"\",RTD(\"cqg.rtd\", ,\"ContractData\",C27, \"NetLastTradeToday\",, \"T\"))","v":""},{"$f":"IF(A27=\"\",\"\",IFERROR(RTD(\"cqg.rtd\", ,\"ContractData\",C27, \"PerCentNetLastTrade\",, \"T\")/100,\"\"))","v":""},{"$f":"IF(A27=\"\",\"\",RTD(\"cqg.rtd\", ,\"ContractData\", C27, \"T_CVol\",, \"T\"))","v":1588},27,{"$f":"IFERROR(RANK($J27,INDIRECT((\"$J$\"&\"1\"&\":$J$\"&$A$103)))+COUNTIF($J$1:J27,J27)-1,\"\")","v":""},"S.US.RBRK",""]
[{"$f":"IF(Symbols!A28=\"\",\"\",Symbols!A28)","v":"S.US.SPOT"},1,"S.US.SPOT",{"$f":"IF(A28=\"\",\"\",RTD(\"cqg.rtd\", ,\"ContractData\",C28, \"LongDescription\",, \"T\"))","v":"Spotify Technology S.A."},null,null,null,{"$f":"IF(A28=\"\",\"\",RTD(\"cqg.rtd\", ,\"ContractData\",C28, \"LastTradeToday\",, \"T\"))","v":""},{"$f":"IF(A28=\"\",\"\",RTD(\"cqg.rtd\", ,\"ContractData\",C28, \"NetLastTradeToday\",, \"T\"))","v":""},{"$f":"IF(A28=\"\",\"\",IFERROR(RTD(\"cqg.rtd\", ,\"ContractData\",C28, \"PerCentNetLastTrade\",, \"T\")/100,\"\"))","v":""},{"$f":"IF(A28=\"\",\"\",RTD(\"cqg.rtd\", ,\"ContractData\", C28, \"T_CVol\",, \"T\"))","v":1873},28,{"$f":"IFERROR(RANK($J28,INDIRECT((\"$J$\"&\"1\"&\":$J$\"&$A$103)))+COUNTIF($J$1:J28,J28)-1,\"\")","v":""},"S.US.SPOT",""]
[{"$f":"IF(Symbols!A29=\"\",\"\",Symbols!A29)","v":"S.US.PINS"},1,"S.US.PINS",{"$f":"IF(A29=\"\",\"\",RTD(\"cqg.rtd\", ,\"ContractData\",C29, \"LongDescription\",, \"T\"))","v":"Pinterest, Inc."},null,null,null,{"$f":"IF(A29=\"\",\"\",RTD(\"cqg.rtd\", ,\"ContractData\",C29, \"LastTradeToday\",, \"T\"))","v":""},{"$f":"IF(A29=\"\",\"\",RTD(\"cqg.rtd\", ,\"ContractData\",C29, \"NetLastTradeToday\",, \"T\"))","v":""},{"$f":"IF(A29=\"\",\"\",IFERROR(RTD(\"cqg.rtd\", ,\"ContractData\",C29, \"PerCentNetLastTrade\",, \"T\")/100,\"\"))","v":""},{"$f":"IF(A29=\"\",\"\",RTD(\"cqg.rtd\", ,\"ContractData\", C29, \"T_CVol\",, \"T\"))","v":5864},29,{"$f":"IFERROR(RANK($J29,INDIRECT((\"$J$\"&\"1\"&\":$J$\"&$A$103)))+COUNTIF($J$1:J29,J29)-1,\"\")","v":""},"S.US.PINS",""]
[{"$f":"IF(Symbols!A30=\"\",\"\",Symbols!A30)","v":"S.US.BIDU"},1,"S.US.BIDU",{"$f":"IF(A30=\"\",\"\",RTD(\"cqg.rtd\", ,\"ContractData\",C30, \"LongDescription\",, \"T\"))","v":"BAIDU, INC"},null,null,null,{"$f":"IF(A30=\"\",\"\",RTD(\"cqg.rtd\", ,\"ContractData\",C30, \"LastTradeToday\",, \"T\"))","v":""},{"$f":"IF(A30=\"\",\"\",RTD(\"cqg.rtd\", ,\"ContractData\",C30, \"NetLastTradeToday\",, \"T\"))","v":""},{"$f":"IF(A30=\"\",\"\",IFERROR(RTD(\"cqg.rtd\", ,\"ContractData\",C30, \"PerCentNetLastTrade\",, \"T\")/100,\"\"))","v":""},{"$f":"IF(A30=\"\",\"\",RTD(\"cqg.rtd\", ,\"ContractData\", C30, \"T_CVol\",, \"T\"))","v":31864},30,{"$f":"IFERROR(RANK($J30,INDIRECT((\"$J$\"&\"1\"&\":$J$\"&$A$103)))+COUNTIF($J$1:J30,J30)-1,\"\")","v":""},"S.US.BIDU",""]
[{"$f":"IF(Symbols!A31=\"\",\"\",Symbols!A31)","v":"S.US.PSTG"},1,"S.US.PSTG",{"$f":"IF(A31=\"\",\"\",RTD(\"cqg.rtd\", ,\"ContractData\",C31, \"LongDescription\",, \"T\"))","v":"Pure Storage, Inc."},null,null,null,{"$f":"IF(A31=\"\",\"\",RTD(\"cqg.rtd\", ,\"ContractData\",C31, \"LastTradeToday\",, \"T\"))","v":""},{"$f":"IF(A31=\"\",\"\",RTD(\"cqg.rtd\", ,\"ContractData\",C31, \"NetLastTradeToday\",, \"T\"))","v":""},{"$f":"IF(A31=\"\",\"\",IFERROR(RTD(\"cqg.rtd\", ,\"ContractData\",C31, \"PerCentNetLastTrade\",, \"T\")/100,\"\"))","v":""},{"$f":"IF(A31=\"\",\"\",RTD(\"cqg.rtd\", ,\"ContractData\", C31, \"T_CVol\",, \"T\"))","v":4361},31,{"$f":"IFERROR(RANK($J31,INDIRECT((\"$J$\"&\"1\"&\":$J$\"&$A$103)))+COUNTIF($J$1:J31,J31)-1,\"\")","v":""},"S.US.PSTG",""]
[{"$f":"IF(Symbols!A32=\"\",\"\",Symbols!A32)","v":"S.US.ABNB"},1,"S.US.ABNB",{"$f":"IF(A32=\"\",\"\",RTD(\"cqg.rtd\", ,\"ContractData\",C32, \"LongDescription\",, \"T\"))","v":"Airbnb, Inc. Class A"},null,null,null,{"$f":"IF(A32=\"\",\"\",RTD(\"cqg.rtd\", ,\"ContractData\",C32, \"LastTradeToday\",, \"T\"))","v":""},{"$f":"IF(A32=\"\",\"\",RTD(\"cqg.rtd\", ,\"ContractData\",C32, \"NetLastTradeToday\",, \"T\"))","v":""},{"$f":"IF(A32=\"\",\"\",IFERROR(RTD(\"cqg.rtd\", ,\"ContractData\",C32, \"PerCentNetLastTrade\",, \"T\")/100,\"\"))","v":""},{"$f":"IF(A32=\"\",\"\",RTD(\"cqg.rtd\", ,\"ContractData\", C32, \"T_CVol\",, \"T\"))","v":10905},32,{"$f":"IFERROR(RANK($J32,INDIRECT((\"$J$\"&\"1\"&\":$J$\"&$A$103)))+COUNTIF($J$1:J32,J32)-1,\"\")","v":""},"S.US.ABNB",""]
[{"$f":"IF(Symbols!A33=\"\",\"\",Symbols!A33)","v":"S.US.MELI"},1,"S.US.MELI",{"$f":"IF(A33=\"\",\"\",RTD(\"cqg.rtd\", ,\"ContractData\",C33, \"LongDescription\",, \"T\"))","v":"MERCADOLIBRE, INC."},null,null,null,{"$f":"IF(A33=\"\",\"\",RTD(\"cqg.rtd\", ,\"ContractData\",C33, \"LastTradeToday\",, \"T\"))","v":""},{"$f":"IF(A33=\"\",\"\",RTD(\"cqg.rtd\", ,\"ContractData\",C33, \"NetLastTradeToday\",, \"T\"))","v":""},{"$f":"IF(A33=\"\",\"\",IFERROR(RTD(\"cqg.rtd\", ,\"ContractData\",C33, \"PerCentNetLastTrade\",, \"T\")/100,\"\"))","v":""},{"$f":"IF(A33=\"\",\"\",RTD(\"cqg.rtd\", ,\"ContractData\", C33, \"T_CVol\",, \"T\"))","v":736},33,{"$f":"IFERROR(RANK($J33,INDIRECT((\"$J$\"&\"1\"&\":$J$\"&$A$103)))+COUNTIF($J$1:J33,J33)-1,\"\")","v":""},"S.US.MELI",""]
[{"$f":"IF(Symbols!A34=\"\",\"\",Symbols!A34)","v":"S.US.TTD"},1,"S.US.TTD",{"$f":"IF(A34=\"\",\"\",RTD(\"cqg.rtd\", ,\"ContractData\",C34, \"LongDescription\",, \"T\"))","v":"THE TRADE DESK CL A"},null,null,null,{"$f":"IF(A34=\"\",\"\",RTD(\"cqg.rtd\", ,\"ContractData\",C34, \"LastTradeToday\",, \"T\"))","v":""},{"$f":"IF(A34=\"\",\"\",RTD(\"cqg.rtd\", ,\"ContractData\",C34, \"NetLastTradeToday\",, \"T\"))","v":""},{"$f":"IF(A34=\"\",\"\",IFERROR(RTD(\"cqg.rtd\", ,\"ContractData\",C34, \"PerCentNetLastTrade\",, \"T\")/100,\"\"))","v":""},{"$f":"IF(A34=\"\",\"\",RTD(\"cqg.rtd\", ,\"ContractData\", C34, \"T_CVol\",, \"T\"))","v":45237},34,{"$f":"IFERROR(RANK($J34,INDIRECT((\"$J$\"&\"1\"&\":$J$\"&$A$103)))+COUNTIF($J$1:J34,J34)-1,\"\")","v":""},"S.US.TTD",""]
[{"$f":"IF(Symbols!A35=\"\",\"\",Symbols!A35)","v":"S.US.GENI"},1,"S.US.GENI",{"$f":"IF(A35=\"\",\"\",RTD(\"cqg.rtd\", ,\"ContractData\",C35, \"LongDescription\",, \"T\"))","v":"Genius Sports LTD"},null,null,null,{"$f":"IF(A35=\"\",\"\",RTD(\"cqg.rtd\", ,\"ContractData\",C35, \"LastTradeToday\",, \"T\"))","v":""},{"$f":"IF(A35=\"\",\"\",RTD(\"cqg.rtd\", ,\"ContractData\",C35, \"NetLastTradeToday\",, \"T\"))","v":""},{"$f":"IF(A35=\"\",\"\",IFERROR(RTD(\"cqg.rtd\", ,\"ContractData\",C35, \"PerCentNetLastTrade\",, \"T\")/100,\"\"))","v":""},{"$f":"IF(A35=\"\",\"\",RTD(\"cqg.rtd\", ,\"ContractData\", C35, \"T_CVol\",, \"T\"))","v":4087},35,{"$f":"IFERROR(RANK($J35,INDIRECT((\"$J$\"&\"1\"&\":$J$\"&$A$103)))+COUNTIF($J$1:J35,J35)-1,\"\")","v":""},"S.US.GENI",""]
[{"$f":"IF(Symbols!A36=\"\",\"\",Symbols!A36)","v":"S.US.PD"},1,"S.US.PD",{"$f":"IF(A36=\"\",\"\",RTD(\"cqg.rtd\", ,\"ContractData\",C36, \"LongDescription\",, \"T\"))","v":"PagerDuty, Inc."},null,null,null,{"$f":"IF(A36=\"\",\"\",RTD(\"cqg.rtd\", ,\"ContractData\",C36, \"LastTradeToday\",, \"T\"))","v":""},{"$f":"IF(A36=\"\",\"\",RTD(\"cqg.rtd\", ,\"ContractData\",C36, \"NetLastTradeToday\",, \"T\"))","v":""},{"$f":"IF(A36=\"\",\"\",IFERROR(RTD(\"cqg.rtd\", ,\"ContractData\",C36, \"PerCentNetLastTrade\",, \"T\")/100,\"\"))","v":""},{"$f":"IF(A36=\"\",\"\",RTD(\"cqg.rtd\", ,\"ContractData\", C36, \"T_CVol\",, \"T\"))","v":1205},36,{"$f":"IFERROR(RANK($J36,INDIRECT((\"$J$\"&\"1\"&\":$J$\"&$A$103)))+COUNTIF($J$1:J36,J36)-1,\"\")","v":""},"S.US.PD",""]
[{"$f":"IF(Symbols!A37=\"\",\"\",Symbols!A37)","v":"S.US.TOST"},1,"S.US.TOST",{"$f":"IF(A37=\"\",\"\",RTD(\"cqg.rtd\", ,\"ContractData\",C37, \"LongDescription\",, \"T\"))","v":"Toast, Inc."},null,null,null,{"$f":"IF(A37=\"\",\"\",RTD(\"cqg.rtd\", ,\"ContractData\",C37, \"LastTradeToday\",, \"T\"))","v":""},{"$f":"IF(A37=\"\",\"\",RTD(\"cqg.rtd\", ,\"ContractData\",C37, \"NetLastTradeToday\",, \"T\"))","v":""},{"$f":"IF(A37=\"\",\"\",IFERROR(RTD(\"cqg.rtd\", ,\"ContractData\",C37, \"PerCentNetLastTrade\",, \"T\")/100,\"\"))","v":""},{"$f":"IF(A37=\"\",\"\",RTD(\"cqg.rtd\", ,\"ContractData\", C37, \"T_CVol\",, \"T\"))","v":4205},37,{"$f":"IFERROR(RANK($J37,INDIRECT((\"$J$\"&\"1\"&\":$J$\"&$A$103)))+COUNTIF($J$1:J37,J37)-1,\"\")","v":""},"S.US.TOST",""]
[{"$f":"IF(Symbols!A38=\"\",\"\",Symbols!A38)","v":"S.US.QCOM"},1,"S.US.QCOM",{"$f":"IF(A38=\"\",\"\",RTD(\"cqg.rtd\", ,\"ContractData\",C38, \"LongDescription\",, \"T\"))","v":"QUALCOMM Inc"},null,null,null,{"$f":"IF(A38=\"\",\"\",RTD(\"cqg.rtd\", ,\"ContractData\",C38, \"LastTradeToday\",, \"T\"))","v":""},{"$f":"IF(A38=\"\",\"\",RTD(\"cqg.rtd\", ,\"ContractData\",C38, \"NetLastTradeToday\",, \"T\"))","v":""},{"$f":"IF(A38=\"\",\"\",IFERROR(RTD(\"cqg.rtd\", ,\"ContractData\",C38, \"PerCentNetLastTrade\",, \"T\")/100,\"\"))","v":""},{"$f":"IF(A38=\"\",\"\",RTD(\"cqg.rtd\", ,\"ContractData\", C38, \"T_CVol\",, \"T\"))","v":36748},38,{"$f":"IFERROR(RANK($J38,INDIRECT((\"$J$\"&\"1\"&\":$J$\"&$A$103)))+COUNTIF($J$1:J38,J38)-1,\"\")","v":""},"S.US.QCOM",""]
[{"$f":"IF(Symbols!A39=\"\",\"\",Symbols!A39)","v":"S.US.NFLX"},1,"S.US.NFLX",{"$f":"IF(A39=\"\",\"\",RTD(\"cqg.rtd\", ,\"ContractData\",C39, \"LongDescription\",, \"T\"))","v":"NETFLIX, INC."},null,null,null,{"$f":"IF(A39=\"\",\"\",RTD(\"cqg.rtd\", ,\"ContractData\",C39, \"LastTradeToday\",, \"T\"))","v":""},{"$f":"IF(A39=\"\",\"\",RTD(\"cqg.rtd\", ,\"ContractData\",C39, \"NetLastTradeToday\",, \"T\"))","v":""},{"$f":"IF(A39=\"\",\"\",IFERROR(RTD(\"cqg.rtd\", ,\"ContractData\",C39, \"PerCentNetLastTrade\",, \"T\")/100,\"\"))","v":""},{"$f":"IF(A39=\"\",\"\",RTD(\"cqg.rtd\", ,\"ContractData\", C39, \"T_CVol\",, \"T\"))","v":186243},39,{"$f":"IFERROR(RANK($J39,INDIRECT((\"$J$\"&\"1\"&\":$J$\"&$A$103)))+COUNTIF($J$1:J39,J39)-1,\"\")","v":""},"S.US.NFLX",""]
[{"$f":"IF(Symbols!A40=\"\",\"\",Symbols!A40)","v":"S.US.Fig"},1,"S.US.Fig",{"$f":"IF(A40=\"\",\"\",RTD(\"cqg.rtd\", ,\"ContractData\",C40, \"LongDescription\",, \"T\"))","v":"Figma, Inc."},null,null,null,{"$f":"IF(A40=\"\",\"\",RTD(\"cqg.rtd\", ,\"ContractData\",C40, \"LastTradeToday\",, \"T\"))","v":""},{"$f":"IF(A40=\"\",\"\",RTD(\"cqg.rtd\", ,\"ContractData\",C40, \"NetLastTradeToday\",, \"T\"))","v":""},{"$f":"IF(A40=\"\",\"\",IFERROR(RTD(\"cqg.rtd\", ,\"ContractData\",C40, \"PerCentNetLastTrade\",, \"T\")/100,\"\"))","v":""},{"$f":"IF(A40=\"\",\"\",RTD(\"cqg.rtd\", ,\"ContractData\", C40, \"T_CVol\",, \"T\"))","v":55046},40,{"$f":"IFERROR(RANK($J40,INDIRECT((\"$J$\"&\"1\"&\":$J$\"&$A$103)))+COUNTIF($J$1:J40,J40)-1,\"\")","v":""},"S.US.Fig",""]
[{"$f":"IF(Symbols!A41=\"\",\"\",Symbols!A41)","v":"S.US.BABA"},1,"S.US.BABA",{"$f":"IF(A41=\"\",\"\",RTD(\"cqg.rtd\", ,\"ContractData\",C41, \"LongDescription\",, \"T\"))","v":"Alibaba Group Holding Ltd"},null,null,null,{"$f":"IF(A41=\"\",\"\",RTD(\"cqg.rtd\", ,\"ContractData\",C41, \"LastTradeToday\",, \"T\"))","v":""},{"$f":"IF(A41=\"\",\"\",RTD(\"cqg.rtd\", ,\"ContractData\",C41, \"NetLastTradeToday\",, \"T\"))","v":""},{"$f":"IF(A41=\"\",\"\",IFERROR(RTD(\"cqg.rtd\", ,\"ContractData\",C41, \"PerCentNetLastTrade\",, \"T\")/100,\"\"))","v":""},{"$f":"IF(A41=\"\",\"\",RTD(\"cqg.rtd\", ,\"ContractData\", C41, \"T_CVol\",, \"T\"))","v":259401},41,{"$f":"IFERROR(RANK($J41,INDIRECT((\"$J$\"&\"1\"&\":$J$\"&$A$103)))+COUNTIF($J$1:J41,J41)-1,\"\")","v":""},"S.US.BABA",""]
[{"$f":"IF(Symbols!A42=\"\",\"\",Symbols!A42)","v":"S.US.NXDR"},1,"S.US.NXDR",{"$f":"IF(A42=\"\",\"\",RTD(\"cqg.rtd\", ,\"ContractData\",C42, \"LongDescription\",, \"T\"))","v":"Nextdoor Holdings, Inc."},null,null,null,{"$f":"IF(A42=\"\",\"\",RTD(\"cqg.rtd\", ,\"ContractData\",C42, \"LastTradeToday\",, \"T\"))","v":""},{"$f":"IF(A42=\"\",\"\",RTD(\"cqg.rtd\", ,\"ContractData\",C42, \"NetLastTradeToday\",, \"T\"))","v":""},{"$f":"IF(A42=\"\",\"\",IFERROR(RTD(\"cqg.rtd\", ,\"ContractData\",C42, \"PerCentNetLastTrade\",, \"T\")/100,\"\"))","v":""},{"$f":"IF(A42=\"\",\"\",RTD(\"cqg.rtd\", ,\"ContractData\", C42, \"T_CVol\",, \"T\"))","v":6},42,{"$f":"IFERROR(RANK($J42,INDIRECT((\"$J$\"&\"1\"&\":$J$\"&$A$103)))+COUNTIF($J$1:J42,J42)-1,\"\")","v":""},"S.US.NXDR",""]
[{"$f":"IF(Symbols!A43=\"\",\"\",Symbols!A43)","v":"S.CA.ETHQ"},1,"S.CA.ETHQ",{"$f":"IF(A43=\"\",\"\",RTD(\"cqg.rtd\", ,\"ContractData\",C43, \"LongDescription\",, \"T\"))","v":"3iQ Ether Staking ETF"},null,null,null,{"$f":"IF(A43=\"\",\"\",RTD(\"cqg.rtd\", ,\"ContractData\",C43, \"LastTradeToday\",, \"T\"))","v":16.149999999999999},{"$f":"IF(A43=\"\",\"\",RTD(\"cqg.rtd\", ,\"ContractData\",C43, \"NetLastTradeToday\",, \"T\"))","v":""},{"$f":"IF(A43=\"\",\"\",IFERROR(RTD(\"cqg.rtd\", ,\"ContractData\",C43, \"PerCentNetLastTrade\",, \"T\")/100,\"\"))","v":""},{"$f":"IF(A43=\"\",\"\",RTD(\"cqg.rtd\", ,\"ContractData\", C43, \"T_CVol\",, \"T\"))","v":0},43,{"$f":"IFERROR(RANK($J43,INDIRECT((\"$J$\"&\"1\"&\":$J$\"&$A$103)))+COUNTIF($J$1:J43,J43)-1,\"\")","v":""},"S.CA.ETHQ",""]
[{"$f":"IF(Symbols!A44=\"\",\"\",Symbols!A44)","v":"S.US.CRM"},1,"S.US.CRM",{"$f":"IF(A44=\"\",\"\",RTD(\"cqg.rtd\", ,\"ContractData\",C44, \"LongDescription\",, \"T\"))","v":"Salesforce, Inc."},null,null,null,{"$f":"IF(A44=\"\",\"\",RTD(\"cqg.rtd\", ,\"ContractData\",C44, \"LastTradeToday\",, \"T\"))","v":""},{"$f":"IF(A44=\"\",\"\",RTD(\"cqg.rtd\", ,\"ContractData\",C44, \"NetLastTradeToday\",, \"T\"))","v":""},{"$f":"IF(A44=\"\",\"\",IFERROR(RTD(\"cqg.rtd\", ,\"ContractData\",C44, \"PerCentNetLastTrade\",, \"T\")/100,\"\"))","v":""},{"$f":"IF(A44=\"\",\"\",RTD(\"cqg.rtd\", ,\"ContractData\", C44, \"T_CVol\",, \"T\"))","v":39133},44,{"$f":"IFERROR(RANK($J44,INDIRECT((\"$J$\"&\"1\"&\":$J$\"&$A$103)))+COUNTIF($J$1:J44,J44)-1,\"\")","v":""},"S.US.CRM",""]
[{"$f":"IF(Symbols!A45=\"\",\"\",Symbols!A45)","v":"S.US.IBTA"},1,"S.US.IBTA",{"$f":"IF(A45=\"\",\"\",RTD(\"cqg.rtd\", ,\"ContractData\",C45, \"LongDescription\",, \"T\"))","v":"Ibotta, Inc."},null,null,null,{"$f":"IF(A45=\"\",\"\",RTD(\"cqg.rtd\", ,\"ContractData\",C45, \"LastTradeToday\",, \"T\"))","v":""},{"$f":"IF(A45=\"\",\"\",RTD(\"cqg.rtd\", ,\"ContractData\",C45, \"NetLastTradeToday\",, \"T\"))","v":""},{"$f":"IF(A45=\"\",\"\",IFERROR(RTD(\"cqg.rtd\", ,\"ContractData\",C45, \"PerCentNetLastTrade\",, \"T\")/100,\"\"))","v":""},{"$f":"IF(A45=\"\",\"\",RTD(\"cqg.rtd\", ,\"ContractData\", C45, \"T_CVol\",, \"T\"))","v":0},45,{"$f":"IFERROR(RANK($J45,INDIRECT((\"$J$\"&\"1\"&\":$J$\"&$A$103)))+COUNTIF($J$1:J45,J45)-1,\"\")","v":""},"S.US.IBTA",""]
[{"$f":"IF(Symbols!A46=\"\",\"\",Symbols!A46)","v":"S.US.SLMT"},1,"S.US.SLMT",{"$f":"IF(A46=\"\",\"\",RTD(\"cqg.rtd\", ,\"ContractData\",C46, \"LongDescription\",, \"T\"))","v":"BRERA HOLDINGS B OS"},null,null,null,{"$f":"IF(A46=\"\",\"\",RTD(\"cqg.rtd\", ,\"ContractData\",C46, \"LastTradeToday\",, \"T\"))","v":""},{"$f":"IF(A46=\"\",\"\",RTD(\"cqg.rtd\", ,\"ContractData\",C46, \"NetLastTradeToday\",, \"T\"))","v":""},{"$f":"IF(A46=\"\",\"\",IFERROR(RTD(\"cqg.rtd\", ,\"ContractData\",C46, \"PerCentNetLastTrade\",, \"T\")/100,\"\"))","v":""},{"$f":"IF(A46=\"\",\"\",RTD(\"cqg.rtd\", ,\"ContractData\", C46, \"T_CVol\",, \"T\"))","v":209347},46,{"$f":"IFERROR(RANK($J46,INDIRECT((\"$J$\"&\"1\"&\":$J$\"&$A$103)))+COUNTIF($J$1:J46,J46)-1,\"\")","v":""},"S.US.SLMT",""]
[{"$f":"IF(Symbols!A47=\"\",\"\",Symbols!A47)","v":"S.CA.SOLQ"},1,"S.CA.SOLQ",{"$f":"IF(A47=\"\",\"\",RTD(\"cqg.rtd\", ,\"ContractData\",C47, \"LongDescription\",, \"T\"))","v":"3IQ SOLANA STAKING ETF"},null,null,null,{"$f":"IF(A47=\"\",\"\",RTD(\"cqg.rtd\", ,\"ContractData\",C47, \"LastTradeToday\",, \"T\"))","v":14.9},{"$f":"IF(A47=\"\",\"\",RTD(\"cqg.rtd\", ,\"ContractData\",C47, \"NetLastTradeToday\",, \"T\"))","v":""},{"$f":"IF(A47=\"\",\"\",IFERROR(RTD(\"cqg.rtd\", ,\"ContractData\",C47, \"PerCentNetLastTrade\",, \"T\")/100,\"\"))","v":""},{"$f":"IF(A47=\"\",\"\",RTD(\"cqg.rtd\", ,\"ContractData\", C47, \"T_CVol\",, \"T\"))","v":0},47,{"$f":"IFERROR(RANK($J47,INDIRECT((\"$J$\"&\"1\"&\":$J$\"&$A$103)))+COUNTIF($J$1:J47,J47)-1,\"\")","v":""},"S.CA.SOLQ",""]
[{"$f":"IF(Symbols!A48=\"\",\"\",Symbols!A48)","v":"S.US.RDDT"},1,"S.US.RDDT",{"$f":"IF(A48=\"\",\"\",RTD(\"cqg.rtd\", ,\"ContractData\",C48, \"LongDescription\",, \"T\"))","v":"Reddit, Inc."},null,null,null,{"$f":"IF(A48=\"\",\"\",RTD(\"cqg.rtd\", ,\"ContractData\",C48, \"LastTradeToday\",, \"T\"))","v":""},{"$f":"IF(A48=\"\",\"\",RTD(\"cqg.rtd\", ,\"ContractData\",C48, \"NetLastTradeToday\",, \"T\"))","v":""},{"$f":"IF(A48=\"\",\"\",IFERROR(RTD(\"cqg.rtd\", ,\"ContractData\",C48, \"PerCentNetLastTrade\",, \"T\")/100,\"\"))","v":""},{"$f":"IF(A48=\"\",\"\",RTD(\"cqg.rtd\", ,\"ContractData\", C48, \"T_CVol\",, \"T\"))","v":32311},48,{"$f":"IFERROR(RANK($J48,INDIRECT((\"$J$\"&\"1\"&\":$J$\"&$A$103)))+COUNTIF($J$1:J48,J48)-1,\"\")","v":""},"S.US.RDDT",""]
[{"$f":"IF(Symbols!A49=\"\",\"\",Symbols!A49)","v":""},"","",{"$f":"IF(A49=\"\",\"\",RTD(\"cqg.rtd\", ,\"ContractData\",C49, \"LongDescription\",, \"T\"))","v":""},null,null,null,{"$f":"IF(A49=\"\",\"\",RTD(\"cqg.rtd\", ,\"ContractData\",C49, \"LastTradeToday\",, \"T\"))","v":""},{"$f":"IF(A49=\"\",\"\",RTD(\"cqg.rtd\", ,\"ContractData\",C49, \"NetLastTradeToday\",, \"T\"))","v":""},{"$f":"IF(A49=\"\",\"\",IFERROR(RTD(\"cqg.rtd\", ,\"ContractData\",C49, \"PerCentNetLastTrade\",, \"T\")/100,\"\"))","v":""},{"$f":"IF(A49=\"\",\"\",RTD(\"cqg.rtd\", ,\"ContractData\", C49, \"T_CVol\",, \"T\"))","v":""},49,{"$f":"IFERROR(RANK($J49,INDIRECT((\"$J$\"&\"1\"&\":$J$\"&$A$103)))+COUNTIF($J$1:J49,J49)-1,\"\")","v":""},"",""]
[{"$f":"IF(Symbols!A50=\"\",\"\",Symbols!A50)","v":""},"","",{"$f":"IF(A50=\"\",\"\",RTD(\"cqg.rtd\", ,\"ContractData\",C50, \"LongDescription\",, \"T\"))","v":""},null,null,null,{"$f":"IF(A50=\"\",\"\",RTD(\"cqg.rtd\", ,\"ContractData\",C50, \"LastTradeToday\",, \"T\"))","v":""},{"$f":"IF(A50=\"\",\"\",RTD(\"cqg.rtd\", ,\"ContractData\",C50, \"NetLastTradeToday\",, \"T\"))","v":""},{"$f":"IF(A50=\"\",\"\",IFERROR(RTD(\"cqg.rtd\", ,\"ContractData\",C50, \"PerCentNetLastTrade\",, \"T\")/100,\"\"))","v":""},{"$f":"IF(A50=\"\",\"\",RTD(\"cqg.rtd\", ,\"ContractData\", C50, \"T_CVol\",, \"T\"))","v":""},50,{"$f":"IFERROR(RANK($J50,INDIRECT((\"$J$\"&\"1\"&\":$J$\"&$A$103)))+COUNTIF($J$1:J50,J50)-1,\"\")","v":""},"",""]
[{"$f":"IF(Symbols!A51=\"\",\"\",Symbols!A51)","v":""},"","",{"$f":"IF(A51=\"\",\"\",RTD(\"cqg.rtd\", ,\"ContractData\",C51, \"LongDescription\",, \"T\"))","v":""},null,null,null,{"$f":"IF(A51=\"\",\"\",RTD(\"cqg.rtd\", ,\"ContractData\",C51, \"LastTradeToday\",, \"T\"))","v":""},{"$f":"IF(A51=\"\",\"\",RTD(\"cqg.rtd\", ,\"ContractData\",C51, \"NetLastTradeToday\",, \"T\"))","v":""},{"$f":"IF(A51=\"\",\"\",IFERROR(RTD(\"cqg.rtd\", ,\"ContractData\",C51, \"PerCentNetLastTrade\",, \"T\")/100,\"\"))","v":""},{"$f":"IF(A51=\"\",\"\",RTD(\"cqg.rtd\", ,\"ContractData\", C51, \"T_CVol\",, \"T\"))","v":""},51,{"$f":"IFERROR(RANK($J51,INDIRECT((\"$J$\"&\"1\"&\":$J$\"&$A$103)))+COUNTIF($J$1:J51,J51)-1,\"\")","v":""},"",""]
[{"$f":"IF(Symbols!A52=\"\",\"\",Symbols!A52)","v":""},"","",{"$f":"IF(A52=\"\",\"\",RTD(\"cqg.rtd\", ,\"ContractData\",C52, \"LongDescription\",, \"T\"))","v":""},null,null,null,{"$f":"IF(A52=\"\",\"\",RTD(\"cqg.rtd\", ,\"ContractData\",C52, \"LastTradeToday\",, \"T\"))","v":""},{"$f":"IF(A52=\"\",\"\",RTD(\"cqg.rtd\", ,\"ContractData\",C52, \"NetLastTradeToday\",, \"T\"))","v":""},{"$f":"IF(A52=\"\",\"\",IFERROR(RTD(\"cqg.rtd\", ,\"ContractData\",C52, \"PerCentNetLastTrade\",, \"T\")/100,\"\"))","v":""},{"$f":"IF(A52=\"\",\"\",RTD(\"cqg.rtd\", ,\"ContractData\", C52, \"T_CVol\",, \"T\"))","v":""},52,{"$f":"IFERROR(RANK($J52,INDIRECT((\"$J$\"&\"1\"&\":$J$\"&$A$103)))+COUNTIF($J$1:J52,J52)-1,\"\")","v":""},"",""]
[{"$f":"IF(Symbols!A53=\"\",\"\",Symbols!A53)","v":""},"","",{"$f":"IF(A53=\"\",\"\",RTD(\"cqg.rtd\", ,\"ContractData\",C53, \"LongDescription\",, \"T\"))","v":""},null,null,null,{"$f":"IF(A53=\"\",\"\",RTD(\"cqg.rtd\", ,\"ContractData\",C53, \"LastTradeToday\",, \"T\"))","v":""},{"$f":"IF(A53=\"\",\"\",RTD(\"cqg.rtd\", ,\"ContractData\",C53, \"NetLastTradeToday\",, \"T\"))","v":""},{"$f":"IF(A53=\"\",\"\",IFERROR(RTD(\"cqg.rtd\", ,\"ContractData\",C53, \"PerCentNetLastTrade\",, \"T\")/100,\"\"))","v":""},{"$f":"IF(A53=\"\",\"\",RTD(\"cqg.rtd\", ,\"ContractData\", C53, \"T_CVol\",, \"T\"))","v":""},53,{"$f":"IFERROR(RANK($J53,INDIRECT((\"$J$\"&\"1\"&\":$J$\"&$A$103)))+COUNTIF($J$1:J53,J53)-1,\"\")","v":""},"",""]
[{"$f":"IF(Symbols!A54=\"\",\"\",Symbols!A54)","v":""},"","",{"$f":"IF(A54=\"\",\"\",RTD(\"cqg.rtd\", ,\"ContractData\",C54, \"LongDescription\",, \"T\"))","v":""},null,null,null,{"$f":"IF(A54=\"\",\"\",RTD(\"cqg.rtd\", ,\"ContractData\",C54, \"LastTradeToday\",, \"T\"))","v":""},{"$f":"IF(A54=\"\",\"\",RTD(\"cqg.rtd\", ,\"ContractData\",C54, \"NetLastTradeToday\",, \"T\"))","v":""},{"$f":"IF(A54=\"\",\"\",IFERROR(RTD(\"cqg.rtd\", ,\"ContractData\",C54, \"PerCentNetLastTrade\",, \"T\")/100,\"\"))","v":""},{"$f":"IF(A54=\"\",\"\",RTD(\"cqg.rtd\", ,\"ContractData\", C54, \"T_CVol\",, \"T\"))","v":""},54,{"$f":"IFERROR(RANK($J54,INDIRECT((\"$J$\"&\"1\"&\":$J$\"&$A$103)))+COUNTIF($J$1:J54,J54)-1,\"\")","v":""},"",""]
[{"$f":"IF(Symbols!A55=\"\",\"\",Symbols!A55)","v":""},"","",{"$f":"IF(A55=\"\",\"\",RTD(\"cqg.rtd\", ,\"ContractData\",C55, \"LongDescription\",, \"T\"))","v":""},null,null,null,{"$f":"IF(A55=\"\",\"\",RTD(\"cqg.rtd\", ,\"ContractData\",C55, \"LastTradeToday\",, \"T\"))","v":""},{"$f":"IF(A55=\"\",\"\",RTD(\"cqg.rtd\", ,\"ContractData\",C55, \"NetLastTradeToday\",, \"T\"))","v":""},{"$f":"IF(A55=\"\",\"\",IFERROR(RTD(\"cqg.rtd\", ,\"ContractData\",C55, \"PerCentNetLastTrade\",, \"T\")/100,\"\"))","v":""},{"$f":"IF(A55=\"\",\"\",RTD(\"cqg.rtd\", ,\"ContractData\", C55, \"T_CVol\",, \"T\"))","v":""},55,{"$f":"IFERROR(RANK($J55,INDIRECT((\"$J$\"&\"1\"&\":$J$\"&$A$103)))+COUNTIF($J$1:J55,J55)-1,\"\")","v":""},"",""]
[{"$f":"IF(Symbols!A56=\"\",\"\",Symbols!A56)","v":""},"","",{"$f":"IF(A56=\"\",\"\",RTD(\"cqg.rtd\", ,\"ContractData\",C56, \"LongDescription\",, \"T\"))","v":""},null,null,null,{"$f":"IF(A56=\"\",\"\",RTD(\"cqg.rtd\", ,\"ContractData\",C56, \"LastTradeToday\",, \"T\"))","v":""},{"$f":"IF(A56=\"\",\"\",RTD(\"cqg.rtd\", ,\"ContractData\",C56, \"NetLastTradeToday\",, \"T\"))","v":""},{"$f":"IF(A56=\"\",\"\",IFERROR(RTD(\"cqg.rtd\", ,\"ContractData\",C56, \"PerCentNetLastTrade\",, \"T\")/100,\"\"))","v":""},{"$f":"IF(A56=\"\",\"\",RTD(\"cqg.rtd\", ,\"ContractData\", C56, \"T_CVol\",, \"T\"))","v":""},56,{"$f":"IFERROR(RANK($J56,INDIRECT((\"$J$\"&\"1\"&\":$J$\"&$A$103)))+COUNTIF($J$1:J56,J56)-1,\"\")","v":""},"",""]
[{"$f":"IF(Symbols!A57=\"\",\"\",Symbols!A57)","v":""},"","",{"$f":"IF(A57=\"\",\"\",RTD(\"cqg.rtd\", ,\"ContractData\",C57, \"LongDescription\",, \"T\"))","v":""},null,null,null,{"$f":"IF(A57=\"\",\"\",RTD(\"cqg.rtd\", ,\"ContractData\",C57, \"LastTradeToday\",, \"T\"))","v":""},{"$f":"IF(A57=\"\",\"\",RTD(\"cqg.rtd\", ,\"ContractData\",C57, \"NetLastTradeToday\",, \"T\"))","v":""},{"$f":"IF(A57=\"\",\"\",IFERROR(RTD(\"cqg.rtd\", ,\"ContractData\",C57, \"PerCentNetLastTrade\",, \"T\")/100,\"\"))","v":""},{"$f":"IF(A57=\"\",\"\",RTD(\"cqg.rtd\", ,\"ContractData\", C57, \"T_CVol\",, \"T\"))","v":""},57,{"$f":"IFERROR(RANK($J57,INDIRECT((\"$J$\"&\"1\"&\":$J$\"&$A$103)))+COUNTIF($J$1:J57,J57)-1,\"\")","v":""},"",""]
[{"$f":"IF(Symbols!A58=\"\",\"\",Symbols!A58)","v":""},"","",{"$f":"IF(A58=\"\",\"\",RTD(\"cqg.rtd\", ,\"ContractData\",C58, \"LongDescription\",, \"T\"))","v":""},null,null,null,{"$f":"IF(A58=\"\",\"\",RTD(\"cqg.rtd\", ,\"ContractData\",C58, \"LastTradeToday\",, \"T\"))","v":""},{"$f":"IF(A58=\"\",\"\",RTD(\"cqg.rtd\", ,\"ContractData\",C58, \"NetLastTradeToday\",, \"T\"))","v":""},{"$f":"IF(A58=\"\",\"\",IFERROR(RTD(\"cqg.rtd\", ,\"ContractData\",C58, \"PerCentNetLastTrade\",, \"T\")/100,\"\"))","v":""},{"$f":"IF(A58=\"\",\"\",RTD(\"cqg.rtd\", ,\"ContractData\", C58, \"T_CVol\",, \"T\"))","v":""},58,{"$f":"IFERROR(RANK($J58,INDIRECT((\"$J$\"&\"1\"&\":$J$\"&$A$103)))+COUNTIF($J$1:J58,J58)-1,\"\")","v":""},"",""]
[{"$f":"IF(Symbols!A59=\"\",\"\",Symbols!A59)","v":""},"","",{"$f":"IF(A59=\"\",\"\",RTD(\"cqg.rtd\", ,\"ContractData\",C59, \"LongDescription\",, \"T\"))","v":""},null,null,null,{"$f":"IF(A59=\"\",\"\",RTD(\"cqg.rtd\", ,\"ContractData\",C59, \"LastTradeToday\",, \"T\"))","v":""},{"$f":"IF(A59=\"\",\"\",RTD(\"cqg.rtd\", ,\"ContractData\",C59, \"NetLastTradeToday\",, \"T\"))","v":""},{"$f":"IF(A59=\"\",\"\",IFERROR(RTD(\"cqg.rtd\", ,\"ContractData\",C59, \"PerCentNetLastTrade\",, \"T\")/100,\"\"))","v":""},{"$f":"IF(A59=\"\",\"\",RTD(\"cqg.rtd\", ,\"ContractData\", C59, \"T_CVol\",, \"T\"))","v":""},59,{"$f":"IFERROR(RANK($J59,INDIRECT((\"$J$\"&\"1\"&\":$J$\"&$A$103)))+COUNTIF($J$1:J59,J59)-1,\"\")","v":""},"",""]
[{"$f":"IF(Symbols!A60=\"\",\"\",Symbols!A60)","v":""},"","",{"$f":"IF(A60=\"\",\"\",RTD(\"cqg.rtd\", ,\"ContractData\",C60, \"LongDescription\",, \"T\"))","v":""},null,null,null,{"$f":"IF(A60=\"\",\"\",RTD(\"cqg.rtd\", ,\"ContractData\",C60, \"LastTradeToday\",, \"T\"))","v":""},{"$f":"IF(A60=\"\",\"\",RTD(\"cqg.rtd\", ,\"ContractData\",C60, \"NetLastTradeToday\",, \"T\"))","v":""},{"$f":"IF(A60=\"\",\"\",IFERROR(RTD(\"cqg.rtd\", ,\"ContractData\",C60, \"PerCentNetLastTrade\",, \"T\")/100,\"\"))","v":""},{"$f":"IF(A60=\"\",\"\",RTD(\"cqg.rtd\", ,\"ContractData\", C60, \"T_CVol\",, \"T\"))","v":""},60,{"$f":"IFERROR(RANK($J60,INDIRECT((\"$J$\"&\"1\"&\":$J$\"&$A$103)))+COUNTIF($J$1:J60,J60)-1,\"\")","v":""},"",""]
[]
[]
[]
[]
[]
[]
[]
[]
[]
[]
[]
[]
[]
[]
[]
[]
[]
[]
[]
[]
[]
[]
[]
[]
[]
[]
[]
[]
[]
[]
[]
[]
[]
[]
[]
[]
[]
[]
[]
[]
[]
[]
[{"$f":"60-COUNTIF(A1:A60,\"\")","v":48},{"$f":"SUM(B1:B101)/A103","v":1}]
[{"$f":"\"$J$1:$J$\"&A103","v":"$J$1:$J$48"}]

{"sheet":"Symbols","index":2,"n_rows":60,"n_cols":13,"rows_kept":60,"cut":false,"hidden":false,"merged":[[0,6,0,10]]}
["S.US.TSLA",{"$f":"IF(A1=\"\",\"\",RTD(\"cqg.rtd\", ,\"ContractData\",A1, \"LongDescription\",, \"T\"))","v":"TESLA, INC."},null,null,null,null,"https://www.ark-funds.com/funds/arkw#hold",null,null,null,null,null,"Last Symbol update was 9/12/2025"]
["S.US.AMD",{"$f":"IF(A2=\"\",\"\",RTD(\"cqg.rtd\", ,\"ContractData\",A2, \"LongDescription\",, \"T\"))","v":"ADV MICRO DEVICES"}]
["S.US.ARKW",{"$f":"IF(A3=\"\",\"\",RTD(\"cqg.rtd\", ,\"ContractData\",A3, \"LongDescription\",, \"T\"))","v":"ARK Next Generation Internet ETF"}]
["S.US.ROKU",{"$f":"IF(A4=\"\",\"\",RTD(\"cqg.rtd\", ,\"ContractData\",A4, \"LongDescription\",, \"T\"))","v":"ROKU, INC. A CMN"}]
["S.US.COIN",{"$f":"IF(A5=\"\",\"\",RTD(\"cqg.rtd\", ,\"ContractData\",A5, \"LongDescription\",, \"T\"))","v":"COINBASE GLB CL A CM"}]
["S.US.SHOP",{"$f":"IF(A6=\"\",\"\",RTD(\"cqg.rtd\", ,\"ContractData\",A6, \"LongDescription\",, \"T\"))","v":"Shopify Inc."}]
["S.US.HOOD",{"$f":"IF(A7=\"\",\"\",RTD(\"cqg.rtd\", ,\"ContractData\",A7, \"LongDescription\",, \"T\"))","v":"ROBINHOOD MK CL A CS"}]
["S.US.PLTR",{"$f":"IF(A8=\"\",\"\",RTD(\"cqg.rtd\", ,\"ContractData\",A8, \"LongDescription\",, \"T\"))","v":"PALANTIR TECH CL A"}]
["S.US.RBLX",{"$f":"IF(A9=\"\",\"\",RTD(\"cqg.rtd\", ,\"ContractData\",A9, \"LongDescription\",, \"T\"))","v":"Roblox Corp"}]
["S.US.CRCL",{"$f":"IF(A10=\"\",\"\",RTD(\"cqg.rtd\", ,\"ContractData\",A10, \"LongDescription\",, \"T\"))","v":"Circle Internet Group"}]
["S.US.TSM",{"$f":"IF(A11=\"\",\"\",RTD(\"cqg.rtd\", ,\"ContractData\",A11, \"LongDescription\",, \"T\"))","v":"Taiwan Semiconductor Manufacturing Co"}]
["S.US.BMNR",{"$f":"IF(A12=\"\",\"\",RTD(\"cqg.rtd\", ,\"ContractData\",A12, \"LongDescription\",, \"T\"))","v":"BitMine Immersion Technologies Inc."}]
["S.US.META",{"$f":"IF(A13=\"\",\"\",RTD(\"cqg.rtd\", ,\"ContractData\",A13, \"LongDescription\",, \"T\"))","v":"Meta Platforms, Inc."}]
["S.US.GOOG",{"$f":"IF(A14=\"\",\"\",RTD(\"cqg.rtd\", ,\"ContractData\",A14, \"LongDescription\",, \"T\"))","v":"ALPHABET CL C CAP"}]
["S.US.CRWD",{"$f":"IF(A15=\"\",\"\",RTD(\"cqg.rtd\", ,\"ContractData\",A15, \"LongDescription\",, \"T\"))","v":"CROWDSTRIKE HLD CM A"}]
["S.US.XYZ",{"$f":"IF(A16=\"\",\"\",RTD(\"cqg.rtd\", ,\"ContractData\",A16, \"LongDescription\",, \"T\"))","v":"Square, Inc"}]
["S.US.GTLB",{"$f":"IF(A17=\"\",\"\",RTD(\"cqg.rtd\", ,\"ContractData\",A17, \"LongDescription\",, \"T\"))","v":"GITLAB INC."}]
["S.US.AMZN",{"$f":"IF(A18=\"\",\"\",RTD(\"cqg.rtd\", ,\"ContractData\",A18, \"LongDescription\",, \"T\"))","v":"Amazon.com Inc"},"To update the Ticker List:"]
["S.US.NET",{"$f":"IF(A19=\"\",\"\",RTD(\"cqg.rtd\", ,\"ContractData\",A19, \"LongDescription\",, \"T\"))","v":"Cloudflare, Inc."}]
["S.US.DDOG",{"$f":"IF(A20=\"\",\"\",RTD(\"cqg.rtd\", ,\"ContractData\",A20, \"LongDescription\",, \"T\"))","v":"DATADOG INC.L A CM"}]
["S.US.CRWV",{"$f":"IF(A21=\"\",\"\",RTD(\"cqg.rtd\", ,\"ContractData\",A21, \"LongDescription\",, \"T\"))","v":"COREWEAVE CL A CS"},"1) From their Web site download"]
["S.US.U",{"$f":"IF(A22=\"\",\"\",RTD(\"cqg.rtd\", ,\"ContractData\",A22, \"LongDescription\",, \"T\"))","v":"Unity Software Inc."},"the CSV File."]
["S.US.DKNG",{"$f":"IF(A23=\"\",\"\",RTD(\"cqg.rtd\", ,\"ContractData\",A23, \"LongDescription\",, \"T\"))","v":"DRAFTKINGS INC. CL A"}]
["S.US.NVDA",{"$f":"IF(A24=\"\",\"\",RTD(\"cqg.rtd\", ,\"ContractData\",A24, \"LongDescription\",, \"T\"))","v":"NVIDIA CORPORATION"}]
["S.US.BLSH",{"$f":"IF(A25=\"\",\"\",RTD(\"cqg.rtd\", ,\"ContractData\",A25, \"LongDescription\",, \"T\"))","v":"Bullish"},"2) Copy the Tickers from the file."]
["S.US.DASH",{"$f":"IF(A26=\"\",\"\",RTD(\"cqg.rtd\", ,\"ContractData\",A26, \"LongDescription\",, \"T\"))","v":"DOORDASH, INC. CL A"},"Merge \"S.US.\" to the Tickers. =\"S.US.\"&H26",null,null,null,null,"NVDA"]
["S.US.RBRK",{"$f":"IF(A27=\"\",\"\",RTD(\"cqg.rtd\", ,\"ContractData\",A27, \"LongDescription\",, \"T\"))","v":"Rubrik, Inc."},null,null,null,null,{"$f":"\"S.US.\"&H26","v":"S.US.NVDA"}]
["S.US.SPOT",{"$f":"IF(A28=\"\",\"\",RTD(\"cqg.rtd\", ,\"ContractData\",A28, \"LongDescription\",, \"T\"))","v":"Spotify Technology S.A."}]
["S.US.PINS",{"$f":"IF(A29=\"\",\"\",RTD(\"cqg.rtd\", ,\"ContractData\",A29, \"LongDescription\",, \"T\"))","v":"Pinterest, Inc."},"3) Remove money market fund tickers."]
["S.US.BIDU",{"$f":"IF(A30=\"\",\"\",RTD(\"cqg.rtd\", ,\"ContractData\",A30, \"LongDescription\",, \"T\"))","v":"BAIDU, INC"}]
["S.US.PSTG",{"$f":"IF(A31=\"\",\"\",RTD(\"cqg.rtd\", ,\"ContractData\",A31, \"LongDescription\",, \"T\"))","v":"Pure Storage, Inc."}]
["S.US.ABNB",{"$f":"IF(A32=\"\",\"\",RTD(\"cqg.rtd\", ,\"ContractData\",A32, \"LongDescription\",, \"T\"))","v":"Airbnb, Inc. Class A"},"4) Copy and Paste \"As Values\" the updated Ticker List to column A."]
["S.US.MELI",{"$f":"IF(A33=\"\",\"\",RTD(\"cqg.rtd\", ,\"ContractData\",A33, \"LongDescription\",, \"T\"))","v":"MERCADOLIBRE, INC."}]
["S.US.TTD",{"$f":"IF(A34=\"\",\"\",RTD(\"cqg.rtd\", ,\"ContractData\",A34, \"LongDescription\",, \"T\"))","v":"THE TRADE DESK CL A"}]
["S.US.GENI",{"$f":"IF(A35=\"\",\"\",RTD(\"cqg.rtd\", ,\"ContractData\",A35, \"LongDescription\",, \"T\"))","v":"Genius Sports LTD"}]
["S.US.PD",{"$f":"IF(A36=\"\",\"\",RTD(\"cqg.rtd\", ,\"ContractData\",A36, \"LongDescription\",, \"T\"))","v":"PagerDuty, Inc."}]
["S.US.TOST",{"$f":"IF(A37=\"\",\"\",RTD(\"cqg.rtd\", ,\"ContractData\",A37, \"LongDescription\",, \"T\"))","v":"Toast, Inc."}]
["S.US.QCOM",{"$f":"IF(A38=\"\",\"\",RTD(\"cqg.rtd\", ,\"ContractData\",A38, \"LongDescription\",, \"T\"))","v":"QUALCOMM Inc"}]
["S.US.NFLX",{"$f":"IF(A39=\"\",\"\",RTD(\"cqg.rtd\", ,\"ContractData\",A39, \"LongDescription\",, \"T\"))","v":"NETFLIX, INC."}]
["S.US.Fig",{"$f":"IF(A40=\"\",\"\",RTD(\"cqg.rtd\", ,\"ContractData\",A40, \"LongDescription\",, \"T\"))","v":"Figma, Inc."}]
["S.US.BABA",{"$f":"IF(A41=\"\",\"\",RTD(\"cqg.rtd\", ,\"ContractData\",A41, \"LongDescription\",, \"T\"))","v":"Alibaba Group Holding Ltd"}]
["S.US.NXDR",{"$f":"IF(A42=\"\",\"\",RTD(\"cqg.rtd\", ,\"ContractData\",A42, \"LongDescription\",, \"T\"))","v":"Nextdoor Holdings, Inc."}]
["S.CA.ETHQ",{"$f":"IF(A43=\"\",\"\",RTD(\"cqg.rtd\", ,\"ContractData\",A43, \"LongDescription\",, \"T\"))","v":"3iQ Ether Staking ETF"}]
["S.US.CRM",{"$f":"IF(A44=\"\",\"\",RTD(\"cqg.rtd\", ,\"ContractData\",A44, \"LongDescription\",, \"T\"))","v":"Salesforce, Inc."}]
["S.US.IBTA",{"$f":"IF(A45=\"\",\"\",RTD(\"cqg.rtd\", ,\"ContractData\",A45, \"LongDescription\",, \"T\"))","v":"Ibotta, Inc."}]
["S.US.SLMT",{"$f":"IF(A46=\"\",\"\",RTD(\"cqg.rtd\", ,\"ContractData\",A46, \"LongDescription\",, \"T\"))","v":"BRERA HOLDINGS B OS"}]
["S.CA.SOLQ",{"$f":"IF(A47=\"\",\"\",RTD(\"cqg.rtd\", ,\"ContractData\",A47, \"LongDescription\",, \"T\"))","v":"3IQ SOLANA STAKING ETF"}]
["S.US.RDDT",{"$f":"IF(A48=\"\",\"\",RTD(\"cqg.rtd\", ,\"ContractData\",A48, \"LongDescription\",, \"T\"))","v":"Reddit, Inc."}]
[null,{"$f":"IF(A49=\"\",\"\",RTD(\"cqg.rtd\", ,\"ContractData\",A49, \"LongDescription\",, \"T\"))","v":""}]
[null,{"$f":"IF(A50=\"\",\"\",RTD(\"cqg.rtd\", ,\"ContractData\",A50, \"LongDescription\",, \"T\"))","v":""}]
[null,{"$f":"IF(A51=\"\",\"\",RTD(\"cqg.rtd\", ,\"ContractData\",A51, \"LongDescription\",, \"T\"))","v":""}]
[null,{"$f":"IF(A52=\"\",\"\",RTD(\"cqg.rtd\", ,\"ContractData\",A52, \"LongDescription\",, \"T\"))","v":""}]
[null,{"$f":"IF(A53=\"\",\"\",RTD(\"cqg.rtd\", ,\"ContractData\",A53, \"LongDescription\",, \"T\"))","v":""}]
[null,{"$f":"IF(A54=\"\",\"\",RTD(\"cqg.rtd\", ,\"ContractData\",A54, \"LongDescription\",, \"T\"))","v":""}]
[null,{"$f":"IF(A55=\"\",\"\",RTD(\"cqg.rtd\", ,\"ContractData\",A55, \"LongDescription\",, \"T\"))","v":""}]
[null,{"$f":"IF(A56=\"\",\"\",RTD(\"cqg.rtd\", ,\"ContractData\",A56, \"LongDescription\",, \"T\"))","v":""}]
[null,{"$f":"IF(A57=\"\",\"\",RTD(\"cqg.rtd\", ,\"ContractData\",A57, \"LongDescription\",, \"T\"))","v":""}]
[null,{"$f":"IF(A58=\"\",\"\",RTD(\"cqg.rtd\", ,\"ContractData\",A58, \"LongDescription\",, \"T\"))","v":""}]
[null,{"$f":"IF(A59=\"\",\"\",RTD(\"cqg.rtd\", ,\"ContractData\",A59, \"LongDescription\",, \"T\"))","v":""}]
[null,{"$f":"IF(A60=\"\",\"\",RTD(\"cqg.rtd\", ,\"ContractData\",A60, \"LongDescription\",, \"T\"))","v":""}]