{"text_format":"1","workbook":"xlsx","n_sheets":3,"sheets":["Display","IVE","Symbols"],"not_rendered":{"charts":2,"images":2,"macros":1,"external_links":0,"defined_names":2,"comments":0,"pivot_tables":0},"unopened":[],"bounds":{"document_bytes":16777216,"sheet_cells":100000,"rows_first":2000,"rows_last":500,"rows_between":2000,"halvings":0,"cell_chars":16384,"cell_head_chars":4096},"cells_cut":0,"cells_raw":0,"read":"whole","date_system":"1900"}

{"sheet":"Display","index":0,"n_rows":52,"n_cols":28,"rows_kept":52,"cut":false,"hidden":false,"merged":[[26,18,26,30],[6,2,6,6],[7,2,7,6],[8,2,8,6],[14,2,14,6],[10,2,10,6],[11,2,11,6],[12,2,12,6],[13,2,13,6],[8,14,8,15],[7,14,7,15],[6,14,6,15],[20,2,20,6],[20,14,20,15],[21,2,21,6],[22,2,22,6],[1,1,2,4],[1,27,2,30],[1,5,2,26],[4,18,4,30],[17,2,17,6],[17,14,17,15],[15,2,15,6],[5,2,5,6],[15,14,15,15],[14,14,14,15],[13,14,13,15],[12,14,12,15],[11,14,11,15],[10,14,10,15],[9,14,9,15],[9,2,9,6],[5,14,5,15],[4,1,4,16],[18,2,18,6],[18,14,18,15],[19,2,19,6],[19,14,19,15],[16,2,16,6],[16,14,16,15],[22,14,22,15],[21,14,21,15],[23,2,23,6],[23,14,23,15],[24,2,24,6],[24,14,24,15],[25,2,25,6],[25,14,25,15],[26,2,26,6],[26,14,26,15],[27,2,27,6],[27,14,27,15],[28,2,28,6],[28,14,28,15],[29,2,29,6],[29,14,29,15],[30,2,30,6],[30,14,30,15],[31,2,31,6],[31,14,31,15],[33,2,33,6],[33,14,33,15],[34,2,34,6],[34,14,34,15],[32,2,32,6],[32,14,32,15],[44,14,44,15],[44,2,44,6],[39,14,39,15],[45,2,45,6],[45,14,45,15],[40,2,40,6],[40,14,40,15],[42,2,42,6],[42,14,42,15],[41,2,41,6],[41,14,41,15],[43,2,43,6],[43,14,43,15],[48,1,48,4],[48,5,48,24],[48,25,48,30],[35,2,35,6],[35,14,35,15],[36,2,36,6],[36,14,36,15],[46,2,46,6],[46,14,46,15],[47,2,47,6],[47,14,47,15],[37,2,37,6],[37,14,37,15],[38,2,38,6],[38,14,38,15],[39,2,39,6]]}
[]
[null,null,null,null,null,"iShares S&P 500 Value ETF",null,null,null,null,null,null,null,null,null,null,null,null,null,null,null,null,null,null,null,null,null,{"$f":"RTD(\"cqg.rtd\", ,\"SystemInfo\", \"Linetime\")","v":46247.394016203703}]
[]
[]
[null,"Exchange Traded Funds Performance",null,null,null,null,null,null,null,null,null,null,null,null,null,null,null,null,"Top 15 Positive Performing Companies "]
[null,"Symbol","Description",null,null,null,null,"Last","NC","%NC","NC/ATR","Open","High","Low","Volume",null,"Ratio"]
[null,"IVE",{"$f":"RTD(\"cqg.rtd\", ,\"ContractData\",B7, \"LongDescription\",, \"T\")","v":"iShares S&P 500 Value ETF"},null,null,null,null,{"$f":"RTD(\"cqg.rtd\", ,\"ContractData\",B7, \"LastTradeToday\",, \"T\")","v":238.29},{"$f":"RTD(\"cqg.rtd\", ,\"ContractData\",B7, \"NetLastTradeToday\",, \"T\")","v":1.69},{"$f":"IFERROR(RTD(\"cqg.rtd\", ,\"ContractData\",B7, \"PerCentNetLastTrade\",, \"T\")/100,\"\")","v":7.1428571428571426E-3},{"$f":"IFERROR(I7/RTD(\"cqg.rtd\",,\"StudyData\",B7, \"ATR\", \"MaType=Sim,Period=10\", \"ATR\",\"D\",\"-1\",\"ALL\",,,\"FALSE\",\"T\")/100,\"\")","v":8.8900578642819566E-3},{"$f":"RTD(\"cqg.rtd\", ,\"ContractData\",B7, \"OPen\",, \"T\")","v":237.28},{"$f":"RTD(\"cqg.rtd\", ,\"ContractData\", B7, \"HIgh\",, \"T\")","v":238.29},{"$f":"RTD(\"cqg.rtd\", ,\"ContractData\",B7, \"LOw\",, \"T\")","v":237.16},{"$f":"RTD(\"cqg.rtd\", ,\"ContractData\",B7, \"T_CVol\",, \"T\")","v":56165.408782999999},null,{"$f":" IFERROR(O7/RTD(\"cqg.rtd\",,\"StudyData\",B7, \"MA\", \"InputChoice=Vol,MAType=Sim,Period=21\", \"MA\",\"D\",\"-1\",\"all\",,,,\"T\"),\"\")","v":8.4967806779563296E-2}]
[null,"GCE",{"$f":"RTD(\"cqg.rtd\", ,\"ContractData\",B8, \"LongDescription\",, \"T\")","v":"Gold (Globex), Dec 26"},null,null,null,null,{"$f":"RTD(\"cqg.rtd\", ,\"ContractData\",B8, \"LastTradeToday\",, \"T\")","v":4429.8},{"$f":"RTD(\"cqg.rtd\", ,\"ContractData\",B8, \"NetLastTradeToday\",, \"T\")","v":-37.700000000000003},{"$f":"IFERROR(RTD(\"cqg.rtd\", ,\"ContractData\",B8, \"PerCentNetLastTrade\",, \"T\")/100,\"\")","v":-8.4387241186345829E-3},{"$f":"IFERROR(I8/RTD(\"cqg.rtd\",,\"StudyData\",B8, \"ATR\", \"MaType=Sim,Period=10\", \"ATR\",\"D\",\"-1\",\"ALL\",,,\"FALSE\",\"T\")/100,\"\")","v":-3.7393374330489987E-3},{"$f":"RTD(\"cqg.rtd\", ,\"ContractData\",B8, \"OPen\",, \"T\")","v":4468.8},{"$f":"RTD(\"cqg.rtd\", ,\"ContractData\", B8, \"HIgh\",, \"T\")","v":4509.1000000000004},{"$f":"RTD(\"cqg.rtd\", ,\"ContractData\",B8, \"LOw\",, \"T\")","v":4420.3},{"$f":"RTD(\"cqg.rtd\", ,\"ContractData\",B8, \"T_CVol\",, \"T\")","v":89090},null,{"$f":" IFERROR(O8/RTD(\"cqg.rtd\",,\"StudyData\",B8, \"MA\", \"InputChoice=Vol,MAType=Sim,Period=21\", \"MA\",\"D\",\"-1\",\"all\",,,,\"T\"),\"\")","v":0.48207334129707247}]
[null,"EP",{"$f":"RTD(\"cqg.rtd\", ,\"ContractData\",B9, \"LongDescription\",, \"T\")","v":"E-Mini S&P 500, Sep 26"},null,null,null,null,{"$f":"RTD(\"cqg.rtd\", ,\"ContractData\",B9, \"LastTradeToday\",, \"T\")","v":7835.75},{"$f":"RTD(\"cqg.rtd\", ,\"ContractData\",B9, \"NetLastTradeToday\",, \"T\")","v":65.25},{"$f":"IFERROR(RTD(\"cqg.rtd\", ,\"ContractData\",B9, \"PerCentNetLastTrade\",, \"T\")/100,\"\")","v":8.3971430409883526E-3},{"$f":"IFERROR(I9/RTD(\"cqg.rtd\",,\"StudyData\",B9, \"ATR\", \"MaType=Sim,Period=10\", \"ATR\",\"D\",\"-1\",\"ALL\",,,\"FALSE\",\"T\")/100,\"\")","v":7.4274331246442808E-3},{"$f":"RTD(\"cqg.rtd\", ,\"ContractData\",B9, \"OPen\",, \"T\")","v":7770},{"$f":"RTD(\"cqg.rtd\", ,\"ContractData\", B9, \"HIgh\",, \"T\")","v":7836.75},{"$f":"RTD(\"cqg.rtd\", ,\"ContractData\",B9, \"LOw\",, \"T\")","v":7764.25},{"$f":"RTD(\"cqg.rtd\", ,\"ContractData\",B9, \"T_CVol\",, \"T\")","v":326079},null,{"$f":" IFERROR(O9/RTD(\"cqg.rtd\",,\"StudyData\",B9, \"MA\", \"InputChoice=Vol,MAType=Sim,Period=21\", \"MA\",\"D\",\"-1\",\"all\",,,,\"T\"),\"\")","v":0.23181195214645761}]
[null,"S.IYY",{"$f":"RTD(\"cqg.rtd\", ,\"ContractData\",B10, \"LongDescription\",, \"T\")","v":"iShares DJ US Total Market Idx Fd"},null,null,null,null,{"$f":"RTD(\"cqg.rtd\", ,\"ContractData\",B10, \"LastTradeToday\",, \"T\")","v":189.78},{"$f":"RTD(\"cqg.rtd\", ,\"ContractData\",B10, \"NetLastTradeToday\",, \"T\")","v":1.34},{"$f":"IFERROR(RTD(\"cqg.rtd\", ,\"ContractData\",B10, \"PerCentNetLastTrade\",, \"T\")/100,\"\")","v":7.1110167692634259E-3},{"$f":"IFERROR(I10/RTD(\"cqg.rtd\",,\"StudyData\",B10, \"ATR\", \"MaType=Sim,Period=10\", \"ATR\",\"D\",\"-1\",\"ALL\",,,\"FALSE\",\"T\")/100,\"\")","v":7.4320576816417098E-3},{"$f":"RTD(\"cqg.rtd\", ,\"ContractData\",B10, \"OPen\",, \"T\")","v":188.99},{"$f":"RTD(\"cqg.rtd\", ,\"ContractData\", B10, \"HIgh\",, \"T\")","v":189.78},{"$f":"RTD(\"cqg.rtd\", ,\"ContractData\",B10, \"LOw\",, \"T\")","v":188.99},{"$f":"RTD(\"cqg.rtd\", ,\"ContractData\",B10, \"T_CVol\",, \"T\")","v":5667.2633770000002},null,{"$f":" IFERROR(O10/RTD(\"cqg.rtd\",,\"StudyData\",B10, \"MA\", \"InputChoice=Vol,MAType=Sim,Period=21\", \"MA\",\"D\",\"-1\",\"all\",,,,\"T\"),\"\")","v":0.16547081434503216}]
[null,"S.XLE",{"$f":"RTD(\"cqg.rtd\", ,\"ContractData\",B11, \"LongDescription\",, \"T\")","v":"Energy Select Sector SPDR"},null,null,null,null,{"$f":"RTD(\"cqg.rtd\", ,\"ContractData\",B11, \"LastTradeToday\",, \"T\")","v":60.72},{"$f":"RTD(\"cqg.rtd\", ,\"ContractData\",B11, \"NetLastTradeToday\",, \"T\")","v":-0.31},{"$f":"IFERROR(RTD(\"cqg.rtd\", ,\"ContractData\",B11, \"PerCentNetLastTrade\",, \"T\")/100,\"\")","v":-5.0794691135507128E-3},{"$f":"IFERROR(I11/RTD(\"cqg.rtd\",,\"StudyData\",B11, \"ATR\", \"MaType=Sim,Period=10\", \"ATR\",\"D\",\"-1\",\"ALL\",,,\"FALSE\",\"T\")/100,\"\")","v":-2.1815622800844476E-3},{"$f":"RTD(\"cqg.rtd\", ,\"ContractData\",B11, \"OPen\",, \"T\")","v":60.52},{"$f":"RTD(\"cqg.rtd\", ,\"ContractData\", B11, \"HIgh\",, \"T\")","v":60.870000000000005},{"$f":"RTD(\"cqg.rtd\", ,\"ContractData\",B11, \"LOw\",, \"T\")","v":60.230000000000004},{"$f":"RTD(\"cqg.rtd\", ,\"ContractData\",B11, \"T_CVol\",, \"T\")","v":6332696.6791580003},null,{"$f":" IFERROR(O11/RTD(\"cqg.rtd\",,\"StudyData\",B11, \"MA\", \"InputChoice=Vol,MAType=Sim,Period=21\", \"MA\",\"D\",\"-1\",\"all\",,,,\"T\"),\"\")","v":0.22038403832971251}]
[null,"S.ARTY",{"$f":"RTD(\"cqg.rtd\", ,\"ContractData\",B12, \"LongDescription\",, \"T\")","v":"iShares Robotics and Artificial Intelligence ETF"},null,null,null,null,{"$f":"RTD(\"cqg.rtd\", ,\"ContractData\",B12, \"LastTradeToday\",, \"T\")","v":77.989999999999995},{"$f":"RTD(\"cqg.rtd\", ,\"ContractData\",B12, \"NetLastTradeToday\",, \"T\")","v":1.96},{"$f":"IFERROR(RTD(\"cqg.rtd\", ,\"ContractData\",B12, \"PerCentNetLastTrade\",, \"T\")/100,\"\")","v":2.5779297645666187E-2},{"$f":"IFERROR(I12/RTD(\"cqg.rtd\",,\"StudyData\",B12, \"ATR\", \"MaType=Sim,Period=10\", \"ATR\",\"D\",\"-1\",\"ALL\",,,\"FALSE\",\"T\")/100,\"\")","v":6.9800569800569801E-3},{"$f":"RTD(\"cqg.rtd\", ,\"ContractData\",B12, \"OPen\",, \"T\")","v":76.350000000000009},{"$f":"RTD(\"cqg.rtd\", ,\"ContractData\", B12, \"HIgh\",, \"T\")","v":78.05},{"$f":"RTD(\"cqg.rtd\", ,\"ContractData\",B12, \"LOw\",, \"T\")","v":76.350000000000009},{"$f":"RTD(\"cqg.rtd\", ,\"ContractData\",B12, \"T_CVol\",, \"T\")","v":85930.222242999997},null,{"$f":" IFERROR(O12/RTD(\"cqg.rtd\",,\"StudyData\",B12, \"MA\", \"InputChoice=Vol,MAType=Sim,Period=21\", \"MA\",\"D\",\"-1\",\"all\",,,,\"T\"),\"\")","v":0.17124612314985005}]
[null,"S.ARKQ",{"$f":"RTD(\"cqg.rtd\", ,\"ContractData\",B13, \"LongDescription\",, \"T\")","v":"ARK Autonomous Technology & Robotics ETF"},null,null,null,null,{"$f":"RTD(\"cqg.rtd\", ,\"ContractData\",B13, \"LastTradeToday\",, \"T\")","v":130.21},{"$f":"RTD(\"cqg.rtd\", ,\"ContractData\",B13, \"NetLastTradeToday\",, \"T\")","v":1.28},{"$f":"IFERROR(RTD(\"cqg.rtd\", ,\"ContractData\",B13, \"PerCentNetLastTrade\",, \"T\")/100,\"\")","v":9.9278678352594431E-3},{"$f":"IFERROR(I13/RTD(\"cqg.rtd\",,\"StudyData\",B13, \"ATR\", \"MaType=Sim,Period=10\", \"ATR\",\"D\",\"-1\",\"ALL\",,,\"FALSE\",\"T\")/100,\"\")","v":3.5126234906695934E-3},{"$f":"RTD(\"cqg.rtd\", ,\"ContractData\",B13, \"OPen\",, \"T\")","v":128.55000000000001},{"$f":"RTD(\"cqg.rtd\", ,\"ContractData\", B13, \"HIgh\",, \"T\")","v":130.39000000000001},{"$f":"RTD(\"cqg.rtd\", ,\"ContractData\",B13, \"LOw\",, \"T\")","v":128.55000000000001},{"$f":"RTD(\"cqg.rtd\", ,\"ContractData\",B13, \"T_CVol\",, \"T\")","v":32392.981906000001},null,{"$f":" IFERROR(O13/RTD(\"cqg.rtd\",,\"StudyData\",B13, \"MA\", \"InputChoice=Vol,MAType=Sim,Period=21\", \"MA\",\"D\",\"-1\",\"all\",,,,\"T\"),\"\")","v":0.22583672131694313}]
[null,"S.ROBO",{"$f":"RTD(\"cqg.rtd\", ,\"ContractData\",B14, \"LongDescription\",, \"T\")","v":"Robo-Stox Global Robotics&Automation ETF"},null,null,null,null,{"$f":"RTD(\"cqg.rtd\", ,\"ContractData\",B14, \"LastTradeToday\",, \"T\")","v":85.06},{"$f":"RTD(\"cqg.rtd\", ,\"ContractData\",B14, \"NetLastTradeToday\",, \"T\")","v":0.3},{"$f":"IFERROR(RTD(\"cqg.rtd\", ,\"ContractData\",B14, \"PerCentNetLastTrade\",, \"T\")/100,\"\")","v":3.5394053798961773E-3},{"$f":"IFERROR(I14/RTD(\"cqg.rtd\",,\"StudyData\",B14, \"ATR\", \"MaType=Sim,Period=10\", \"ATR\",\"D\",\"-1\",\"ALL\",,,\"FALSE\",\"T\")/100,\"\")","v":1.6620498614958448E-3},{"$f":"RTD(\"cqg.rtd\", ,\"ContractData\",B14, \"OPen\",, \"T\")","v":84.710000000000008},{"$f":"RTD(\"cqg.rtd\", ,\"ContractData\", B14, \"HIgh\",, \"T\")","v":85.16},{"$f":"RTD(\"cqg.rtd\", ,\"ContractData\",B14, \"LOw\",, \"T\")","v":84.66},{"$f":"RTD(\"cqg.rtd\", ,\"ContractData\",B14, \"T_CVol\",, \"T\")","v":137766.169776},null,{"$f":" IFERROR(O14/RTD(\"cqg.rtd\",,\"StudyData\",B14, \"MA\", \"InputChoice=Vol,MAType=Sim,Period=21\", \"MA\",\"D\",\"-1\",\"all\",,,,\"T\"),\"\")","v":0.92749748733917536}]
[null,"S.CHAT",{"$f":"RTD(\"cqg.rtd\", ,\"ContractData\",B15, \"LongDescription\",, \"T\")","v":"Roundhill Generative AI & Technology ETF"},null,null,null,null,{"$f":"RTD(\"cqg.rtd\", ,\"ContractData\",B15, \"LastTradeToday\",, \"T\")","v":94.72},{"$f":"RTD(\"cqg.rtd\", ,\"ContractData\",B15, \"NetLastTradeToday\",, \"T\")","v":2.0300000000000002},{"$f":"IFERROR(RTD(\"cqg.rtd\", ,\"ContractData\",B15, \"PerCentNetLastTrade\",, \"T\")/100,\"\")","v":2.1900960189880244E-2},{"$f":"IFERROR(I15/RTD(\"cqg.rtd\",,\"StudyData\",B15, \"ATR\", \"MaType=Sim,Period=10\", \"ATR\",\"D\",\"-1\",\"ALL\",,,\"FALSE\",\"T\")/100,\"\")","v":5.4761262476396011E-3},{"$f":"RTD(\"cqg.rtd\", ,\"ContractData\",B15, \"OPen\",, \"T\")","v":92.7},{"$f":"RTD(\"cqg.rtd\", ,\"ContractData\", B15, \"HIgh\",, \"T\")","v":94.79},{"$f":"RTD(\"cqg.rtd\", ,\"ContractData\",B15, \"LOw\",, \"T\")","v":92.7},{"$f":"RTD(\"cqg.rtd\", ,\"ContractData\",B15, \"T_CVol\",, \"T\")","v":141743.33779300001},null,{"$f":" IFERROR(O15/RTD(\"cqg.rtd\",,\"StudyData\",B15, \"MA\", \"InputChoice=Vol,MAType=Sim,Period=21\", \"MA\",\"D\",\"-1\",\"all\",,,,\"T\"),\"\")","v":0.22365972391959332}]
[null,"S.IETC",{"$f":"RTD(\"cqg.rtd\", ,\"ContractData\",B16, \"LongDescription\",, \"T\")","v":"iShares U.S. Tech Independence Focused ETF"},null,null,null,null,{"$f":"RTD(\"cqg.rtd\", ,\"ContractData\",B16, \"LastTradeToday\",, \"T\")","v":112},{"$f":"RTD(\"cqg.rtd\", ,\"ContractData\",B16, \"NetLastTradeToday\",, \"T\")","v":0.6},{"$f":"IFERROR(RTD(\"cqg.rtd\", ,\"ContractData\",B16, \"PerCentNetLastTrade\",, \"T\")/100,\"\")","v":5.3859964093357273E-3},{"$f":"IFERROR(I16/RTD(\"cqg.rtd\",,\"StudyData\",B16, \"ATR\", \"MaType=Sim,Period=10\", \"ATR\",\"D\",\"-1\",\"ALL\",,,\"FALSE\",\"T\")/100,\"\")","v":2.4390243902439024E-3},{"$f":"RTD(\"cqg.rtd\", ,\"ContractData\",B16, \"OPen\",, \"T\")","v":111.35000000000001},{"$f":"RTD(\"cqg.rtd\", ,\"ContractData\", B16, \"HIgh\",, \"T\")","v":112},{"$f":"RTD(\"cqg.rtd\", ,\"ContractData\",B16, \"LOw\",, \"T\")","v":111.35000000000001},{"$f":"RTD(\"cqg.rtd\", ,\"ContractData\",B16, \"T_CVol\",, \"T\")","v":3156.4700360000002},null,{"$f":" IFERROR(O16/RTD(\"cqg.rtd\",,\"StudyData\",B16, \"MA\", \"InputChoice=Vol,MAType=Sim,Period=21\", \"MA\",\"D\",\"-1\",\"all\",,,,\"T\"),\"\")","v":6.0235070728600119E-2}]
[null,null,"Top 15 Description",null,null,null,null,"Last","NC","%NC","NC/ATR","Open","High","Low","Volume",null,"Ratio"]
[{"$f":"TRIM(IVE!O1)","v":"S.US.SMCI"},"News",{"$f":"IFERROR(PROPER(RTD(\"cqg.rtd\", ,\"ContractData\",A18, \"LongDescription\",, \"T\"))&\" (\"&RIGHT(A18,LEN(A18)-5)&\")\",\"\")","v":"Super Micro Computer (SMCI)"},null,null,null,null,{"$f":"IF(C18=\"\",\"\",IFERROR(RTD(\"cqg.rtd\", ,\"ContractData\",A18, \"LastTradeToday\",, \"T\"),\"\"))","v":41.61},{"$f":"IF(C18=\"\",\"\",IFERROR(RTD(\"cqg.rtd\", ,\"ContractData\",A18, \"NetLastTradeToday\",, \"T\"),\"\"))","v":3.99},{"$f":"IFERROR(RTD(\"cqg.rtd\", ,\"ContractData\",A18, \"PerCentNetLastTrade\",, \"T\")/100,\"\")","v":0.10608880616857219},{"$f":"IFERROR(I18/RTD(\"cqg.rtd\",,\"StudyData\",A18, \"ATR\", \"MaType=Sim,Period=10\", \"ATR\",\"D\",\"-1\",\"ALL\",,,\"FALSE\",\"T\")/100,\"\")","v":1.6272430668841761E-2},{"$f":"IF(C18=\"\",\"\",IFERROR(RTD(\"cqg.rtd\", ,\"ContractData\",A18, \"OPen\",, \"T\"),\"\"))","v":38.28},{"$f":"IF(C18=\"\",\"\",IFERROR(RTD(\"cqg.rtd\", ,\"ContractData\", A18, \"HIgh\",, \"T\"),\"\"))","v":41.75},{"$f":"IF(C18=\"\",\"\",IFERROR(RTD(\"cqg.rtd\", ,\"ContractData\",A18, \"LOw\",, \"T\"),\"\"))","v":38.200000000000003},{"$f":"IF(C18=\"\",\"\",IFERROR(RTD(\"cqg.rtd\", ,\"ContractData\",A18, \"T_CVol\",, \"T\"),\"\"))","v":38617346.731009997},null,{"$f":" IFERROR(O18/RTD(\"cqg.rtd\",,\"StudyData\",A18, \"MA\", \"InputChoice=Vol,MAType=Sim,Period=21\", \"MA\",\"D\",\"-1\",\"all\",,,,\"T\"),\"\")","v":0.70589196598896531},{"$f":"IVE!R1","v":"https://finance.yahoo.com/quote/SMCI"}]
[{"$f":"TRIM(IVE!O2)","v":"S.US.WDC"},"News",{"$f":"IFERROR(PROPER(RTD(\"cqg.rtd\", ,\"ContractData\",A19, \"LongDescription\",, \"T\"))&\" (\"&RIGHT(A19,LEN(A19)-5)&\")\",\"\")","v":"Western Digital Cp (WDC)"},null,null,null,null,{"$f":"IF(C19=\"\",\"\",IFERROR(RTD(\"cqg.rtd\", ,\"ContractData\",A19, \"LastTradeToday\",, \"T\"),\"\"))","v":483.24},{"$f":"IF(C19=\"\",\"\",IFERROR(RTD(\"cqg.rtd\", ,\"ContractData\",A19, \"NetLastTradeToday\",, \"T\"),\"\"))","v":29.14},{"$f":"IFERROR(RTD(\"cqg.rtd\", ,\"ContractData\",A19, \"PerCentNetLastTrade\",, \"T\")/100,\"\")","v":6.4170887469720328E-2},{"$f":"IFERROR(I19/RTD(\"cqg.rtd\",,\"StudyData\",A19, \"ATR\", \"MaType=Sim,Period=10\", \"ATR\",\"D\",\"-1\",\"ALL\",,,\"FALSE\",\"T\")/100,\"\")","v":6.0785581676714162E-3},{"$f":"IF(C19=\"\",\"\",IFERROR(RTD(\"cqg.rtd\", ,\"ContractData\",A19, \"OPen\",, \"T\"),\"\"))","v":453.13},{"$f":"IF(C19=\"\",\"\",IFERROR(RTD(\"cqg.rtd\", ,\"ContractData\", A19, \"HIgh\",, \"T\"),\"\"))","v":483.5},{"$f":"IF(C19=\"\",\"\",IFERROR(RTD(\"cqg.rtd\", ,\"ContractData\",A19, \"LOw\",, \"T\"),\"\"))","v":451.55},{"$f":"IF(C19=\"\",\"\",IFERROR(RTD(\"cqg.rtd\", ,\"ContractData\",A19, \"T_CVol\",, \"T\"),\"\"))","v":1744815.455174},null,{"$f":" IFERROR(O19/RTD(\"cqg.rtd\",,\"StudyData\",A19, \"MA\", \"InputChoice=Vol,MAType=Sim,Period=21\", \"MA\",\"D\",\"-1\",\"all\",,,,\"T\"),\"\")","v":0.20855590249250527},{"$f":"IVE!R2","v":"https://finance.yahoo.com/quote/WDC"}]
[{"$f":"TRIM(IVE!O3)","v":"S.US.PSKY"},"News",{"$f":"IFERROR(PROPER(RTD(\"cqg.rtd\", ,\"ContractData\",A20, \"LongDescription\",, \"T\"))&\" (\"&RIGHT(A20,LEN(A20)-5)&\")\",\"\")","v":"Paramount Skydn B (PSKY)"},null,null,null,null,{"$f":"IF(C20=\"\",\"\",IFERROR(RTD(\"cqg.rtd\", ,\"ContractData\",A20, \"LastTradeToday\",, \"T\"),\"\"))","v":10},{"$f":"IF(C20=\"\",\"\",IFERROR(RTD(\"cqg.rtd\", ,\"ContractData\",A20, \"NetLastTradeToday\",, \"T\"),\"\"))","v":0.5},{"$f":"IFERROR(RTD(\"cqg.rtd\", ,\"ContractData\",A20, \"PerCentNetLastTrade\",, \"T\")/100,\"\")","v":5.2631578947368425E-2},{"$f":"IFERROR(I20/RTD(\"cqg.rtd\",,\"StudyData\",A20, \"ATR\", \"MaType=Sim,Period=10\", \"ATR\",\"D\",\"-1\",\"ALL\",,,\"FALSE\",\"T\")/100,\"\")","v":1.1655011655011656E-2},{"$f":"IF(C20=\"\",\"\",IFERROR(RTD(\"cqg.rtd\", ,\"ContractData\",A20, \"OPen\",, \"T\"),\"\"))","v":9.5},{"$f":"IF(C20=\"\",\"\",IFERROR(RTD(\"cqg.rtd\", ,\"ContractData\", A20, \"HIgh\",, \"T\"),\"\"))","v":10.029999999999999},{"$f":"IF(C20=\"\",\"\",IFERROR(RTD(\"cqg.rtd\", ,\"ContractData\",A20, \"LOw\",, \"T\"),\"\"))","v":9.5},{"$f":"IF(C20=\"\",\"\",IFERROR(RTD(\"cqg.rtd\", ,\"ContractData\",A20, \"T_CVol\",, \"T\"),\"\"))","v":2463149.0046629999},null,{"$f":" IFERROR(O20/RTD(\"cqg.rtd\",,\"StudyData\",A20, \"MA\", \"InputChoice=Vol,MAType=Sim,Period=21\", \"MA\",\"D\",\"-1\",\"all\",,,,\"T\"),\"\")","v":0.20033740062619532},{"$f":"IVE!R3","v":"https://finance.yahoo.com/quote/PSKY"}]
[{"$f":"TRIM(IVE!O4)","v":"S.US.HPE"},"News",{"$f":"IFERROR(PROPER(RTD(\"cqg.rtd\", ,\"ContractData\",A21, \"LongDescription\",, \"T\"))&\" (\"&RIGHT(A21,LEN(A21)-5)&\")\",\"\")","v":"Hewlett Packard Enterprise Company (HPE)"},null,null,null,null,{"$f":"IF(C21=\"\",\"\",IFERROR(RTD(\"cqg.rtd\", ,\"ContractData\",A21, \"LastTradeToday\",, \"T\"),\"\"))","v":61.77},{"$f":"IF(C21=\"\",\"\",IFERROR(RTD(\"cqg.rtd\", ,\"ContractData\",A21, \"NetLastTradeToday\",, \"T\"),\"\"))","v":2.98},{"$f":"IFERROR(RTD(\"cqg.rtd\", ,\"ContractData\",A21, \"PerCentNetLastTrade\",, \"T\")/100,\"\")","v":5.0688892668821234E-2},{"$f":"IFERROR(I21/RTD(\"cqg.rtd\",,\"StudyData\",A21, \"ATR\", \"MaType=Sim,Period=10\", \"ATR\",\"D\",\"-1\",\"ALL\",,,\"FALSE\",\"T\")/100,\"\")","v":8.9489489489489489E-3},{"$f":"IF(C21=\"\",\"\",IFERROR(RTD(\"cqg.rtd\", ,\"ContractData\",A21, \"OPen\",, \"T\"),\"\"))","v":61.2},{"$f":"IF(C21=\"\",\"\",IFERROR(RTD(\"cqg.rtd\", ,\"ContractData\", A21, \"HIgh\",, \"T\"),\"\"))","v":63.440000000000005},{"$f":"IF(C21=\"\",\"\",IFERROR(RTD(\"cqg.rtd\", ,\"ContractData\",A21, \"LOw\",, \"T\"),\"\"))","v":60.800000000000004},{"$f":"IF(C21=\"\",\"\",IFERROR(RTD(\"cqg.rtd\", ,\"ContractData\",A21, \"T_CVol\",, \"T\"),\"\"))","v":10341334.664455},null,{"$f":" IFERROR(O21/RTD(\"cqg.rtd\",,\"StudyData\",A21, \"MA\", \"InputChoice=Vol,MAType=Sim,Period=21\", \"MA\",\"D\",\"-1\",\"all\",,,,\"T\"),\"\")","v":0.61947667617051827},{"$f":"IVE!R4","v":"https://finance.yahoo.com/quote/HPE"}]
[{"$f":"TRIM(IVE!O5)","v":"S.US.MRVL"},"News",{"$f":"IFERROR(PROPER(RTD(\"cqg.rtd\", ,\"ContractData\",A22, \"LongDescription\",, \"T\"))&\" (\"&RIGHT(A22,LEN(A22)-5)&\")\",\"\")","v":"Marvell Tech Inc Cmn (MRVL)"},null,null,null,null,{"$f":"IF(C22=\"\",\"\",IFERROR(RTD(\"cqg.rtd\", ,\"ContractData\",A22, \"LastTradeToday\",, \"T\"),\"\"))","v":227.70000000000002},{"$f":"IF(C22=\"\",\"\",IFERROR(RTD(\"cqg.rtd\", ,\"ContractData\",A22, \"NetLastTradeToday\",, \"T\"),\"\"))","v":10.620000000000001},{"$f":"IFERROR(RTD(\"cqg.rtd\", ,\"ContractData\",A22, \"PerCentNetLastTrade\",, \"T\")/100,\"\")","v":4.8922056384742951E-2},{"$f":"IFERROR(I22/RTD(\"cqg.rtd\",,\"StudyData\",A22, \"ATR\", \"MaType=Sim,Period=10\", \"ATR\",\"D\",\"-1\",\"ALL\",,,\"FALSE\",\"T\")/100,\"\")","v":6.1277479660723569E-3},{"$f":"IF(C22=\"\",\"\",IFERROR(RTD(\"cqg.rtd\", ,\"ContractData\",A22, \"OPen\",, \"T\"),\"\"))","v":217.68},{"$f":"IF(C22=\"\",\"\",IFERROR(RTD(\"cqg.rtd\", ,\"ContractData\", A22, \"HIgh\",, \"T\"),\"\"))","v":228.98000000000002},{"$f":"IF(C22=\"\",\"\",IFERROR(RTD(\"cqg.rtd\", ,\"ContractData\",A22, \"LOw\",, \"T\"),\"\"))","v":217.18},{"$f":"IF(C22=\"\",\"\",IFERROR(RTD(\"cqg.rtd\", ,\"ContractData\",A22, \"T_CVol\",, \"T\"),\"\"))","v":4883783.6012199996},null,{"$f":" IFERROR(O22/RTD(\"cqg.rtd\",,\"StudyData\",A22, \"MA\", \"InputChoice=Vol,MAType=Sim,Period=21\", \"MA\",\"D\",\"-1\",\"all\",,,,\"T\"),\"\")","v":0.20730643730027068},{"$f":"IVE!R5","v":"https://finance.yahoo.com/quote/MRVL"}]
[{"$f":"TRIM(IVE!O6)","v":"S.US.INTC"},"News",{"$f":"IFERROR(PROPER(RTD(\"cqg.rtd\", ,\"ContractData\",A23, \"LongDescription\",, \"T\"))&\" (\"&RIGHT(A23,LEN(A23)-5)&\")\",\"\")","v":"Intel Corp (INTC)"},null,null,null,null,{"$f":"IF(C23=\"\",\"\",IFERROR(RTD(\"cqg.rtd\", ,\"ContractData\",A23, \"LastTradeToday\",, \"T\"),\"\"))","v":105.49000000000001},{"$f":"IF(C23=\"\",\"\",IFERROR(RTD(\"cqg.rtd\", ,\"ContractData\",A23, \"NetLastTradeToday\",, \"T\"),\"\"))","v":4.54},{"$f":"IFERROR(RTD(\"cqg.rtd\", ,\"ContractData\",A23, \"PerCentNetLastTrade\",, \"T\")/100,\"\")","v":4.4972758791480931E-2},{"$f":"IFERROR(I23/RTD(\"cqg.rtd\",,\"StudyData\",A23, \"ATR\", \"MaType=Sim,Period=10\", \"ATR\",\"D\",\"-1\",\"ALL\",,,\"FALSE\",\"T\")/100,\"\")","v":6.6200058326042581E-3},{"$f":"IF(C23=\"\",\"\",IFERROR(RTD(\"cqg.rtd\", ,\"ContractData\",A23, \"OPen\",, \"T\"),\"\"))","v":101.51},{"$f":"IF(C23=\"\",\"\",IFERROR(RTD(\"cqg.rtd\", ,\"ContractData\", A23, \"HIgh\",, \"T\"),\"\"))","v":106.17},{"$f":"IF(C23=\"\",\"\",IFERROR(RTD(\"cqg.rtd\", ,\"ContractData\",A23, \"LOw\",, \"T\"),\"\"))","v":100.33},{"$f":"IF(C23=\"\",\"\",IFERROR(RTD(\"cqg.rtd\", ,\"ContractData\",A23, \"T_CVol\",, \"T\"),\"\"))","v":33117661.434824999},null,{"$f":" IFERROR(O23/RTD(\"cqg.rtd\",,\"StudyData\",A23, \"MA\", \"InputChoice=Vol,MAType=Sim,Period=21\", \"MA\",\"D\",\"-1\",\"all\",,,,\"T\"),\"\")","v":0.27500605053407196},{"$f":"IVE!R6","v":"https://finance.yahoo.com/quote/INTC"}]
[{"$f":"TRIM(IVE!O7)","v":"S.US.KDP"},"News",{"$f":"IFERROR(PROPER(RTD(\"cqg.rtd\", ,\"ContractData\",A24, \"LongDescription\",, \"T\"))&\" (\"&RIGHT(A24,LEN(A24)-5)&\")\",\"\")","v":"Keurig Dr Pepper Inc (KDP)"},null,null,null,null,{"$f":"IF(C24=\"\",\"\",IFERROR(RTD(\"cqg.rtd\", ,\"ContractData\",A24, \"LastTradeToday\",, \"T\"),\"\"))","v":30.86},{"$f":"IF(C24=\"\",\"\",IFERROR(RTD(\"cqg.rtd\", ,\"ContractData\",A24, \"NetLastTradeToday\",, \"T\"),\"\"))","v":1.3},{"$f":"IFERROR(RTD(\"cqg.rtd\", ,\"ContractData\",A24, \"PerCentNetLastTrade\",, \"T\")/100,\"\")","v":4.3978349120433018E-2},{"$f":"IFERROR(I24/RTD(\"cqg.rtd\",,\"StudyData\",A24, \"ATR\", \"MaType=Sim,Period=10\", \"ATR\",\"D\",\"-1\",\"ALL\",,,\"FALSE\",\"T\")/100,\"\")","v":1.2404580152671756E-2},{"$f":"IF(C24=\"\",\"\",IFERROR(RTD(\"cqg.rtd\", ,\"ContractData\",A24, \"OPen\",, \"T\"),\"\"))","v":30.060000000000002},{"$f":"IF(C24=\"\",\"\",IFERROR(RTD(\"cqg.rtd\", ,\"ContractData\", A24, \"HIgh\",, \"T\"),\"\"))","v":30.88},{"$f":"IF(C24=\"\",\"\",IFERROR(RTD(\"cqg.rtd\", ,\"ContractData\",A24, \"LOw\",, \"T\"),\"\"))","v":30.01},{"$f":"IF(C24=\"\",\"\",IFERROR(RTD(\"cqg.rtd\", ,\"ContractData\",A24, \"T_CVol\",, \"T\"),\"\"))","v":1869378.4114369999},null,{"$f":" IFERROR(O24/RTD(\"cqg.rtd\",,\"StudyData\",A24, \"MA\", \"InputChoice=Vol,MAType=Sim,Period=21\", \"MA\",\"D\",\"-1\",\"all\",,,,\"T\"),\"\")","v":0.14625393705433512},{"$f":"IVE!R7","v":"https://finance.yahoo.com/quote/KDP"}]
[{"$f":"TRIM(IVE!O8)","v":"S.US.CSGP"},"News",{"$f":"IFERROR(PROPER(RTD(\"cqg.rtd\", ,\"ContractData\",A25, \"LongDescription\",, \"T\"))&\" (\"&RIGHT(A25,LEN(A25)-5)&\")\",\"\")","v":"Costar Group Inc ## (CSGP)"},null,null,null,null,{"$f":"IF(C25=\"\",\"\",IFERROR(RTD(\"cqg.rtd\", ,\"ContractData\",A25, \"LastTradeToday\",, \"T\"),\"\"))","v":31.71},{"$f":"IF(C25=\"\",\"\",IFERROR(RTD(\"cqg.rtd\", ,\"ContractData\",A25, \"NetLastTradeToday\",, \"T\"),\"\"))","v":1.21},{"$f":"IFERROR(RTD(\"cqg.rtd\", ,\"ContractData\",A25, \"PerCentNetLastTrade\",, \"T\")/100,\"\")","v":3.9672131147540986E-2},{"$f":"IFERROR(I25/RTD(\"cqg.rtd\",,\"StudyData\",A25, \"ATR\", \"MaType=Sim,Period=10\", \"ATR\",\"D\",\"-1\",\"ALL\",,,\"FALSE\",\"T\")/100,\"\")","v":9.7345132743362813E-3},{"$f":"IF(C25=\"\",\"\",IFERROR(RTD(\"cqg.rtd\", ,\"ContractData\",A25, \"OPen\",, \"T\"),\"\"))","v":30.68},{"$f":"IF(C25=\"\",\"\",IFERROR(RTD(\"cqg.rtd\", ,\"ContractData\", A25, \"HIgh\",, \"T\"),\"\"))","v":31.78},{"$f":"IF(C25=\"\",\"\",IFERROR(RTD(\"cqg.rtd\", ,\"ContractData\",A25, \"LOw\",, \"T\"),\"\"))","v":30.68},{"$f":"IF(C25=\"\",\"\",IFERROR(RTD(\"cqg.rtd\", ,\"ContractData\",A25, \"T_CVol\",, \"T\"),\"\"))","v":819631.63104500005},null,{"$f":" IFERROR(O25/RTD(\"cqg.rtd\",,\"StudyData\",A25, \"MA\", \"InputChoice=Vol,MAType=Sim,Period=21\", \"MA\",\"D\",\"-1\",\"all\",,,,\"T\"),\"\")","v":0.10874166770585571},{"$f":"IVE!R8","v":"https://finance.yahoo.com/quote/CSGP"}]
[{"$f":"TRIM(IVE!O9)","v":"S.US.ALB"},"News",{"$f":"IFERROR(PROPER(RTD(\"cqg.rtd\", ,\"ContractData\",A26, \"LongDescription\",, \"T\"))&\" (\"&RIGHT(A26,LEN(A26)-5)&\")\",\"\")","v":"Albemarle Corporation (ALB)"},null,null,null,null,{"$f":"IF(C26=\"\",\"\",IFERROR(RTD(\"cqg.rtd\", ,\"ContractData\",A26, \"LastTradeToday\",, \"T\"),\"\"))","v":133.04},{"$f":"IF(C26=\"\",\"\",IFERROR(RTD(\"cqg.rtd\", ,\"ContractData\",A26, \"NetLastTradeToday\",, \"T\"),\"\"))","v":4.7},{"$f":"IFERROR(RTD(\"cqg.rtd\", ,\"ContractData\",A26, \"PerCentNetLastTrade\",, \"T\")/100,\"\")","v":3.6621474209131998E-2},{"$f":"IFERROR(I26/RTD(\"cqg.rtd\",,\"StudyData\",A26, \"ATR\", \"MaType=Sim,Period=10\", \"ATR\",\"D\",\"-1\",\"ALL\",,,\"FALSE\",\"T\")/100,\"\")","v":9.1333074232413519E-3},{"$f":"IF(C26=\"\",\"\",IFERROR(RTD(\"cqg.rtd\", ,\"ContractData\",A26, \"OPen\",, \"T\"),\"\"))","v":128},{"$f":"IF(C26=\"\",\"\",IFERROR(RTD(\"cqg.rtd\", ,\"ContractData\", A26, \"HIgh\",, \"T\"),\"\"))","v":133.67000000000002},{"$f":"IF(C26=\"\",\"\",IFERROR(RTD(\"cqg.rtd\", ,\"ContractData\",A26, \"LOw\",, \"T\"),\"\"))","v":127.12},{"$f":"IF(C26=\"\",\"\",IFERROR(RTD(\"cqg.rtd\", ,\"ContractData\",A26, \"T_CVol\",, \"T\"),\"\"))","v":392262.23316900001},null,{"$f":" IFERROR(O26/RTD(\"cqg.rtd\",,\"StudyData\",A26, \"MA\", \"InputChoice=Vol,MAType=Sim,Period=21\", \"MA\",\"D\",\"-1\",\"all\",,,,\"T\"),\"\")","v":0.16534084129152565},{"$f":"IVE!R9","v":"https://finance.yahoo.com/quote/ALB"}]
[{"$f":"TRIM(IVE!O10)","v":"S.US.HPQ"},"News",{"$f":"IFERROR(PROPER(RTD(\"cqg.rtd\", ,\"ContractData\",A27, \"LongDescription\",, \"T\"))&\" (\"&RIGHT(A27,LEN(A27)-5)&\")\",\"\")","v":"Hewlett-Packard Company (HPQ)"},null,null,null,null,{"$f":"IF(C27=\"\",\"\",IFERROR(RTD(\"cqg.rtd\", ,\"ContractData\",A27, \"LastTradeToday\",, \"T\"),\"\"))","v":30.32},{"$f":"IF(C27=\"\",\"\",IFERROR(RTD(\"cqg.rtd\", ,\"ContractData\",A27, \"NetLastTradeToday\",, \"T\"),\"\"))","v":1.04},{"$f":"IFERROR(RTD(\"cqg.rtd\", ,\"ContractData\",A27, \"PerCentNetLastTrade\",, \"T\")/100,\"\")","v":3.5519125683060107E-2},{"$f":"IFERROR(I27/RTD(\"cqg.rtd\",,\"StudyData\",A27, \"ATR\", \"MaType=Sim,Period=10\", \"ATR\",\"D\",\"-1\",\"ALL\",,,\"FALSE\",\"T\")/100,\"\")","v":7.2423398328690814E-3},{"$f":"IF(C27=\"\",\"\",IFERROR(RTD(\"cqg.rtd\", ,\"ContractData\",A27, \"OPen\",, \"T\"),\"\"))","v":31.32},{"$f":"IF(C27=\"\",\"\",IFERROR(RTD(\"cqg.rtd\", ,\"ContractData\", A27, \"HIgh\",, \"T\"),\"\"))","v":32.19},{"$f":"IF(C27=\"\",\"\",IFERROR(RTD(\"cqg.rtd\", ,\"ContractData\",A27, \"LOw\",, \"T\"),\"\"))","v":29.490000000000002},{"$f":"IF(C27=\"\",\"\",IFERROR(RTD(\"cqg.rtd\", ,\"ContractData\",A27, \"T_CVol\",, \"T\"),\"\"))","v":8592955.5549100004},null,{"$f":" IFERROR(O27/RTD(\"cqg.rtd\",,\"StudyData\",A27, \"MA\", \"InputChoice=Vol,MAType=Sim,Period=21\", \"MA\",\"D\",\"-1\",\"all\",,,,\"T\"),\"\")","v":0.58516588623341548},{"$f":"IVE!R10","v":"https://finance.yahoo.com/quote/HPQ"},"Bottom 15 Negative Performing Companies "]
[{"$f":"TRIM(IVE!O11)","v":"S.US.AKAM"},"News",{"$f":"IFERROR(PROPER(RTD(\"cqg.rtd\", ,\"ContractData\",A28, \"LongDescription\",, \"T\"))&\" (\"&RIGHT(A28,LEN(A28)-5)&\")\",\"\")","v":"Akamai Technologies (AKAM)"},null,null,null,null,{"$f":"IF(C28=\"\",\"\",IFERROR(RTD(\"cqg.rtd\", ,\"ContractData\",A28, \"LastTradeToday\",, \"T\"),\"\"))","v":127},{"$f":"IF(C28=\"\",\"\",IFERROR(RTD(\"cqg.rtd\", ,\"ContractData\",A28, \"NetLastTradeToday\",, \"T\"),\"\"))","v":4.22},{"$f":"IFERROR(RTD(\"cqg.rtd\", ,\"ContractData\",A28, \"PerCentNetLastTrade\",, \"T\")/100,\"\")","v":3.437041863495683E-2},{"$f":"IFERROR(I28/RTD(\"cqg.rtd\",,\"StudyData\",A28, \"ATR\", \"MaType=Sim,Period=10\", \"ATR\",\"D\",\"-1\",\"ALL\",,,\"FALSE\",\"T\")/100,\"\")","v":6.0036989614454406E-3},{"$f":"IF(C28=\"\",\"\",IFERROR(RTD(\"cqg.rtd\", ,\"ContractData\",A28, \"OPen\",, \"T\"),\"\"))","v":124.92},{"$f":"IF(C28=\"\",\"\",IFERROR(RTD(\"cqg.rtd\", ,\"ContractData\", A28, \"HIgh\",, \"T\"),\"\"))","v":127.03},{"$f":"IF(C28=\"\",\"\",IFERROR(RTD(\"cqg.rtd\", ,\"ContractData\",A28, \"LOw\",, \"T\"),\"\"))","v":123.31},{"$f":"IF(C28=\"\",\"\",IFERROR(RTD(\"cqg.rtd\", ,\"ContractData\",A28, \"T_CVol\",, \"T\"),\"\"))","v":494712.98794700002},null,{"$f":" IFERROR(O28/RTD(\"cqg.rtd\",,\"StudyData\",A28, \"MA\", \"InputChoice=Vol,MAType=Sim,Period=21\", \"MA\",\"D\",\"-1\",\"all\",,,,\"T\"),\"\")","v":0.13221763852017246},{"$f":"IVE!R11","v":"https://finance.yahoo.com/quote/AKAM"}]
[{"$f":"TRIM(IVE!O12)","v":"S.US.DELL"},"News",{"$f":"IFERROR(PROPER(RTD(\"cqg.rtd\", ,\"ContractData\",A29, \"LongDescription\",, \"T\"))&\" (\"&RIGHT(A29,LEN(A29)-5)&\")\",\"\")","v":"Dell Technologies Inc. (DELL)"},null,null,null,null,{"$f":"IF(C29=\"\",\"\",IFERROR(RTD(\"cqg.rtd\", ,\"ContractData\",A29, \"LastTradeToday\",, \"T\"),\"\"))","v":501.07},{"$f":"IF(C29=\"\",\"\",IFERROR(RTD(\"cqg.rtd\", ,\"ContractData\",A29, \"NetLastTradeToday\",, \"T\"),\"\"))","v":16.57},{"$f":"IFERROR(RTD(\"cqg.rtd\", ,\"ContractData\",A29, \"PerCentNetLastTrade\",, \"T\")/100,\"\")","v":3.4200206398348809E-2},{"$f":"IFERROR(I29/RTD(\"cqg.rtd\",,\"StudyData\",A29, \"ATR\", \"MaType=Sim,Period=10\", \"ATR\",\"D\",\"-1\",\"ALL\",,,\"FALSE\",\"T\")/100,\"\")","v":4.5827917139143184E-3},{"$f":"IF(C29=\"\",\"\",IFERROR(RTD(\"cqg.rtd\", ,\"ContractData\",A29, \"OPen\",, \"T\"),\"\"))","v":499.68},{"$f":"IF(C29=\"\",\"\",IFERROR(RTD(\"cqg.rtd\", ,\"ContractData\", A29, \"HIgh\",, \"T\"),\"\"))","v":514},{"$f":"IF(C29=\"\",\"\",IFERROR(RTD(\"cqg.rtd\", ,\"ContractData\",A29, \"LOw\",, \"T\"),\"\"))","v":487.12},{"$f":"IF(C29=\"\",\"\",IFERROR(RTD(\"cqg.rtd\", ,\"ContractData\",A29, \"T_CVol\",, \"T\"),\"\"))","v":3442711.2161929999},null,{"$f":" IFERROR(O29/RTD(\"cqg.rtd\",,\"StudyData\",A29, \"MA\", \"InputChoice=Vol,MAType=Sim,Period=21\", \"MA\",\"D\",\"-1\",\"all\",,,,\"T\"),\"\")","v":0.54699152173116639},{"$f":"IVE!R12","v":"https://finance.yahoo.com/quote/DELL"}]
[{"$f":"TRIM(IVE!O13)","v":"S.US.BLDR"},"News",{"$f":"IFERROR(PROPER(RTD(\"cqg.rtd\", ,\"ContractData\",A30, \"LongDescription\",, \"T\"))&\" (\"&RIGHT(A30,LEN(A30)-5)&\")\",\"\")","v":"Builders Firstsource Inc (BLDR)"},null,null,null,null,{"$f":"IF(C30=\"\",\"\",IFERROR(RTD(\"cqg.rtd\", ,\"ContractData\",A30, \"LastTradeToday\",, \"T\"),\"\"))","v":74.86},{"$f":"IF(C30=\"\",\"\",IFERROR(RTD(\"cqg.rtd\", ,\"ContractData\",A30, \"NetLastTradeToday\",, \"T\"),\"\"))","v":2.4500000000000002},{"$f":"IFERROR(RTD(\"cqg.rtd\", ,\"ContractData\",A30, \"PerCentNetLastTrade\",, \"T\")/100,\"\")","v":3.3835105648391109E-2},{"$f":"IFERROR(I30/RTD(\"cqg.rtd\",,\"StudyData\",A30, \"ATR\", \"MaType=Sim,Period=10\", \"ATR\",\"D\",\"-1\",\"ALL\",,,\"FALSE\",\"T\")/100,\"\")","v":6.4917859035506101E-3},{"$f":"IF(C30=\"\",\"\",IFERROR(RTD(\"cqg.rtd\", ,\"ContractData\",A30, \"OPen\",, \"T\"),\"\"))","v":73.44},{"$f":"IF(C30=\"\",\"\",IFERROR(RTD(\"cqg.rtd\", ,\"ContractData\", A30, \"HIgh\",, \"T\"),\"\"))","v":75.2},{"$f":"IF(C30=\"\",\"\",IFERROR(RTD(\"cqg.rtd\", ,\"ContractData\",A30, \"LOw\",, \"T\"),\"\"))","v":73},{"$f":"IF(C30=\"\",\"\",IFERROR(RTD(\"cqg.rtd\", ,\"ContractData\",A30, \"T_CVol\",, \"T\"),\"\"))","v":280874.34197200002},null,{"$f":" IFERROR(O30/RTD(\"cqg.rtd\",,\"StudyData\",A30, \"MA\", \"InputChoice=Vol,MAType=Sim,Period=21\", \"MA\",\"D\",\"-1\",\"all\",,,,\"T\"),\"\")","v":0.11870857760093564},{"$f":"IVE!R13","v":"https://finance.yahoo.com/quote/BLDR"}]
[{"$f":"TRIM(IVE!O14)","v":"S.US.EQR"},"News",{"$f":"IFERROR(PROPER(RTD(\"cqg.rtd\", ,\"ContractData\",A31, \"LongDescription\",, \"T\"))&\" (\"&RIGHT(A31,LEN(A31)-5)&\")\",\"\")","v":"Equity Residential Properties Trust (EQR)"},null,null,null,null,{"$f":"IF(C31=\"\",\"\",IFERROR(RTD(\"cqg.rtd\", ,\"ContractData\",A31, \"LastTradeToday\",, \"T\"),\"\"))","v":66.52},{"$f":"IF(C31=\"\",\"\",IFERROR(RTD(\"cqg.rtd\", ,\"ContractData\",A31, \"NetLastTradeToday\",, \"T\"),\"\"))","v":2.1},{"$f":"IFERROR(RTD(\"cqg.rtd\", ,\"ContractData\",A31, \"PerCentNetLastTrade\",, \"T\")/100,\"\")","v":3.2598571872089414E-2},{"$f":"IFERROR(I31/RTD(\"cqg.rtd\",,\"StudyData\",A31, \"ATR\", \"MaType=Sim,Period=10\", \"ATR\",\"D\",\"-1\",\"ALL\",,,\"FALSE\",\"T\")/100,\"\")","v":1.516245487364621E-2},{"$f":"IF(C31=\"\",\"\",IFERROR(RTD(\"cqg.rtd\", ,\"ContractData\",A31, \"OPen\",, \"T\"),\"\"))","v":65.09},{"$f":"IF(C31=\"\",\"\",IFERROR(RTD(\"cqg.rtd\", ,\"ContractData\", A31, \"HIgh\",, \"T\"),\"\"))","v":66.52},{"$f":"IF(C31=\"\",\"\",IFERROR(RTD(\"cqg.rtd\", ,\"ContractData\",A31, \"LOw\",, \"T\"),\"\"))","v":64.75},{"$f":"IF(C31=\"\",\"\",IFERROR(RTD(\"cqg.rtd\", ,\"ContractData\",A31, \"T_CVol\",, \"T\"),\"\"))","v":785281.637017},null,{"$f":" IFERROR(O31/RTD(\"cqg.rtd\",,\"StudyData\",A31, \"MA\", \"InputChoice=Vol,MAType=Sim,Period=21\", \"MA\",\"D\",\"-1\",\"all\",,,,\"T\"),\"\")","v":0.25554598706195225},{"$f":"IVE!R14","v":"https://finance.yahoo.com/quote/EQR"}]
[{"$f":"TRIM(IVE!O15)","v":"S.US.AVB"},"News",{"$f":"IFERROR(PROPER(RTD(\"cqg.rtd\", ,\"ContractData\",A32, \"LongDescription\",, \"T\"))&\" (\"&RIGHT(A32,LEN(A32)-5)&\")\",\"\")","v":"Avalonbay Communities, Inc. (AVB)"},null,null,null,null,{"$f":"IF(C32=\"\",\"\",IFERROR(RTD(\"cqg.rtd\", ,\"ContractData\",A32, \"LastTradeToday\",, \"T\"),\"\"))","v":185.62},{"$f":"IF(C32=\"\",\"\",IFERROR(RTD(\"cqg.rtd\", ,\"ContractData\",A32, \"NetLastTradeToday\",, \"T\"),\"\"))","v":5.83},{"$f":"IFERROR(RTD(\"cqg.rtd\", ,\"ContractData\",A32, \"PerCentNetLastTrade\",, \"T\")/100,\"\")","v":3.2426720062294898E-2},{"$f":"IFERROR(I32/RTD(\"cqg.rtd\",,\"StudyData\",A32, \"ATR\", \"MaType=Sim,Period=10\", \"ATR\",\"D\",\"-1\",\"ALL\",,,\"FALSE\",\"T\")/100,\"\")","v":1.5851005981511693E-2},{"$f":"IF(C32=\"\",\"\",IFERROR(RTD(\"cqg.rtd\", ,\"ContractData\",A32, \"OPen\",, \"T\"),\"\"))","v":180.27},{"$f":"IF(C32=\"\",\"\",IFERROR(RTD(\"cqg.rtd\", ,\"ContractData\", A32, \"HIgh\",, \"T\"),\"\"))","v":185.62},{"$f":"IF(C32=\"\",\"\",IFERROR(RTD(\"cqg.rtd\", ,\"ContractData\",A32, \"LOw\",, \"T\"),\"\"))","v":180.27},{"$f":"IF(C32=\"\",\"\",IFERROR(RTD(\"cqg.rtd\", ,\"ContractData\",A32, \"T_CVol\",, \"T\"),\"\"))","v":249062.804153},null,{"$f":" IFERROR(O32/RTD(\"cqg.rtd\",,\"StudyData\",A32, \"MA\", \"InputChoice=Vol,MAType=Sim,Period=21\", \"MA\",\"D\",\"-1\",\"all\",,,,\"T\"),\"\")","v":0.29578805264336072},{"$f":"IVE!R15","v":"https://finance.yahoo.com/quote/AVB"}]
[null,null,"Bottom 15 Description",null,null,null,null,"Last","NC","%NC","NC/ATR","Open","High","Low","Volume",null,"Ratio"]
[{"$f":"TRIM(IVE!AC1)","v":"S.US.CSCO"},"News",{"$f":"IFERROR(PROPER(RTD(\"cqg.rtd\", ,\"ContractData\",A34, \"LongDescription\",, \"T\"))&\" (\"&RIGHT(A34,LEN(A34)-5)&\")\",\"\")","v":"Cisco Systems Inc. (CSCO)"},null,null,null,null,{"$f":"IF(C34=\"\",\"\",IFERROR(RTD(\"cqg.rtd\", ,\"ContractData\",A34, \"LastTradeToday\",, \"T\"),\"\"))","v":115.22},{"$f":"IF(C34=\"\",\"\",IFERROR(RTD(\"cqg.rtd\", ,\"ContractData\",A34, \"NetLastTradeToday\",, \"T\"),\"\"))","v":-8.66},{"$f":"IFERROR(RTD(\"cqg.rtd\", ,\"ContractData\",A34, \"PerCentNetLastTrade\",, \"T\")/100,\"\")","v":-6.9906360994510808E-2},{"$f":"IFERROR(I34/RTD(\"cqg.rtd\",,\"StudyData\",A34, \"ATR\", \"MaType=Sim,Period=10\", \"ATR\",\"D\",\"-1\",\"ALL\",,,\"FALSE\",\"T\")/100,\"\")","v":-2.5651658767772513E-2},{"$f":"IF(C34=\"\",\"\",IFERROR(RTD(\"cqg.rtd\", ,\"ContractData\",A34, \"OPen\",, \"T\"),\"\"))","v":113.92},{"$f":"IF(C34=\"\",\"\",IFERROR(RTD(\"cqg.rtd\", ,\"ContractData\", A34, \"HIgh\",, \"T\"),\"\"))","v":115.94},{"$f":"IF(C34=\"\",\"\",IFERROR(RTD(\"cqg.rtd\", ,\"ContractData\",A34, \"LOw\",, \"T\"),\"\"))","v":111.48},{"$f":"IF(C34=\"\",\"\",IFERROR(RTD(\"cqg.rtd\", ,\"ContractData\",A34, \"T_CVol\",, \"T\"),\"\"))","v":22243084.278028999},null,{"$f":" IFERROR(O34/RTD(\"cqg.rtd\",,\"StudyData\",A34, \"MA\", \"InputChoice=Vol,MAType=Sim,Period=21\", \"MA\",\"D\",\"-1\",\"all\",,,,\"T\"),\"\")","v":1.0711866968604136},{"$f":"IVE!AH1","v":"https://finance.yahoo.com/quote/CSCO"}]
[{"$f":"TRIM(IVE!AC2)","v":"S.US.DVN"},"News",{"$f":"IFERROR(PROPER(RTD(\"cqg.rtd\", ,\"ContractData\",A35, \"LongDescription\",, \"T\"))&\" (\"&RIGHT(A35,LEN(A35)-5)&\")\",\"\")","v":"Devon Energy Corp (DVN)"},null,null,null,null,{"$f":"IF(C35=\"\",\"\",IFERROR(RTD(\"cqg.rtd\", ,\"ContractData\",A35, \"LastTradeToday\",, \"T\"),\"\"))","v":44.03},{"$f":"IF(C35=\"\",\"\",IFERROR(RTD(\"cqg.rtd\", ,\"ContractData\",A35, \"NetLastTradeToday\",, \"T\"),\"\"))","v":-0.83000000000000007},{"$f":"IFERROR(RTD(\"cqg.rtd\", ,\"ContractData\",A35, \"PerCentNetLastTrade\",, \"T\")/100,\"\")","v":-1.850200624164066E-2},{"$f":"IFERROR(I35/RTD(\"cqg.rtd\",,\"StudyData\",A35, \"ATR\", \"MaType=Sim,Period=10\", \"ATR\",\"D\",\"-1\",\"ALL\",,,\"FALSE\",\"T\")/100,\"\")","v":-6.2032884902840056E-3},{"$f":"IF(C35=\"\",\"\",IFERROR(RTD(\"cqg.rtd\", ,\"ContractData\",A35, \"OPen\",, \"T\"),\"\"))","v":44.25},{"$f":"IF(C35=\"\",\"\",IFERROR(RTD(\"cqg.rtd\", ,\"ContractData\", A35, \"HIgh\",, \"T\"),\"\"))","v":44.43},{"$f":"IF(C35=\"\",\"\",IFERROR(RTD(\"cqg.rtd\", ,\"ContractData\",A35, \"LOw\",, \"T\"),\"\"))","v":43.65},{"$f":"IF(C35=\"\",\"\",IFERROR(RTD(\"cqg.rtd\", ,\"ContractData\",A35, \"T_CVol\",, \"T\"),\"\"))","v":1830667.7783609999},null,{"$f":" IFERROR(O35/RTD(\"cqg.rtd\",,\"StudyData\",A35, \"MA\", \"InputChoice=Vol,MAType=Sim,Period=21\", \"MA\",\"D\",\"-1\",\"all\",,,,\"T\"),\"\")","v":0.17942821455259023},{"$f":"IVE!AH2","v":"https://finance.yahoo.com/quote/DVN"}]
[{"$f":"TRIM(IVE!AC3)","v":"S.US.EXE"},"News",{"$f":"IFERROR(PROPER(RTD(\"cqg.rtd\", ,\"ContractData\",A36, \"LongDescription\",, \"T\"))&\" (\"&RIGHT(A36,LEN(A36)-5)&\")\",\"\")","v":"Expand Energy Cor Cs (EXE)"},null,null,null,null,{"$f":"IF(C36=\"\",\"\",IFERROR(RTD(\"cqg.rtd\", ,\"ContractData\",A36, \"LastTradeToday\",, \"T\"),\"\"))","v":94.56},{"$f":"IF(C36=\"\",\"\",IFERROR(RTD(\"cqg.rtd\", ,\"ContractData\",A36, \"NetLastTradeToday\",, \"T\"),\"\"))","v":-1.72},{"$f":"IFERROR(RTD(\"cqg.rtd\", ,\"ContractData\",A36, \"PerCentNetLastTrade\",, \"T\")/100,\"\")","v":-1.7864561695056087E-2},{"$f":"IFERROR(I36/RTD(\"cqg.rtd\",,\"StudyData\",A36, \"ATR\", \"MaType=Sim,Period=10\", \"ATR\",\"D\",\"-1\",\"ALL\",,,\"FALSE\",\"T\")/100,\"\")","v":-6.4395357543991019E-3},{"$f":"IF(C36=\"\",\"\",IFERROR(RTD(\"cqg.rtd\", ,\"ContractData\",A36, \"OPen\",, \"T\"),\"\"))","v":94.69},{"$f":"IF(C36=\"\",\"\",IFERROR(RTD(\"cqg.rtd\", ,\"ContractData\", A36, \"HIgh\",, \"T\"),\"\"))","v":95.460000000000008},{"$f":"IF(C36=\"\",\"\",IFERROR(RTD(\"cqg.rtd\", ,\"ContractData\",A36, \"LOw\",, \"T\"),\"\"))","v":94.25},{"$f":"IF(C36=\"\",\"\",IFERROR(RTD(\"cqg.rtd\", ,\"ContractData\",A36, \"T_CVol\",, \"T\"),\"\"))","v":242022.339672},null,{"$f":" IFERROR(O36/RTD(\"cqg.rtd\",,\"StudyData\",A36, \"MA\", \"InputChoice=Vol,MAType=Sim,Period=21\", \"MA\",\"D\",\"-1\",\"all\",,,,\"T\"),\"\")","v":6.8415474420195868E-2},{"$f":"IVE!AH3","v":"https://finance.yahoo.com/quote/EXE"}]
[{"$f":"TRIM(IVE!AC4)","v":"S.US.BKR"},"News",{"$f":"IFERROR(PROPER(RTD(\"cqg.rtd\", ,\"ContractData\",A37, \"LongDescription\",, \"T\"))&\" (\"&RIGHT(A37,LEN(A37)-5)&\")\",\"\")","v":"Baker Hughes Co (BKR)"},null,null,null,null,{"$f":"IF(C37=\"\",\"\",IFERROR(RTD(\"cqg.rtd\", ,\"ContractData\",A37, \"LastTradeToday\",, \"T\"),\"\"))","v":63.15},{"$f":"IF(C37=\"\",\"\",IFERROR(RTD(\"cqg.rtd\", ,\"ContractData\",A37, \"NetLastTradeToday\",, \"T\"),\"\"))","v":-1.1300000000000001},{"$f":"IFERROR(RTD(\"cqg.rtd\", ,\"ContractData\",A37, \"PerCentNetLastTrade\",, \"T\")/100,\"\")","v":-1.7579340385812072E-2},{"$f":"IFERROR(I37/RTD(\"cqg.rtd\",,\"StudyData\",A37, \"ATR\", \"MaType=Sim,Period=10\", \"ATR\",\"D\",\"-1\",\"ALL\",,,\"FALSE\",\"T\")/100,\"\")","v":-7.5233022636484693E-3},{"$f":"IF(C37=\"\",\"\",IFERROR(RTD(\"cqg.rtd\", ,\"ContractData\",A37, \"OPen\",, \"T\"),\"\"))","v":63.96},{"$f":"IF(C37=\"\",\"\",IFERROR(RTD(\"cqg.rtd\", ,\"ContractData\", A37, \"HIgh\",, \"T\"),\"\"))","v":63.97},{"$f":"IF(C37=\"\",\"\",IFERROR(RTD(\"cqg.rtd\", ,\"ContractData\",A37, \"LOw\",, \"T\"),\"\"))","v":62.5},{"$f":"IF(C37=\"\",\"\",IFERROR(RTD(\"cqg.rtd\", ,\"ContractData\",A37, \"T_CVol\",, \"T\"),\"\"))","v":1025974.843554},null,{"$f":" IFERROR(O37/RTD(\"cqg.rtd\",,\"StudyData\",A37, \"MA\", \"InputChoice=Vol,MAType=Sim,Period=21\", \"MA\",\"D\",\"-1\",\"all\",,,,\"T\"),\"\")","v":0.11480184304682754},{"$f":"IVE!AH4","v":"https://finance.yahoo.com/quote/BKR"}]
[{"$f":"TRIM(IVE!AC5)","v":"S.US.CF"},"News",{"$f":"IFERROR(PROPER(RTD(\"cqg.rtd\", ,\"ContractData\",A38, \"LongDescription\",, \"T\"))&\" (\"&RIGHT(A38,LEN(A38)-5)&\")\",\"\")","v":"Cf Industries Holdings, Inc (CF)"},null,null,null,null,{"$f":"IF(C38=\"\",\"\",IFERROR(RTD(\"cqg.rtd\", ,\"ContractData\",A38, \"LastTradeToday\",, \"T\"),\"\"))","v":118.07000000000001},{"$f":"IF(C38=\"\",\"\",IFERROR(RTD(\"cqg.rtd\", ,\"ContractData\",A38, \"NetLastTradeToday\",, \"T\"),\"\"))","v":-1.94},{"$f":"IFERROR(RTD(\"cqg.rtd\", ,\"ContractData\",A38, \"PerCentNetLastTrade\",, \"T\")/100,\"\")","v":-1.6165319556703608E-2},{"$f":"IFERROR(I38/RTD(\"cqg.rtd\",,\"StudyData\",A38, \"ATR\", \"MaType=Sim,Period=10\", \"ATR\",\"D\",\"-1\",\"ALL\",,,\"FALSE\",\"T\")/100,\"\")","v":-3.8332345386287293E-3},{"$f":"IF(C38=\"\",\"\",IFERROR(RTD(\"cqg.rtd\", ,\"ContractData\",A38, \"OPen\",, \"T\"),\"\"))","v":117.66},{"$f":"IF(C38=\"\",\"\",IFERROR(RTD(\"cqg.rtd\", ,\"ContractData\", A38, \"HIgh\",, \"T\"),\"\"))","v":120.54},{"$f":"IF(C38=\"\",\"\",IFERROR(RTD(\"cqg.rtd\", ,\"ContractData\",A38, \"LOw\",, \"T\"),\"\"))","v":117.15},{"$f":"IF(C38=\"\",\"\",IFERROR(RTD(\"cqg.rtd\", ,\"ContractData\",A38, \"T_CVol\",, \"T\"),\"\"))","v":200986.152584},null,{"$f":" IFERROR(O38/RTD(\"cqg.rtd\",,\"StudyData\",A38, \"MA\", \"InputChoice=Vol,MAType=Sim,Period=21\", \"MA\",\"D\",\"-1\",\"all\",,,,\"T\"),\"\")","v":8.5304296075521965E-2},{"$f":"IVE!AH5","v":"https://finance.yahoo.com/quote/CF"}]
[{"$f":"TRIM(IVE!AC6)","v":"S.US.FCX"},"News",{"$f":"IFERROR(PROPER(RTD(\"cqg.rtd\", ,\"ContractData\",A39, \"LongDescription\",, \"T\"))&\" (\"&RIGHT(A39,LEN(A39)-5)&\")\",\"\")","v":"Freeport-Mcmoran Inc. (FCX)"},null,null,null,null,{"$f":"IF(C39=\"\",\"\",IFERROR(RTD(\"cqg.rtd\", ,\"ContractData\",A39, \"LastTradeToday\",, \"T\"),\"\"))","v":68.2},{"$f":"IF(C39=\"\",\"\",IFERROR(RTD(\"cqg.rtd\", ,\"ContractData\",A39, \"NetLastTradeToday\",, \"T\"),\"\"))","v":-1.02},{"$f":"IFERROR(RTD(\"cqg.rtd\", ,\"ContractData\",A39, \"PerCentNetLastTrade\",, \"T\")/100,\"\")","v":-1.4735625541750938E-2},{"$f":"IFERROR(I39/RTD(\"cqg.rtd\",,\"StudyData\",A39, \"ATR\", \"MaType=Sim,Period=10\", \"ATR\",\"D\",\"-1\",\"ALL\",,,\"FALSE\",\"T\")/100,\"\")","v":-3.8374717832957111E-3},{"$f":"IF(C39=\"\",\"\",IFERROR(RTD(\"cqg.rtd\", ,\"ContractData\",A39, \"OPen\",, \"T\"),\"\"))","v":68.14},{"$f":"IF(C39=\"\",\"\",IFERROR(RTD(\"cqg.rtd\", ,\"ContractData\", A39, \"HIgh\",, \"T\"),\"\"))","v":68.350000000000009},{"$f":"IF(C39=\"\",\"\",IFERROR(RTD(\"cqg.rtd\", ,\"ContractData\",A39, \"LOw\",, \"T\"),\"\"))","v":67.349999999999994},{"$f":"IF(C39=\"\",\"\",IFERROR(RTD(\"cqg.rtd\", ,\"ContractData\",A39, \"T_CVol\",, \"T\"),\"\"))","v":1872363.601362},null,{"$f":" IFERROR(O39/RTD(\"cqg.rtd\",,\"StudyData\",A39, \"MA\", \"InputChoice=Vol,MAType=Sim,Period=21\", \"MA\",\"D\",\"-1\",\"all\",,,,\"T\"),\"\")","v":0.13376510405525427},{"$f":"IVE!AH6","v":"https://finance.yahoo.com/quote/FCX"}]
[{"$f":"TRIM(IVE!AC7)","v":"S.US.COP"},"News",{"$f":"IFERROR(PROPER(RTD(\"cqg.rtd\", ,\"ContractData\",A40, \"LongDescription\",, \"T\"))&\" (\"&RIGHT(A40,LEN(A40)-5)&\")\",\"\")","v":"Conocophillips (COP)"},null,null,null,null,{"$f":"IF(C40=\"\",\"\",IFERROR(RTD(\"cqg.rtd\", ,\"ContractData\",A40, \"LastTradeToday\",, \"T\"),\"\"))","v":125.47},{"$f":"IF(C40=\"\",\"\",IFERROR(RTD(\"cqg.rtd\", ,\"ContractData\",A40, \"NetLastTradeToday\",, \"T\"),\"\"))","v":-1.83},{"$f":"IFERROR(RTD(\"cqg.rtd\", ,\"ContractData\",A40, \"PerCentNetLastTrade\",, \"T\")/100,\"\")","v":-1.4375490966221524E-2},{"$f":"IFERROR(I40/RTD(\"cqg.rtd\",,\"StudyData\",A40, \"ATR\", \"MaType=Sim,Period=10\", \"ATR\",\"D\",\"-1\",\"ALL\",,,\"FALSE\",\"T\")/100,\"\")","v":-4.9339444594230257E-3},{"$f":"IF(C40=\"\",\"\",IFERROR(RTD(\"cqg.rtd\", ,\"ContractData\",A40, \"OPen\",, \"T\"),\"\"))","v":125.72},{"$f":"IF(C40=\"\",\"\",IFERROR(RTD(\"cqg.rtd\", ,\"ContractData\", A40, \"HIgh\",, \"T\"),\"\"))","v":126.39},{"$f":"IF(C40=\"\",\"\",IFERROR(RTD(\"cqg.rtd\", ,\"ContractData\",A40, \"LOw\",, \"T\"),\"\"))","v":124.52},{"$f":"IF(C40=\"\",\"\",IFERROR(RTD(\"cqg.rtd\", ,\"ContractData\",A40, \"T_CVol\",, \"T\"),\"\"))","v":844732.07677599997},null,{"$f":" IFERROR(O40/RTD(\"cqg.rtd\",,\"StudyData\",A40, \"MA\", \"InputChoice=Vol,MAType=Sim,Period=21\", \"MA\",\"D\",\"-1\",\"all\",,,,\"T\"),\"\")","v":0.13116347578489004},{"$f":"IVE!AH7","v":"https://finance.yahoo.com/quote/COP"}]
[{"$f":"TRIM(IVE!AC8)","v":"S.US.EMR"},"News",{"$f":"IFERROR(PROPER(RTD(\"cqg.rtd\", ,\"ContractData\",A41, \"LongDescription\",, \"T\"))&\" (\"&RIGHT(A41,LEN(A41)-5)&\")\",\"\")","v":"Emerson Electric Co (EMR)"},null,null,null,null,{"$f":"IF(C41=\"\",\"\",IFERROR(RTD(\"cqg.rtd\", ,\"ContractData\",A41, \"LastTradeToday\",, \"T\"),\"\"))","v":161.52000000000001},{"$f":"IF(C41=\"\",\"\",IFERROR(RTD(\"cqg.rtd\", ,\"ContractData\",A41, \"NetLastTradeToday\",, \"T\"),\"\"))","v":-2.2800000000000002},{"$f":"IFERROR(RTD(\"cqg.rtd\", ,\"ContractData\",A41, \"PerCentNetLastTrade\",, \"T\")/100,\"\")","v":-1.3919413919413919E-2},{"$f":"IFERROR(I41/RTD(\"cqg.rtd\",,\"StudyData\",A41, \"ATR\", \"MaType=Sim,Period=10\", \"ATR\",\"D\",\"-1\",\"ALL\",,,\"FALSE\",\"T\")/100,\"\")","v":-4.4168926772568777E-3},{"$f":"IF(C41=\"\",\"\",IFERROR(RTD(\"cqg.rtd\", ,\"ContractData\",A41, \"OPen\",, \"T\"),\"\"))","v":164.26},{"$f":"IF(C41=\"\",\"\",IFERROR(RTD(\"cqg.rtd\", ,\"ContractData\", A41, \"HIgh\",, \"T\"),\"\"))","v":164.26},{"$f":"IF(C41=\"\",\"\",IFERROR(RTD(\"cqg.rtd\", ,\"ContractData\",A41, \"LOw\",, \"T\"),\"\"))","v":160.64000000000001},{"$f":"IF(C41=\"\",\"\",IFERROR(RTD(\"cqg.rtd\", ,\"ContractData\",A41, \"T_CVol\",, \"T\"),\"\"))","v":372863.897589},null,{"$f":" IFERROR(O41/RTD(\"cqg.rtd\",,\"StudyData\",A41, \"MA\", \"InputChoice=Vol,MAType=Sim,Period=21\", \"MA\",\"D\",\"-1\",\"all\",,,,\"T\"),\"\")","v":0.11751788618962067},{"$f":"IVE!AH8","v":"https://finance.yahoo.com/quote/EMR"}]
[{"$f":"TRIM(IVE!AC9)","v":"S.US.SLB"},"News",{"$f":"IFERROR(PROPER(RTD(\"cqg.rtd\", ,\"ContractData\",A42, \"LongDescription\",, \"T\"))&\" (\"&RIGHT(A42,LEN(A42)-5)&\")\",\"\")","v":"Slb (SLB)"},null,null,null,null,{"$f":"IF(C42=\"\",\"\",IFERROR(RTD(\"cqg.rtd\", ,\"ContractData\",A42, \"LastTradeToday\",, \"T\"),\"\"))","v":51.89},{"$f":"IF(C42=\"\",\"\",IFERROR(RTD(\"cqg.rtd\", ,\"ContractData\",A42, \"NetLastTradeToday\",, \"T\"),\"\"))","v":-0.72},{"$f":"IFERROR(RTD(\"cqg.rtd\", ,\"ContractData\",A42, \"PerCentNetLastTrade\",, \"T\")/100,\"\")","v":-1.3685611100551227E-2},{"$f":"IFERROR(I42/RTD(\"cqg.rtd\",,\"StudyData\",A42, \"ATR\", \"MaType=Sim,Period=10\", \"ATR\",\"D\",\"-1\",\"ALL\",,,\"FALSE\",\"T\")/100,\"\")","v":-4.3425814234016894E-3},{"$f":"IF(C42=\"\",\"\",IFERROR(RTD(\"cqg.rtd\", ,\"ContractData\",A42, \"OPen\",, \"T\"),\"\"))","v":52},{"$f":"IF(C42=\"\",\"\",IFERROR(RTD(\"cqg.rtd\", ,\"ContractData\", A42, \"HIgh\",, \"T\"),\"\"))","v":52.4},{"$f":"IF(C42=\"\",\"\",IFERROR(RTD(\"cqg.rtd\", ,\"ContractData\",A42, \"LOw\",, \"T\"),\"\"))","v":51.6},{"$f":"IF(C42=\"\",\"\",IFERROR(RTD(\"cqg.rtd\", ,\"ContractData\",A42, \"T_CVol\",, \"T\"),\"\"))","v":1178064.963585},null,{"$f":" IFERROR(O42/RTD(\"cqg.rtd\",,\"StudyData\",A42, \"MA\", \"InputChoice=Vol,MAType=Sim,Period=21\", \"MA\",\"D\",\"-1\",\"all\",,,,\"T\"),\"\")","v":9.3791073404832725E-2},{"$f":"IVE!AH9","v":"https://finance.yahoo.com/quote/SLB"}]
[{"$f":"TRIM(IVE!AC10)","v":"S.US.OXY"},"News",{"$f":"IFERROR(PROPER(RTD(\"cqg.rtd\", ,\"ContractData\",A43, \"LongDescription\",, \"T\"))&\" (\"&RIGHT(A43,LEN(A43)-5)&\")\",\"\")","v":"Occidental Petroleum (OXY)"},null,null,null,null,{"$f":"IF(C43=\"\",\"\",IFERROR(RTD(\"cqg.rtd\", ,\"ContractData\",A43, \"LastTradeToday\",, \"T\"),\"\"))","v":57.76},{"$f":"IF(C43=\"\",\"\",IFERROR(RTD(\"cqg.rtd\", ,\"ContractData\",A43, \"NetLastTradeToday\",, \"T\"),\"\"))","v":-0.79},{"$f":"IFERROR(RTD(\"cqg.rtd\", ,\"ContractData\",A43, \"PerCentNetLastTrade\",, \"T\")/100,\"\")","v":-1.3492741246797607E-2},{"$f":"IFERROR(I43/RTD(\"cqg.rtd\",,\"StudyData\",A43, \"ATR\", \"MaType=Sim,Period=10\", \"ATR\",\"D\",\"-1\",\"ALL\",,,\"FALSE\",\"T\")/100,\"\")","v":-4.3051771117166215E-3},{"$f":"IF(C43=\"\",\"\",IFERROR(RTD(\"cqg.rtd\", ,\"ContractData\",A43, \"OPen\",, \"T\"),\"\"))","v":57.74},{"$f":"IF(C43=\"\",\"\",IFERROR(RTD(\"cqg.rtd\", ,\"ContractData\", A43, \"HIgh\",, \"T\"),\"\"))","v":57.99},{"$f":"IF(C43=\"\",\"\",IFERROR(RTD(\"cqg.rtd\", ,\"ContractData\",A43, \"LOw\",, \"T\"),\"\"))","v":57.17},{"$f":"IF(C43=\"\",\"\",IFERROR(RTD(\"cqg.rtd\", ,\"ContractData\",A43, \"T_CVol\",, \"T\"),\"\"))","v":1081101.5497409999},null,{"$f":" IFERROR(O43/RTD(\"cqg.rtd\",,\"StudyData\",A43, \"MA\", \"InputChoice=Vol,MAType=Sim,Period=21\", \"MA\",\"D\",\"-1\",\"all\",,,,\"T\"),\"\")","v":0.12797161819877184},{"$f":"IVE!AH10","v":"https://finance.yahoo.com/quote/OXY"}]
[{"$f":"TRIM(IVE!AC11)","v":"S.US.FANG"},"News",{"$f":"IFERROR(PROPER(RTD(\"cqg.rtd\", ,\"ContractData\",A44, \"LongDescription\",, \"T\"))&\" (\"&RIGHT(A44,LEN(A44)-5)&\")\",\"\")","v":"Diamondback Energy (FANG)"},null,null,null,null,{"$f":"IF(C44=\"\",\"\",IFERROR(RTD(\"cqg.rtd\", ,\"ContractData\",A44, \"LastTradeToday\",, \"T\"),\"\"))","v":198.18},{"$f":"IF(C44=\"\",\"\",IFERROR(RTD(\"cqg.rtd\", ,\"ContractData\",A44, \"NetLastTradeToday\",, \"T\"),\"\"))","v":-2.66},{"$f":"IFERROR(RTD(\"cqg.rtd\", ,\"ContractData\",A44, \"PerCentNetLastTrade\",, \"T\")/100,\"\")","v":-1.3244373630750848E-2},{"$f":"IFERROR(I44/RTD(\"cqg.rtd\",,\"StudyData\",A44, \"ATR\", \"MaType=Sim,Period=10\", \"ATR\",\"D\",\"-1\",\"ALL\",,,\"FALSE\",\"T\")/100,\"\")","v":-4.1163726400495204E-3},{"$f":"IF(C44=\"\",\"\",IFERROR(RTD(\"cqg.rtd\", ,\"ContractData\",A44, \"OPen\",, \"T\"),\"\"))","v":198.01},{"$f":"IF(C44=\"\",\"\",IFERROR(RTD(\"cqg.rtd\", ,\"ContractData\", A44, \"HIgh\",, \"T\"),\"\"))","v":199.52},{"$f":"IF(C44=\"\",\"\",IFERROR(RTD(\"cqg.rtd\", ,\"ContractData\",A44, \"LOw\",, \"T\"),\"\"))","v":196.66},{"$f":"IF(C44=\"\",\"\",IFERROR(RTD(\"cqg.rtd\", ,\"ContractData\",A44, \"T_CVol\",, \"T\"),\"\"))","v":161354.88923},null,{"$f":" IFERROR(O44/RTD(\"cqg.rtd\",,\"StudyData\",A44, \"MA\", \"InputChoice=Vol,MAType=Sim,Period=21\", \"MA\",\"D\",\"-1\",\"all\",,,,\"T\"),\"\")","v":8.6323108255106792E-2},{"$f":"IVE!AH11","v":"https://finance.yahoo.com/quote/FANG"}]
[{"$f":"TRIM(IVE!AC12)","v":"S.US.WST"},"News",{"$f":"IFERROR(PROPER(RTD(\"cqg.rtd\", ,\"ContractData\",A45, \"LongDescription\",, \"T\"))&\" (\"&RIGHT(A45,LEN(A45)-5)&\")\",\"\")","v":"West Pharmaceuticals Svcs Inc (WST)"},null,null,null,null,{"$f":"IF(C45=\"\",\"\",IFERROR(RTD(\"cqg.rtd\", ,\"ContractData\",A45, \"LastTradeToday\",, \"T\"),\"\"))","v":347.68},{"$f":"IF(C45=\"\",\"\",IFERROR(RTD(\"cqg.rtd\", ,\"ContractData\",A45, \"NetLastTradeToday\",, \"T\"),\"\"))","v":-4.6100000000000003},{"$f":"IFERROR(RTD(\"cqg.rtd\", ,\"ContractData\",A45, \"PerCentNetLastTrade\",, \"T\")/100,\"\")","v":-1.3085809986091004E-2},{"$f":"IFERROR(I45/RTD(\"cqg.rtd\",,\"StudyData\",A45, \"ATR\", \"MaType=Sim,Period=10\", \"ATR\",\"D\",\"-1\",\"ALL\",,,\"FALSE\",\"T\")/100,\"\")","v":-6.5520181921546339E-3},{"$f":"IF(C45=\"\",\"\",IFERROR(RTD(\"cqg.rtd\", ,\"ContractData\",A45, \"OPen\",, \"T\"),\"\"))","v":353.55},{"$f":"IF(C45=\"\",\"\",IFERROR(RTD(\"cqg.rtd\", ,\"ContractData\", A45, \"HIgh\",, \"T\"),\"\"))","v":353.55},{"$f":"IF(C45=\"\",\"\",IFERROR(RTD(\"cqg.rtd\", ,\"ContractData\",A45, \"LOw\",, \"T\"),\"\"))","v":346.40000000000003},{"$f":"IF(C45=\"\",\"\",IFERROR(RTD(\"cqg.rtd\", ,\"ContractData\",A45, \"T_CVol\",, \"T\"),\"\"))","v":33585.696154999998},null,{"$f":" IFERROR(O45/RTD(\"cqg.rtd\",,\"StudyData\",A45, \"MA\", \"InputChoice=Vol,MAType=Sim,Period=21\", \"MA\",\"D\",\"-1\",\"all\",,,,\"T\"),\"\")","v":4.318550650433859E-2},{"$f":"IVE!AH12","v":"https://finance.yahoo.com/quote/WST"}]
[{"$f":"TRIM(IVE!AC13)","v":"S.US.MCK"},"News",{"$f":"IFERROR(PROPER(RTD(\"cqg.rtd\", ,\"ContractData\",A46, \"LongDescription\",, \"T\"))&\" (\"&RIGHT(A46,LEN(A46)-5)&\")\",\"\")","v":"Mckesson Corporation (MCK)"},null,null,null,null,{"$f":"IF(C46=\"\",\"\",IFERROR(RTD(\"cqg.rtd\", ,\"ContractData\",A46, \"LastTradeToday\",, \"T\"),\"\"))","v":867.29},{"$f":"IF(C46=\"\",\"\",IFERROR(RTD(\"cqg.rtd\", ,\"ContractData\",A46, \"NetLastTradeToday\",, \"T\"),\"\"))","v":-11.44},{"$f":"IFERROR(RTD(\"cqg.rtd\", ,\"ContractData\",A46, \"PerCentNetLastTrade\",, \"T\")/100,\"\")","v":-1.3018788478827399E-2},{"$f":"IFERROR(I46/RTD(\"cqg.rtd\",,\"StudyData\",A46, \"ATR\", \"MaType=Sim,Period=10\", \"ATR\",\"D\",\"-1\",\"ALL\",,,\"FALSE\",\"T\")/100,\"\")","v":-3.3785180591240659E-3},{"$f":"IF(C46=\"\",\"\",IFERROR(RTD(\"cqg.rtd\", ,\"ContractData\",A46, \"OPen\",, \"T\"),\"\"))","v":873.09},{"$f":"IF(C46=\"\",\"\",IFERROR(RTD(\"cqg.rtd\", ,\"ContractData\", A46, \"HIgh\",, \"T\"),\"\"))","v":875.46},{"$f":"IF(C46=\"\",\"\",IFERROR(RTD(\"cqg.rtd\", ,\"ContractData\",A46, \"LOw\",, \"T\"),\"\"))","v":860.09},{"$f":"IF(C46=\"\",\"\",IFERROR(RTD(\"cqg.rtd\", ,\"ContractData\",A46, \"T_CVol\",, \"T\"),\"\"))","v":137986.068696},null,{"$f":" IFERROR(O46/RTD(\"cqg.rtd\",,\"StudyData\",A46, \"MA\", \"InputChoice=Vol,MAType=Sim,Period=21\", \"MA\",\"D\",\"-1\",\"all\",,,,\"T\"),\"\")","v":0.13475085593591396},{"$f":"IVE!AH13","v":"https://finance.yahoo.com/quote/MCK"}]
[{"$f":"TRIM(IVE!AC14)","v":"S.US.APA"},"News",{"$f":"IFERROR(PROPER(RTD(\"cqg.rtd\", ,\"ContractData\",A47, \"LongDescription\",, \"T\"))&\" (\"&RIGHT(A47,LEN(A47)-5)&\")\",\"\")","v":"Apa Corporation Cmn (APA)"},null,null,null,null,{"$f":"IF(C47=\"\",\"\",IFERROR(RTD(\"cqg.rtd\", ,\"ContractData\",A47, \"LastTradeToday\",, \"T\"),\"\"))","v":39.5},{"$f":"IF(C47=\"\",\"\",IFERROR(RTD(\"cqg.rtd\", ,\"ContractData\",A47, \"NetLastTradeToday\",, \"T\"),\"\"))","v":-0.47000000000000003},{"$f":"IFERROR(RTD(\"cqg.rtd\", ,\"ContractData\",A47, \"PerCentNetLastTrade\",, \"T\")/100,\"\")","v":-1.1758819114335753E-2},{"$f":"IFERROR(I47/RTD(\"cqg.rtd\",,\"StudyData\",A47, \"ATR\", \"MaType=Sim,Period=10\", \"ATR\",\"D\",\"-1\",\"ALL\",,,\"FALSE\",\"T\")/100,\"\")","v":-2.8711056811240076E-3},{"$f":"IF(C47=\"\",\"\",IFERROR(RTD(\"cqg.rtd\", ,\"ContractData\",A47, \"OPen\",, \"T\"),\"\"))","v":39.4},{"$f":"IF(C47=\"\",\"\",IFERROR(RTD(\"cqg.rtd\", ,\"ContractData\", A47, \"HIgh\",, \"T\"),\"\"))","v":39.78},{"$f":"IF(C47=\"\",\"\",IFERROR(RTD(\"cqg.rtd\", ,\"ContractData\",A47, \"LOw\",, \"T\"),\"\"))","v":39.08},{"$f":"IF(C47=\"\",\"\",IFERROR(RTD(\"cqg.rtd\", ,\"ContractData\",A47, \"T_CVol\",, \"T\"),\"\"))","v":552021.81808200001},null,{"$f":" IFERROR(O47/RTD(\"cqg.rtd\",,\"StudyData\",A47, \"MA\", \"InputChoice=Vol,MAType=Sim,Period=21\", \"MA\",\"D\",\"-1\",\"all\",,,,\"T\"),\"\")","v":9.7902503501250765E-2},{"$f":"IVE!AH14","v":"https://finance.yahoo.com/quote/APA"}]
[{"$f":"TRIM(IVE!AC15)","v":"S.US.HAL"},"News",{"$f":"IFERROR(PROPER(RTD(\"cqg.rtd\", ,\"ContractData\",A48, \"LongDescription\",, \"T\"))&\" (\"&RIGHT(A48,LEN(A48)-5)&\")\",\"\")","v":"Halliburton Company (HAL)"},null,null,null,null,{"$f":"IF(C48=\"\",\"\",IFERROR(RTD(\"cqg.rtd\", ,\"ContractData\",A48, \"LastTradeToday\",, \"T\"),\"\"))","v":32.93},{"$f":"IF(C48=\"\",\"\",IFERROR(RTD(\"cqg.rtd\", ,\"ContractData\",A48, \"NetLastTradeToday\",, \"T\"),\"\"))","v":-0.36},{"$f":"IFERROR(RTD(\"cqg.rtd\", ,\"ContractData\",A48, \"PerCentNetLastTrade\",, \"T\")/100,\"\")","v":-1.0814058275758487E-2},{"$f":"IFERROR(I48/RTD(\"cqg.rtd\",,\"StudyData\",A48, \"ATR\", \"MaType=Sim,Period=10\", \"ATR\",\"D\",\"-1\",\"ALL\",,,\"FALSE\",\"T\")/100,\"\")","v":-3.9779005524861874E-3},{"$f":"IF(C48=\"\",\"\",IFERROR(RTD(\"cqg.rtd\", ,\"ContractData\",A48, \"OPen\",, \"T\"),\"\"))","v":32.89},{"$f":"IF(C48=\"\",\"\",IFERROR(RTD(\"cqg.rtd\", ,\"ContractData\", A48, \"HIgh\",, \"T\"),\"\"))","v":33.24},{"$f":"IF(C48=\"\",\"\",IFERROR(RTD(\"cqg.rtd\", ,\"ContractData\",A48, \"LOw\",, \"T\"),\"\"))","v":32.68},{"$f":"IF(C48=\"\",\"\",IFERROR(RTD(\"cqg.rtd\", ,\"ContractData\",A48, \"T_CVol\",, \"T\"),\"\"))","v":1126129.4763720001},null,{"$f":" IFERROR(O48/RTD(\"cqg.rtd\",,\"StudyData\",A48, \"MA\", \"InputChoice=Vol,MAType=Sim,Period=21\", \"MA\",\"D\",\"-1\",\"all\",,,,\"T\"),\"\")","v":9.0855633306430109E-2},{"$f":"IVE!AH15","v":"https://finance.yahoo.com/quote/HAL"}]
[null,"Designed by Thom Hartle",null,null,null,"  From their website: \"The fund provides targeted exposure to the U.S large-cap value stocks.\"",null,null,null,null,null,null,null,null,null,null,null,null,null,null,null,null,null,null,null,{"$f":"Z52","v":"77% of the stocks in the ETF are higher today"}]
[]
[null,null,null,null,null,null,null,null,null,null,null,null,null,null,null,null,null,null,null,null,null,null,null,null,null,{"$f":"IVE!B449","v":0.77293577981651373},"of the stocks in the ETF are higher today"]
[null,null,null,null,null,null,null,null,null,null,null,null,null,null,null,null,null,null,null,null,null,null,null,null,null,{"$f":"TEXT(Display!Z51,\"0%\")&\" \"&Display!AA51","v":"77% of the stocks in the ETF are higher today"}]

{"sheet":"IVE","index":1,"n_rows":450,"n_cols":34,"rows_kept":450,"cut":false,"hidden":true,"merged":[]}
[{"$f":"IF(Symbols!A1=\"\",\"\",Symbols!A1)","v":"S.US.A"},{"$f":"IF(A1=\"\",\"\",IF(J1>0,1,0))","v":1},{"$f":"A1","v":"S.US.A"},{"$f":"IF(A1=\"\",\"\",RTD(\"cqg.rtd\", ,\"ContractData\",C1, \"LongDescription\",, \"T\"))","v":"Agilent Technologies"},null,{"$f":"(\"$J$\"&\"1\"&\":$J$\"&A449)","v":"$J$1:$J$436"},null,{"$f":"IF(A1=\"\",\"\",RTD(\"cqg.rtd\", ,\"ContractData\",C1, \"LastTradeToday\",, \"T\"))","v":149.19},{"$f":"IF(A1=\"\",\"\",RTD(\"cqg.rtd\", ,\"ContractData\",C1, \"NetLastTradeToday\",, \"T\"))","v":0.95000000000000007},{"$f":"IF(A1=\"\",\"\",IFERROR(RTD(\"cqg.rtd\", ,\"ContractData\",C1, \"PerCentNetLastTrade\",, \"T\")/100,\"\"))","v":6.4085267134376686E-3},{"$f":"IF(A1=\"\",\"\",RTD(\"cqg.rtd\", ,\"ContractData\", C1, \"T_CVol\",, \"T\"))","v":162979.654274},1,{"$f":"IFERROR(RANK($J1,INDIRECT((\"$J$\"&\"1\"&\":$J$\"&$A$449)))+COUNTIF($J$1:J1,J1)-1,\"\")","v":239},{"$f":"C1","v":"S.US.A"},{"$f":"IFERROR(VLOOKUP($L1,$M$1:$N$437,2,FALSE),\"\")","v":"S.US.SMCI"},{"$f":"IF(O1=\"\",\"\",RTD(\"cqg.rtd\", ,\"ContractData\",O1, \"LongDescription\",, \"T\"))","v":"Super Micro Computer"},{"$f":"IFERROR(RTD(\"cqg.rtd\", ,\"ContractData\",O1, \"PerCentNetLastTrade\",, \"T\")/100,\"\")","v":0.10608880616857219},{"$f":"IFERROR(\"https://finance.yahoo.com/quote/\"&RIGHT(O1,(LEN(O1)-5)),\"\")","v":"https://finance.yahoo.com/quote/SMCI"},null,{"$f":"IF(Q1>=0,Q1,NA())","v":0.10608880616857219},{"$f":"IFERROR(IF(Q1>=0,NA(),-1*Q1),\"\")","v":""},null,{"$f":"IF(Q1=\"\",\"\",IF(Q1<0,\"\",IFERROR(PROPER(RTD(\"cqg.rtd\", ,\"ContractData\",O1, \"LongDescription\",, \"T\")),\"\")))","v":"Super Micro Computer"},null,null,{"$f":"IF(W1=\"\",\"\",IFERROR(T1,Q1))","v":0.10608880616857219},{"$f":"MIN(J1:J350)","v":-6.9906360994510808E-2},{"$f":"IFERROR(VLOOKUP(AA1,J1:O437,4,FALSE),\"\")","v":436},{"$f":"IF(AB1=\"\",\"\",VLOOKUP($AB1,$M$1:$N$437,2,FALSE))","v":"S.US.CSCO"},{"$f":"IF(RTD(\"cqg.rtd\", ,\"ContractData\",AC1, \"PerCentNetLastTrade\",, \"T\")>0,\"\",IFERROR(RTD(\"cqg.rtd\", ,\"ContractData\",AC1, \"PerCentNetLastTrade\",, \"T\")/100,\"\"))","v":-6.9906360994510808E-2},{"$f":"IF(AD1>0,\"\",IFERROR(PROPER(RTD(\"cqg.rtd\", ,\"ContractData\",AC1, \"LongDescription\",, \"T\")),\"\"))","v":"Cisco Systems Inc."},{"$f":"\"\"","v":""},{"$f":"IF(AD1>0,\"\",IFERROR(AD1*-1,\"\"))","v":6.9906360994510808E-2},{"$f":"IFERROR(\"https://finance.yahoo.com/quote/\"&RIGHT(AC1,(LEN(AC1)-5)),\"\")","v":"https://finance.yahoo.com/quote/CSCO"}]
[{"$f":"IF(Symbols!A2=\"\",\"\",Symbols!A2)","v":"S.US.AAPL"},{"$f":"IF(A2=\"\",\"\",IF(J2>0,1,0))","v":1},{"$f":"A2","v":"S.US.AAPL"},{"$f":"IF(A2=\"\",\"\",RTD(\"cqg.rtd\", ,\"ContractData\",C2, \"LongDescription\",, \"T\"))","v":"APPLE INC."},null,null,null,{"$f":"IF(A2=\"\",\"\",RTD(\"cqg.rtd\", ,\"ContractData\",C2, \"LastTradeToday\",, \"T\"))","v":305.13},{"$f":"IF(A2=\"\",\"\",RTD(\"cqg.rtd\", ,\"ContractData\",C2, \"NetLastTradeToday\",, \"T\"))","v":2.85},{"$f":"IF(A2=\"\",\"\",IFERROR(RTD(\"cqg.rtd\", ,\"ContractData\",C2, \"PerCentNetLastTrade\",, \"T\")/100,\"\"))","v":9.4292803970223334E-3},{"$f":"IF(A2=\"\",\"\",RTD(\"cqg.rtd\", ,\"ContractData\", C2, \"T_CVol\",, \"T\"))","v":11020627.693934999},{"$f":"L1+1","v":2},{"$f":"IFERROR(RANK($J2,INDIRECT((\"$J$\"&\"1\"&\":$J$\"&$A$449)))+COUNTIF($J$1:J2,J2)-1,\"\")","v":177},{"$f":"C2","v":"S.US.AAPL"},{"$f":"IFERROR(VLOOKUP($L2,$M$1:$N$437,2,FALSE),\"\")","v":"S.US.WDC"},{"$f":"IF(O2=\"\",\"\",RTD(\"cqg.rtd\", ,\"ContractData\",O2, \"LongDescription\",, \"T\"))","v":"WESTERN DIGITAL CP"},{"$f":"IFERROR(RTD(\"cqg.rtd\", ,\"ContractData\",O2, \"PerCentNetLastTrade\",, \"T\")/100,\"\")","v":6.4170887469720328E-2},{"$f":"IFERROR(\"https://finance.yahoo.com/quote/\"&RIGHT(O2,(LEN(O2)-5)),\"\")","v":"https://finance.yahoo.com/quote/WDC"},null,{"$f":"IF(Q2>=0,Q2,NA())","v":6.4170887469720328E-2},{"$f":"IFERROR(IF(Q2>=0,NA(),-1*Q2),\"\")","v":""},null,{"$f":"IF(Q2=\"\",\"\",IF(Q2<0,\"\",IFERROR(PROPER(RTD(\"cqg.rtd\", ,\"ContractData\",O2, \"LongDescription\",, \"T\")),\"\")))","v":"Western Digital Cp"},null,null,{"$f":"IF(W2=\"\",\"\",IFERROR(T2,Q2))","v":6.4170887469720328E-2},null,{"$f":"IFERROR(AB1-1,\"\")","v":435},{"$f":"IF(AB2=\"\",\"\",VLOOKUP($AB2,$M$1:$N$437,2,FALSE))","v":"S.US.DVN"},{"$f":"IF(RTD(\"cqg.rtd\", ,\"ContractData\",AC2, \"PerCentNetLastTrade\",, \"T\")>0,\"\",IFERROR(RTD(\"cqg.rtd\", ,\"ContractData\",AC2, \"PerCentNetLastTrade\",, \"T\")/100,\"\"))","v":-1.850200624164066E-2},{"$f":"IF(AD2>0,\"\",IFERROR(PROPER(RTD(\"cqg.rtd\", ,\"ContractData\",AC2, \"LongDescription\",, \"T\")),\"\"))","v":"Devon Energy Corp"},{"$f":"\"\"","v":""},{"$f":"IF(AD2>0,\"\",IFERROR(AD2*-1,\"\"))","v":1.850200624164066E-2},{"$f":"IFERROR(\"https://finance.yahoo.com/quote/\"&RIGHT(AC2,(LEN(AC2)-5)),\"\")","v":"https://finance.yahoo.com/quote/DVN"}]
[{"$f":"IF(Symbols!A3=\"\",\"\",Symbols!A3)","v":"S.US.ABBV"},1,"S.US.ABBV",{"$f":"IF(A3=\"\",\"\",RTD(\"cqg.rtd\", ,\"ContractData\",C3, \"LongDescription\",, \"T\"))","v":"AbbVie Inc."},null,null,null,{"$f":"IF(A3=\"\",\"\",RTD(\"cqg.rtd\", ,\"ContractData\",C3, \"LastTradeToday\",, \"T\"))","v":253.09},{"$f":"IF(A3=\"\",\"\",RTD(\"cqg.rtd\", ,\"ContractData\",C3, \"NetLastTradeToday\",, \"T\"))","v":4.33},{"$f":"IF(A3=\"\",\"\",IFERROR(RTD(\"cqg.rtd\", ,\"ContractData\",C3, \"PerCentNetLastTrade\",, \"T\")/100,\"\"))","v":1.7406335423701558E-2},{"$f":"IF(A3=\"\",\"\",RTD(\"cqg.rtd\", ,\"ContractData\", C3, \"T_CVol\",, \"T\"))","v":827020.14880199998},{"$f":"L2+1","v":3},{"$f":"IFERROR(RANK($J3,INDIRECT((\"$J$\"&\"1\"&\":$J$\"&$A$449)))+COUNTIF($J$1:J3,J3)-1,\"\")","v":79},"S.US.ABBV","S.US.PSKY",{"$f":"IF(O3=\"\",\"\",RTD(\"cqg.rtd\", ,\"ContractData\",O3, \"LongDescription\",, \"T\"))","v":"PARAMOUNT SKYDN B"},{"$f":"IFERROR(RTD(\"cqg.rtd\", ,\"ContractData\",O3, \"PerCentNetLastTrade\",, \"T\")/100,\"\")","v":5.2631578947368425E-2},{"$f":"IFERROR(\"https://finance.yahoo.com/quote/\"&RIGHT(O3,(LEN(O3)-5)),\"\")","v":"https://finance.yahoo.com/quote/PSKY"},null,5.2631578947368425E-2,"",null,{"$f":"IF(Q3=\"\",\"\",IF(Q3<0,\"\",IFERROR(PROPER(RTD(\"cqg.rtd\", ,\"ContractData\",O3, \"LongDescription\",, \"T\")),\"\")))","v":"Paramount Skydn B"},null,null,5.2631578947368425E-2,null,{"$f":"IFERROR(AB2-1,\"\")","v":434},"S.US.EXE",{"$f":"IF(RTD(\"cqg.rtd\", ,\"ContractData\",AC3, \"PerCentNetLastTrade\",, \"T\")>0,\"\",IFERROR(RTD(\"cqg.rtd\", ,\"ContractData\",AC3, \"PerCentNetLastTrade\",, \"T\")/100,\"\"))","v":-1.7864561695056087E-2},{"$f":"IF(AD3>0,\"\",IFERROR(PROPER(RTD(\"cqg.rtd\", ,\"ContractData\",AC3, \"LongDescription\",, \"T\")),\"\"))","v":"Expand Energy Cor Cs"},{"$f":"\"\"","v":""},1.7864561695056087E-2,"https://finance.yahoo.com/quote/EXE"]
[{"$f":"IF(Symbols!A4=\"\",\"\",Symbols!A4)","v":"S.US.ABNB"},1,"S.US.ABNB",{"$f":"IF(A4=\"\",\"\",RTD(\"cqg.rtd\", ,\"ContractData\",C4, \"LongDescription\",, \"T\"))","v":"Airbnb, Inc. Class A"},null,null,null,{"$f":"IF(A4=\"\",\"\",RTD(\"cqg.rtd\", ,\"ContractData\",C4, \"LastTradeToday\",, \"T\"))","v":181.49},{"$f":"IF(A4=\"\",\"\",RTD(\"cqg.rtd\", ,\"ContractData\",C4, \"NetLastTradeToday\",, \"T\"))","v":1.4000000000000001},{"$f":"IF(A4=\"\",\"\",IFERROR(RTD(\"cqg.rtd\", ,\"ContractData\",C4, \"PerCentNetLastTrade\",, \"T\")/100,\"\"))","v":7.7738908323615975E-3},{"$f":"IF(A4=\"\",\"\",RTD(\"cqg.rtd\", ,\"ContractData\", C4, \"T_CVol\",, \"T\"))","v":788728.31401199999},4,{"$f":"IFERROR(RANK($J4,INDIRECT((\"$J$\"&\"1\"&\":$J$\"&$A$449)))+COUNTIF($J$1:J4,J4)-1,\"\")","v":214},"S.US.ABNB","S.US.HPE",{"$f":"IF(O4=\"\",\"\",RTD(\"cqg.rtd\", ,\"ContractData\",O4, \"LongDescription\",, \"T\"))","v":"Hewlett Packard Enterprise Company"},{"$f":"IFERROR(RTD(\"cqg.rtd\", ,\"ContractData\",O4, \"PerCentNetLastTrade\",, \"T\")/100,\"\")","v":5.0688892668821234E-2},"https://finance.yahoo.com/quote/HPE",null,5.0688892668821234E-2,"",null,{"$f":"IF(Q4=\"\",\"\",IF(Q4<0,\"\",IFERROR(PROPER(RTD(\"cqg.rtd\", ,\"ContractData\",O4, \"LongDescription\",, \"T\")),\"\")))","v":"Hewlett Packard Enterprise Company"},null,null,5.0688892668821234E-2,null,433,"S.US.BKR",{"$f":"IF(RTD(\"cqg.rtd\", ,\"ContractData\",AC4, \"PerCentNetLastTrade\",, \"T\")>0,\"\",IFERROR(RTD(\"cqg.rtd\", ,\"ContractData\",AC4, \"PerCentNetLastTrade\",, \"T\")/100,\"\"))","v":-1.7579340385812072E-2},{"$f":"IF(AD4>0,\"\",IFERROR(PROPER(RTD(\"cqg.rtd\", ,\"ContractData\",AC4, \"LongDescription\",, \"T\")),\"\"))","v":"Baker Hughes Co"},{"$f":"\"\"","v":""},1.7579340385812072E-2,"https://finance.yahoo.com/quote/BKR"]
[{"$f":"IF(Symbols!A5=\"\",\"\",Symbols!A5)","v":"S.US.ABT"},1,"S.US.ABT",{"$f":"IF(A5=\"\",\"\",RTD(\"cqg.rtd\", ,\"ContractData\",C5, \"LongDescription\",, \"T\"))","v":"Abbott Laboratories"},null,null,null,{"$f":"IF(A5=\"\",\"\",RTD(\"cqg.rtd\", ,\"ContractData\",C5, \"LastTradeToday\",, \"T\"))","v":112.22},{"$f":"IF(A5=\"\",\"\",RTD(\"cqg.rtd\", ,\"ContractData\",C5, \"NetLastTradeToday\",, \"T\"))","v":1.31},{"$f":"IF(A5=\"\",\"\",IFERROR(RTD(\"cqg.rtd\", ,\"ContractData\",C5, \"PerCentNetLastTrade\",, \"T\")/100,\"\"))","v":1.1811378595257415E-2},{"$f":"IF(A5=\"\",\"\",RTD(\"cqg.rtd\", ,\"ContractData\", C5, \"T_CVol\",, \"T\"))","v":1208221.626135},5,{"$f":"IFERROR(RANK($J5,INDIRECT((\"$J$\"&\"1\"&\":$J$\"&$A$449)))+COUNTIF($J$1:J5,J5)-1,\"\")","v":138},"S.US.ABT","S.US.MRVL",{"$f":"IF(O5=\"\",\"\",RTD(\"cqg.rtd\", ,\"ContractData\",O5, \"LongDescription\",, \"T\"))","v":"MARVELL TECH INC CMN"},{"$f":"IFERROR(RTD(\"cqg.rtd\", ,\"ContractData\",O5, \"PerCentNetLastTrade\",, \"T\")/100,\"\")","v":4.8922056384742951E-2},{"$f":"IFERROR(\"https://finance.yahoo.com/quote/\"&RIGHT(O5,(LEN(O5)-5)),\"\")","v":"https://finance.yahoo.com/quote/MRVL"},null,4.8922056384742951E-2,"",null,{"$f":"IF(Q5=\"\",\"\",IF(Q5<0,\"\",IFERROR(PROPER(RTD(\"cqg.rtd\", ,\"ContractData\",O5, \"LongDescription\",, \"T\")),\"\")))","v":"Marvell Tech Inc Cmn"},null,null,4.8922056384742951E-2,null,432,"S.US.CF",{"$f":"IF(RTD(\"cqg.rtd\", ,\"ContractData\",AC5, \"PerCentNetLastTrade\",, \"T\")>0,\"\",IFERROR(RTD(\"cqg.rtd\", ,\"ContractData\",AC5, \"PerCentNetLastTrade\",, \"T\")/100,\"\"))","v":-1.6165319556703608E-2},{"$f":"IF(AD5>0,\"\",IFERROR(PROPER(RTD(\"cqg.rtd\", ,\"ContractData\",AC5, \"LongDescription\",, \"T\")),\"\"))","v":"Cf Industries Holdings, Inc"},{"$f":"\"\"","v":""},1.6165319556703608E-2,"https://finance.yahoo.com/quote/CF"]
[{"$f":"IF(Symbols!A6=\"\",\"\",Symbols!A6)","v":"S.US.ACGL"},1,"S.US.ACGL",{"$f":"IF(A6=\"\",\"\",RTD(\"cqg.rtd\", ,\"ContractData\",C6, \"LongDescription\",, \"T\"))","v":"Arch Capital Grp Ltd"},null,null,null,{"$f":"IF(A6=\"\",\"\",RTD(\"cqg.rtd\", ,\"ContractData\",C6, \"LastTradeToday\",, \"T\"))","v":97.87},{"$f":"IF(A6=\"\",\"\",RTD(\"cqg.rtd\", ,\"ContractData\",C6, \"NetLastTradeToday\",, \"T\"))","v":0.57999999999999996},{"$f":"IF(A6=\"\",\"\",IFERROR(RTD(\"cqg.rtd\", ,\"ContractData\",C6, \"PerCentNetLastTrade\",, \"T\")/100,\"\"))","v":5.9615582279782097E-3},{"$f":"IF(A6=\"\",\"\",RTD(\"cqg.rtd\", ,\"ContractData\", C6, \"T_CVol\",, \"T\"))","v":130262.32609800001},6,{"$f":"IFERROR(RANK($J6,INDIRECT((\"$J$\"&\"1\"&\":$J$\"&$A$449)))+COUNTIF($J$1:J6,J6)-1,\"\")","v":252},"S.US.ACGL","S.US.INTC",{"$f":"IF(O6=\"\",\"\",RTD(\"cqg.rtd\", ,\"ContractData\",O6, \"LongDescription\",, \"T\"))","v":"INTEL CORP"},{"$f":"IFERROR(RTD(\"cqg.rtd\", ,\"ContractData\",O6, \"PerCentNetLastTrade\",, \"T\")/100,\"\")","v":4.4972758791480931E-2},{"$f":"IFERROR(\"https://finance.yahoo.com/quote/\"&RIGHT(O6,(LEN(O6)-5)),\"\")","v":"https://finance.yahoo.com/quote/INTC"},null,4.4972758791480931E-2,"",null,{"$f":"IF(Q6=\"\",\"\",IF(Q6<0,\"\",IFERROR(PROPER(RTD(\"cqg.rtd\", ,\"ContractData\",O6, \"LongDescription\",, \"T\")),\"\")))","v":"Intel Corp"},null,null,4.4972758791480931E-2,null,431,"S.US.FCX",{"$f":"IF(RTD(\"cqg.rtd\", ,\"ContractData\",AC6, \"PerCentNetLastTrade\",, \"T\")>0,\"\",IFERROR(RTD(\"cqg.rtd\", ,\"ContractData\",AC6, \"PerCentNetLastTrade\",, \"T\")/100,\"\"))","v":-1.4735625541750938E-2},{"$f":"IF(AD6>0,\"\",IFERROR(PROPER(RTD(\"cqg.rtd\", ,\"ContractData\",AC6, \"LongDescription\",, \"T\")),\"\"))","v":"Freeport-Mcmoran Inc."},{"$f":"\"\"","v":""},1.4735625541750938E-2,"https://finance.yahoo.com/quote/FCX"]
[{"$f":"IF(Symbols!A7=\"\",\"\",Symbols!A7)","v":"S.US.ACN"},1,"S.US.ACN",{"$f":"IF(A7=\"\",\"\",RTD(\"cqg.rtd\", ,\"ContractData\",C7, \"LongDescription\",, \"T\"))","v":"Accenture PLC Ireland"},null,null,null,{"$f":"IF(A7=\"\",\"\",RTD(\"cqg.rtd\", ,\"ContractData\",C7, \"LastTradeToday\",, \"T\"))","v":183.58},{"$f":"IF(A7=\"\",\"\",RTD(\"cqg.rtd\", ,\"ContractData\",C7, \"NetLastTradeToday\",, \"T\"))","v":3.44},{"$f":"IF(A7=\"\",\"\",IFERROR(RTD(\"cqg.rtd\", ,\"ContractData\",C7, \"PerCentNetLastTrade\",, \"T\")/100,\"\"))","v":1.9096258465637835E-2},{"$f":"IF(A7=\"\",\"\",RTD(\"cqg.rtd\", ,\"ContractData\", C7, \"T_CVol\",, \"T\"))","v":961645.14885600004},7,{"$f":"IFERROR(RANK($J7,INDIRECT((\"$J$\"&\"1\"&\":$J$\"&$A$449)))+COUNTIF($J$1:J7,J7)-1,\"\")","v":63},"S.US.ACN","S.US.KDP",{"$f":"IF(O7=\"\",\"\",RTD(\"cqg.rtd\", ,\"ContractData\",O7, \"LongDescription\",, \"T\"))","v":"KEURIG DR PEPPER INC"},{"$f":"IFERROR(RTD(\"cqg.rtd\", ,\"ContractData\",O7, \"PerCentNetLastTrade\",, \"T\")/100,\"\")","v":4.3978349120433018E-2},"https://finance.yahoo.com/quote/KDP",null,4.3978349120433018E-2,"",null,{"$f":"IF(Q7=\"\",\"\",IF(Q7<0,\"\",IFERROR(PROPER(RTD(\"cqg.rtd\", ,\"ContractData\",O7, \"LongDescription\",, \"T\")),\"\")))","v":"Keurig Dr Pepper Inc"},null,null,4.3978349120433018E-2,null,430,"S.US.COP",{"$f":"IF(RTD(\"cqg.rtd\", ,\"ContractData\",AC7, \"PerCentNetLastTrade\",, \"T\")>0,\"\",IFERROR(RTD(\"cqg.rtd\", ,\"ContractData\",AC7, \"PerCentNetLastTrade\",, \"T\")/100,\"\"))","v":-1.4375490966221524E-2},{"$f":"IF(AD7>0,\"\",IFERROR(PROPER(RTD(\"cqg.rtd\", ,\"ContractData\",AC7, \"LongDescription\",, \"T\")),\"\"))","v":"Conocophillips"},{"$f":"\"\"","v":""},1.4375490966221524E-2,"https://finance.yahoo.com/quote/COP"]
[{"$f":"IF(Symbols!A8=\"\",\"\",Symbols!A8)","v":"S.US.ADBE"},1,"S.US.ADBE",{"$f":"IF(A8=\"\",\"\",RTD(\"cqg.rtd\", ,\"ContractData\",C8, \"LongDescription\",, \"T\"))","v":"Adobe Inc."},null,null,null,{"$f":"IF(A8=\"\",\"\",RTD(\"cqg.rtd\", ,\"ContractData\",C8, \"LastTradeToday\",, \"T\"))","v":261.72000000000003},{"$f":"IF(A8=\"\",\"\",RTD(\"cqg.rtd\", ,\"ContractData\",C8, \"NetLastTradeToday\",, \"T\"))","v":2.97},{"$f":"IF(A8=\"\",\"\",IFERROR(RTD(\"cqg.rtd\", ,\"ContractData\",C8, \"PerCentNetLastTrade\",, \"T\")/100,\"\"))","v":1.1478260869565217E-2},{"$f":"IF(A8=\"\",\"\",RTD(\"cqg.rtd\", ,\"ContractData\", C8, \"T_CVol\",, \"T\"))","v":524141.64453300001},8,{"$f":"IFERROR(RANK($J8,INDIRECT((\"$J$\"&\"1\"&\":$J$\"&$A$449)))+COUNTIF($J$1:J8,J8)-1,\"\")","v":147},"S.US.ADBE","S.US.CSGP",{"$f":"IF(O8=\"\",\"\",RTD(\"cqg.rtd\", ,\"ContractData\",O8, \"LongDescription\",, \"T\"))","v":"COSTAR GROUP INC ##"},{"$f":"IFERROR(RTD(\"cqg.rtd\", ,\"ContractData\",O8, \"PerCentNetLastTrade\",, \"T\")/100,\"\")","v":3.9672131147540986E-2},"https://finance.yahoo.com/quote/CSGP",null,3.9672131147540986E-2,"",null,{"$f":"IF(Q8=\"\",\"\",IF(Q8<0,\"\",IFERROR(PROPER(RTD(\"cqg.rtd\", ,\"ContractData\",O8, \"LongDescription\",, \"T\")),\"\")))","v":"Costar Group Inc ##"},null,null,3.9672131147540986E-2,null,429,"S.US.EMR",{"$f":"IF(RTD(\"cqg.rtd\", ,\"ContractData\",AC8, \"PerCentNetLastTrade\",, \"T\")>0,\"\",IFERROR(RTD(\"cqg.rtd\", ,\"ContractData\",AC8, \"PerCentNetLastTrade\",, \"T\")/100,\"\"))","v":-1.3919413919413919E-2},{"$f":"IF(AD8>0,\"\",IFERROR(PROPER(RTD(\"cqg.rtd\", ,\"ContractData\",AC8, \"LongDescription\",, \"T\")),\"\"))","v":"Emerson Electric Co"},{"$f":"\"\"","v":""},1.3919413919413919E-2,"https://finance.yahoo.com/quote/EMR"]
[{"$f":"IF(Symbols!A9=\"\",\"\",Symbols!A9)","v":"S.US.ADI"},1,"S.US.ADI",{"$f":"IF(A9=\"\",\"\",RTD(\"cqg.rtd\", ,\"ContractData\",C9, \"LongDescription\",, \"T\"))","v":"Analog Devices Inc"},null,null,null,{"$f":"IF(A9=\"\",\"\",RTD(\"cqg.rtd\", ,\"ContractData\",C9, \"LastTradeToday\",, \"T\"))","v":387.45},{"$f":"IF(A9=\"\",\"\",RTD(\"cqg.rtd\", ,\"ContractData\",C9, \"NetLastTradeToday\",, \"T\"))","v":3.02},{"$f":"IF(A9=\"\",\"\",IFERROR(RTD(\"cqg.rtd\", ,\"ContractData\",C9, \"PerCentNetLastTrade\",, \"T\")/100,\"\"))","v":7.8557864890877408E-3},{"$f":"IF(A9=\"\",\"\",RTD(\"cqg.rtd\", ,\"ContractData\", C9, \"T_CVol\",, \"T\"))","v":289174.72181700001},9,{"$f":"IFERROR(RANK($J9,INDIRECT((\"$J$\"&\"1\"&\":$J$\"&$A$449)))+COUNTIF($J$1:J9,J9)-1,\"\")","v":211},"S.US.ADI","S.US.ALB",{"$f":"IF(O9=\"\",\"\",RTD(\"cqg.rtd\", ,\"ContractData\",O9, \"LongDescription\",, \"T\"))","v":"Albemarle Corporation"},{"$f":"IFERROR(RTD(\"cqg.rtd\", ,\"ContractData\",O9, \"PerCentNetLastTrade\",, \"T\")/100,\"\")","v":3.6621474209131998E-2},"https://finance.yahoo.com/quote/ALB",null,3.6621474209131998E-2,"",null,{"$f":"IF(Q9=\"\",\"\",IF(Q9<0,\"\",IFERROR(PROPER(RTD(\"cqg.rtd\", ,\"ContractData\",O9, \"LongDescription\",, \"T\")),\"\")))","v":"Albemarle Corporation"},null,null,3.6621474209131998E-2,null,428,"S.US.SLB",{"$f":"IF(RTD(\"cqg.rtd\", ,\"ContractData\",AC9, \"PerCentNetLastTrade\",, \"T\")>0,\"\",IFERROR(RTD(\"cqg.rtd\", ,\"ContractData\",AC9, \"PerCentNetLastTrade\",, \"T\")/100,\"\"))","v":-1.3685611100551227E-2},{"$f":"IF(AD9>0,\"\",IFERROR(PROPER(RTD(\"cqg.rtd\", ,\"ContractData\",AC9, \"LongDescription\",, \"T\")),\"\"))","v":"Slb"},{"$f":"\"\"","v":""},1.3685611100551227E-2,"https://finance.yahoo.com/quote/SLB"]
[{"$f":"IF(Symbols!A10=\"\",\"\",Symbols!A10)","v":"S.US.ADM"},1,"S.US.ADM",{"$f":"IF(A10=\"\",\"\",RTD(\"cqg.rtd\", ,\"ContractData\",C10, \"LongDescription\",, \"T\"))","v":"Archer-Daniels-Midland"},null,null,null,{"$f":"IF(A10=\"\",\"\",RTD(\"cqg.rtd\", ,\"ContractData\",C10, \"LastTradeToday\",, \"T\"))","v":80.320000000000007},{"$f":"IF(A10=\"\",\"\",RTD(\"cqg.rtd\", ,\"ContractData\",C10, \"NetLastTradeToday\",, \"T\"))","v":0.59},{"$f":"IF(A10=\"\",\"\",IFERROR(RTD(\"cqg.rtd\", ,\"ContractData\",C10, \"PerCentNetLastTrade\",, \"T\")/100,\"\"))","v":7.3999749153392698E-3},{"$f":"IF(A10=\"\",\"\",RTD(\"cqg.rtd\", ,\"ContractData\", C10, \"T_CVol\",, \"T\"))","v":338864.12999400002},10,{"$f":"IFERROR(RANK($J10,INDIRECT((\"$J$\"&\"1\"&\":$J$\"&$A$449)))+COUNTIF($J$1:J10,J10)-1,\"\")","v":222},"S.US.ADM","S.US.HPQ",{"$f":"IF(O10=\"\",\"\",RTD(\"cqg.rtd\", ,\"ContractData\",O10, \"LongDescription\",, \"T\"))","v":"Hewlett-Packard Company"},{"$f":"IFERROR(RTD(\"cqg.rtd\", ,\"ContractData\",O10, \"PerCentNetLastTrade\",, \"T\")/100,\"\")","v":3.5519125683060107E-2},{"$f":"IFERROR(\"https://finance.yahoo.com/quote/\"&RIGHT(O10,(LEN(O10)-5)),\"\")","v":"https://finance.yahoo.com/quote/HPQ"},null,3.5519125683060107E-2,"",null,{"$f":"IF(Q10=\"\",\"\",IF(Q10<0,\"\",IFERROR(PROPER(RTD(\"cqg.rtd\", ,\"ContractData\",O10, \"LongDescription\",, \"T\")),\"\")))","v":"Hewlett-Packard Company"},null,null,3.5519125683060107E-2,null,427,"S.US.OXY",{"$f":"IF(RTD(\"cqg.rtd\", ,\"ContractData\",AC10, \"PerCentNetLastTrade\",, \"T\")>0,\"\",IFERROR(RTD(\"cqg.rtd\", ,\"ContractData\",AC10, \"PerCentNetLastTrade\",, \"T\")/100,\"\"))","v":-1.3492741246797607E-2},{"$f":"IF(AD10>0,\"\",IFERROR(PROPER(RTD(\"cqg.rtd\", ,\"ContractData\",AC10, \"LongDescription\",, \"T\")),\"\"))","v":"Occidental Petroleum"},{"$f":"\"\"","v":""},1.3492741246797607E-2,"https://finance.yahoo.com/quote/OXY"]
[{"$f":"IF(Symbols!A11=\"\",\"\",Symbols!A11)","v":"S.US.ADP"},1,"S.US.ADP",{"$f":"IF(A11=\"\",\"\",RTD(\"cqg.rtd\", ,\"ContractData\",C11, \"LongDescription\",, \"T\"))","v":"AUTOMATIC DATA PROCS"},null,null,null,{"$f":"IF(A11=\"\",\"\",RTD(\"cqg.rtd\", ,\"ContractData\",C11, \"LastTradeToday\",, \"T\"))","v":271.41000000000003},{"$f":"IF(A11=\"\",\"\",RTD(\"cqg.rtd\", ,\"ContractData\",C11, \"NetLastTradeToday\",, \"T\"))","v":2.08},{"$f":"IF(A11=\"\",\"\",IFERROR(RTD(\"cqg.rtd\", ,\"ContractData\",C11, \"PerCentNetLastTrade\",, \"T\")/100,\"\"))","v":7.722867857275462E-3},{"$f":"IF(A11=\"\",\"\",RTD(\"cqg.rtd\", ,\"ContractData\", C11, \"T_CVol\",, \"T\"))","v":190896.262942},11,{"$f":"IFERROR(RANK($J11,INDIRECT((\"$J$\"&\"1\"&\":$J$\"&$A$449)))+COUNTIF($J$1:J11,J11)-1,\"\")","v":217},"S.US.ADP","S.US.AKAM",{"$f":"IF(O11=\"\",\"\",RTD(\"cqg.rtd\", ,\"ContractData\",O11, \"LongDescription\",, \"T\"))","v":"AKAMAI TECHNOLOGIES"},{"$f":"IFERROR(RTD(\"cqg.rtd\", ,\"ContractData\",O11, \"PerCentNetLastTrade\",, \"T\")/100,\"\")","v":3.437041863495683E-2},"https://finance.yahoo.com/quote/AKAM",null,3.437041863495683E-2,"",null,{"$f":"IF(Q11=\"\",\"\",IF(Q11<0,\"\",IFERROR(PROPER(RTD(\"cqg.rtd\", ,\"ContractData\",O11, \"LongDescription\",, \"T\")),\"\")))","v":"Akamai Technologies"},null,null,3.437041863495683E-2,null,426,"S.US.FANG",{"$f":"IF(RTD(\"cqg.rtd\", ,\"ContractData\",AC11, \"PerCentNetLastTrade\",, \"T\")>0,\"\",IFERROR(RTD(\"cqg.rtd\", ,\"ContractData\",AC11, \"PerCentNetLastTrade\",, \"T\")/100,\"\"))","v":-1.3244373630750848E-2},{"$f":"IF(AD11>0,\"\",IFERROR(PROPER(RTD(\"cqg.rtd\", ,\"ContractData\",AC11, \"LongDescription\",, \"T\")),\"\"))","v":"Diamondback Energy"},{"$f":"\"\"","v":""},1.3244373630750848E-2,"https://finance.yahoo.com/quote/FANG"]
[{"$f":"IF(Symbols!A12=\"\",\"\",Symbols!A12)","v":"S.US.ADSK"},0,"S.US.ADSK",{"$f":"IF(A12=\"\",\"\",RTD(\"cqg.rtd\", ,\"ContractData\",C12, \"LongDescription\",, \"T\"))","v":"Autodesk Inc"},null,null,null,{"$f":"IF(A12=\"\",\"\",RTD(\"cqg.rtd\", ,\"ContractData\",C12, \"LastTradeToday\",, \"T\"))","v":249.11},{"$f":"IF(A12=\"\",\"\",RTD(\"cqg.rtd\", ,\"ContractData\",C12, \"NetLastTradeToday\",, \"T\"))","v":-0.4},{"$f":"IF(A12=\"\",\"\",IFERROR(RTD(\"cqg.rtd\", ,\"ContractData\",C12, \"PerCentNetLastTrade\",, \"T\")/100,\"\"))","v":-1.6031421586309167E-3},{"$f":"IF(A12=\"\",\"\",RTD(\"cqg.rtd\", ,\"ContractData\", C12, \"T_CVol\",, \"T\"))","v":214305.70985300001},12,{"$f":"IFERROR(RANK($J12,INDIRECT((\"$J$\"&\"1\"&\":$J$\"&$A$449)))+COUNTIF($J$1:J12,J12)-1,\"\")","v":359},"S.US.ADSK","S.US.DELL",{"$f":"IF(O12=\"\",\"\",RTD(\"cqg.rtd\", ,\"ContractData\",O12, \"LongDescription\",, \"T\"))","v":"Dell Technologies Inc."},{"$f":"IFERROR(RTD(\"cqg.rtd\", ,\"ContractData\",O12, \"PerCentNetLastTrade\",, \"T\")/100,\"\")","v":3.4200206398348809E-2},"https://finance.yahoo.com/quote/DELL",null,3.4200206398348809E-2,"",null,{"$f":"IF(Q12=\"\",\"\",IF(Q12<0,\"\",IFERROR(PROPER(RTD(\"cqg.rtd\", ,\"ContractData\",O12, \"LongDescription\",, \"T\")),\"\")))","v":"Dell Technologies Inc."},null,null,3.4200206398348809E-2,null,425,"S.US.WST",{"$f":"IF(RTD(\"cqg.rtd\", ,\"ContractData\",AC12, \"PerCentNetLastTrade\",, \"T\")>0,\"\",IFERROR(RTD(\"cqg.rtd\", ,\"ContractData\",AC12, \"PerCentNetLastTrade\",, \"T\")/100,\"\"))","v":-1.3085809986091004E-2},{"$f":"IF(AD12>0,\"\",IFERROR(PROPER(RTD(\"cqg.rtd\", ,\"ContractData\",AC12, \"LongDescription\",, \"T\")),\"\"))","v":"West Pharmaceuticals Svcs Inc"},{"$f":"\"\"","v":""},1.3085809986091004E-2,"https://finance.yahoo.com/quote/WST"]
[{"$f":"IF(Symbols!A13=\"\",\"\",Symbols!A13)","v":"S.US.AEE"},1,"S.US.AEE",{"$f":"IF(A13=\"\",\"\",RTD(\"cqg.rtd\", ,\"ContractData\",C13, \"LongDescription\",, \"T\"))","v":"Ameren Corp"},null,null,null,{"$f":"IF(A13=\"\",\"\",RTD(\"cqg.rtd\", ,\"ContractData\",C13, \"LastTradeToday\",, \"T\"))","v":109.47},{"$f":"IF(A13=\"\",\"\",RTD(\"cqg.rtd\", ,\"ContractData\",C13, \"NetLastTradeToday\",, \"T\"))","v":0.65},{"$f":"IF(A13=\"\",\"\",IFERROR(RTD(\"cqg.rtd\", ,\"ContractData\",C13, \"PerCentNetLastTrade\",, \"T\")/100,\"\"))","v":5.9731666972982914E-3},{"$f":"IF(A13=\"\",\"\",RTD(\"cqg.rtd\", ,\"ContractData\", C13, \"T_CVol\",, \"T\"))","v":131402.90634799999},13,{"$f":"IFERROR(RANK($J13,INDIRECT((\"$J$\"&\"1\"&\":$J$\"&$A$449)))+COUNTIF($J$1:J13,J13)-1,\"\")","v":251},"S.US.AEE","S.US.BLDR",{"$f":"IF(O13=\"\",\"\",RTD(\"cqg.rtd\", ,\"ContractData\",O13, \"LongDescription\",, \"T\"))","v":"Builders FirstSource Inc"},{"$f":"IFERROR(RTD(\"cqg.rtd\", ,\"ContractData\",O13, \"PerCentNetLastTrade\",, \"T\")/100,\"\")","v":3.3835105648391109E-2},"https://finance.yahoo.com/quote/BLDR",null,3.3835105648391109E-2,"",null,{"$f":"IF(Q13=\"\",\"\",IF(Q13<0,\"\",IFERROR(PROPER(RTD(\"cqg.rtd\", ,\"ContractData\",O13, \"LongDescription\",, \"T\")),\"\")))","v":"Builders Firstsource Inc"},null,null,3.3835105648391109E-2,null,424,"S.US.MCK",{"$f":"IF(RTD(\"cqg.rtd\", ,\"ContractData\",AC13, \"PerCentNetLastTrade\",, \"T\")>0,\"\",IFERROR(RTD(\"cqg.rtd\", ,\"ContractData\",AC13, \"PerCentNetLastTrade\",, \"T\")/100,\"\"))","v":-1.3018788478827399E-2},{"$f":"IF(AD13>0,\"\",IFERROR(PROPER(RTD(\"cqg.rtd\", ,\"ContractData\",AC13, \"LongDescription\",, \"T\")),\"\"))","v":"Mckesson Corporation"},{"$f":"\"\"","v":""},1.3018788478827399E-2,"https://finance.yahoo.com/quote/MCK"]
[{"$f":"IF(Symbols!A14=\"\",\"\",Symbols!A14)","v":"S.US.AEP"},1,"S.US.AEP",{"$f":"IF(A14=\"\",\"\",RTD(\"cqg.rtd\", ,\"ContractData\",C14, \"LongDescription\",, \"T\"))","v":"AMER ELC PWR CO CMN"},null,null,null,{"$f":"IF(A14=\"\",\"\",RTD(\"cqg.rtd\", ,\"ContractData\",C14, \"LastTradeToday\",, \"T\"))","v":125.49000000000001},{"$f":"IF(A14=\"\",\"\",RTD(\"cqg.rtd\", ,\"ContractData\",C14, \"NetLastTradeToday\",, \"T\"))","v":0.84},{"$f":"IF(A14=\"\",\"\",IFERROR(RTD(\"cqg.rtd\", ,\"ContractData\",C14, \"PerCentNetLastTrade\",, \"T\")/100,\"\"))","v":6.7388688327316478E-3},{"$f":"IF(A14=\"\",\"\",RTD(\"cqg.rtd\", ,\"ContractData\", C14, \"T_CVol\",, \"T\"))","v":376970.55000799999},14,{"$f":"IFERROR(RANK($J14,INDIRECT((\"$J$\"&\"1\"&\":$J$\"&$A$449)))+COUNTIF($J$1:J14,J14)-1,\"\")","v":232},"S.US.AEP","S.US.EQR",{"$f":"IF(O14=\"\",\"\",RTD(\"cqg.rtd\", ,\"ContractData\",O14, \"LongDescription\",, \"T\"))","v":"Equity Residential Properties Trust"},{"$f":"IFERROR(RTD(\"cqg.rtd\", ,\"ContractData\",O14, \"PerCentNetLastTrade\",, \"T\")/100,\"\")","v":3.2598571872089414E-2},"https://finance.yahoo.com/quote/EQR",null,3.2598571872089414E-2,"",null,{"$f":"IF(Q14=\"\",\"\",IF(Q14<0,\"\",IFERROR(PROPER(RTD(\"cqg.rtd\", ,\"ContractData\",O14, \"LongDescription\",, \"T\")),\"\")))","v":"Equity Residential Properties Trust"},null,null,3.2598571872089414E-2,null,423,"S.US.APA",{"$f":"IF(RTD(\"cqg.rtd\", ,\"ContractData\",AC14, \"PerCentNetLastTrade\",, \"T\")>0,\"\",IFERROR(RTD(\"cqg.rtd\", ,\"ContractData\",AC14, \"PerCentNetLastTrade\",, \"T\")/100,\"\"))","v":-1.1758819114335753E-2},{"$f":"IF(AD14>0,\"\",IFERROR(PROPER(RTD(\"cqg.rtd\", ,\"ContractData\",AC14, \"LongDescription\",, \"T\")),\"\"))","v":"Apa Corporation Cmn"},{"$f":"\"\"","v":""},1.1758819114335753E-2,"https://finance.yahoo.com/quote/APA"]
[{"$f":"IF(Symbols!A15=\"\",\"\",Symbols!A15)","v":"S.US.AES"},0,"S.US.AES",{"$f":"IF(A15=\"\",\"\",RTD(\"cqg.rtd\", ,\"ContractData\",C15, \"LongDescription\",, \"T\"))","v":"AES Corp"},null,null,null,{"$f":"IF(A15=\"\",\"\",RTD(\"cqg.rtd\", ,\"ContractData\",C15, \"LastTradeToday\",, \"T\"))","v":14.71},{"$f":"IF(A15=\"\",\"\",RTD(\"cqg.rtd\", ,\"ContractData\",C15, \"NetLastTradeToday\",, \"T\"))","v":0},{"$f":"IF(A15=\"\",\"\",IFERROR(RTD(\"cqg.rtd\", ,\"ContractData\",C15, \"PerCentNetLastTrade\",, \"T\")/100,\"\"))","v":0},{"$f":"IF(A15=\"\",\"\",RTD(\"cqg.rtd\", ,\"ContractData\", C15, \"T_CVol\",, \"T\"))","v":445127.05817199999},15,{"$f":"IFERROR(RANK($J15,INDIRECT((\"$J$\"&\"1\"&\":$J$\"&$A$449)))+COUNTIF($J$1:J15,J15)-1,\"\")","v":337},"S.US.AES","S.US.AVB",{"$f":"IF(O15=\"\",\"\",RTD(\"cqg.rtd\", ,\"ContractData\",O15, \"LongDescription\",, \"T\"))","v":"AvalonBay Communities, Inc."},{"$f":"IFERROR(RTD(\"cqg.rtd\", ,\"ContractData\",O15, \"PerCentNetLastTrade\",, \"T\")/100,\"\")","v":3.2426720062294898E-2},"https://finance.yahoo.com/quote/AVB",null,3.2426720062294898E-2,"",null,{"$f":"IF(Q15=\"\",\"\",IF(Q15<0,\"\",IFERROR(PROPER(RTD(\"cqg.rtd\", ,\"ContractData\",O15, \"LongDescription\",, \"T\")),\"\")))","v":"Avalonbay Communities, Inc."},null,null,3.2426720062294898E-2,null,422,"S.US.HAL",{"$f":"IF(RTD(\"cqg.rtd\", ,\"ContractData\",AC15, \"PerCentNetLastTrade\",, \"T\")>0,\"\",IFERROR(RTD(\"cqg.rtd\", ,\"ContractData\",AC15, \"PerCentNetLastTrade\",, \"T\")/100,\"\"))","v":-1.0814058275758487E-2},{"$f":"IF(AD15>0,\"\",IFERROR(PROPER(RTD(\"cqg.rtd\", ,\"ContractData\",AC15, \"LongDescription\",, \"T\")),\"\"))","v":"Halliburton Company"},{"$f":"\"\"","v":""},1.0814058275758487E-2,"https://finance.yahoo.com/quote/HAL"]
[{"$f":"IF(Symbols!A16=\"\",\"\",Symbols!A16)","v":"S.US.AFL"},1,"S.US.AFL",{"$f":"IF(A16=\"\",\"\",RTD(\"cqg.rtd\", ,\"ContractData\",C16, \"LongDescription\",, \"T\"))","v":"AFLAC Inc"},null,null,null,{"$f":"IF(A16=\"\",\"\",RTD(\"cqg.rtd\", ,\"ContractData\",C16, \"LastTradeToday\",, \"T\"))","v":121.52},{"$f":"IF(A16=\"\",\"\",RTD(\"cqg.rtd\", ,\"ContractData\",C16, \"NetLastTradeToday\",, \"T\"))","v":0.79},{"$f":"IF(A16=\"\",\"\",IFERROR(RTD(\"cqg.rtd\", ,\"ContractData\",C16, \"PerCentNetLastTrade\",, \"T\")/100,\"\"))","v":6.5435268781578728E-3},{"$f":"IF(A16=\"\",\"\",RTD(\"cqg.rtd\", ,\"ContractData\", C16, \"T_CVol\",, \"T\"))","v":159561.111821},16,{"$f":"IFERROR(RANK($J16,INDIRECT((\"$J$\"&\"1\"&\":$J$\"&$A$449)))+COUNTIF($J$1:J16,J16)-1,\"\")","v":237},"S.US.AFL","S.US.KKR"]
[{"$f":"IF(Symbols!A17=\"\",\"\",Symbols!A17)","v":"S.US.AIG"},1,"S.US.AIG",{"$f":"IF(A17=\"\",\"\",RTD(\"cqg.rtd\", ,\"ContractData\",C17, \"LongDescription\",, \"T\"))","v":"American Intl Group Inc"},null,null,null,{"$f":"IF(A17=\"\",\"\",RTD(\"cqg.rtd\", ,\"ContractData\",C17, \"LastTradeToday\",, \"T\"))","v":76.64},{"$f":"IF(A17=\"\",\"\",RTD(\"cqg.rtd\", ,\"ContractData\",C17, \"NetLastTradeToday\",, \"T\"))","v":0.5},{"$f":"IF(A17=\"\",\"\",IFERROR(RTD(\"cqg.rtd\", ,\"ContractData\",C17, \"PerCentNetLastTrade\",, \"T\")/100,\"\"))","v":6.5668505384817444E-3},{"$f":"IF(A17=\"\",\"\",RTD(\"cqg.rtd\", ,\"ContractData\", C17, \"T_CVol\",, \"T\"))","v":132818.99284799999},17,{"$f":"IFERROR(RANK($J17,INDIRECT((\"$J$\"&\"1\"&\":$J$\"&$A$449)))+COUNTIF($J$1:J17,J17)-1,\"\")","v":235},"S.US.AIG","S.US.CHTR"]
[{"$f":"IF(Symbols!A18=\"\",\"\",Symbols!A18)","v":"S.US.AIZ"},1,"S.US.AIZ",{"$f":"IF(A18=\"\",\"\",RTD(\"cqg.rtd\", ,\"ContractData\",C18, \"LongDescription\",, \"T\"))","v":"Assurant Inc"},null,null,null,{"$f":"IF(A18=\"\",\"\",RTD(\"cqg.rtd\", ,\"ContractData\",C18, \"LastTradeToday\",, \"T\"))","v":283.83},{"$f":"IF(A18=\"\",\"\",RTD(\"cqg.rtd\", ,\"ContractData\",C18, \"NetLastTradeToday\",, \"T\"))","v":2.71},{"$f":"IF(A18=\"\",\"\",IFERROR(RTD(\"cqg.rtd\", ,\"ContractData\",C18, \"PerCentNetLastTrade\",, \"T\")/100,\"\"))","v":9.6400113830392726E-3},{"$f":"IF(A18=\"\",\"\",RTD(\"cqg.rtd\", ,\"ContractData\", C18, \"T_CVol\",, \"T\"))","v":26492.554443000001},18,{"$f":"IFERROR(RANK($J18,INDIRECT((\"$J$\"&\"1\"&\":$J$\"&$A$449)))+COUNTIF($J$1:J18,J18)-1,\"\")","v":172},"S.US.AIZ","S.US.FICO"]
[{"$f":"IF(Symbols!A19=\"\",\"\",Symbols!A19)","v":"S.US.AJG"},0,"S.US.AJG",{"$f":"IF(A19=\"\",\"\",RTD(\"cqg.rtd\", ,\"ContractData\",C19, \"LongDescription\",, \"T\"))","v":"Arthur J Gallagher Co"},null,null,null,{"$f":"IF(A19=\"\",\"\",RTD(\"cqg.rtd\", ,\"ContractData\",C19, \"LastTradeToday\",, \"T\"))","v":254.92000000000002},{"$f":"IF(A19=\"\",\"\",RTD(\"cqg.rtd\", ,\"ContractData\",C19, \"NetLastTradeToday\",, \"T\"))","v":-0.54},{"$f":"IF(A19=\"\",\"\",IFERROR(RTD(\"cqg.rtd\", ,\"ContractData\",C19, \"PerCentNetLastTrade\",, \"T\")/100,\"\"))","v":-2.1138338683159789E-3},{"$f":"IF(A19=\"\",\"\",RTD(\"cqg.rtd\", ,\"ContractData\", C19, \"T_CVol\",, \"T\"))","v":99038.364337000006},19,{"$f":"IFERROR(RANK($J19,INDIRECT((\"$J$\"&\"1\"&\":$J$\"&$A$449)))+COUNTIF($J$1:J19,J19)-1,\"\")","v":364},"S.US.AJG","S.US.FISV"]
[{"$f":"IF(Symbols!A20=\"\",\"\",Symbols!A20)","v":"S.US.AKAM"},1,"S.US.AKAM",{"$f":"IF(A20=\"\",\"\",RTD(\"cqg.rtd\", ,\"ContractData\",C20, \"LongDescription\",, \"T\"))","v":"AKAMAI TECHNOLOGIES"},null,null,null,{"$f":"IF(A20=\"\",\"\",RTD(\"cqg.rtd\", ,\"ContractData\",C20, \"LastTradeToday\",, \"T\"))","v":127},{"$f":"IF(A20=\"\",\"\",RTD(\"cqg.rtd\", ,\"ContractData\",C20, \"NetLastTradeToday\",, \"T\"))","v":4.22},{"$f":"IF(A20=\"\",\"\",IFERROR(RTD(\"cqg.rtd\", ,\"ContractData\",C20, \"PerCentNetLastTrade\",, \"T\")/100,\"\"))","v":3.437041863495683E-2},{"$f":"IF(A20=\"\",\"\",RTD(\"cqg.rtd\", ,\"ContractData\", C20, \"T_CVol\",, \"T\"))","v":494712.98794700002},20,{"$f":"IFERROR(RANK($J20,INDIRECT((\"$J$\"&\"1\"&\":$J$\"&$A$449)))+COUNTIF($J$1:J20,J20)-1,\"\")","v":11},"S.US.AKAM","S.US.INTU"]
[{"$f":"IF(Symbols!A21=\"\",\"\",Symbols!A21)","v":"S.US.ALB"},1,"S.US.ALB",{"$f":"IF(A21=\"\",\"\",RTD(\"cqg.rtd\", ,\"ContractData\",C21, \"LongDescription\",, \"T\"))","v":"Albemarle Corporation"},null,null,null,{"$f":"IF(A21=\"\",\"\",RTD(\"cqg.rtd\", ,\"ContractData\",C21, \"LastTradeToday\",, \"T\"))","v":133.04},{"$f":"IF(A21=\"\",\"\",RTD(\"cqg.rtd\", ,\"ContractData\",C21, \"NetLastTradeToday\",, \"T\"))","v":4.7},{"$f":"IF(A21=\"\",\"\",IFERROR(RTD(\"cqg.rtd\", ,\"ContractData\",C21, \"PerCentNetLastTrade\",, \"T\")/100,\"\"))","v":3.6621474209131998E-2},{"$f":"IF(A21=\"\",\"\",RTD(\"cqg.rtd\", ,\"ContractData\", C21, \"T_CVol\",, \"T\"))","v":392262.23316900001},21,{"$f":"IFERROR(RANK($J21,INDIRECT((\"$J$\"&\"1\"&\":$J$\"&$A$449)))+COUNTIF($J$1:J21,J21)-1,\"\")","v":9},"S.US.ALB","S.US.TTD"]
[{"$f":"IF(Symbols!A22=\"\",\"\",Symbols!A22)","v":"S.US.ALGN"},1,"S.US.ALGN",{"$f":"IF(A22=\"\",\"\",RTD(\"cqg.rtd\", ,\"ContractData\",C22, \"LongDescription\",, \"T\"))","v":"Align Technology Inc"},null,null,null,{"$f":"IF(A22=\"\",\"\",RTD(\"cqg.rtd\", ,\"ContractData\",C22, \"LastTradeToday\",, \"T\"))","v":175.76},{"$f":"IF(A22=\"\",\"\",RTD(\"cqg.rtd\", ,\"ContractData\",C22, \"NetLastTradeToday\",, \"T\"))","v":1.75},{"$f":"IF(A22=\"\",\"\",IFERROR(RTD(\"cqg.rtd\", ,\"ContractData\",C22, \"PerCentNetLastTrade\",, \"T\")/100,\"\"))","v":1.0056893281995287E-2},{"$f":"IF(A22=\"\",\"\",RTD(\"cqg.rtd\", ,\"ContractData\", C22, \"T_CVol\",, \"T\"))","v":46647.388089},22,{"$f":"IFERROR(RANK($J22,INDIRECT((\"$J$\"&\"1\"&\":$J$\"&$A$449)))+COUNTIF($J$1:J22,J22)-1,\"\")","v":162},"S.US.ALGN","S.US.MKC"]
[{"$f":"IF(Symbols!A23=\"\",\"\",Symbols!A23)","v":"S.US.ALL"},1,"S.US.ALL",{"$f":"IF(A23=\"\",\"\",RTD(\"cqg.rtd\", ,\"ContractData\",C23, \"LongDescription\",, \"T\"))","v":"Allstate Corporation"},null,null,null,{"$f":"IF(A23=\"\",\"\",RTD(\"cqg.rtd\", ,\"ContractData\",C23, \"LastTradeToday\",, \"T\"))","v":258.01},{"$f":"IF(A23=\"\",\"\",RTD(\"cqg.rtd\", ,\"ContractData\",C23, \"NetLastTradeToday\",, \"T\"))","v":2.17},{"$f":"IF(A23=\"\",\"\",IFERROR(RTD(\"cqg.rtd\", ,\"ContractData\",C23, \"PerCentNetLastTrade\",, \"T\")/100,\"\"))","v":8.4818636647904944E-3},{"$f":"IF(A23=\"\",\"\",RTD(\"cqg.rtd\", ,\"ContractData\", C23, \"T_CVol\",, \"T\"))","v":191666.14458200001},23,{"$f":"IFERROR(RANK($J23,INDIRECT((\"$J$\"&\"1\"&\":$J$\"&$A$449)))+COUNTIF($J$1:J23,J23)-1,\"\")","v":196},"S.US.ALL","S.US.ORCL"]
[{"$f":"IF(Symbols!A24=\"\",\"\",Symbols!A24)","v":"S.US.ALLE"},0,"S.US.ALLE",{"$f":"IF(A24=\"\",\"\",RTD(\"cqg.rtd\", ,\"ContractData\",C24, \"LongDescription\",, \"T\"))","v":"Allegion plc"},null,null,null,{"$f":"IF(A24=\"\",\"\",RTD(\"cqg.rtd\", ,\"ContractData\",C24, \"LastTradeToday\",, \"T\"))","v":164.77},{"$f":"IF(A24=\"\",\"\",RTD(\"cqg.rtd\", ,\"ContractData\",C24, \"NetLastTradeToday\",, \"T\"))","v":-1.34},{"$f":"IF(A24=\"\",\"\",IFERROR(RTD(\"cqg.rtd\", ,\"ContractData\",C24, \"PerCentNetLastTrade\",, \"T\")/100,\"\"))","v":-8.0669435915959303E-3},{"$f":"IF(A24=\"\",\"\",RTD(\"cqg.rtd\", ,\"ContractData\", C24, \"T_CVol\",, \"T\"))","v":80139.457039000001},24,{"$f":"IFERROR(RANK($J24,INDIRECT((\"$J$\"&\"1\"&\":$J$\"&$A$449)))+COUNTIF($J$1:J24,J24)-1,\"\")","v":406},"S.US.ALLE","S.US.KHC"]
[{"$f":"IF(Symbols!A25=\"\",\"\",Symbols!A25)","v":"S.US.AMCR"},0,"S.US.AMCR",{"$f":"IF(A25=\"\",\"\",RTD(\"cqg.rtd\", ,\"ContractData\",C25, \"LongDescription\",, \"T\"))","v":"Amcor PLC"},null,null,null,{"$f":"IF(A25=\"\",\"\",RTD(\"cqg.rtd\", ,\"ContractData\",C25, \"LastTradeToday\",, \"T\"))","v":46.08},{"$f":"IF(A25=\"\",\"\",RTD(\"cqg.rtd\", ,\"ContractData\",C25, \"NetLastTradeToday\",, \"T\"))","v":-0.48},{"$f":"IF(A25=\"\",\"\",IFERROR(RTD(\"cqg.rtd\", ,\"ContractData\",C25, \"PerCentNetLastTrade\",, \"T\")/100,\"\"))","v":-1.0309278350515462E-2},{"$f":"IF(A25=\"\",\"\",RTD(\"cqg.rtd\", ,\"ContractData\", C25, \"T_CVol\",, \"T\"))","v":565481.12152699998},25,{"$f":"IFERROR(RANK($J25,INDIRECT((\"$J$\"&\"1\"&\":$J$\"&$A$449)))+COUNTIF($J$1:J25,J25)-1,\"\")","v":418},"S.US.AMCR","S.US.GPN"]
[{"$f":"IF(Symbols!A26=\"\",\"\",Symbols!A26)","v":"S.US.AME"},0,"S.US.AME",{"$f":"IF(A26=\"\",\"\",RTD(\"cqg.rtd\", ,\"ContractData\",C26, \"LongDescription\",, \"T\"))","v":"Ametek Inc New"},null,null,null,{"$f":"IF(A26=\"\",\"\",RTD(\"cqg.rtd\", ,\"ContractData\",C26, \"LastTradeToday\",, \"T\"))","v":257.55},{"$f":"IF(A26=\"\",\"\",RTD(\"cqg.rtd\", ,\"ContractData\",C26, \"NetLastTradeToday\",, \"T\"))","v":-0.97},{"$f":"IF(A26=\"\",\"\",IFERROR(RTD(\"cqg.rtd\", ,\"ContractData\",C26, \"PerCentNetLastTrade\",, \"T\")/100,\"\"))","v":-3.7521274949713756E-3},{"$f":"IF(A26=\"\",\"\",RTD(\"cqg.rtd\", ,\"ContractData\", C26, \"T_CVol\",, \"T\"))","v":84201.324804999997},26,{"$f":"IFERROR(RANK($J26,INDIRECT((\"$J$\"&\"1\"&\":$J$\"&$A$449)))+COUNTIF($J$1:J26,J26)-1,\"\")","v":380},"S.US.AME","S.US.LEN"]
[{"$f":"IF(Symbols!A27=\"\",\"\",Symbols!A27)","v":"S.US.AMGN"},1,"S.US.AMGN",{"$f":"IF(A27=\"\",\"\",RTD(\"cqg.rtd\", ,\"ContractData\",C27, \"LongDescription\",, \"T\"))","v":"AMGEN"},null,null,null,{"$f":"IF(A27=\"\",\"\",RTD(\"cqg.rtd\", ,\"ContractData\",C27, \"LastTradeToday\",, \"T\"))","v":418.79},{"$f":"IF(A27=\"\",\"\",RTD(\"cqg.rtd\", ,\"ContractData\",C27, \"NetLastTradeToday\",, \"T\"))","v":2.61},{"$f":"IF(A27=\"\",\"\",IFERROR(RTD(\"cqg.rtd\", ,\"ContractData\",C27, \"PerCentNetLastTrade\",, \"T\")/100,\"\"))","v":6.2713249074919505E-3},{"$f":"IF(A27=\"\",\"\",RTD(\"cqg.rtd\", ,\"ContractData\", C27, \"T_CVol\",, \"T\"))","v":170536.983993},27,{"$f":"IFERROR(RANK($J27,INDIRECT((\"$J$\"&\"1\"&\":$J$\"&$A$449)))+COUNTIF($J$1:J27,J27)-1,\"\")","v":244},"S.US.AMGN","S.US.YUM"]
[{"$f":"IF(Symbols!A28=\"\",\"\",Symbols!A28)","v":"S.US.AMP"},1,"S.US.AMP",{"$f":"IF(A28=\"\",\"\",RTD(\"cqg.rtd\", ,\"ContractData\",C28, \"LongDescription\",, \"T\"))","v":"Ameriprise Financial Inc"},null,null,null,{"$f":"IF(A28=\"\",\"\",RTD(\"cqg.rtd\", ,\"ContractData\",C28, \"LastTradeToday\",, \"T\"))","v":566.71},{"$f":"IF(A28=\"\",\"\",RTD(\"cqg.rtd\", ,\"ContractData\",C28, \"NetLastTradeToday\",, \"T\"))","v":1.6400000000000001},{"$f":"IF(A28=\"\",\"\",IFERROR(RTD(\"cqg.rtd\", ,\"ContractData\",C28, \"PerCentNetLastTrade\",, \"T\")/100,\"\"))","v":2.9022952908489214E-3},{"$f":"IF(A28=\"\",\"\",RTD(\"cqg.rtd\", ,\"ContractData\", C28, \"T_CVol\",, \"T\"))","v":26510.613697000001},28,{"$f":"IFERROR(RANK($J28,INDIRECT((\"$J$\"&\"1\"&\":$J$\"&$A$449)))+COUNTIF($J$1:J28,J28)-1,\"\")","v":303},{"$f":"C28","v":"S.US.AMP"},"S.US.ARES"]
[{"$f":"IF(Symbols!A29=\"\",\"\",Symbols!A29)","v":"S.US.AMT"},1,"S.US.AMT",{"$f":"IF(A29=\"\",\"\",RTD(\"cqg.rtd\", ,\"ContractData\",C29, \"LongDescription\",, \"T\"))","v":"American Tower Corp ClA"},null,null,null,{"$f":"IF(A29=\"\",\"\",RTD(\"cqg.rtd\", ,\"ContractData\",C29, \"LastTradeToday\",, \"T\"))","v":173.64000000000001},{"$f":"IF(A29=\"\",\"\",RTD(\"cqg.rtd\", ,\"ContractData\",C29, \"NetLastTradeToday\",, \"T\"))","v":3.21},{"$f":"IF(A29=\"\",\"\",IFERROR(RTD(\"cqg.rtd\", ,\"ContractData\",C29, \"PerCentNetLastTrade\",, \"T\")/100,\"\"))","v":1.8834712198556591E-2},{"$f":"IF(A29=\"\",\"\",RTD(\"cqg.rtd\", ,\"ContractData\", C29, \"T_CVol\",, \"T\"))","v":212169.27002500001},29,{"$f":"IFERROR(RANK($J29,INDIRECT((\"$J$\"&\"1\"&\":$J$\"&$A$449)))+COUNTIF($J$1:J29,J29)-1,\"\")","v":64},"S.US.AMT","S.US.ESS"]
[{"$f":"IF(Symbols!A30=\"\",\"\",Symbols!A30)","v":"S.US.AMZN"},1,"S.US.AMZN",{"$f":"IF(A30=\"\",\"\",RTD(\"cqg.rtd\", ,\"ContractData\",C30, \"LongDescription\",, \"T\"))","v":"Amazon.com Inc"},null,null,null,{"$f":"IF(A30=\"\",\"\",RTD(\"cqg.rtd\", ,\"ContractData\",C30, \"LastTradeToday\",, \"T\"))","v":268},{"$f":"IF(A30=\"\",\"\",RTD(\"cqg.rtd\", ,\"ContractData\",C30, \"NetLastTradeToday\",, \"T\"))","v":0.72},{"$f":"IF(A30=\"\",\"\",IFERROR(RTD(\"cqg.rtd\", ,\"ContractData\",C30, \"PerCentNetLastTrade\",, \"T\")/100,\"\"))","v":2.6938042502244837E-3},{"$f":"IF(A30=\"\",\"\",RTD(\"cqg.rtd\", ,\"ContractData\", C30, \"T_CVol\",, \"T\"))","v":6906857.1620960003},30,{"$f":"IFERROR(RANK($J30,INDIRECT((\"$J$\"&\"1\"&\":$J$\"&$A$449)))+COUNTIF($J$1:J30,J30)-1,\"\")","v":306},"S.US.AMZN","S.US.XYZ"]
[{"$f":"IF(Symbols!A31=\"\",\"\",Symbols!A31)","v":"S.US.AON"},1,"S.US.AON",{"$f":"IF(A31=\"\",\"\",RTD(\"cqg.rtd\", ,\"ContractData\",C31, \"LongDescription\",, \"T\"))","v":"AON Corporation"},null,null,null,{"$f":"IF(A31=\"\",\"\",RTD(\"cqg.rtd\", ,\"ContractData\",C31, \"LastTradeToday\",, \"T\"))","v":354.69},{"$f":"IF(A31=\"\",\"\",RTD(\"cqg.rtd\", ,\"ContractData\",C31, \"NetLastTradeToday\",, \"T\"))","v":2.33},{"$f":"IF(A31=\"\",\"\",IFERROR(RTD(\"cqg.rtd\", ,\"ContractData\",C31, \"PerCentNetLastTrade\",, \"T\")/100,\"\"))","v":6.6125553411283912E-3},{"$f":"IF(A31=\"\",\"\",RTD(\"cqg.rtd\", ,\"ContractData\", C31, \"T_CVol\",, \"T\"))","v":45751.432377999998},31,{"$f":"IFERROR(RANK($J31,INDIRECT((\"$J$\"&\"1\"&\":$J$\"&$A$449)))+COUNTIF($J$1:J31,J31)-1,\"\")","v":234},"S.US.AON","S.US.CVNA"]
[{"$f":"IF(Symbols!A32=\"\",\"\",Symbols!A32)","v":"S.US.AOS"},1,"S.US.AOS",{"$f":"IF(A32=\"\",\"\",RTD(\"cqg.rtd\", ,\"ContractData\",C32, \"LongDescription\",, \"T\"))","v":"AO Smith Corp"},null,null,null,{"$f":"IF(A32=\"\",\"\",RTD(\"cqg.rtd\", ,\"ContractData\",C32, \"LastTradeToday\",, \"T\"))","v":62.74},{"$f":"IF(A32=\"\",\"\",RTD(\"cqg.rtd\", ,\"ContractData\",C32, \"NetLastTradeToday\",, \"T\"))","v":0.15},{"$f":"IF(A32=\"\",\"\",IFERROR(RTD(\"cqg.rtd\", ,\"ContractData\",C32, \"PerCentNetLastTrade\",, \"T\")/100,\"\"))","v":2.3965489694839433E-3},{"$f":"IF(A32=\"\",\"\",RTD(\"cqg.rtd\", ,\"ContractData\", C32, \"T_CVol\",, \"T\"))","v":75881.190791000001},32,{"$f":"IFERROR(RANK($J32,INDIRECT((\"$J$\"&\"1\"&\":$J$\"&$A$449)))+COUNTIF($J$1:J32,J32)-1,\"\")","v":307},"S.US.AOS","S.US.NTAP"]
[{"$f":"IF(Symbols!A33=\"\",\"\",Symbols!A33)","v":"S.US.APA"},0,"S.US.APA",{"$f":"IF(A33=\"\",\"\",RTD(\"cqg.rtd\", ,\"ContractData\",C33, \"LongDescription\",, \"T\"))","v":"APA CORPORATION CMN"},null,null,null,{"$f":"IF(A33=\"\",\"\",RTD(\"cqg.rtd\", ,\"ContractData\",C33, \"LastTradeToday\",, \"T\"))","v":39.5},{"$f":"IF(A33=\"\",\"\",RTD(\"cqg.rtd\", ,\"ContractData\",C33, \"NetLastTradeToday\",, \"T\"))","v":-0.47000000000000003},{"$f":"IF(A33=\"\",\"\",IFERROR(RTD(\"cqg.rtd\", ,\"ContractData\",C33, \"PerCentNetLastTrade\",, \"T\")/100,\"\"))","v":-1.1758819114335753E-2},{"$f":"IF(A33=\"\",\"\",RTD(\"cqg.rtd\", ,\"ContractData\", C33, \"T_CVol\",, \"T\"))","v":552021.81808200001},33,{"$f":"IFERROR(RANK($J33,INDIRECT((\"$J$\"&\"1\"&\":$J$\"&$A$449)))+COUNTIF($J$1:J33,J33)-1,\"\")","v":423},"S.US.APA","S.US.FOX"]
[{"$f":"IF(Symbols!A34=\"\",\"\",Symbols!A34)","v":"S.US.APD"},1,"S.US.APD",{"$f":"IF(A34=\"\",\"\",RTD(\"cqg.rtd\", ,\"ContractData\",C34, \"LongDescription\",, \"T\"))","v":"Air Products & Chems Inc"},null,null,null,{"$f":"IF(A34=\"\",\"\",RTD(\"cqg.rtd\", ,\"ContractData\",C34, \"LastTradeToday\",, \"T\"))","v":305.94},{"$f":"IF(A34=\"\",\"\",RTD(\"cqg.rtd\", ,\"ContractData\",C34, \"NetLastTradeToday\",, \"T\"))","v":1.87},{"$f":"IF(A34=\"\",\"\",IFERROR(RTD(\"cqg.rtd\", ,\"ContractData\",C34, \"PerCentNetLastTrade\",, \"T\")/100,\"\"))","v":6.1498996941493737E-3},{"$f":"IF(A34=\"\",\"\",RTD(\"cqg.rtd\", ,\"ContractData\", C34, \"T_CVol\",, \"T\"))","v":84265.771529999998},34,{"$f":"IFERROR(RANK($J34,INDIRECT((\"$J$\"&\"1\"&\":$J$\"&$A$449)))+COUNTIF($J$1:J34,J34)-1,\"\")","v":246},"S.US.APD","S.US.TMUS"]
[{"$f":"IF(Symbols!A35=\"\",\"\",Symbols!A35)","v":"S.US.APO"},1,"S.US.APO",{"$f":"IF(A35=\"\",\"\",RTD(\"cqg.rtd\", ,\"ContractData\",C35, \"LongDescription\",, \"T\"))","v":"Apollo Global Management, LLC"},null,null,null,{"$f":"IF(A35=\"\",\"\",RTD(\"cqg.rtd\", ,\"ContractData\",C35, \"LastTradeToday\",, \"T\"))","v":140.79},{"$f":"IF(A35=\"\",\"\",RTD(\"cqg.rtd\", ,\"ContractData\",C35, \"NetLastTradeToday\",, \"T\"))","v":2.1800000000000002},{"$f":"IF(A35=\"\",\"\",IFERROR(RTD(\"cqg.rtd\", ,\"ContractData\",C35, \"PerCentNetLastTrade\",, \"T\")/100,\"\"))","v":1.5727580982613086E-2},{"$f":"IF(A35=\"\",\"\",RTD(\"cqg.rtd\", ,\"ContractData\", C35, \"T_CVol\",, \"T\"))","v":223869.585093},35,{"$f":"IFERROR(RANK($J35,INDIRECT((\"$J$\"&\"1\"&\":$J$\"&$A$449)))+COUNTIF($J$1:J35,J35)-1,\"\")","v":87},"S.US.APO","S.US.CPT"]
[{"$f":"IF(Symbols!A36=\"\",\"\",Symbols!A36)","v":"S.US.APTV"},1,"S.US.APTV",{"$f":"IF(A36=\"\",\"\",RTD(\"cqg.rtd\", ,\"ContractData\",C36, \"LongDescription\",, \"T\"))","v":"Aptiv PLC"},null,null,null,{"$f":"IF(A36=\"\",\"\",RTD(\"cqg.rtd\", ,\"ContractData\",C36, \"LastTradeToday\",, \"T\"))","v":48.64},{"$f":"IF(A36=\"\",\"\",RTD(\"cqg.rtd\", ,\"ContractData\",C36, \"NetLastTradeToday\",, \"T\"))","v":0.16},{"$f":"IF(A36=\"\",\"\",IFERROR(RTD(\"cqg.rtd\", ,\"ContractData\",C36, \"PerCentNetLastTrade\",, \"T\")/100,\"\"))","v":3.3003300330033004E-3},{"$f":"IF(A36=\"\",\"\",RTD(\"cqg.rtd\", ,\"ContractData\", C36, \"T_CVol\",, \"T\"))","v":623500.97410600004},36,{"$f":"IFERROR(RANK($J36,INDIRECT((\"$J$\"&\"1\"&\":$J$\"&$A$449)))+COUNTIF($J$1:J36,J36)-1,\"\")","v":295},"S.US.APTV","S.US.DG"]
[{"$f":"IF(Symbols!A37=\"\",\"\",Symbols!A37)","v":"S.US.ARE"},1,"S.US.ARE",{"$f":"IF(A37=\"\",\"\",RTD(\"cqg.rtd\", ,\"ContractData\",C37, \"LongDescription\",, \"T\"))","v":"Alexandria Real Estate Equities Inc"},null,null,null,{"$f":"IF(A37=\"\",\"\",RTD(\"cqg.rtd\", ,\"ContractData\",C37, \"LastTradeToday\",, \"T\"))","v":48.74},{"$f":"IF(A37=\"\",\"\",RTD(\"cqg.rtd\", ,\"ContractData\",C37, \"NetLastTradeToday\",, \"T\"))","v":0.68},{"$f":"IF(A37=\"\",\"\",IFERROR(RTD(\"cqg.rtd\", ,\"ContractData\",C37, \"PerCentNetLastTrade\",, \"T\")/100,\"\"))","v":1.4148980441115273E-2},{"$f":"IF(A37=\"\",\"\",RTD(\"cqg.rtd\", ,\"ContractData\", C37, \"T_CVol\",, \"T\"))","v":200152.33738899999},37,{"$f":"IFERROR(RANK($J37,INDIRECT((\"$J$\"&\"1\"&\":$J$\"&$A$449)))+COUNTIF($J$1:J37,J37)-1,\"\")","v":101},"S.US.ARE","S.US.PM"]
[{"$f":"IF(Symbols!A38=\"\",\"\",Symbols!A38)","v":"S.US.ARES"},1,"S.US.ARES",{"$f":"IF(A38=\"\",\"\",RTD(\"cqg.rtd\", ,\"ContractData\",C38, \"LongDescription\",, \"T\"))","v":"Ares Management, L.P."},null,null,null,{"$f":"IF(A38=\"\",\"\",RTD(\"cqg.rtd\", ,\"ContractData\",C38, \"LastTradeToday\",, \"T\"))","v":146.17000000000002},{"$f":"IF(A38=\"\",\"\",RTD(\"cqg.rtd\", ,\"ContractData\",C38, \"NetLastTradeToday\",, \"T\"))","v":3.8200000000000003},{"$f":"IF(A38=\"\",\"\",IFERROR(RTD(\"cqg.rtd\", ,\"ContractData\",C38, \"PerCentNetLastTrade\",, \"T\")/100,\"\"))","v":2.6835265191429578E-2},{"$f":"IF(A38=\"\",\"\",RTD(\"cqg.rtd\", ,\"ContractData\", C38, \"T_CVol\",, \"T\"))","v":144766.57440099999},38,{"$f":"IFERROR(RANK($J38,INDIRECT((\"$J$\"&\"1\"&\":$J$\"&$A$449)))+COUNTIF($J$1:J38,J38)-1,\"\")","v":28},"S.US.ARES","S.US.FOXA"]
[{"$f":"IF(Symbols!A39=\"\",\"\",Symbols!A39)","v":"S.US.ATO"},1,"S.US.ATO",{"$f":"IF(A39=\"\",\"\",RTD(\"cqg.rtd\", ,\"ContractData\",C39, \"LongDescription\",, \"T\"))","v":"Atmos Energy Corp"},null,null,null,{"$f":"IF(A39=\"\",\"\",RTD(\"cqg.rtd\", ,\"ContractData\",C39, \"LastTradeToday\",, \"T\"))","v":170.78},{"$f":"IF(A39=\"\",\"\",RTD(\"cqg.rtd\", ,\"ContractData\",C39, \"NetLastTradeToday\",, \"T\"))","v":1.19},{"$f":"IF(A39=\"\",\"\",IFERROR(RTD(\"cqg.rtd\", ,\"ContractData\",C39, \"PerCentNetLastTrade\",, \"T\")/100,\"\"))","v":7.0169231676396014E-3},{"$f":"IF(A39=\"\",\"\",RTD(\"cqg.rtd\", ,\"ContractData\", C39, \"T_CVol\",, \"T\"))","v":87183.712463000003},39,{"$f":"IFERROR(RANK($J39,INDIRECT((\"$J$\"&\"1\"&\":$J$\"&$A$449)))+COUNTIF($J$1:J39,J39)-1,\"\")","v":228},"S.US.ATO","S.US.FIS"]
[{"$f":"IF(Symbols!A40=\"\",\"\",Symbols!A40)","v":"S.US.AVB"},1,"S.US.AVB",{"$f":"IF(A40=\"\",\"\",RTD(\"cqg.rtd\", ,\"ContractData\",C40, \"LongDescription\",, \"T\"))","v":"AvalonBay Communities, Inc."},null,null,null,{"$f":"IF(A40=\"\",\"\",RTD(\"cqg.rtd\", ,\"ContractData\",C40, \"LastTradeToday\",, \"T\"))","v":185.62},{"$f":"IF(A40=\"\",\"\",RTD(\"cqg.rtd\", ,\"ContractData\",C40, \"NetLastTradeToday\",, \"T\"))","v":5.83},{"$f":"IF(A40=\"\",\"\",IFERROR(RTD(\"cqg.rtd\", ,\"ContractData\",C40, \"PerCentNetLastTrade\",, \"T\")/100,\"\"))","v":3.2426720062294898E-2},{"$f":"IF(A40=\"\",\"\",RTD(\"cqg.rtd\", ,\"ContractData\", C40, \"T_CVol\",, \"T\"))","v":249062.804153},40,{"$f":"IFERROR(RANK($J40,INDIRECT((\"$J$\"&\"1\"&\":$J$\"&$A$449)))+COUNTIF($J$1:J40,J40)-1,\"\")","v":15},"S.US.AVB","S.US.PANW"]
[{"$f":"IF(Symbols!A41=\"\",\"\",Symbols!A41)","v":"S.US.AVY"},0,"S.US.AVY",{"$f":"IF(A41=\"\",\"\",RTD(\"cqg.rtd\", ,\"ContractData\",C41, \"LongDescription\",, \"T\"))","v":"Avery Dennison Corp"},null,null,null,{"$f":"IF(A41=\"\",\"\",RTD(\"cqg.rtd\", ,\"ContractData\",C41, \"LastTradeToday\",, \"T\"))","v":180.35},{"$f":"IF(A41=\"\",\"\",RTD(\"cqg.rtd\", ,\"ContractData\",C41, \"NetLastTradeToday\",, \"T\"))","v":-0.68},{"$f":"IF(A41=\"\",\"\",IFERROR(RTD(\"cqg.rtd\", ,\"ContractData\",C41, \"PerCentNetLastTrade\",, \"T\")/100,\"\"))","v":-3.7562834889244877E-3},{"$f":"IF(A41=\"\",\"\",RTD(\"cqg.rtd\", ,\"ContractData\", C41, \"T_CVol\",, \"T\"))","v":78002.782277999999},41,{"$f":"IFERROR(RANK($J41,INDIRECT((\"$J$\"&\"1\"&\":$J$\"&$A$449)))+COUNTIF($J$1:J41,J41)-1,\"\")","v":381},"S.US.AVY","S.US.MAA"]
[{"$f":"IF(Symbols!A42=\"\",\"\",Symbols!A42)","v":"S.US.AWK"},1,"S.US.AWK",{"$f":"IF(A42=\"\",\"\",RTD(\"cqg.rtd\", ,\"ContractData\",C42, \"LongDescription\",, \"T\"))","v":"American Water Works"},null,null,null,{"$f":"IF(A42=\"\",\"\",RTD(\"cqg.rtd\", ,\"ContractData\",C42, \"LastTradeToday\",, \"T\"))","v":136.61000000000001},{"$f":"IF(A42=\"\",\"\",RTD(\"cqg.rtd\", ,\"ContractData\",C42, \"NetLastTradeToday\",, \"T\"))","v":1.69},{"$f":"IF(A42=\"\",\"\",IFERROR(RTD(\"cqg.rtd\", ,\"ContractData\",C42, \"PerCentNetLastTrade\",, \"T\")/100,\"\"))","v":1.2525941298547288E-2},{"$f":"IF(A42=\"\",\"\",RTD(\"cqg.rtd\", ,\"ContractData\", C42, \"T_CVol\",, \"T\"))","v":229616.830162},42,{"$f":"IFERROR(RANK($J42,INDIRECT((\"$J$\"&\"1\"&\":$J$\"&$A$449)))+COUNTIF($J$1:J42,J42)-1,\"\")","v":123},"S.US.AWK","S.US.FDXF"]
[{"$f":"IF(Symbols!A43=\"\",\"\",Symbols!A43)","v":"S.US.AXON"},1,"S.US.AXON",{"$f":"IF(A43=\"\",\"\",RTD(\"cqg.rtd\", ,\"ContractData\",C43, \"LongDescription\",, \"T\"))","v":"AXON ENTERPRISE, INC"},null,null,null,{"$f":"IF(A43=\"\",\"\",RTD(\"cqg.rtd\", ,\"ContractData\",C43, \"LastTradeToday\",, \"T\"))","v":610.97},{"$f":"IF(A43=\"\",\"\",RTD(\"cqg.rtd\", ,\"ContractData\",C43, \"NetLastTradeToday\",, \"T\"))","v":11.19},{"$f":"IF(A43=\"\",\"\",IFERROR(RTD(\"cqg.rtd\", ,\"ContractData\",C43, \"PerCentNetLastTrade\",, \"T\")/100,\"\"))","v":1.8656840841641934E-2},{"$f":"IF(A43=\"\",\"\",RTD(\"cqg.rtd\", ,\"ContractData\", C43, \"T_CVol\",, \"T\"))","v":136074.32074600001},43,{"$f":"IFERROR(RANK($J43,INDIRECT((\"$J$\"&\"1\"&\":$J$\"&$A$449)))+COUNTIF($J$1:J43,J43)-1,\"\")","v":68},"S.US.AXON","S.US.MO"]
[{"$f":"IF(Symbols!A44=\"\",\"\",Symbols!A44)","v":"S.US.AXP"},0,"S.US.AXP",{"$f":"IF(A44=\"\",\"\",RTD(\"cqg.rtd\", ,\"ContractData\",C44, \"LongDescription\",, \"T\"))","v":"American Express Co"},null,null,null,{"$f":"IF(A44=\"\",\"\",RTD(\"cqg.rtd\", ,\"ContractData\",C44, \"LastTradeToday\",, \"T\"))","v":343.56},{"$f":"IF(A44=\"\",\"\",RTD(\"cqg.rtd\", ,\"ContractData\",C44, \"NetLastTradeToday\",, \"T\"))","v":-0.52},{"$f":"IF(A44=\"\",\"\",IFERROR(RTD(\"cqg.rtd\", ,\"ContractData\",C44, \"PerCentNetLastTrade\",, \"T\")/100,\"\"))","v":-1.5112764473378284E-3},{"$f":"IF(A44=\"\",\"\",RTD(\"cqg.rtd\", ,\"ContractData\", C44, \"T_CVol\",, \"T\"))","v":217445.52428899999},44,{"$f":"IFERROR(RANK($J44,INDIRECT((\"$J$\"&\"1\"&\":$J$\"&$A$449)))+COUNTIF($J$1:J44,J44)-1,\"\")","v":358},"S.US.AXP","S.US.DAL"]
[{"$f":"IF(Symbols!A45=\"\",\"\",Symbols!A45)","v":"S.US.AZO"},1,"S.US.AZO",{"$f":"IF(A45=\"\",\"\",RTD(\"cqg.rtd\", ,\"ContractData\",C45, \"LongDescription\",, \"T\"))","v":"Autozone Inc"},null,null,null,{"$f":"IF(A45=\"\",\"\",RTD(\"cqg.rtd\", ,\"ContractData\",C45, \"LastTradeToday\",, \"T\"))","v":3082.28},{"$f":"IF(A45=\"\",\"\",RTD(\"cqg.rtd\", ,\"ContractData\",C45, \"NetLastTradeToday\",, \"T\"))","v":36.410000000000004},{"$f":"IF(A45=\"\",\"\",IFERROR(RTD(\"cqg.rtd\", ,\"ContractData\",C45, \"PerCentNetLastTrade\",, \"T\")/100,\"\"))","v":1.1953891663137296E-2},{"$f":"IF(A45=\"\",\"\",RTD(\"cqg.rtd\", ,\"ContractData\", C45, \"T_CVol\",, \"T\"))","v":33237.538478000002},45,{"$f":"IFERROR(RANK($J45,INDIRECT((\"$J$\"&\"1\"&\":$J$\"&$A$449)))+COUNTIF($J$1:J45,J45)-1,\"\")","v":135},"S.US.AZO","S.US.NCLH"]
[{"$f":"IF(Symbols!A46=\"\",\"\",Symbols!A46)","v":"S.US.BA"},0,"S.US.BA",{"$f":"IF(A46=\"\",\"\",RTD(\"cqg.rtd\", ,\"ContractData\",C46, \"LongDescription\",, \"T\"))","v":"Boeing Company"},null,null,null,{"$f":"IF(A46=\"\",\"\",RTD(\"cqg.rtd\", ,\"ContractData\",C46, \"LastTradeToday\",, \"T\"))","v":231.19},{"$f":"IF(A46=\"\",\"\",RTD(\"cqg.rtd\", ,\"ContractData\",C46, \"NetLastTradeToday\",, \"T\"))","v":-0.01},{"$f":"IF(A46=\"\",\"\",IFERROR(RTD(\"cqg.rtd\", ,\"ContractData\",C46, \"PerCentNetLastTrade\",, \"T\")/100,\"\"))","v":-4.3252595155709348E-5},{"$f":"IF(A46=\"\",\"\",RTD(\"cqg.rtd\", ,\"ContractData\", C46, \"T_CVol\",, \"T\"))","v":371599.67947999999},46,{"$f":"IFERROR(RANK($J46,INDIRECT((\"$J$\"&\"1\"&\":$J$\"&$A$449)))+COUNTIF($J$1:J46,J46)-1,\"\")","v":338},"S.US.BA","S.US.GIS"]
[{"$f":"IF(Symbols!A47=\"\",\"\",Symbols!A47)","v":"S.US.BAC"},1,"S.US.BAC",{"$f":"IF(A47=\"\",\"\",RTD(\"cqg.rtd\", ,\"ContractData\",C47, \"LongDescription\",, \"T\"))","v":"Bank of America Corp"},null,null,null,{"$f":"IF(A47=\"\",\"\",RTD(\"cqg.rtd\", ,\"ContractData\",C47, \"LastTradeToday\",, \"T\"))","v":64.92},{"$f":"IF(A47=\"\",\"\",RTD(\"cqg.rtd\", ,\"ContractData\",C47, \"NetLastTradeToday\",, \"T\"))","v":0.11},{"$f":"IF(A47=\"\",\"\",IFERROR(RTD(\"cqg.rtd\", ,\"ContractData\",C47, \"PerCentNetLastTrade\",, \"T\")/100,\"\"))","v":1.6972689399783983E-3},{"$f":"IF(A47=\"\",\"\",RTD(\"cqg.rtd\", ,\"ContractData\", C47, \"T_CVol\",, \"T\"))","v":5575814.8315650001},47,{"$f":"IFERROR(RANK($J47,INDIRECT((\"$J$\"&\"1\"&\":$J$\"&$A$449)))+COUNTIF($J$1:J47,J47)-1,\"\")","v":316},"S.US.BAC","S.US.DLTR"]
[{"$f":"IF(Symbols!A48=\"\",\"\",Symbols!A48)","v":"S.US.BALL"},1,"S.US.BALL",{"$f":"IF(A48=\"\",\"\",RTD(\"cqg.rtd\", ,\"ContractData\",C48, \"LongDescription\",, \"T\"))","v":"Ball Corp"},null,null,null,{"$f":"IF(A48=\"\",\"\",RTD(\"cqg.rtd\", ,\"ContractData\",C48, \"LastTradeToday\",, \"T\"))","v":62.2},{"$f":"IF(A48=\"\",\"\",RTD(\"cqg.rtd\", ,\"ContractData\",C48, \"NetLastTradeToday\",, \"T\"))","v":0.06},{"$f":"IF(A48=\"\",\"\",IFERROR(RTD(\"cqg.rtd\", ,\"ContractData\",C48, \"PerCentNetLastTrade\",, \"T\")/100,\"\"))","v":9.6556163501770192E-4},{"$f":"IF(A48=\"\",\"\",RTD(\"cqg.rtd\", ,\"ContractData\", C48, \"T_CVol\",, \"T\"))","v":137736.355625},48,{"$f":"IFERROR(RANK($J48,INDIRECT((\"$J$\"&\"1\"&\":$J$\"&$A$449)))+COUNTIF($J$1:J48,J48)-1,\"\")","v":323},"S.US.BALL","S.US.UDR"]
[{"$f":"IF(Symbols!A49=\"\",\"\",Symbols!A49)","v":"S.US.BAX"},1,"S.US.BAX",{"$f":"IF(A49=\"\",\"\",RTD(\"cqg.rtd\", ,\"ContractData\",C49, \"LongDescription\",, \"T\"))","v":"Baxter International Inc"},null,null,null,{"$f":"IF(A49=\"\",\"\",RTD(\"cqg.rtd\", ,\"ContractData\",C49, \"LastTradeToday\",, \"T\"))","v":27.330000000000002},{"$f":"IF(A49=\"\",\"\",RTD(\"cqg.rtd\", ,\"ContractData\",C49, \"NetLastTradeToday\",, \"T\"))","v":0.38},{"$f":"IF(A49=\"\",\"\",IFERROR(RTD(\"cqg.rtd\", ,\"ContractData\",C49, \"PerCentNetLastTrade\",, \"T\")/100,\"\"))","v":1.4100185528756956E-2},{"$f":"IF(A49=\"\",\"\",RTD(\"cqg.rtd\", ,\"ContractData\", C49, \"T_CVol\",, \"T\"))","v":793949.57925499999},49,{"$f":"IFERROR(RANK($J49,INDIRECT((\"$J$\"&\"1\"&\":$J$\"&$A$449)))+COUNTIF($J$1:J49,J49)-1,\"\")","v":102},"S.US.BAX","S.US.CMCSA"]
[{"$f":"IF(Symbols!A50=\"\",\"\",Symbols!A50)","v":"S.US.BBY"},1,"S.US.BBY",{"$f":"IF(A50=\"\",\"\",RTD(\"cqg.rtd\", ,\"ContractData\",C50, \"LongDescription\",, \"T\"))","v":"Best Buy Co Inc"},null,null,null,{"$f":"IF(A50=\"\",\"\",RTD(\"cqg.rtd\", ,\"ContractData\",C50, \"LastTradeToday\",, \"T\"))","v":84.67},{"$f":"IF(A50=\"\",\"\",RTD(\"cqg.rtd\", ,\"ContractData\",C50, \"NetLastTradeToday\",, \"T\"))","v":1.67},{"$f":"IF(A50=\"\",\"\",IFERROR(RTD(\"cqg.rtd\", ,\"ContractData\",C50, \"PerCentNetLastTrade\",, \"T\")/100,\"\"))","v":2.0120481927710845E-2},{"$f":"IF(A50=\"\",\"\",RTD(\"cqg.rtd\", ,\"ContractData\", C50, \"T_CVol\",, \"T\"))","v":391737.28999199998},50,{"$f":"IFERROR(RANK($J50,INDIRECT((\"$J$\"&\"1\"&\":$J$\"&$A$449)))+COUNTIF($J$1:J50,J50)-1,\"\")","v":58},"S.US.BBY","S.US.EBAY"]
[{"$f":"IF(Symbols!A51=\"\",\"\",Symbols!A51)","v":"S.US.BDX"},1,"S.US.BDX",{"$f":"IF(A51=\"\",\"\",RTD(\"cqg.rtd\", ,\"ContractData\",C51, \"LongDescription\",, \"T\"))","v":"Becton Dickinson & Co"},null,null,null,{"$f":"IF(A51=\"\",\"\",RTD(\"cqg.rtd\", ,\"ContractData\",C51, \"LastTradeToday\",, \"T\"))","v":185},{"$f":"IF(A51=\"\",\"\",RTD(\"cqg.rtd\", ,\"ContractData\",C51, \"NetLastTradeToday\",, \"T\"))","v":1.42},{"$f":"IF(A51=\"\",\"\",IFERROR(RTD(\"cqg.rtd\", ,\"ContractData\",C51, \"PerCentNetLastTrade\",, \"T\")/100,\"\"))","v":7.7350473907833095E-3},{"$f":"IF(A51=\"\",\"\",RTD(\"cqg.rtd\", ,\"ContractData\", C51, \"T_CVol\",, \"T\"))","v":219737.100989},51,{"$f":"IFERROR(RANK($J51,INDIRECT((\"$J$\"&\"1\"&\":$J$\"&$A$449)))+COUNTIF($J$1:J51,J51)-1,\"\")","v":216},"S.US.BDX","S.US.ODFL"]
[{"$f":"IF(Symbols!A52=\"\",\"\",Symbols!A52)","v":"S.US.BEN"},1,"S.US.BEN",{"$f":"IF(A52=\"\",\"\",RTD(\"cqg.rtd\", ,\"ContractData\",C52, \"LongDescription\",, \"T\"))","v":"Franklin Resources Inc"},null,null,null,{"$f":"IF(A52=\"\",\"\",RTD(\"cqg.rtd\", ,\"ContractData\",C52, \"LastTradeToday\",, \"T\"))","v":34.01},{"$f":"IF(A52=\"\",\"\",RTD(\"cqg.rtd\", ,\"ContractData\",C52, \"NetLastTradeToday\",, \"T\"))","v":0.42},{"$f":"IF(A52=\"\",\"\",IFERROR(RTD(\"cqg.rtd\", ,\"ContractData\",C52, \"PerCentNetLastTrade\",, \"T\")/100,\"\"))","v":1.2503721345638583E-2},{"$f":"IF(A52=\"\",\"\",RTD(\"cqg.rtd\", ,\"ContractData\", C52, \"T_CVol\",, \"T\"))","v":295859.65710499999},52,{"$f":"IFERROR(RANK($J52,INDIRECT((\"$J$\"&\"1\"&\":$J$\"&$A$449)))+COUNTIF($J$1:J52,J52)-1,\"\")","v":125},"S.US.BEN","S.US.GEHC"]
[{"$f":"IF(Symbols!A53=\"\",\"\",Symbols!A53)","v":"S.US.BFB"},1,"S.US.BFB",{"$f":"IF(A53=\"\",\"\",RTD(\"cqg.rtd\", ,\"ContractData\",C53, \"LongDescription\",, \"T\"))","v":"Brown-Forman Corporation ClsB"},null,null,null,{"$f":"IF(A53=\"\",\"\",RTD(\"cqg.rtd\", ,\"ContractData\",C53, \"LastTradeToday\",, \"T\"))","v":28.28},{"$f":"IF(A53=\"\",\"\",RTD(\"cqg.rtd\", ,\"ContractData\",C53, \"NetLastTradeToday\",, \"T\"))","v":0.36},{"$f":"IF(A53=\"\",\"\",IFERROR(RTD(\"cqg.rtd\", ,\"ContractData\",C53, \"PerCentNetLastTrade\",, \"T\")/100,\"\"))","v":1.2893982808022923E-2},{"$f":"IF(A53=\"\",\"\",RTD(\"cqg.rtd\", ,\"ContractData\", C53, \"T_CVol\",, \"T\"))","v":157105.524657},53,{"$f":"IFERROR(RANK($J53,INDIRECT((\"$J$\"&\"1\"&\":$J$\"&$A$449)))+COUNTIF($J$1:J53,J53)-1,\"\")","v":118},"S.US.BFB","S.US.JBHT"]
[{"$f":"IF(Symbols!A54=\"\",\"\",Symbols!A54)","v":"S.US.BG"},1,"S.US.BG",{"$f":"IF(A54=\"\",\"\",RTD(\"cqg.rtd\", ,\"ContractData\",C54, \"LongDescription\",, \"T\"))","v":"Bunge Limited"},null,null,null,{"$f":"IF(A54=\"\",\"\",RTD(\"cqg.rtd\", ,\"ContractData\",C54, \"LastTradeToday\",, \"T\"))","v":113.13},{"$f":"IF(A54=\"\",\"\",RTD(\"cqg.rtd\", ,\"ContractData\",C54, \"NetLastTradeToday\",, \"T\"))","v":1.3800000000000001},{"$f":"IF(A54=\"\",\"\",IFERROR(RTD(\"cqg.rtd\", ,\"ContractData\",C54, \"PerCentNetLastTrade\",, \"T\")/100,\"\"))","v":1.2348993288590604E-2},{"$f":"IF(A54=\"\",\"\",RTD(\"cqg.rtd\", ,\"ContractData\", C54, \"T_CVol\",, \"T\"))","v":99178.670119000002},54,{"$f":"IFERROR(RANK($J54,INDIRECT((\"$J$\"&\"1\"&\":$J$\"&$A$449)))+COUNTIF($J$1:J54,J54)-1,\"\")","v":126},"S.US.BG","S.US.IVZ"]
[{"$f":"IF(Symbols!A55=\"\",\"\",Symbols!A55)","v":"S.US.BIIB"},1,"S.US.BIIB",{"$f":"IF(A55=\"\",\"\",RTD(\"cqg.rtd\", ,\"ContractData\",C55, \"LongDescription\",, \"T\"))","v":"BIOGEN INC CMN"},null,null,null,{"$f":"IF(A55=\"\",\"\",RTD(\"cqg.rtd\", ,\"ContractData\",C55, \"LastTradeToday\",, \"T\"))","v":209.98000000000002},{"$f":"IF(A55=\"\",\"\",RTD(\"cqg.rtd\", ,\"ContractData\",C55, \"NetLastTradeToday\",, \"T\"))","v":1.1100000000000001},{"$f":"IF(A55=\"\",\"\",IFERROR(RTD(\"cqg.rtd\", ,\"ContractData\",C55, \"PerCentNetLastTrade\",, \"T\")/100,\"\"))","v":5.3143103365729883E-3},{"$f":"IF(A55=\"\",\"\",RTD(\"cqg.rtd\", ,\"ContractData\", C55, \"T_CVol\",, \"T\"))","v":203840.21666800001},55,{"$f":"IFERROR(RANK($J55,INDIRECT((\"$J$\"&\"1\"&\":$J$\"&$A$449)))+COUNTIF($J$1:J55,J55)-1,\"\")","v":271},"S.US.BIIB","S.US.DHI"]
[{"$f":"IF(Symbols!A56=\"\",\"\",Symbols!A56)","v":"S.US.BKR"},0,"S.US.BKR",{"$f":"IF(A56=\"\",\"\",RTD(\"cqg.rtd\", ,\"ContractData\",C56, \"LongDescription\",, \"T\"))","v":"BAKER HUGHES CO"},null,null,null,{"$f":"IF(A56=\"\",\"\",RTD(\"cqg.rtd\", ,\"ContractData\",C56, \"LastTradeToday\",, \"T\"))","v":63.15},{"$f":"IF(A56=\"\",\"\",RTD(\"cqg.rtd\", ,\"ContractData\",C56, \"NetLastTradeToday\",, \"T\"))","v":-1.1300000000000001},{"$f":"IF(A56=\"\",\"\",IFERROR(RTD(\"cqg.rtd\", ,\"ContractData\",C56, \"PerCentNetLastTrade\",, \"T\")/100,\"\"))","v":-1.7579340385812072E-2},{"$f":"IF(A56=\"\",\"\",RTD(\"cqg.rtd\", ,\"ContractData\", C56, \"T_CVol\",, \"T\"))","v":1025974.843554},56,{"$f":"IFERROR(RANK($J56,INDIRECT((\"$J$\"&\"1\"&\":$J$\"&$A$449)))+COUNTIF($J$1:J56,J56)-1,\"\")","v":433},"S.US.BKR","S.US.UAL"]
[{"$f":"IF(Symbols!A57=\"\",\"\",Symbols!A57)","v":"S.US.BLDR"},1,"S.US.BLDR",{"$f":"IF(A57=\"\",\"\",RTD(\"cqg.rtd\", ,\"ContractData\",C57, \"LongDescription\",, \"T\"))","v":"Builders FirstSource Inc"},null,null,null,{"$f":"IF(A57=\"\",\"\",RTD(\"cqg.rtd\", ,\"ContractData\",C57, \"LastTradeToday\",, \"T\"))","v":74.86},{"$f":"IF(A57=\"\",\"\",RTD(\"cqg.rtd\", ,\"ContractData\",C57, \"NetLastTradeToday\",, \"T\"))","v":2.4500000000000002},{"$f":"IF(A57=\"\",\"\",IFERROR(RTD(\"cqg.rtd\", ,\"ContractData\",C57, \"PerCentNetLastTrade\",, \"T\")/100,\"\"))","v":3.3835105648391109E-2},{"$f":"IF(A57=\"\",\"\",RTD(\"cqg.rtd\", ,\"ContractData\", C57, \"T_CVol\",, \"T\"))","v":280874.34197200002},57,{"$f":"IFERROR(RANK($J57,INDIRECT((\"$J$\"&\"1\"&\":$J$\"&$A$449)))+COUNTIF($J$1:J57,J57)-1,\"\")","v":13},"S.US.BLDR","S.US.STZ"]
[{"$f":"IF(Symbols!A58=\"\",\"\",Symbols!A58)","v":"S.US.BLK"},1,"S.US.BLK",{"$f":"IF(A58=\"\",\"\",RTD(\"cqg.rtd\", ,\"ContractData\",C58, \"LongDescription\",, \"T\"))","v":"BlackRock, Inc."},null,null,null,{"$f":"IF(A58=\"\",\"\",RTD(\"cqg.rtd\", ,\"ContractData\",C58, \"LastTradeToday\",, \"T\"))","v":1180.22},{"$f":"IF(A58=\"\",\"\",RTD(\"cqg.rtd\", ,\"ContractData\",C58, \"NetLastTradeToday\",, \"T\"))","v":19.309999999999999},{"$f":"IF(A58=\"\",\"\",IFERROR(RTD(\"cqg.rtd\", ,\"ContractData\",C58, \"PerCentNetLastTrade\",, \"T\")/100,\"\"))","v":1.6633503027797158E-2},{"$f":"IF(A58=\"\",\"\",RTD(\"cqg.rtd\", ,\"ContractData\", C58, \"T_CVol\",, \"T\"))","v":51182.176223000002},58,{"$f":"IFERROR(RANK($J58,INDIRECT((\"$J$\"&\"1\"&\":$J$\"&$A$449)))+COUNTIF($J$1:J58,J58)-1,\"\")","v":82},"S.US.BLK","S.US.BBY"]
[{"$f":"IF(Symbols!A59=\"\",\"\",Symbols!A59)","v":"S.US.BMY"},1,"S.US.BMY",{"$f":"IF(A59=\"\",\"\",RTD(\"cqg.rtd\", ,\"ContractData\",C59, \"LongDescription\",, \"T\"))","v":"Bristol-Myers Squibb Co"},null,null,null,{"$f":"IF(A59=\"\",\"\",RTD(\"cqg.rtd\", ,\"ContractData\",C59, \"LastTradeToday\",, \"T\"))","v":64.47},{"$f":"IF(A59=\"\",\"\",RTD(\"cqg.rtd\", ,\"ContractData\",C59, \"NetLastTradeToday\",, \"T\"))","v":0.77},{"$f":"IF(A59=\"\",\"\",IFERROR(RTD(\"cqg.rtd\", ,\"ContractData\",C59, \"PerCentNetLastTrade\",, \"T\")/100,\"\"))","v":1.2087912087912087E-2},{"$f":"IF(A59=\"\",\"\",RTD(\"cqg.rtd\", ,\"ContractData\", C59, \"T_CVol\",, \"T\"))","v":1363934.2170579999},59,{"$f":"IFERROR(RANK($J59,INDIRECT((\"$J$\"&\"1\"&\":$J$\"&$A$449)))+COUNTIF($J$1:J59,J59)-1,\"\")","v":133},"S.US.BMY","S.US.EIX"]
[{"$f":"IF(Symbols!A60=\"\",\"\",Symbols!A60)","v":"S.US.BNY"},0,"S.US.BNY",{"$f":"IF(A60=\"\",\"\",RTD(\"cqg.rtd\", ,\"ContractData\",C60, \"LongDescription\",, \"T\"))","v":"Bank of New York Co Inc"},null,null,null,{"$f":"IF(A60=\"\",\"\",RTD(\"cqg.rtd\", ,\"ContractData\",C60, \"LastTradeToday\",, \"T\"))","v":162.87},{"$f":"IF(A60=\"\",\"\",RTD(\"cqg.rtd\", ,\"ContractData\",C60, \"NetLastTradeToday\",, \"T\"))","v":-0.06},{"$f":"IF(A60=\"\",\"\",IFERROR(RTD(\"cqg.rtd\", ,\"ContractData\",C60, \"PerCentNetLastTrade\",, \"T\")/100,\"\"))","v":-3.6825630638924689E-4},{"$f":"IF(A60=\"\",\"\",RTD(\"cqg.rtd\", ,\"ContractData\", C60, \"T_CVol\",, \"T\"))","v":326166.19024899998},60,{"$f":"IFERROR(RANK($J60,INDIRECT((\"$J$\"&\"1\"&\":$J$\"&$A$449)))+COUNTIF($J$1:J60,J60)-1,\"\")","v":344},"S.US.BNY","S.US.BXP"]
[{"$f":"IF(Symbols!A61=\"\",\"\",Symbols!A61)","v":"S.US.BR"},{"$f":"IF(A61=\"\",\"\",IF(J61>0,1,0))","v":1},{"$f":"A61","v":"S.US.BR"},{"$f":"IF(A61=\"\",\"\",RTD(\"cqg.rtd\", ,\"ContractData\",C61, \"LongDescription\",, \"T\"))","v":"Broadridge Financial Solutions"},null,null,null,{"$f":"IF(A61=\"\",\"\",RTD(\"cqg.rtd\", ,\"ContractData\",C61, \"LastTradeToday\",, \"T\"))","v":169.59},{"$f":"IF(A61=\"\",\"\",RTD(\"cqg.rtd\", ,\"ContractData\",C61, \"NetLastTradeToday\",, \"T\"))","v":0.32},{"$f":"IF(A61=\"\",\"\",IFERROR(RTD(\"cqg.rtd\", ,\"ContractData\",C61, \"PerCentNetLastTrade\",, \"T\")/100,\"\"))","v":1.8904708453949311E-3},{"$f":"IF(A61=\"\",\"\",RTD(\"cqg.rtd\", ,\"ContractData\", C61, \"T_CVol\",, \"T\"))","v":162574.92940200001},61,{"$f":"IFERROR(RANK($J61,INDIRECT((\"$J$\"&\"1\"&\":$J$\"&$A$449)))+COUNTIF($J$1:J61,J61)-1,\"\")","v":314},"S.US.BR","S.US.MS"]
[{"$f":"IF(Symbols!A62=\"\",\"\",Symbols!A62)","v":"S.US.BRO"},1,"S.US.BRO",{"$f":"IF(A62=\"\",\"\",RTD(\"cqg.rtd\", ,\"ContractData\",C62, \"LongDescription\",, \"T\"))","v":"BROWN AND BROWN INC"},null,null,null,{"$f":"IF(A62=\"\",\"\",RTD(\"cqg.rtd\", ,\"ContractData\",C62, \"LastTradeToday\",, \"T\"))","v":71.44},{"$f":"IF(A62=\"\",\"\",RTD(\"cqg.rtd\", ,\"ContractData\",C62, \"NetLastTradeToday\",, \"T\"))","v":0.38},{"$f":"IF(A62=\"\",\"\",IFERROR(RTD(\"cqg.rtd\", ,\"ContractData\",C62, \"PerCentNetLastTrade\",, \"T\")/100,\"\"))","v":5.3475935828877011E-3},{"$f":"IF(A62=\"\",\"\",RTD(\"cqg.rtd\", ,\"ContractData\", C62, \"T_CVol\",, \"T\"))","v":288518.66986999998},62,{"$f":"IFERROR(RANK($J62,INDIRECT((\"$J$\"&\"1\"&\":$J$\"&$A$449)))+COUNTIF($J$1:J62,J62)-1,\"\")","v":268},"S.US.BRO","S.US.GS"]
[{"$f":"IF(Symbols!A63=\"\",\"\",Symbols!A63)","v":"S.US.BSX"},1,"S.US.BSX",{"$f":"IF(A63=\"\",\"\",RTD(\"cqg.rtd\", ,\"ContractData\",C63, \"LongDescription\",, \"T\"))","v":"Boston Scientific Corp"},null,null,null,{"$f":"IF(A63=\"\",\"\",RTD(\"cqg.rtd\", ,\"ContractData\",C63, \"LastTradeToday\",, \"T\"))","v":52.14},{"$f":"IF(A63=\"\",\"\",RTD(\"cqg.rtd\", ,\"ContractData\",C63, \"NetLastTradeToday\",, \"T\"))","v":0.72},{"$f":"IF(A63=\"\",\"\",IFERROR(RTD(\"cqg.rtd\", ,\"ContractData\",C63, \"PerCentNetLastTrade\",, \"T\")/100,\"\"))","v":1.4002333722287048E-2},{"$f":"IF(A63=\"\",\"\",RTD(\"cqg.rtd\", ,\"ContractData\", C63, \"T_CVol\",, \"T\"))","v":2653604.3805160001},63,{"$f":"IFERROR(RANK($J63,INDIRECT((\"$J$\"&\"1\"&\":$J$\"&$A$449)))+COUNTIF($J$1:J63,J63)-1,\"\")","v":107},"S.US.BSX","S.US.ACN"]
[{"$f":"IF(Symbols!A64=\"\",\"\",Symbols!A64)","v":"S.US.BX"},1,"S.US.BX",{"$f":"IF(A64=\"\",\"\",RTD(\"cqg.rtd\", ,\"ContractData\",C64, \"LongDescription\",, \"T\"))","v":"Blackstone Inc."},null,null,null,{"$f":"IF(A64=\"\",\"\",RTD(\"cqg.rtd\", ,\"ContractData\",C64, \"LastTradeToday\",, \"T\"))","v":149},{"$f":"IF(A64=\"\",\"\",RTD(\"cqg.rtd\", ,\"ContractData\",C64, \"NetLastTradeToday\",, \"T\"))","v":2.59},{"$f":"IF(A64=\"\",\"\",IFERROR(RTD(\"cqg.rtd\", ,\"ContractData\",C64, \"PerCentNetLastTrade\",, \"T\")/100,\"\"))","v":1.7690048493955331E-2},{"$f":"IF(A64=\"\",\"\",RTD(\"cqg.rtd\", ,\"ContractData\", C64, \"T_CVol\",, \"T\"))","v":580140.04245199997},64,{"$f":"IFERROR(RANK($J64,INDIRECT((\"$J$\"&\"1\"&\":$J$\"&$A$449)))+COUNTIF($J$1:J64,J64)-1,\"\")","v":75},"S.US.BX","S.US.AMT"]
[{"$f":"IF(Symbols!A65=\"\",\"\",Symbols!A65)","v":"S.US.BXP"},1,"S.US.BXP",{"$f":"IF(A65=\"\",\"\",RTD(\"cqg.rtd\", ,\"ContractData\",C65, \"LongDescription\",, \"T\"))","v":"BXP, Inc."},null,null,null,{"$f":"IF(A65=\"\",\"\",RTD(\"cqg.rtd\", ,\"ContractData\",C65, \"LastTradeToday\",, \"T\"))","v":69.290000000000006},{"$f":"IF(A65=\"\",\"\",RTD(\"cqg.rtd\", ,\"ContractData\",C65, \"NetLastTradeToday\",, \"T\"))","v":1.34},{"$f":"IF(A65=\"\",\"\",IFERROR(RTD(\"cqg.rtd\", ,\"ContractData\",C65, \"PerCentNetLastTrade\",, \"T\")/100,\"\"))","v":1.9720382634289921E-2},{"$f":"IF(A65=\"\",\"\",RTD(\"cqg.rtd\", ,\"ContractData\", C65, \"T_CVol\",, \"T\"))","v":103649.18659700001},65,{"$f":"IFERROR(RANK($J65,INDIRECT((\"$J$\"&\"1\"&\":$J$\"&$A$449)))+COUNTIF($J$1:J65,J65)-1,\"\")","v":60},"S.US.BXP","S.US.INVH"]
[{"$f":"IF(Symbols!A66=\"\",\"\",Symbols!A66)","v":"S.US.C"},1,"S.US.C",{"$f":"IF(A66=\"\",\"\",RTD(\"cqg.rtd\", ,\"ContractData\",C66, \"LongDescription\",, \"T\"))","v":"Citigroup Inc"},null,null,null,{"$f":"IF(A66=\"\",\"\",RTD(\"cqg.rtd\", ,\"ContractData\",C66, \"LastTradeToday\",, \"T\"))","v":138.91},{"$f":"IF(A66=\"\",\"\",RTD(\"cqg.rtd\", ,\"ContractData\",C66, \"NetLastTradeToday\",, \"T\"))","v":1.33},{"$f":"IF(A66=\"\",\"\",IFERROR(RTD(\"cqg.rtd\", ,\"ContractData\",C66, \"PerCentNetLastTrade\",, \"T\")/100,\"\"))","v":9.6671027765663602E-3},{"$f":"IF(A66=\"\",\"\",RTD(\"cqg.rtd\", ,\"ContractData\", C66, \"T_CVol\",, \"T\"))","v":1364887.9270510001},66,{"$f":"IFERROR(RANK($J66,INDIRECT((\"$J$\"&\"1\"&\":$J$\"&$A$449)))+COUNTIF($J$1:J66,J66)-1,\"\")","v":171},{"$f":"C66","v":"S.US.C"},{"$f":"IFERROR(VLOOKUP($L66,$M$1:$N$437,2,FALSE),\"\")","v":"S.US.ZBH"}]
[{"$f":"IF(Symbols!A67=\"\",\"\",Symbols!A67)","v":"S.US.CAH"},0,"S.US.CAH",{"$f":"IF(A67=\"\",\"\",RTD(\"cqg.rtd\", ,\"ContractData\",C67, \"LongDescription\",, \"T\"))","v":"Cardinal Health Inc"},null,null,null,{"$f":"IF(A67=\"\",\"\",RTD(\"cqg.rtd\", ,\"ContractData\",C67, \"LastTradeToday\",, \"T\"))","v":233.37},{"$f":"IF(A67=\"\",\"\",RTD(\"cqg.rtd\", ,\"ContractData\",C67, \"NetLastTradeToday\",, \"T\"))","v":-0.79},{"$f":"IF(A67=\"\",\"\",IFERROR(RTD(\"cqg.rtd\", ,\"ContractData\",C67, \"PerCentNetLastTrade\",, \"T\")/100,\"\"))","v":-3.3737615305773831E-3},{"$f":"IF(A67=\"\",\"\",RTD(\"cqg.rtd\", ,\"ContractData\", C67, \"T_CVol\",, \"T\"))","v":294154.52789899998},{"$f":"L66+1","v":67},{"$f":"IFERROR(RANK($J67,INDIRECT((\"$J$\"&\"1\"&\":$J$\"&$A$449)))+COUNTIF($J$1:J67,J67)-1,\"\")","v":376},"S.US.CAH","S.US.EXR"]
[{"$f":"IF(Symbols!A68=\"\",\"\",Symbols!A68)","v":"S.US.CARR"},1,"S.US.CARR",{"$f":"IF(A68=\"\",\"\",RTD(\"cqg.rtd\", ,\"ContractData\",C68, \"LongDescription\",, \"T\"))","v":"Carrier Global Corporation"},null,null,null,{"$f":"IF(A68=\"\",\"\",RTD(\"cqg.rtd\", ,\"ContractData\",C68, \"LastTradeToday\",, \"T\"))","v":63.230000000000004},{"$f":"IF(A68=\"\",\"\",RTD(\"cqg.rtd\", ,\"ContractData\",C68, \"NetLastTradeToday\",, \"T\"))","v":0.15},{"$f":"IF(A68=\"\",\"\",IFERROR(RTD(\"cqg.rtd\", ,\"ContractData\",C68, \"PerCentNetLastTrade\",, \"T\")/100,\"\"))","v":2.3779327837666455E-3},{"$f":"IF(A68=\"\",\"\",RTD(\"cqg.rtd\", ,\"ContractData\", C68, \"T_CVol\",, \"T\"))","v":343509.692844},68,{"$f":"IFERROR(RANK($J68,INDIRECT((\"$J$\"&\"1\"&\":$J$\"&$A$449)))+COUNTIF($J$1:J68,J68)-1,\"\")","v":308},"S.US.CARR","S.US.AXON"]
[{"$f":"IF(Symbols!A69=\"\",\"\",Symbols!A69)","v":"S.US.CB"},1,"S.US.CB",{"$f":"IF(A69=\"\",\"\",RTD(\"cqg.rtd\", ,\"ContractData\",C69, \"LongDescription\",, \"T\"))","v":"Chubb Limited"},null,null,null,{"$f":"IF(A69=\"\",\"\",RTD(\"cqg.rtd\", ,\"ContractData\",C69, \"LastTradeToday\",, \"T\"))","v":345.29},{"$f":"IF(A69=\"\",\"\",RTD(\"cqg.rtd\", ,\"ContractData\",C69, \"NetLastTradeToday\",, \"T\"))","v":1.96},{"$f":"IF(A69=\"\",\"\",IFERROR(RTD(\"cqg.rtd\", ,\"ContractData\",C69, \"PerCentNetLastTrade\",, \"T\")/100,\"\"))","v":5.7087932892552354E-3},{"$f":"IF(A69=\"\",\"\",RTD(\"cqg.rtd\", ,\"ContractData\", C69, \"T_CVol\",, \"T\"))","v":167894.046099},69,{"$f":"IFERROR(RANK($J69,INDIRECT((\"$J$\"&\"1\"&\":$J$\"&$A$449)))+COUNTIF($J$1:J69,J69)-1,\"\")","v":263},"S.US.CB","S.US.MDLZ"]
[{"$f":"IF(Symbols!A70=\"\",\"\",Symbols!A70)","v":"S.US.CBOE"},1,"S.US.CBOE",{"$f":"IF(A70=\"\",\"\",RTD(\"cqg.rtd\", ,\"ContractData\",C70, \"LongDescription\",, \"T\"))","v":"Cboe Global Markets, Inc."},null,null,null,{"$f":"IF(A70=\"\",\"\",RTD(\"cqg.rtd\", ,\"ContractData\",C70, \"LastTradeToday\",, \"T\"))","v":293.47000000000003},{"$f":"IF(A70=\"\",\"\",RTD(\"cqg.rtd\", ,\"ContractData\",C70, \"NetLastTradeToday\",, \"T\"))","v":2.4900000000000002},{"$f":"IF(A70=\"\",\"\",IFERROR(RTD(\"cqg.rtd\", ,\"ContractData\",C70, \"PerCentNetLastTrade\",, \"T\")/100,\"\"))","v":8.5572891607670638E-3},{"$f":"IF(A70=\"\",\"\",RTD(\"cqg.rtd\", ,\"ContractData\", C70, \"T_CVol\",, \"T\"))","v":98378.751055000001},70,{"$f":"IFERROR(RANK($J70,INDIRECT((\"$J$\"&\"1\"&\":$J$\"&$A$449)))+COUNTIF($J$1:J70,J70)-1,\"\")","v":195},"S.US.CBOE","S.US.MAS"]
[{"$f":"IF(Symbols!A71=\"\",\"\",Symbols!A71)","v":"S.US.CBRE"},1,"S.US.CBRE",{"$f":"IF(A71=\"\",\"\",RTD(\"cqg.rtd\", ,\"ContractData\",C71, \"LongDescription\",, \"T\"))","v":"CBRE Group, Inc."},null,null,null,{"$f":"IF(A71=\"\",\"\",RTD(\"cqg.rtd\", ,\"ContractData\",C71, \"LastTradeToday\",, \"T\"))","v":150.07},{"$f":"IF(A71=\"\",\"\",RTD(\"cqg.rtd\", ,\"ContractData\",C71, \"NetLastTradeToday\",, \"T\"))","v":2.67},{"$f":"IF(A71=\"\",\"\",IFERROR(RTD(\"cqg.rtd\", ,\"ContractData\",C71, \"PerCentNetLastTrade\",, \"T\")/100,\"\"))","v":1.8113975576662146E-2},{"$f":"IF(A71=\"\",\"\",RTD(\"cqg.rtd\", ,\"ContractData\", C71, \"T_CVol\",, \"T\"))","v":135351.384533},71,{"$f":"IFERROR(RANK($J71,INDIRECT((\"$J$\"&\"1\"&\":$J$\"&$A$449)))+COUNTIF($J$1:J71,J71)-1,\"\")","v":74},"S.US.CBRE","S.US.KMB"]
[{"$f":"IF(Symbols!A72=\"\",\"\",Symbols!A72)","v":"S.US.CCI"},1,"S.US.CCI",{"$f":"IF(A72=\"\",\"\",RTD(\"cqg.rtd\", ,\"ContractData\",C72, \"LongDescription\",, \"T\"))","v":"Crown Castle Intl"},null,null,null,{"$f":"IF(A72=\"\",\"\",RTD(\"cqg.rtd\", ,\"ContractData\",C72, \"LastTradeToday\",, \"T\"))","v":75.06},{"$f":"IF(A72=\"\",\"\",RTD(\"cqg.rtd\", ,\"ContractData\",C72, \"NetLastTradeToday\",, \"T\"))","v":1.0900000000000001},{"$f":"IF(A72=\"\",\"\",IFERROR(RTD(\"cqg.rtd\", ,\"ContractData\",C72, \"PerCentNetLastTrade\",, \"T\")/100,\"\"))","v":1.4735703663647425E-2},{"$f":"IF(A72=\"\",\"\",RTD(\"cqg.rtd\", ,\"ContractData\", C72, \"T_CVol\",, \"T\"))","v":330451.80599800003},72,{"$f":"IFERROR(RANK($J72,INDIRECT((\"$J$\"&\"1\"&\":$J$\"&$A$449)))+COUNTIF($J$1:J72,J72)-1,\"\")","v":95},"S.US.CCI","S.US.STX"]
[{"$f":"IF(Symbols!A73=\"\",\"\",Symbols!A73)","v":"S.US.CDNS"},1,"S.US.CDNS",{"$f":"IF(A73=\"\",\"\",RTD(\"cqg.rtd\", ,\"ContractData\",C73, \"LongDescription\",, \"T\"))","v":"CADENCE DESIGN SYS"},null,null,null,{"$f":"IF(A73=\"\",\"\",RTD(\"cqg.rtd\", ,\"ContractData\",C73, \"LastTradeToday\",, \"T\"))","v":325.78000000000003},{"$f":"IF(A73=\"\",\"\",RTD(\"cqg.rtd\", ,\"ContractData\",C73, \"NetLastTradeToday\",, \"T\"))","v":2.65},{"$f":"IF(A73=\"\",\"\",IFERROR(RTD(\"cqg.rtd\", ,\"ContractData\",C73, \"PerCentNetLastTrade\",, \"T\")/100,\"\"))","v":8.2010336397115718E-3},{"$f":"IF(A73=\"\",\"\",RTD(\"cqg.rtd\", ,\"ContractData\", C73, \"T_CVol\",, \"T\"))","v":347287.54143899999},73,{"$f":"IFERROR(RANK($J73,INDIRECT((\"$J$\"&\"1\"&\":$J$\"&$A$449)))+COUNTIF($J$1:J73,J73)-1,\"\")","v":204},"S.US.CDNS","S.US.CMG"]
[{"$f":"IF(Symbols!A74=\"\",\"\",Symbols!A74)","v":"S.US.CDW"},1,"S.US.CDW",{"$f":"IF(A74=\"\",\"\",RTD(\"cqg.rtd\", ,\"ContractData\",C74, \"LongDescription\",, \"T\"))","v":"CDW Corporation"},null,null,null,{"$f":"IF(A74=\"\",\"\",RTD(\"cqg.rtd\", ,\"ContractData\",C74, \"LastTradeToday\",, \"T\"))","v":138.38},{"$f":"IF(A74=\"\",\"\",RTD(\"cqg.rtd\", ,\"ContractData\",C74, \"NetLastTradeToday\",, \"T\"))","v":1.71},{"$f":"IF(A74=\"\",\"\",IFERROR(RTD(\"cqg.rtd\", ,\"ContractData\",C74, \"PerCentNetLastTrade\",, \"T\")/100,\"\"))","v":1.2511889953903564E-2},{"$f":"IF(A74=\"\",\"\",RTD(\"cqg.rtd\", ,\"ContractData\", C74, \"T_CVol\",, \"T\"))","v":165252.95867699999},74,{"$f":"IFERROR(RANK($J74,INDIRECT((\"$J$\"&\"1\"&\":$J$\"&$A$449)))+COUNTIF($J$1:J74,J74)-1,\"\")","v":124},"S.US.CDW","S.US.CBRE"]
[{"$f":"IF(Symbols!A75=\"\",\"\",Symbols!A75)","v":"S.US.CEG"},1,"S.US.CEG",{"$f":"IF(A75=\"\",\"\",RTD(\"cqg.rtd\", ,\"ContractData\",C75, \"LongDescription\",, \"T\"))","v":"CONSTELLATION EN CM"},null,null,null,{"$f":"IF(A75=\"\",\"\",RTD(\"cqg.rtd\", ,\"ContractData\",C75, \"LastTradeToday\",, \"T\"))","v":280.17},{"$f":"IF(A75=\"\",\"\",RTD(\"cqg.rtd\", ,\"ContractData\",C75, \"NetLastTradeToday\",, \"T\"))","v":1.49},{"$f":"IF(A75=\"\",\"\",IFERROR(RTD(\"cqg.rtd\", ,\"ContractData\",C75, \"PerCentNetLastTrade\",, \"T\")/100,\"\"))","v":5.3466341323381659E-3},{"$f":"IF(A75=\"\",\"\",RTD(\"cqg.rtd\", ,\"ContractData\", C75, \"T_CVol\",, \"T\"))","v":420275.052777},75,{"$f":"IFERROR(RANK($J75,INDIRECT((\"$J$\"&\"1\"&\":$J$\"&$A$449)))+COUNTIF($J$1:J75,J75)-1,\"\")","v":269},"S.US.CEG","S.US.BX"]
[{"$f":"IF(Symbols!A76=\"\",\"\",Symbols!A76)","v":"S.US.CF"},0,"S.US.CF",{"$f":"IF(A76=\"\",\"\",RTD(\"cqg.rtd\", ,\"ContractData\",C76, \"LongDescription\",, \"T\"))","v":"CF Industries Holdings, Inc"},null,null,null,{"$f":"IF(A76=\"\",\"\",RTD(\"cqg.rtd\", ,\"ContractData\",C76, \"LastTradeToday\",, \"T\"))","v":118.07000000000001},{"$f":"IF(A76=\"\",\"\",RTD(\"cqg.rtd\", ,\"ContractData\",C76, \"NetLastTradeToday\",, \"T\"))","v":-1.94},{"$f":"IF(A76=\"\",\"\",IFERROR(RTD(\"cqg.rtd\", ,\"ContractData\",C76, \"PerCentNetLastTrade\",, \"T\")/100,\"\"))","v":-1.6165319556703608E-2},{"$f":"IF(A76=\"\",\"\",RTD(\"cqg.rtd\", ,\"ContractData\", C76, \"T_CVol\",, \"T\"))","v":200986.152584},76,{"$f":"IFERROR(RANK($J76,INDIRECT((\"$J$\"&\"1\"&\":$J$\"&$A$449)))+COUNTIF($J$1:J76,J76)-1,\"\")","v":432},"S.US.CF","S.US.EFX"]
[{"$f":"IF(Symbols!A77=\"\",\"\",Symbols!A77)","v":"S.US.CFG"},1,"S.US.CFG",{"$f":"IF(A77=\"\",\"\",RTD(\"cqg.rtd\", ,\"ContractData\",C77, \"LongDescription\",, \"T\"))","v":"Citizens Financial Group, Inc."},null,null,null,{"$f":"IF(A77=\"\",\"\",RTD(\"cqg.rtd\", ,\"ContractData\",C77, \"LastTradeToday\",, \"T\"))","v":74.570000000000007},{"$f":"IF(A77=\"\",\"\",RTD(\"cqg.rtd\", ,\"ContractData\",C77, \"NetLastTradeToday\",, \"T\"))","v":0.66},{"$f":"IF(A77=\"\",\"\",IFERROR(RTD(\"cqg.rtd\", ,\"ContractData\",C77, \"PerCentNetLastTrade\",, \"T\")/100,\"\"))","v":8.9297794615072392E-3},{"$f":"IF(A77=\"\",\"\",RTD(\"cqg.rtd\", ,\"ContractData\", C77, \"T_CVol\",, \"T\"))","v":480401.95253000001},77,{"$f":"IFERROR(RANK($J77,INDIRECT((\"$J$\"&\"1\"&\":$J$\"&$A$449)))+COUNTIF($J$1:J77,J77)-1,\"\")","v":185},"S.US.CFG","S.US.SPGI"]
[{"$f":"IF(Symbols!A78=\"\",\"\",Symbols!A78)","v":"S.US.CHD"},1,"S.US.CHD",{"$f":"IF(A78=\"\",\"\",RTD(\"cqg.rtd\", ,\"ContractData\",C78, \"LongDescription\",, \"T\"))","v":"Church/Dwight Co Inc"},null,null,null,{"$f":"IF(A78=\"\",\"\",RTD(\"cqg.rtd\", ,\"ContractData\",C78, \"LastTradeToday\",, \"T\"))","v":102.15},{"$f":"IF(A78=\"\",\"\",RTD(\"cqg.rtd\", ,\"ContractData\",C78, \"NetLastTradeToday\",, \"T\"))","v":0.91},{"$f":"IF(A78=\"\",\"\",IFERROR(RTD(\"cqg.rtd\", ,\"ContractData\",C78, \"PerCentNetLastTrade\",, \"T\")/100,\"\"))","v":8.988542078229949E-3},{"$f":"IF(A78=\"\",\"\",RTD(\"cqg.rtd\", ,\"ContractData\", C78, \"T_CVol\",, \"T\"))","v":95391.749962999995},78,{"$f":"IFERROR(RANK($J78,INDIRECT((\"$J$\"&\"1\"&\":$J$\"&$A$449)))+COUNTIF($J$1:J78,J78)-1,\"\")","v":184},"S.US.CHD","S.US.GL"]
[{"$f":"IF(Symbols!A79=\"\",\"\",Symbols!A79)","v":"S.US.CHRW"},1,"S.US.CHRW",{"$f":"IF(A79=\"\",\"\",RTD(\"cqg.rtd\", ,\"ContractData\",C79, \"LongDescription\",, \"T\"))","v":"C.H. ROBINSON WW"},null,null,null,{"$f":"IF(A79=\"\",\"\",RTD(\"cqg.rtd\", ,\"ContractData\",C79, \"LastTradeToday\",, \"T\"))","v":149},{"$f":"IF(A79=\"\",\"\",RTD(\"cqg.rtd\", ,\"ContractData\",C79, \"NetLastTradeToday\",, \"T\"))","v":2.3000000000000003},{"$f":"IF(A79=\"\",\"\",IFERROR(RTD(\"cqg.rtd\", ,\"ContractData\",C79, \"PerCentNetLastTrade\",, \"T\")/100,\"\"))","v":1.5678254942058621E-2},{"$f":"IF(A79=\"\",\"\",RTD(\"cqg.rtd\", ,\"ContractData\", C79, \"T_CVol\",, \"T\"))","v":192673.91644999999},79,{"$f":"IFERROR(RANK($J79,INDIRECT((\"$J$\"&\"1\"&\":$J$\"&$A$449)))+COUNTIF($J$1:J79,J79)-1,\"\")","v":88},"S.US.CHRW","S.US.ABBV"]
[{"$f":"IF(Symbols!A80=\"\",\"\",Symbols!A80)","v":"S.US.CHTR"},1,"S.US.CHTR",{"$f":"IF(A80=\"\",\"\",RTD(\"cqg.rtd\", ,\"ContractData\",C80, \"LongDescription\",, \"T\"))","v":"CHARTER COMMUNICATIO"},null,null,null,{"$f":"IF(A80=\"\",\"\",RTD(\"cqg.rtd\", ,\"ContractData\",C80, \"LastTradeToday\",, \"T\"))","v":154.96},{"$f":"IF(A80=\"\",\"\",RTD(\"cqg.rtd\", ,\"ContractData\",C80, \"NetLastTradeToday\",, \"T\"))","v":4.74},{"$f":"IF(A80=\"\",\"\",IFERROR(RTD(\"cqg.rtd\", ,\"ContractData\",C80, \"PerCentNetLastTrade\",, \"T\")/100,\"\"))","v":3.1553721208893624E-2},{"$f":"IF(A80=\"\",\"\",RTD(\"cqg.rtd\", ,\"ContractData\", C80, \"T_CVol\",, \"T\"))","v":145491.663049},80,{"$f":"IFERROR(RANK($J80,INDIRECT((\"$J$\"&\"1\"&\":$J$\"&$A$449)))+COUNTIF($J$1:J80,J80)-1,\"\")","v":17},"S.US.CHTR","S.US.QCOM"]
[{"$f":"IF(Symbols!A81=\"\",\"\",Symbols!A81)","v":"S.US.CI"},1,"S.US.CI",{"$f":"IF(A81=\"\",\"\",RTD(\"cqg.rtd\", ,\"ContractData\",C81, \"LongDescription\",, \"T\"))","v":"The Cigna Group"},null,null,null,{"$f":"IF(A81=\"\",\"\",RTD(\"cqg.rtd\", ,\"ContractData\",C81, \"LastTradeToday\",, \"T\"))","v":279.63},{"$f":"IF(A81=\"\",\"\",RTD(\"cqg.rtd\", ,\"ContractData\",C81, \"NetLastTradeToday\",, \"T\"))","v":2.2200000000000002},{"$f":"IF(A81=\"\",\"\",IFERROR(RTD(\"cqg.rtd\", ,\"ContractData\",C81, \"PerCentNetLastTrade\",, \"T\")/100,\"\"))","v":8.0025954363577376E-3},{"$f":"IF(A81=\"\",\"\",RTD(\"cqg.rtd\", ,\"ContractData\", C81, \"T_CVol\",, \"T\"))","v":122519.42262300001},81,{"$f":"IFERROR(RANK($J81,INDIRECT((\"$J$\"&\"1\"&\":$J$\"&$A$449)))+COUNTIF($J$1:J81,J81)-1,\"\")","v":208},"S.US.CI","S.US.FTNT"]
[{"$f":"IF(Symbols!A82=\"\",\"\",Symbols!A82)","v":"S.US.CINF"},1,"S.US.CINF",{"$f":"IF(A82=\"\",\"\",RTD(\"cqg.rtd\", ,\"ContractData\",C82, \"LongDescription\",, \"T\"))","v":"CINCINNATI FINANCIAL"},null,null,null,{"$f":"IF(A82=\"\",\"\",RTD(\"cqg.rtd\", ,\"ContractData\",C82, \"LastTradeToday\",, \"T\"))","v":173.6},{"$f":"IF(A82=\"\",\"\",RTD(\"cqg.rtd\", ,\"ContractData\",C82, \"NetLastTradeToday\",, \"T\"))","v":1.1300000000000001},{"$f":"IF(A82=\"\",\"\",IFERROR(RTD(\"cqg.rtd\", ,\"ContractData\",C82, \"PerCentNetLastTrade\",, \"T\")/100,\"\"))","v":6.5518640923059078E-3},{"$f":"IF(A82=\"\",\"\",RTD(\"cqg.rtd\", ,\"ContractData\", C82, \"T_CVol\",, \"T\"))","v":23797.626690000001},82,{"$f":"IFERROR(RANK($J82,INDIRECT((\"$J$\"&\"1\"&\":$J$\"&$A$449)))+COUNTIF($J$1:J82,J82)-1,\"\")","v":236},"S.US.CINF","S.US.BLK"]
[{"$f":"IF(Symbols!A83=\"\",\"\",Symbols!A83)","v":"S.US.CL"},1,"S.US.CL",{"$f":"IF(A83=\"\",\"\",RTD(\"cqg.rtd\", ,\"ContractData\",C83, \"LongDescription\",, \"T\"))","v":"Colgate-Palmolive Co"},null,null,null,{"$f":"IF(A83=\"\",\"\",RTD(\"cqg.rtd\", ,\"ContractData\",C83, \"LastTradeToday\",, \"T\"))","v":93.38},{"$f":"IF(A83=\"\",\"\",RTD(\"cqg.rtd\", ,\"ContractData\",C83, \"NetLastTradeToday\",, \"T\"))","v":1.06},{"$f":"IF(A83=\"\",\"\",IFERROR(RTD(\"cqg.rtd\", ,\"ContractData\",C83, \"PerCentNetLastTrade\",, \"T\")/100,\"\"))","v":1.1481802426343155E-2},{"$f":"IF(A83=\"\",\"\",RTD(\"cqg.rtd\", ,\"ContractData\", C83, \"T_CVol\",, \"T\"))","v":280725.54342499998},83,{"$f":"IFERROR(RANK($J83,INDIRECT((\"$J$\"&\"1\"&\":$J$\"&$A$449)))+COUNTIF($J$1:J83,J83)-1,\"\")","v":146},"S.US.CL","S.US.VTR"]
[{"$f":"IF(Symbols!A84=\"\",\"\",Symbols!A84)","v":"S.US.CLX"},1,"S.US.CLX",{"$f":"IF(A84=\"\",\"\",RTD(\"cqg.rtd\", ,\"ContractData\",C84, \"LongDescription\",, \"T\"))","v":"Clorox Company"},null,null,null,{"$f":"IF(A84=\"\",\"\",RTD(\"cqg.rtd\", ,\"ContractData\",C84, \"LastTradeToday\",, \"T\"))","v":105.83},{"$f":"IF(A84=\"\",\"\",RTD(\"cqg.rtd\", ,\"ContractData\",C84, \"NetLastTradeToday\",, \"T\"))","v":7.0000000000000007E-2},{"$f":"IF(A84=\"\",\"\",IFERROR(RTD(\"cqg.rtd\", ,\"ContractData\",C84, \"PerCentNetLastTrade\",, \"T\")/100,\"\"))","v":6.6187594553706501E-4},{"$f":"IF(A84=\"\",\"\",RTD(\"cqg.rtd\", ,\"ContractData\", C84, \"T_CVol\",, \"T\"))","v":687284.42032000003},84,{"$f":"IFERROR(RANK($J84,INDIRECT((\"$J$\"&\"1\"&\":$J$\"&$A$449)))+COUNTIF($J$1:J84,J84)-1,\"\")","v":331},"S.US.CLX","S.US.PSA"]
[{"$f":"IF(Symbols!A85=\"\",\"\",Symbols!A85)","v":"S.US.CMCSA"},1,"S.US.CMCSA",{"$f":"IF(A85=\"\",\"\",RTD(\"cqg.rtd\", ,\"ContractData\",C85, \"LongDescription\",, \"T\"))","v":"COMCAST CORP A"},null,null,null,{"$f":"IF(A85=\"\",\"\",RTD(\"cqg.rtd\", ,\"ContractData\",C85, \"LastTradeToday\",, \"T\"))","v":26.01},{"$f":"IF(A85=\"\",\"\",RTD(\"cqg.rtd\", ,\"ContractData\",C85, \"NetLastTradeToday\",, \"T\"))","v":0.54},{"$f":"IF(A85=\"\",\"\",IFERROR(RTD(\"cqg.rtd\", ,\"ContractData\",C85, \"PerCentNetLastTrade\",, \"T\")/100,\"\"))","v":2.1201413427561835E-2},{"$f":"IF(A85=\"\",\"\",RTD(\"cqg.rtd\", ,\"ContractData\", C85, \"T_CVol\",, \"T\"))","v":3010152.7498889999},85,{"$f":"IFERROR(RANK($J85,INDIRECT((\"$J$\"&\"1\"&\":$J$\"&$A$449)))+COUNTIF($J$1:J85,J85)-1,\"\")","v":49},"S.US.CMCSA","S.US.WDAY"]
[{"$f":"IF(Symbols!A86=\"\",\"\",Symbols!A86)","v":"S.US.CME"},1,"S.US.CME",{"$f":"IF(A86=\"\",\"\",RTD(\"cqg.rtd\", ,\"ContractData\",C86, \"LongDescription\",, \"T\"))","v":"CME GROUP INC"},null,null,null,{"$f":"IF(A86=\"\",\"\",RTD(\"cqg.rtd\", ,\"ContractData\",C86, \"LastTradeToday\",, \"T\"))","v":264.93},{"$f":"IF(A86=\"\",\"\",RTD(\"cqg.rtd\", ,\"ContractData\",C86, \"NetLastTradeToday\",, \"T\"))","v":2.7600000000000002},{"$f":"IF(A86=\"\",\"\",IFERROR(RTD(\"cqg.rtd\", ,\"ContractData\",C86, \"PerCentNetLastTrade\",, \"T\")/100,\"\"))","v":1.0527520311248427E-2},{"$f":"IF(A86=\"\",\"\",RTD(\"cqg.rtd\", ,\"ContractData\", C86, \"T_CVol\",, \"T\"))","v":244534.93726000001},86,{"$f":"IFERROR(RANK($J86,INDIRECT((\"$J$\"&\"1\"&\":$J$\"&$A$449)))+COUNTIF($J$1:J86,J86)-1,\"\")","v":156},"S.US.CME","S.US.SBUX"]
[{"$f":"IF(Symbols!A87=\"\",\"\",Symbols!A87)","v":"S.US.CMG"},1,"S.US.CMG",{"$f":"IF(A87=\"\",\"\",RTD(\"cqg.rtd\", ,\"ContractData\",C87, \"LongDescription\",, \"T\"))","v":"Chipotle Mexican Grill"},null,null,null,{"$f":"IF(A87=\"\",\"\",RTD(\"cqg.rtd\", ,\"ContractData\",C87, \"LastTradeToday\",, \"T\"))","v":33.24},{"$f":"IF(A87=\"\",\"\",RTD(\"cqg.rtd\", ,\"ContractData\",C87, \"NetLastTradeToday\",, \"T\"))","v":0.6},{"$f":"IF(A87=\"\",\"\",IFERROR(RTD(\"cqg.rtd\", ,\"ContractData\",C87, \"PerCentNetLastTrade\",, \"T\")/100,\"\"))","v":1.8382352941176471E-2},{"$f":"IF(A87=\"\",\"\",RTD(\"cqg.rtd\", ,\"ContractData\", C87, \"T_CVol\",, \"T\"))","v":5640318.5114719998},87,{"$f":"IFERROR(RANK($J87,INDIRECT((\"$J$\"&\"1\"&\":$J$\"&$A$449)))+COUNTIF($J$1:J87,J87)-1,\"\")","v":73},"S.US.CMG","S.US.APO"]
[{"$f":"IF(Symbols!A88=\"\",\"\",Symbols!A88)","v":"S.US.CMI"},0,"S.US.CMI",{"$f":"IF(A88=\"\",\"\",RTD(\"cqg.rtd\", ,\"ContractData\",C88, \"LongDescription\",, \"T\"))","v":"Cummins Inc"},null,null,null,{"$f":"IF(A88=\"\",\"\",RTD(\"cqg.rtd\", ,\"ContractData\",C88, \"LastTradeToday\",, \"T\"))","v":634.94000000000005},{"$f":"IF(A88=\"\",\"\",RTD(\"cqg.rtd\", ,\"ContractData\",C88, \"NetLastTradeToday\",, \"T\"))","v":-2.91},{"$f":"IF(A88=\"\",\"\",IFERROR(RTD(\"cqg.rtd\", ,\"ContractData\",C88, \"PerCentNetLastTrade\",, \"T\")/100,\"\"))","v":-4.5622011444697028E-3},{"$f":"IF(A88=\"\",\"\",RTD(\"cqg.rtd\", ,\"ContractData\", C88, \"T_CVol\",, \"T\"))","v":44904.017118999996},88,{"$f":"IFERROR(RANK($J88,INDIRECT((\"$J$\"&\"1\"&\":$J$\"&$A$449)))+COUNTIF($J$1:J88,J88)-1,\"\")","v":386},"S.US.CMI","S.US.CHRW"]
[{"$f":"IF(Symbols!A89=\"\",\"\",Symbols!A89)","v":"S.US.CMS"},1,"S.US.CMS",{"$f":"IF(A89=\"\",\"\",RTD(\"cqg.rtd\", ,\"ContractData\",C89, \"LongDescription\",, \"T\"))","v":"CMS Energy Corporation"},null,null,null,{"$f":"IF(A89=\"\",\"\",RTD(\"cqg.rtd\", ,\"ContractData\",C89, \"LastTradeToday\",, \"T\"))","v":70.58},{"$f":"IF(A89=\"\",\"\",RTD(\"cqg.rtd\", ,\"ContractData\",C89, \"NetLastTradeToday\",, \"T\"))","v":0.56000000000000005},{"$f":"IF(A89=\"\",\"\",IFERROR(RTD(\"cqg.rtd\", ,\"ContractData\",C89, \"PerCentNetLastTrade\",, \"T\")/100,\"\"))","v":7.9977149385889752E-3},{"$f":"IF(A89=\"\",\"\",RTD(\"cqg.rtd\", ,\"ContractData\", C89, \"T_CVol\",, \"T\"))","v":364600.85229000001},89,{"$f":"IFERROR(RANK($J89,INDIRECT((\"$J$\"&\"1\"&\":$J$\"&$A$449)))+COUNTIF($J$1:J89,J89)-1,\"\")","v":209},"S.US.CMS","S.US.PFE"]
[{"$f":"IF(Symbols!A90=\"\",\"\",Symbols!A90)","v":"S.US.CNC"},0,"S.US.CNC",{"$f":"IF(A90=\"\",\"\",RTD(\"cqg.rtd\", ,\"ContractData\",C90, \"LongDescription\",, \"T\"))","v":"Cenetene Corporation"},null,null,null,{"$f":"IF(A90=\"\",\"\",RTD(\"cqg.rtd\", ,\"ContractData\",C90, \"LastTradeToday\",, \"T\"))","v":66.849999999999994},{"$f":"IF(A90=\"\",\"\",RTD(\"cqg.rtd\", ,\"ContractData\",C90, \"NetLastTradeToday\",, \"T\"))","v":-0.22},{"$f":"IF(A90=\"\",\"\",IFERROR(RTD(\"cqg.rtd\", ,\"ContractData\",C90, \"PerCentNetLastTrade\",, \"T\")/100,\"\"))","v":-3.2801550618756525E-3},{"$f":"IF(A90=\"\",\"\",RTD(\"cqg.rtd\", ,\"ContractData\", C90, \"T_CVol\",, \"T\"))","v":362224.96664300002},90,{"$f":"IFERROR(RANK($J90,INDIRECT((\"$J$\"&\"1\"&\":$J$\"&$A$449)))+COUNTIF($J$1:J90,J90)-1,\"\")","v":374},"S.US.CNC","S.US.PCG"]
[{"$f":"IF(Symbols!A91=\"\",\"\",Symbols!A91)","v":"S.US.CNP"},1,"S.US.CNP",{"$f":"IF(A91=\"\",\"\",RTD(\"cqg.rtd\", ,\"ContractData\",C91, \"LongDescription\",, \"T\"))","v":"Centerpoint Energy Holding Co."},null,null,null,{"$f":"IF(A91=\"\",\"\",RTD(\"cqg.rtd\", ,\"ContractData\",C91, \"LastTradeToday\",, \"T\"))","v":40.770000000000003},{"$f":"IF(A91=\"\",\"\",RTD(\"cqg.rtd\", ,\"ContractData\",C91, \"NetLastTradeToday\",, \"T\"))","v":0.24},{"$f":"IF(A91=\"\",\"\",IFERROR(RTD(\"cqg.rtd\", ,\"ContractData\",C91, \"PerCentNetLastTrade\",, \"T\")/100,\"\"))","v":5.9215396002960776E-3},{"$f":"IF(A91=\"\",\"\",RTD(\"cqg.rtd\", ,\"ContractData\", C91, \"T_CVol\",, \"T\"))","v":457020.594568},91,{"$f":"IFERROR(RANK($J91,INDIRECT((\"$J$\"&\"1\"&\":$J$\"&$A$449)))+COUNTIF($J$1:J91,J91)-1,\"\")","v":253},"S.US.CNP","S.US.TSLA"]
[{"$f":"IF(Symbols!A92=\"\",\"\",Symbols!A92)","v":"S.US.COF"},1,"S.US.COF",{"$f":"IF(A92=\"\",\"\",RTD(\"cqg.rtd\", ,\"ContractData\",C92, \"LongDescription\",, \"T\"))","v":"Capital One Financl Corp"},null,null,null,{"$f":"IF(A92=\"\",\"\",RTD(\"cqg.rtd\", ,\"ContractData\",C92, \"LastTradeToday\",, \"T\"))","v":223.70000000000002},{"$f":"IF(A92=\"\",\"\",RTD(\"cqg.rtd\", ,\"ContractData\",C92, \"NetLastTradeToday\",, \"T\"))","v":1.26},{"$f":"IF(A92=\"\",\"\",IFERROR(RTD(\"cqg.rtd\", ,\"ContractData\",C92, \"PerCentNetLastTrade\",, \"T\")/100,\"\"))","v":5.6644488401366667E-3},{"$f":"IF(A92=\"\",\"\",RTD(\"cqg.rtd\", ,\"ContractData\", C92, \"T_CVol\",, \"T\"))","v":321362.53807800001},92,{"$f":"IFERROR(RANK($J92,INDIRECT((\"$J$\"&\"1\"&\":$J$\"&$A$449)))+COUNTIF($J$1:J92,J92)-1,\"\")","v":265},"S.US.COF","S.US.TAP"]
[{"$f":"IF(Symbols!A93=\"\",\"\",Symbols!A93)","v":"S.US.COIN"},1,"S.US.COIN",{"$f":"IF(A93=\"\",\"\",RTD(\"cqg.rtd\", ,\"ContractData\",C93, \"LongDescription\",, \"T\"))","v":"COINBASE GLB CL A CM"},null,null,null,{"$f":"IF(A93=\"\",\"\",RTD(\"cqg.rtd\", ,\"ContractData\",C93, \"LastTradeToday\",, \"T\"))","v":150.62},{"$f":"IF(A93=\"\",\"\",RTD(\"cqg.rtd\", ,\"ContractData\",C93, \"NetLastTradeToday\",, \"T\"))","v":1.58},{"$f":"IF(A93=\"\",\"\",IFERROR(RTD(\"cqg.rtd\", ,\"ContractData\",C93, \"PerCentNetLastTrade\",, \"T\")/100,\"\"))","v":1.0601180891035964E-2},{"$f":"IF(A93=\"\",\"\",RTD(\"cqg.rtd\", ,\"ContractData\", C93, \"T_CVol\",, \"T\"))","v":1467124.192764},93,{"$f":"IFERROR(RANK($J93,INDIRECT((\"$J$\"&\"1\"&\":$J$\"&$A$449)))+COUNTIF($J$1:J93,J93)-1,\"\")","v":154},"S.US.COIN","S.US.KR"]
[{"$f":"IF(Symbols!A94=\"\",\"\",Symbols!A94)","v":"S.US.COO"},1,"S.US.COO",{"$f":"IF(A94=\"\",\"\",RTD(\"cqg.rtd\", ,\"ContractData\",C94, \"LongDescription\",, \"T\"))","v":"THE COOPER CO INC CM"},null,null,null,{"$f":"IF(A94=\"\",\"\",RTD(\"cqg.rtd\", ,\"ContractData\",C94, \"LastTradeToday\",, \"T\"))","v":77.489999999999995},{"$f":"IF(A94=\"\",\"\",RTD(\"cqg.rtd\", ,\"ContractData\",C94, \"NetLastTradeToday\",, \"T\"))","v":0.76},{"$f":"IF(A94=\"\",\"\",IFERROR(RTD(\"cqg.rtd\", ,\"ContractData\",C94, \"PerCentNetLastTrade\",, \"T\")/100,\"\"))","v":9.9048612016160564E-3},{"$f":"IF(A94=\"\",\"\",RTD(\"cqg.rtd\", ,\"ContractData\", C94, \"T_CVol\",, \"T\"))","v":168480.260263},94,{"$f":"IFERROR(RANK($J94,INDIRECT((\"$J$\"&\"1\"&\":$J$\"&$A$449)))+COUNTIF($J$1:J94,J94)-1,\"\")","v":164},"S.US.COO","S.US.KVUE"]
[{"$f":"IF(Symbols!A95=\"\",\"\",Symbols!A95)","v":"S.US.COP"},0,"S.US.COP",{"$f":"IF(A95=\"\",\"\",RTD(\"cqg.rtd\", ,\"ContractData\",C95, \"LongDescription\",, \"T\"))","v":"ConocoPhillips"},null,null,null,{"$f":"IF(A95=\"\",\"\",RTD(\"cqg.rtd\", ,\"ContractData\",C95, \"LastTradeToday\",, \"T\"))","v":125.47},{"$f":"IF(A95=\"\",\"\",RTD(\"cqg.rtd\", ,\"ContractData\",C95, \"NetLastTradeToday\",, \"T\"))","v":-1.83},{"$f":"IF(A95=\"\",\"\",IFERROR(RTD(\"cqg.rtd\", ,\"ContractData\",C95, \"PerCentNetLastTrade\",, \"T\")/100,\"\"))","v":-1.4375490966221524E-2},{"$f":"IF(A95=\"\",\"\",RTD(\"cqg.rtd\", ,\"ContractData\", C95, \"T_CVol\",, \"T\"))","v":844732.07677599997},95,{"$f":"IFERROR(RANK($J95,INDIRECT((\"$J$\"&\"1\"&\":$J$\"&$A$449)))+COUNTIF($J$1:J95,J95)-1,\"\")","v":430},"S.US.COP","S.US.CCI"]
[{"$f":"IF(Symbols!A96=\"\",\"\",Symbols!A96)","v":"S.US.COR"},0,"S.US.COR",{"$f":"IF(A96=\"\",\"\",RTD(\"cqg.rtd\", ,\"ContractData\",C96, \"LongDescription\",, \"T\"))","v":"Cencora Inc."},null,null,null,{"$f":"IF(A96=\"\",\"\",RTD(\"cqg.rtd\", ,\"ContractData\",C96, \"LastTradeToday\",, \"T\"))","v":313.47000000000003},{"$f":"IF(A96=\"\",\"\",RTD(\"cqg.rtd\", ,\"ContractData\",C96, \"NetLastTradeToday\",, \"T\"))","v":-0.70000000000000007},{"$f":"IF(A96=\"\",\"\",IFERROR(RTD(\"cqg.rtd\", ,\"ContractData\",C96, \"PerCentNetLastTrade\",, \"T\")/100,\"\"))","v":-2.2280930706305505E-3},{"$f":"IF(A96=\"\",\"\",RTD(\"cqg.rtd\", ,\"ContractData\", C96, \"T_CVol\",, \"T\"))","v":305726.35466499999},96,{"$f":"IFERROR(RANK($J96,INDIRECT((\"$J$\"&\"1\"&\":$J$\"&$A$449)))+COUNTIF($J$1:J96,J96)-1,\"\")","v":368},"S.US.COR","S.US.GEN"]
[{"$f":"IF(Symbols!A97=\"\",\"\",Symbols!A97)","v":"S.US.COST"},1,"S.US.COST",{"$f":"IF(A97=\"\",\"\",RTD(\"cqg.rtd\", ,\"ContractData\",C97, \"LongDescription\",, \"T\"))","v":"COSTCO WHOLESALE"},null,null,null,{"$f":"IF(A97=\"\",\"\",RTD(\"cqg.rtd\", ,\"ContractData\",C97, \"LastTradeToday\",, \"T\"))","v":954.26},{"$f":"IF(A97=\"\",\"\",RTD(\"cqg.rtd\", ,\"ContractData\",C97, \"NetLastTradeToday\",, \"T\"))","v":4.6900000000000004},{"$f":"IF(A97=\"\",\"\",IFERROR(RTD(\"cqg.rtd\", ,\"ContractData\",C97, \"PerCentNetLastTrade\",, \"T\")/100,\"\"))","v":4.939077687795528E-3},{"$f":"IF(A97=\"\",\"\",RTD(\"cqg.rtd\", ,\"ContractData\", C97, \"T_CVol\",, \"T\"))","v":228374.99550700001},97,{"$f":"IFERROR(RANK($J97,INDIRECT((\"$J$\"&\"1\"&\":$J$\"&$A$449)))+COUNTIF($J$1:J97,J97)-1,\"\")","v":274},"S.US.COST","S.US.IRM"]
[{"$f":"IF(Symbols!A98=\"\",\"\",Symbols!A98)","v":"S.US.CPAY"},1,"S.US.CPAY",{"$f":"IF(A98=\"\",\"\",RTD(\"cqg.rtd\", ,\"ContractData\",C98, \"LongDescription\",, \"T\"))","v":"Corpay, Inc."},null,null,null,{"$f":"IF(A98=\"\",\"\",RTD(\"cqg.rtd\", ,\"ContractData\",C98, \"LastTradeToday\",, \"T\"))","v":414.2},{"$f":"IF(A98=\"\",\"\",RTD(\"cqg.rtd\", ,\"ContractData\",C98, \"NetLastTradeToday\",, \"T\"))","v":4.5200000000000005},{"$f":"IF(A98=\"\",\"\",IFERROR(RTD(\"cqg.rtd\", ,\"ContractData\",C98, \"PerCentNetLastTrade\",, \"T\")/100,\"\"))","v":1.1033001366920522E-2},{"$f":"IF(A98=\"\",\"\",RTD(\"cqg.rtd\", ,\"ContractData\", C98, \"T_CVol\",, \"T\"))","v":63264.997365000003},98,{"$f":"IFERROR(RANK($J98,INDIRECT((\"$J$\"&\"1\"&\":$J$\"&$A$449)))+COUNTIF($J$1:J98,J98)-1,\"\")","v":150},"S.US.CPAY","S.US.TSN"]
[{"$f":"IF(Symbols!A99=\"\",\"\",Symbols!A99)","v":"S.US.CPRT"},1,"S.US.CPRT",{"$f":"IF(A99=\"\",\"\",RTD(\"cqg.rtd\", ,\"ContractData\",C99, \"LongDescription\",, \"T\"))","v":"COPART, INC."},null,null,null,{"$f":"IF(A99=\"\",\"\",RTD(\"cqg.rtd\", ,\"ContractData\",C99, \"LastTradeToday\",, \"T\"))","v":29.36},{"$f":"IF(A99=\"\",\"\",RTD(\"cqg.rtd\", ,\"ContractData\",C99, \"NetLastTradeToday\",, \"T\"))","v":0.37},{"$f":"IF(A99=\"\",\"\",IFERROR(RTD(\"cqg.rtd\", ,\"ContractData\",C99, \"PerCentNetLastTrade\",, \"T\")/100,\"\"))","v":1.2763021731631597E-2},{"$f":"IF(A99=\"\",\"\",RTD(\"cqg.rtd\", ,\"ContractData\", C99, \"T_CVol\",, \"T\"))","v":1313922.4078820001},99,{"$f":"IFERROR(RANK($J99,INDIRECT((\"$J$\"&\"1\"&\":$J$\"&$A$449)))+COUNTIF($J$1:J99,J99)-1,\"\")","v":119},"S.US.CPRT","S.US.CVS"]
[{"$f":"IF(Symbols!A100=\"\",\"\",Symbols!A100)","v":"S.US.CPT"},1,"S.US.CPT",{"$f":"IF(A100=\"\",\"\",RTD(\"cqg.rtd\", ,\"ContractData\",C100, \"LongDescription\",, \"T\"))","v":"Camden Property Trust"},null,null,null,{"$f":"IF(A100=\"\",\"\",RTD(\"cqg.rtd\", ,\"ContractData\",C100, \"LastTradeToday\",, \"T\"))","v":110.98},{"$f":"IF(A100=\"\",\"\",RTD(\"cqg.rtd\", ,\"ContractData\",C100, \"NetLastTradeToday\",, \"T\"))","v":2.6},{"$f":"IF(A100=\"\",\"\",IFERROR(RTD(\"cqg.rtd\", ,\"ContractData\",C100, \"PerCentNetLastTrade\",, \"T\")/100,\"\"))","v":2.3989665990035061E-2},{"$f":"IF(A100=\"\",\"\",RTD(\"cqg.rtd\", ,\"ContractData\", C100, \"T_CVol\",, \"T\"))","v":58336.287343999997},100,{"$f":"IFERROR(RANK($J100,INDIRECT((\"$J$\"&\"1\"&\":$J$\"&$A$449)))+COUNTIF($J$1:J100,J100)-1,\"\")","v":35},"S.US.CPT","S.US.DIS"]
[{"$f":"IF(Symbols!A101=\"\",\"\",Symbols!A101)","v":"S.US.CRH"},1,"S.US.CRH",{"$f":"IF(A101=\"\",\"\",RTD(\"cqg.rtd\", ,\"ContractData\",C101, \"LongDescription\",, \"T\"))","v":"CRH Public Limited Company"},null,null,null,{"$f":"IF(A101=\"\",\"\",RTD(\"cqg.rtd\", ,\"ContractData\",C101, \"LastTradeToday\",, \"T\"))","v":98.56},{"$f":"IF(A101=\"\",\"\",RTD(\"cqg.rtd\", ,\"ContractData\",C101, \"NetLastTradeToday\",, \"T\"))","v":0.57000000000000006},{"$f":"IF(A101=\"\",\"\",IFERROR(RTD(\"cqg.rtd\", ,\"ContractData\",C101, \"PerCentNetLastTrade\",, \"T\")/100,\"\"))","v":5.8169200938871313E-3},{"$f":"IF(A101=\"\",\"\",RTD(\"cqg.rtd\", ,\"ContractData\", C101, \"T_CVol\",, \"T\"))","v":681361.38093300001},101,{"$f":"IFERROR(RANK($J101,INDIRECT((\"$J$\"&\"1\"&\":$J$\"&$A$449)))+COUNTIF($J$1:J101,J101)-1,\"\")","v":256},"S.US.CRH","S.US.ARE"]
[{"$f":"IF(Symbols!A102=\"\",\"\",Symbols!A102)","v":"S.US.CRL"},1,"S.US.CRL",{"$f":"IF(A102=\"\",\"\",RTD(\"cqg.rtd\", ,\"ContractData\",C102, \"LongDescription\",, \"T\"))","v":"Charles River Labs Hldgs Inc"},null,null,null,{"$f":"IF(A102=\"\",\"\",RTD(\"cqg.rtd\", ,\"ContractData\",C102, \"LastTradeToday\",, \"T\"))","v":285.04000000000002},{"$f":"IF(A102=\"\",\"\",RTD(\"cqg.rtd\", ,\"ContractData\",C102, \"NetLastTradeToday\",, \"T\"))","v":0.67},{"$f":"IF(A102=\"\",\"\",IFERROR(RTD(\"cqg.rtd\", ,\"ContractData\",C102, \"PerCentNetLastTrade\",, \"T\")/100,\"\"))","v":2.3560853817209972E-3},{"$f":"IF(A102=\"\",\"\",RTD(\"cqg.rtd\", ,\"ContractData\", C102, \"T_CVol\",, \"T\"))","v":72172.848031999994},102,{"$f":"IFERROR(RANK($J102,INDIRECT((\"$J$\"&\"1\"&\":$J$\"&$A$449)))+COUNTIF($J$1:J102,J102)-1,\"\")","v":309},"S.US.CRL","S.US.BAX"]
[{"$f":"IF(Symbols!A103=\"\",\"\",Symbols!A103)","v":"S.US.CRM"},1,"S.US.CRM",{"$f":"IF(A103=\"\",\"\",RTD(\"cqg.rtd\", ,\"ContractData\",C103, \"LongDescription\",, \"T\"))","v":"Salesforce, Inc."},null,null,null,{"$f":"IF(A103=\"\",\"\",RTD(\"cqg.rtd\", ,\"ContractData\",C103, \"LastTradeToday\",, \"T\"))","v":195.21},{"$f":"IF(A103=\"\",\"\",RTD(\"cqg.rtd\", ,\"ContractData\",C103, \"NetLastTradeToday\",, \"T\"))","v":1.8900000000000001},{"$f":"IF(A103=\"\",\"\",IFERROR(RTD(\"cqg.rtd\", ,\"ContractData\",C103, \"PerCentNetLastTrade\",, \"T\")/100,\"\"))","v":9.7765363128491621E-3},{"$f":"IF(A103=\"\",\"\",RTD(\"cqg.rtd\", ,\"ContractData\", C103, \"T_CVol\",, \"T\"))","v":2007965.391484},103,{"$f":"IFERROR(RANK($J103,INDIRECT((\"$J$\"&\"1\"&\":$J$\"&$A$449)))+COUNTIF($J$1:J103,J103)-1,\"\")","v":168},"S.US.CRM","S.US.JBL"]
[{"$f":"IF(Symbols!A104=\"\",\"\",Symbols!A104)","v":"S.US.CSCO"},0,"S.US.CSCO",{"$f":"IF(A104=\"\",\"\",RTD(\"cqg.rtd\", ,\"ContractData\",C104, \"LongDescription\",, \"T\"))","v":"CISCO SYSTEMS INC."},null,null,null,{"$f":"IF(A104=\"\",\"\",RTD(\"cqg.rtd\", ,\"ContractData\",C104, \"LastTradeToday\",, \"T\"))","v":115.22},{"$f":"IF(A104=\"\",\"\",RTD(\"cqg.rtd\", ,\"ContractData\",C104, \"NetLastTradeToday\",, \"T\"))","v":-8.66},{"$f":"IF(A104=\"\",\"\",IFERROR(RTD(\"cqg.rtd\", ,\"ContractData\",C104, \"PerCentNetLastTrade\",, \"T\")/100,\"\"))","v":-6.9906360994510808E-2},{"$f":"IF(A104=\"\",\"\",RTD(\"cqg.rtd\", ,\"ContractData\", C104, \"T_CVol\",, \"T\"))","v":22243084.278028999},104,{"$f":"IFERROR(RANK($J104,INDIRECT((\"$J$\"&\"1\"&\":$J$\"&$A$449)))+COUNTIF($J$1:J104,J104)-1,\"\")","v":436},"S.US.CSCO","S.US.FRT"]
[{"$f":"IF(Symbols!A105=\"\",\"\",Symbols!A105)","v":"S.US.CSGP"},1,"S.US.CSGP",{"$f":"IF(A105=\"\",\"\",RTD(\"cqg.rtd\", ,\"ContractData\",C105, \"LongDescription\",, \"T\"))","v":"COSTAR GROUP INC ##"},null,null,null,{"$f":"IF(A105=\"\",\"\",RTD(\"cqg.rtd\", ,\"ContractData\",C105, \"LastTradeToday\",, \"T\"))","v":31.71},{"$f":"IF(A105=\"\",\"\",RTD(\"cqg.rtd\", ,\"ContractData\",C105, \"NetLastTradeToday\",, \"T\"))","v":1.21},{"$f":"IF(A105=\"\",\"\",IFERROR(RTD(\"cqg.rtd\", ,\"ContractData\",C105, \"PerCentNetLastTrade\",, \"T\")/100,\"\"))","v":3.9672131147540986E-2},{"$f":"IF(A105=\"\",\"\",RTD(\"cqg.rtd\", ,\"ContractData\", C105, \"T_CVol\",, \"T\"))","v":819631.63104500005},105,{"$f":"IFERROR(RANK($J105,INDIRECT((\"$J$\"&\"1\"&\":$J$\"&$A$449)))+COUNTIF($J$1:J105,J105)-1,\"\")","v":8},"S.US.CSGP","S.US.GDDY"]
[{"$f":"IF(Symbols!A106=\"\",\"\",Symbols!A106)","v":"S.US.CSX"},1,"S.US.CSX",{"$f":"IF(A106=\"\",\"\",RTD(\"cqg.rtd\", ,\"ContractData\",C106, \"LongDescription\",, \"T\"))","v":"CSX Corporation"},null,null,null,{"$f":"IF(A106=\"\",\"\",RTD(\"cqg.rtd\", ,\"ContractData\",C106, \"LastTradeToday\",, \"T\"))","v":50.61},{"$f":"IF(A106=\"\",\"\",RTD(\"cqg.rtd\", ,\"ContractData\",C106, \"NetLastTradeToday\",, \"T\"))","v":0.53},{"$f":"IF(A106=\"\",\"\",IFERROR(RTD(\"cqg.rtd\", ,\"ContractData\",C106, \"PerCentNetLastTrade\",, \"T\")/100,\"\"))","v":1.0583067092651756E-2},{"$f":"IF(A106=\"\",\"\",RTD(\"cqg.rtd\", ,\"ContractData\", C106, \"T_CVol\",, \"T\"))","v":1076740.4023490001},106,{"$f":"IFERROR(RANK($J106,INDIRECT((\"$J$\"&\"1\"&\":$J$\"&$A$449)))+COUNTIF($J$1:J106,J106)-1,\"\")","v":155},"S.US.CSX","S.US.MLM"]
[{"$f":"IF(Symbols!A107=\"\",\"\",Symbols!A107)","v":"S.US.CTAS"},1,"S.US.CTAS",{"$f":"IF(A107=\"\",\"\",RTD(\"cqg.rtd\", ,\"ContractData\",C107, \"LongDescription\",, \"T\"))","v":"Cintas Corp"},null,null,null,{"$f":"IF(A107=\"\",\"\",RTD(\"cqg.rtd\", ,\"ContractData\",C107, \"LastTradeToday\",, \"T\"))","v":203.70000000000002},{"$f":"IF(A107=\"\",\"\",RTD(\"cqg.rtd\", ,\"ContractData\",C107, \"NetLastTradeToday\",, \"T\"))","v":0.19},{"$f":"IF(A107=\"\",\"\",IFERROR(RTD(\"cqg.rtd\", ,\"ContractData\",C107, \"PerCentNetLastTrade\",, \"T\")/100,\"\"))","v":9.3361505577121517E-4},{"$f":"IF(A107=\"\",\"\",RTD(\"cqg.rtd\", ,\"ContractData\", C107, \"T_CVol\",, \"T\"))","v":214224.05973499999},107,{"$f":"IFERROR(RANK($J107,INDIRECT((\"$J$\"&\"1\"&\":$J$\"&$A$449)))+COUNTIF($J$1:J107,J107)-1,\"\")","v":324},"S.US.CTAS","S.US.BSX"]
[{"$f":"IF(Symbols!A108=\"\",\"\",Symbols!A108)","v":"S.US.CTSH"},1,"S.US.CTSH",{"$f":"IF(A108=\"\",\"\",RTD(\"cqg.rtd\", ,\"ContractData\",C108, \"LongDescription\",, \"T\"))","v":"COGNIZANT TECH SOL"},null,null,null,{"$f":"IF(A108=\"\",\"\",RTD(\"cqg.rtd\", ,\"ContractData\",C108, \"LastTradeToday\",, \"T\"))","v":58.88},{"$f":"IF(A108=\"\",\"\",RTD(\"cqg.rtd\", ,\"ContractData\",C108, \"NetLastTradeToday\",, \"T\"))","v":0.68},{"$f":"IF(A108=\"\",\"\",IFERROR(RTD(\"cqg.rtd\", ,\"ContractData\",C108, \"PerCentNetLastTrade\",, \"T\")/100,\"\"))","v":1.1683848797250859E-2},{"$f":"IF(A108=\"\",\"\",RTD(\"cqg.rtd\", ,\"ContractData\", C108, \"T_CVol\",, \"T\"))","v":689972.20010999998},108,{"$f":"IFERROR(RANK($J108,INDIRECT((\"$J$\"&\"1\"&\":$J$\"&$A$449)))+COUNTIF($J$1:J108,J108)-1,\"\")","v":141},"S.US.CTSH","S.US.SJM"]
[{"$f":"IF(Symbols!A109=\"\",\"\",Symbols!A109)","v":"S.US.CTVA"},0,"S.US.CTVA",{"$f":"IF(A109=\"\",\"\",RTD(\"cqg.rtd\", ,\"ContractData\",C109, \"LongDescription\",, \"T\"))","v":"Corteva Inc"},null,null,null,{"$f":"IF(A109=\"\",\"\",RTD(\"cqg.rtd\", ,\"ContractData\",C109, \"LastTradeToday\",, \"T\"))","v":75.47},{"$f":"IF(A109=\"\",\"\",RTD(\"cqg.rtd\", ,\"ContractData\",C109, \"NetLastTradeToday\",, \"T\"))","v":-0.06},{"$f":"IF(A109=\"\",\"\",IFERROR(RTD(\"cqg.rtd\", ,\"ContractData\",C109, \"PerCentNetLastTrade\",, \"T\")/100,\"\"))","v":-7.9438633655501119E-4},{"$f":"IF(A109=\"\",\"\",RTD(\"cqg.rtd\", ,\"ContractData\", C109, \"T_CVol\",, \"T\"))","v":223041.981183},109,{"$f":"IFERROR(RANK($J109,INDIRECT((\"$J$\"&\"1\"&\":$J$\"&$A$449)))+COUNTIF($J$1:J109,J109)-1,\"\")","v":348},"S.US.CTVA","S.US.Q"]
[{"$f":"IF(Symbols!A110=\"\",\"\",Symbols!A110)","v":"S.US.CVNA"},1,"S.US.CVNA",{"$f":"IF(A110=\"\",\"\",RTD(\"cqg.rtd\", ,\"ContractData\",C110, \"LongDescription\",, \"T\"))","v":"Carvana Co."},null,null,null,{"$f":"IF(A110=\"\",\"\",RTD(\"cqg.rtd\", ,\"ContractData\",C110, \"LastTradeToday\",, \"T\"))","v":74.350000000000009},{"$f":"IF(A110=\"\",\"\",RTD(\"cqg.rtd\", ,\"ContractData\",C110, \"NetLastTradeToday\",, \"T\"))","v":1.87},{"$f":"IF(A110=\"\",\"\",IFERROR(RTD(\"cqg.rtd\", ,\"ContractData\",C110, \"PerCentNetLastTrade\",, \"T\")/100,\"\"))","v":2.5800220750551873E-2},{"$f":"IF(A110=\"\",\"\",RTD(\"cqg.rtd\", ,\"ContractData\", C110, \"T_CVol\",, \"T\"))","v":1968332.559259},110,{"$f":"IFERROR(RANK($J110,INDIRECT((\"$J$\"&\"1\"&\":$J$\"&$A$449)))+COUNTIF($J$1:J110,J110)-1,\"\")","v":31},"S.US.CVNA","S.US.MRK"]
[{"$f":"IF(Symbols!A111=\"\",\"\",Symbols!A111)","v":"S.US.CVS"},1,"S.US.CVS",{"$f":"IF(A111=\"\",\"\",RTD(\"cqg.rtd\", ,\"ContractData\",C111, \"LongDescription\",, \"T\"))","v":"CVS Health Corporation"},null,null,null,{"$f":"IF(A111=\"\",\"\",RTD(\"cqg.rtd\", ,\"ContractData\",C111, \"LastTradeToday\",, \"T\"))","v":96.070000000000007},{"$f":"IF(A111=\"\",\"\",RTD(\"cqg.rtd\", ,\"ContractData\",C111, \"NetLastTradeToday\",, \"T\"))","v":1.35},{"$f":"IF(A111=\"\",\"\",IFERROR(RTD(\"cqg.rtd\", ,\"ContractData\",C111, \"PerCentNetLastTrade\",, \"T\")/100,\"\"))","v":1.4252533783783782E-2},{"$f":"IF(A111=\"\",\"\",RTD(\"cqg.rtd\", ,\"ContractData\", C111, \"T_CVol\",, \"T\"))","v":976180.29748499999},111,{"$f":"IFERROR(RANK($J111,INDIRECT((\"$J$\"&\"1\"&\":$J$\"&$A$449)))+COUNTIF($J$1:J111,J111)-1,\"\")","v":99},"S.US.CVS","S.US.FDX"]
[{"$f":"IF(Symbols!A112=\"\",\"\",Symbols!A112)","v":"S.US.CVX"},0,"S.US.CVX",{"$f":"IF(A112=\"\",\"\",RTD(\"cqg.rtd\", ,\"ContractData\",C112, \"LongDescription\",, \"T\"))","v":"Chevron Corp"},null,null,null,{"$f":"IF(A112=\"\",\"\",RTD(\"cqg.rtd\", ,\"ContractData\",C112, \"LastTradeToday\",, \"T\"))","v":196.48000000000002},{"$f":"IF(A112=\"\",\"\",RTD(\"cqg.rtd\", ,\"ContractData\",C112, \"NetLastTradeToday\",, \"T\"))","v":-0.12},{"$f":"IF(A112=\"\",\"\",IFERROR(RTD(\"cqg.rtd\", ,\"ContractData\",C112, \"PerCentNetLastTrade\",, \"T\")/100,\"\"))","v":-6.1037639877924718E-4},{"$f":"IF(A112=\"\",\"\",RTD(\"cqg.rtd\", ,\"ContractData\", C112, \"T_CVol\",, \"T\"))","v":1097752.8959659999},112,{"$f":"IFERROR(RANK($J112,INDIRECT((\"$J$\"&\"1\"&\":$J$\"&$A$449)))+COUNTIF($J$1:J112,J112)-1,\"\")","v":347},"S.US.CVX","S.US.SBAC"]
[{"$f":"IF(Symbols!A113=\"\",\"\",Symbols!A113)","v":"S.US.D"},1,"S.US.D",{"$f":"IF(A113=\"\",\"\",RTD(\"cqg.rtd\", ,\"ContractData\",C113, \"LongDescription\",, \"T\"))","v":"Dominion Energy, Inc."},null,null,null,{"$f":"IF(A113=\"\",\"\",RTD(\"cqg.rtd\", ,\"ContractData\",C113, \"LastTradeToday\",, \"T\"))","v":68.570000000000007},{"$f":"IF(A113=\"\",\"\",RTD(\"cqg.rtd\", ,\"ContractData\",C113, \"NetLastTradeToday\",, \"T\"))","v":0.53},{"$f":"IF(A113=\"\",\"\",IFERROR(RTD(\"cqg.rtd\", ,\"ContractData\",C113, \"PerCentNetLastTrade\",, \"T\")/100,\"\"))","v":7.7895355673133449E-3},{"$f":"IF(A113=\"\",\"\",RTD(\"cqg.rtd\", ,\"ContractData\", C113, \"T_CVol\",, \"T\"))","v":547025.73091399996},113,{"$f":"IFERROR(RANK($J113,INDIRECT((\"$J$\"&\"1\"&\":$J$\"&$A$449)))+COUNTIF($J$1:J113,J113)-1,\"\")","v":213},"S.US.D","S.US.TER"]
[{"$f":"IF(Symbols!A114=\"\",\"\",Symbols!A114)","v":"S.US.DAL"},1,"S.US.DAL",{"$f":"IF(A114=\"\",\"\",RTD(\"cqg.rtd\", ,\"ContractData\",C114, \"LongDescription\",, \"T\"))","v":"Delta Airlines, Inc."},null,null,null,{"$f":"IF(A114=\"\",\"\",RTD(\"cqg.rtd\", ,\"ContractData\",C114, \"LastTradeToday\",, \"T\"))","v":91.99},{"$f":"IF(A114=\"\",\"\",RTD(\"cqg.rtd\", ,\"ContractData\",C114, \"NetLastTradeToday\",, \"T\"))","v":2.0499999999999998},{"$f":"IF(A114=\"\",\"\",IFERROR(RTD(\"cqg.rtd\", ,\"ContractData\",C114, \"PerCentNetLastTrade\",, \"T\")/100,\"\"))","v":2.2795507617035474E-2},{"$f":"IF(A114=\"\",\"\",RTD(\"cqg.rtd\", ,\"ContractData\", C114, \"T_CVol\",, \"T\"))","v":753153.64982699999},114,{"$f":"IFERROR(RANK($J114,INDIRECT((\"$J$\"&\"1\"&\":$J$\"&$A$449)))+COUNTIF($J$1:J114,J114)-1,\"\")","v":44},"S.US.DAL","S.US.PRU"]
[{"$f":"IF(Symbols!A115=\"\",\"\",Symbols!A115)","v":"S.US.DD"},0,"S.US.DD",{"$f":"IF(A115=\"\",\"\",RTD(\"cqg.rtd\", ,\"ContractData\",C115, \"LongDescription\",, \"T\"))","v":"E.I. du Pont de Nemours and Co. (DuPont)"},null,null,null,{"$f":"IF(A115=\"\",\"\",RTD(\"cqg.rtd\", ,\"ContractData\",C115, \"LastTradeToday\",, \"T\"))","v":144.21},{"$f":"IF(A115=\"\",\"\",RTD(\"cqg.rtd\", ,\"ContractData\",C115, \"NetLastTradeToday\",, \"T\"))","v":-0.16},{"$f":"IF(A115=\"\",\"\",IFERROR(RTD(\"cqg.rtd\", ,\"ContractData\",C115, \"PerCentNetLastTrade\",, \"T\")/100,\"\"))","v":-1.1082634896446631E-3},{"$f":"IF(A115=\"\",\"\",RTD(\"cqg.rtd\", ,\"ContractData\", C115, \"T_CVol\",, \"T\"))","v":97167.928358999998},115,{"$f":"IFERROR(RANK($J115,INDIRECT((\"$J$\"&\"1\"&\":$J$\"&$A$449)))+COUNTIF($J$1:J115,J115)-1,\"\")","v":351},"S.US.DD","S.US.VTRS"]
[{"$f":"IF(Symbols!A116=\"\",\"\",Symbols!A116)","v":"S.US.DE"},0,"S.US.DE",{"$f":"IF(A116=\"\",\"\",RTD(\"cqg.rtd\", ,\"ContractData\",C116, \"LongDescription\",, \"T\"))","v":"Deere & Company"},null,null,null,{"$f":"IF(A116=\"\",\"\",RTD(\"cqg.rtd\", ,\"ContractData\",C116, \"LastTradeToday\",, \"T\"))","v":617.95000000000005},{"$f":"IF(A116=\"\",\"\",RTD(\"cqg.rtd\", ,\"ContractData\",C116, \"NetLastTradeToday\",, \"T\"))","v":-1.82},{"$f":"IF(A116=\"\",\"\",IFERROR(RTD(\"cqg.rtd\", ,\"ContractData\",C116, \"PerCentNetLastTrade\",, \"T\")/100,\"\"))","v":-2.9365732449134359E-3},{"$f":"IF(A116=\"\",\"\",RTD(\"cqg.rtd\", ,\"ContractData\", C116, \"T_CVol\",, \"T\"))","v":48099.869065999999},116,{"$f":"IFERROR(RANK($J116,INDIRECT((\"$J$\"&\"1\"&\":$J$\"&$A$449)))+COUNTIF($J$1:J116,J116)-1,\"\")","v":369},"S.US.DE","S.US.NSC"]
[{"$f":"IF(Symbols!A117=\"\",\"\",Symbols!A117)","v":"S.US.DECK"},1,"S.US.DECK",{"$f":"IF(A117=\"\",\"\",RTD(\"cqg.rtd\", ,\"ContractData\",C117, \"LongDescription\",, \"T\"))","v":"Deckers Outdoor Corp"},null,null,null,{"$f":"IF(A117=\"\",\"\",RTD(\"cqg.rtd\", ,\"ContractData\",C117, \"LastTradeToday\",, \"T\"))","v":92.14},{"$f":"IF(A117=\"\",\"\",RTD(\"cqg.rtd\", ,\"ContractData\",C117, \"NetLastTradeToday\",, \"T\"))","v":0.94000000000000006},{"$f":"IF(A117=\"\",\"\",IFERROR(RTD(\"cqg.rtd\", ,\"ContractData\",C117, \"PerCentNetLastTrade\",, \"T\")/100,\"\"))","v":1.0307017543859648E-2},{"$f":"IF(A117=\"\",\"\",RTD(\"cqg.rtd\", ,\"ContractData\", C117, \"T_CVol\",, \"T\"))","v":416648.17604699999},117,{"$f":"IFERROR(RANK($J117,INDIRECT((\"$J$\"&\"1\"&\":$J$\"&$A$449)))+COUNTIF($J$1:J117,J117)-1,\"\")","v":161},"S.US.DECK","S.US.UNP"]
[{"$f":"IF(Symbols!A118=\"\",\"\",Symbols!A118)","v":"S.US.DELL"},1,"S.US.DELL",{"$f":"IF(A118=\"\",\"\",RTD(\"cqg.rtd\", ,\"ContractData\",C118, \"LongDescription\",, \"T\"))","v":"Dell Technologies Inc."},null,null,null,{"$f":"IF(A118=\"\",\"\",RTD(\"cqg.rtd\", ,\"ContractData\",C118, \"LastTradeToday\",, \"T\"))","v":501.07},{"$f":"IF(A118=\"\",\"\",RTD(\"cqg.rtd\", ,\"ContractData\",C118, \"NetLastTradeToday\",, \"T\"))","v":16.57},{"$f":"IF(A118=\"\",\"\",IFERROR(RTD(\"cqg.rtd\", ,\"ContractData\",C118, \"PerCentNetLastTrade\",, \"T\")/100,\"\"))","v":3.4200206398348809E-2},{"$f":"IF(A118=\"\",\"\",RTD(\"cqg.rtd\", ,\"ContractData\", C118, \"T_CVol\",, \"T\"))","v":3442711.2161929999},118,{"$f":"IFERROR(RANK($J118,INDIRECT((\"$J$\"&\"1\"&\":$J$\"&$A$449)))+COUNTIF($J$1:J118,J118)-1,\"\")","v":12},"S.US.DELL","S.US.BFB"]
[{"$f":"IF(Symbols!A119=\"\",\"\",Symbols!A119)","v":"S.US.DG"},1,"S.US.DG",{"$f":"IF(A119=\"\",\"\",RTD(\"cqg.rtd\", ,\"ContractData\",C119, \"LongDescription\",, \"T\"))","v":"Dollar General Corporation"},null,null,null,{"$f":"IF(A119=\"\",\"\",RTD(\"cqg.rtd\", ,\"ContractData\",C119, \"LastTradeToday\",, \"T\"))","v":122.46000000000001},{"$f":"IF(A119=\"\",\"\",RTD(\"cqg.rtd\", ,\"ContractData\",C119, \"NetLastTradeToday\",, \"T\"))","v":2.86},{"$f":"IF(A119=\"\",\"\",IFERROR(RTD(\"cqg.rtd\", ,\"ContractData\",C119, \"PerCentNetLastTrade\",, \"T\")/100,\"\"))","v":2.391304347826087E-2},{"$f":"IF(A119=\"\",\"\",RTD(\"cqg.rtd\", ,\"ContractData\", C119, \"T_CVol\",, \"T\"))","v":441282.96996100002},119,{"$f":"IFERROR(RANK($J119,INDIRECT((\"$J$\"&\"1\"&\":$J$\"&$A$449)))+COUNTIF($J$1:J119,J119)-1,\"\")","v":36},"S.US.DG","S.US.CPRT"]
[{"$f":"IF(Symbols!A120=\"\",\"\",Symbols!A120)","v":"S.US.DGX"},0,"S.US.DGX",{"$f":"IF(A120=\"\",\"\",RTD(\"cqg.rtd\", ,\"ContractData\",C120, \"LongDescription\",, \"T\"))","v":"Quest Diagnostics Inc"},null,null,null,{"$f":"IF(A120=\"\",\"\",RTD(\"cqg.rtd\", ,\"ContractData\",C120, \"LastTradeToday\",, \"T\"))","v":237.75},{"$f":"IF(A120=\"\",\"\",RTD(\"cqg.rtd\", ,\"ContractData\",C120, \"NetLastTradeToday\",, \"T\"))","v":-0.02},{"$f":"IF(A120=\"\",\"\",IFERROR(RTD(\"cqg.rtd\", ,\"ContractData\",C120, \"PerCentNetLastTrade\",, \"T\")/100,\"\"))","v":-8.4114900954704113E-5},{"$f":"IF(A120=\"\",\"\",RTD(\"cqg.rtd\", ,\"ContractData\", C120, \"T_CVol\",, \"T\"))","v":59921.568522000001},120,{"$f":"IFERROR(RANK($J120,INDIRECT((\"$J$\"&\"1\"&\":$J$\"&$A$449)))+COUNTIF($J$1:J120,J120)-1,\"\")","v":339},"S.US.DGX","S.US.SPG"]
[{"$f":"IF(Symbols!A121=\"\",\"\",Symbols!A121)","v":"S.US.DHI"},1,"S.US.DHI",{"$f":"IF(A121=\"\",\"\",RTD(\"cqg.rtd\", ,\"ContractData\",C121, \"LongDescription\",, \"T\"))","v":"DR Horton Inc"},null,null,null,{"$f":"IF(A121=\"\",\"\",RTD(\"cqg.rtd\", ,\"ContractData\",C121, \"LastTradeToday\",, \"T\"))","v":148.82},{"$f":"IF(A121=\"\",\"\",RTD(\"cqg.rtd\", ,\"ContractData\",C121, \"NetLastTradeToday\",, \"T\"))","v":3},{"$f":"IF(A121=\"\",\"\",IFERROR(RTD(\"cqg.rtd\", ,\"ContractData\",C121, \"PerCentNetLastTrade\",, \"T\")/100,\"\"))","v":2.0573309559731176E-2},{"$f":"IF(A121=\"\",\"\",RTD(\"cqg.rtd\", ,\"ContractData\", C121, \"T_CVol\",, \"T\"))","v":261160.87147499999},121,{"$f":"IFERROR(RANK($J121,INDIRECT((\"$J$\"&\"1\"&\":$J$\"&$A$449)))+COUNTIF($J$1:J121,J121)-1,\"\")","v":55},"S.US.DHI","S.US.WBD"]
[{"$f":"IF(Symbols!A122=\"\",\"\",Symbols!A122)","v":"S.US.DHR"},1,"S.US.DHR",{"$f":"IF(A122=\"\",\"\",RTD(\"cqg.rtd\", ,\"ContractData\",C122, \"LongDescription\",, \"T\"))","v":"Danaher Corporation"},null,null,null,{"$f":"IF(A122=\"\",\"\",RTD(\"cqg.rtd\", ,\"ContractData\",C122, \"LastTradeToday\",, \"T\"))","v":205.8},{"$f":"IF(A122=\"\",\"\",RTD(\"cqg.rtd\", ,\"ContractData\",C122, \"NetLastTradeToday\",, \"T\"))","v":0.01},{"$f":"IF(A122=\"\",\"\",IFERROR(RTD(\"cqg.rtd\", ,\"ContractData\",C122, \"PerCentNetLastTrade\",, \"T\")/100,\"\"))","v":4.8593226104281064E-5},{"$f":"IF(A122=\"\",\"\",RTD(\"cqg.rtd\", ,\"ContractData\", C122, \"T_CVol\",, \"T\"))","v":249184.02977200001},122,{"$f":"IFERROR(RANK($J122,INDIRECT((\"$J$\"&\"1\"&\":$J$\"&$A$449)))+COUNTIF($J$1:J122,J122)-1,\"\")","v":335},"S.US.DHR","S.US.PHM"]
[{"$f":"IF(Symbols!A123=\"\",\"\",Symbols!A123)","v":"S.US.DIS"},1,"S.US.DIS",{"$f":"IF(A123=\"\",\"\",RTD(\"cqg.rtd\", ,\"ContractData\",C123, \"LongDescription\",, \"T\"))","v":"The Walt Disney Company"},null,null,null,{"$f":"IF(A123=\"\",\"\",RTD(\"cqg.rtd\", ,\"ContractData\",C123, \"LastTradeToday\",, \"T\"))","v":104.69},{"$f":"IF(A123=\"\",\"\",RTD(\"cqg.rtd\", ,\"ContractData\",C123, \"NetLastTradeToday\",, \"T\"))","v":1.47},{"$f":"IF(A123=\"\",\"\",IFERROR(RTD(\"cqg.rtd\", ,\"ContractData\",C123, \"PerCentNetLastTrade\",, \"T\")/100,\"\"))","v":1.4241426080217012E-2},{"$f":"IF(A123=\"\",\"\",RTD(\"cqg.rtd\", ,\"ContractData\", C123, \"T_CVol\",, \"T\"))","v":1287505.0775520001},123,{"$f":"IFERROR(RANK($J123,INDIRECT((\"$J$\"&\"1\"&\":$J$\"&$A$449)))+COUNTIF($J$1:J123,J123)-1,\"\")","v":100},"S.US.DIS","S.US.AWK"]
[{"$f":"IF(Symbols!A124=\"\",\"\",Symbols!A124)","v":"S.US.DLR"},1,"S.US.DLR",{"$f":"IF(A124=\"\",\"\",RTD(\"cqg.rtd\", ,\"ContractData\",C124, \"LongDescription\",, \"T\"))","v":"Digital Realty"},null,null,null,{"$f":"IF(A124=\"\",\"\",RTD(\"cqg.rtd\", ,\"ContractData\",C124, \"LastTradeToday\",, \"T\"))","v":199.22},{"$f":"IF(A124=\"\",\"\",RTD(\"cqg.rtd\", ,\"ContractData\",C124, \"NetLastTradeToday\",, \"T\"))","v":2.16},{"$f":"IF(A124=\"\",\"\",IFERROR(RTD(\"cqg.rtd\", ,\"ContractData\",C124, \"PerCentNetLastTrade\",, \"T\")/100,\"\"))","v":1.0961128590277074E-2},{"$f":"IF(A124=\"\",\"\",RTD(\"cqg.rtd\", ,\"ContractData\", C124, \"T_CVol\",, \"T\"))","v":139177.35797000001},124,{"$f":"IFERROR(RANK($J124,INDIRECT((\"$J$\"&\"1\"&\":$J$\"&$A$449)))+COUNTIF($J$1:J124,J124)-1,\"\")","v":151},"S.US.DLR","S.US.CDW"]
[{"$f":"IF(Symbols!A125=\"\",\"\",Symbols!A125)","v":"S.US.DLTR"},{"$f":"IF(A125=\"\",\"\",IF(J125>0,1,0))","v":1},{"$f":"A125","v":"S.US.DLTR"},{"$f":"IF(A125=\"\",\"\",RTD(\"cqg.rtd\", ,\"ContractData\",C125, \"LongDescription\",, \"T\"))","v":"DOLLAR TREE INC"},null,null,null,{"$f":"IF(A125=\"\",\"\",RTD(\"cqg.rtd\", ,\"ContractData\",C125, \"LastTradeToday\",, \"T\"))","v":131.4},{"$f":"IF(A125=\"\",\"\",RTD(\"cqg.rtd\", ,\"ContractData\",C125, \"NetLastTradeToday\",, \"T\"))","v":2.79},{"$f":"IF(A125=\"\",\"\",IFERROR(RTD(\"cqg.rtd\", ,\"ContractData\",C125, \"PerCentNetLastTrade\",, \"T\")/100,\"\"))","v":2.1693491952414275E-2},{"$f":"IF(A125=\"\",\"\",RTD(\"cqg.rtd\", ,\"ContractData\", C125, \"T_CVol\",, \"T\"))","v":146294.39557200001},125,{"$f":"IFERROR(RANK($J125,INDIRECT((\"$J$\"&\"1\"&\":$J$\"&$A$449)))+COUNTIF($J$1:J125,J125)-1,\"\")","v":47},"S.US.DLTR","S.US.BEN"]
[{"$f":"IF(Symbols!A126=\"\",\"\",Symbols!A126)","v":"S.US.DOC"},1,"S.US.DOC",{"$f":"IF(A126=\"\",\"\",RTD(\"cqg.rtd\", ,\"ContractData\",C126, \"LongDescription\",, \"T\"))","v":"Healthpeak Properties, Inc."},null,null,null,{"$f":"IF(A126=\"\",\"\",RTD(\"cqg.rtd\", ,\"ContractData\",C126, \"LastTradeToday\",, \"T\"))","v":20.900000000000002},{"$f":"IF(A126=\"\",\"\",RTD(\"cqg.rtd\", ,\"ContractData\",C126, \"NetLastTradeToday\",, \"T\"))","v":0.24},{"$f":"IF(A126=\"\",\"\",IFERROR(RTD(\"cqg.rtd\", ,\"ContractData\",C126, \"PerCentNetLastTrade\",, \"T\")/100,\"\"))","v":1.1616650532429815E-2},{"$f":"IF(A126=\"\",\"\",RTD(\"cqg.rtd\", ,\"ContractData\", C126, \"T_CVol\",, \"T\"))","v":298667.239818},126,{"$f":"IFERROR(RANK($J126,INDIRECT((\"$J$\"&\"1\"&\":$J$\"&$A$449)))+COUNTIF($J$1:J126,J126)-1,\"\")","v":144},"S.US.DOC","S.US.BG"]
[{"$f":"IF(Symbols!A127=\"\",\"\",Symbols!A127)","v":"S.US.DOV"},0,"S.US.DOV",{"$f":"IF(A127=\"\",\"\",RTD(\"cqg.rtd\", ,\"ContractData\",C127, \"LongDescription\",, \"T\"))","v":"Dover Corporation"},null,null,null,{"$f":"IF(A127=\"\",\"\",RTD(\"cqg.rtd\", ,\"ContractData\",C127, \"LastTradeToday\",, \"T\"))","v":207.16},{"$f":"IF(A127=\"\",\"\",RTD(\"cqg.rtd\", ,\"ContractData\",C127, \"NetLastTradeToday\",, \"T\"))","v":-0.91},{"$f":"IF(A127=\"\",\"\",IFERROR(RTD(\"cqg.rtd\", ,\"ContractData\",C127, \"PerCentNetLastTrade\",, \"T\")/100,\"\"))","v":-4.3735281395684148E-3},{"$f":"IF(A127=\"\",\"\",RTD(\"cqg.rtd\", ,\"ContractData\", C127, \"T_CVol\",, \"T\"))","v":76043.282861999993},127,{"$f":"IFERROR(RANK($J127,INDIRECT((\"$J$\"&\"1\"&\":$J$\"&$A$449)))+COUNTIF($J$1:J127,J127)-1,\"\")","v":384},"S.US.DOV","S.US.VZ"]
[{"$f":"IF(Symbols!A128=\"\",\"\",Symbols!A128)","v":"S.US.DOW"},0,"S.US.DOW",{"$f":"IF(A128=\"\",\"\",RTD(\"cqg.rtd\", ,\"ContractData\",C128, \"LongDescription\",, \"T\"))","v":"Dow Inc."},null,null,null,{"$f":"IF(A128=\"\",\"\",RTD(\"cqg.rtd\", ,\"ContractData\",C128, \"LastTradeToday\",, \"T\"))","v":30.38},{"$f":"IF(A128=\"\",\"\",RTD(\"cqg.rtd\", ,\"ContractData\",C128, \"NetLastTradeToday\",, \"T\"))","v":-0.19},{"$f":"IF(A128=\"\",\"\",IFERROR(RTD(\"cqg.rtd\", ,\"ContractData\",C128, \"PerCentNetLastTrade\",, \"T\")/100,\"\"))","v":-6.2152437029767745E-3},{"$f":"IF(A128=\"\",\"\",RTD(\"cqg.rtd\", ,\"ContractData\", C128, \"T_CVol\",, \"T\"))","v":865938.99143599998},128,{"$f":"IFERROR(RANK($J128,INDIRECT((\"$J$\"&\"1\"&\":$J$\"&$A$449)))+COUNTIF($J$1:J128,J128)-1,\"\")","v":399},"S.US.DOW","S.US.PEP"]
[{"$f":"IF(Symbols!A129=\"\",\"\",Symbols!A129)","v":"S.US.DPZ"},0,"S.US.DPZ",{"$f":"IF(A129=\"\",\"\",RTD(\"cqg.rtd\", ,\"ContractData\",C129, \"LongDescription\",, \"T\"))","v":"DOMINOS PIZZA INC CM"},null,null,null,{"$f":"IF(A129=\"\",\"\",RTD(\"cqg.rtd\", ,\"ContractData\",C129, \"LastTradeToday\",, \"T\"))","v":353.62},{"$f":"IF(A129=\"\",\"\",RTD(\"cqg.rtd\", ,\"ContractData\",C129, \"NetLastTradeToday\",, \"T\"))","v":-0.1},{"$f":"IF(A129=\"\",\"\",IFERROR(RTD(\"cqg.rtd\", ,\"ContractData\",C129, \"PerCentNetLastTrade\",, \"T\")/100,\"\"))","v":-2.8270948773040822E-4},{"$f":"IF(A129=\"\",\"\",RTD(\"cqg.rtd\", ,\"ContractData\", C129, \"T_CVol\",, \"T\"))","v":40902.174414000001},129,{"$f":"IFERROR(RANK($J129,INDIRECT((\"$J$\"&\"1\"&\":$J$\"&$A$449)))+COUNTIF($J$1:J129,J129)-1,\"\")","v":343},"S.US.DPZ","S.US.F"]
[{"$f":"IF(Symbols!A130=\"\",\"\",Symbols!A130)","v":"S.US.DRI"},1,"S.US.DRI",{"$f":"IF(A130=\"\",\"\",RTD(\"cqg.rtd\", ,\"ContractData\",C130, \"LongDescription\",, \"T\"))","v":"Darden Restaurants Inc"},null,null,null,{"$f":"IF(A130=\"\",\"\",RTD(\"cqg.rtd\", ,\"ContractData\",C130, \"LastTradeToday\",, \"T\"))","v":229},{"$f":"IF(A130=\"\",\"\",RTD(\"cqg.rtd\", ,\"ContractData\",C130, \"NetLastTradeToday\",, \"T\"))","v":1.32},{"$f":"IF(A130=\"\",\"\",IFERROR(RTD(\"cqg.rtd\", ,\"ContractData\",C130, \"PerCentNetLastTrade\",, \"T\")/100,\"\"))","v":5.7976106816584683E-3},{"$f":"IF(A130=\"\",\"\",RTD(\"cqg.rtd\", ,\"ContractData\", C130, \"T_CVol\",, \"T\"))","v":107292.19667},130,{"$f":"IFERROR(RANK($J130,INDIRECT((\"$J$\"&\"1\"&\":$J$\"&$A$449)))+COUNTIF($J$1:J130,J130)-1,\"\")","v":258},{"$f":"C130","v":"S.US.DRI"},{"$f":"IFERROR(VLOOKUP($L130,$M$1:$N$437,2,FALSE),\"\")","v":"S.US.VICI"}]
[{"$f":"IF(Symbols!A131=\"\",\"\",Symbols!A131)","v":"S.US.DTE"},1,"S.US.DTE",{"$f":"IF(A131=\"\",\"\",RTD(\"cqg.rtd\", ,\"ContractData\",C131, \"LongDescription\",, \"T\"))","v":"DTE Energy Corp"},null,null,null,{"$f":"IF(A131=\"\",\"\",RTD(\"cqg.rtd\", ,\"ContractData\",C131, \"LastTradeToday\",, \"T\"))","v":139.47},{"$f":"IF(A131=\"\",\"\",RTD(\"cqg.rtd\", ,\"ContractData\",C131, \"NetLastTradeToday\",, \"T\"))","v":0.79},{"$f":"IF(A131=\"\",\"\",IFERROR(RTD(\"cqg.rtd\", ,\"ContractData\",C131, \"PerCentNetLastTrade\",, \"T\")/100,\"\"))","v":5.6965676377271415E-3},{"$f":"IF(A131=\"\",\"\",RTD(\"cqg.rtd\", ,\"ContractData\", C131, \"T_CVol\",, \"T\"))","v":160432.24479999999},{"$f":"L130+1","v":131},{"$f":"IFERROR(RANK($J131,INDIRECT((\"$J$\"&\"1\"&\":$J$\"&$A$449)))+COUNTIF($J$1:J131,J131)-1,\"\")","v":264},"S.US.DTE","S.US.TFC"]
[{"$f":"IF(Symbols!A132=\"\",\"\",Symbols!A132)","v":"S.US.DUK"},1,"S.US.DUK",{"$f":"IF(A132=\"\",\"\",RTD(\"cqg.rtd\", ,\"ContractData\",C132, \"LongDescription\",, \"T\"))","v":"Duke Energy Corp"},null,null,null,{"$f":"IF(A132=\"\",\"\",RTD(\"cqg.rtd\", ,\"ContractData\",C132, \"LastTradeToday\",, \"T\"))","v":124.59},{"$f":"IF(A132=\"\",\"\",RTD(\"cqg.rtd\", ,\"ContractData\",C132, \"NetLastTradeToday\",, \"T\"))","v":1.1000000000000001},{"$f":"IF(A132=\"\",\"\",IFERROR(RTD(\"cqg.rtd\", ,\"ContractData\",C132, \"PerCentNetLastTrade\",, \"T\")/100,\"\"))","v":8.9076038545631217E-3},{"$f":"IF(A132=\"\",\"\",RTD(\"cqg.rtd\", ,\"ContractData\", C132, \"T_CVol\",, \"T\"))","v":417629.43726999999},132,{"$f":"IFERROR(RANK($J132,INDIRECT((\"$J$\"&\"1\"&\":$J$\"&$A$449)))+COUNTIF($J$1:J132,J132)-1,\"\")","v":186},"S.US.DUK","S.US.PAYX"]
[{"$f":"IF(Symbols!A133=\"\",\"\",Symbols!A133)","v":"S.US.DVA"},1,"S.US.DVA",{"$f":"IF(A133=\"\",\"\",RTD(\"cqg.rtd\", ,\"ContractData\",C133, \"LongDescription\",, \"T\"))","v":"DaVita Inc."},null,null,null,{"$f":"IF(A133=\"\",\"\",RTD(\"cqg.rtd\", ,\"ContractData\",C133, \"LastTradeToday\",, \"T\"))","v":182.07},{"$f":"IF(A133=\"\",\"\",RTD(\"cqg.rtd\", ,\"ContractData\",C133, \"NetLastTradeToday\",, \"T\"))","v":0.57000000000000006},{"$f":"IF(A133=\"\",\"\",IFERROR(RTD(\"cqg.rtd\", ,\"ContractData\",C133, \"PerCentNetLastTrade\",, \"T\")/100,\"\"))","v":3.1404958677685949E-3},{"$f":"IF(A133=\"\",\"\",RTD(\"cqg.rtd\", ,\"ContractData\", C133, \"T_CVol\",, \"T\"))","v":44525.615514999998},133,{"$f":"IFERROR(RANK($J133,INDIRECT((\"$J$\"&\"1\"&\":$J$\"&$A$449)))+COUNTIF($J$1:J133,J133)-1,\"\")","v":299},"S.US.DVA","S.US.BMY"]
[{"$f":"IF(Symbols!A134=\"\",\"\",Symbols!A134)","v":"S.US.DVN"},0,"S.US.DVN",{"$f":"IF(A134=\"\",\"\",RTD(\"cqg.rtd\", ,\"ContractData\",C134, \"LongDescription\",, \"T\"))","v":"Devon Energy Corp"},null,null,null,{"$f":"IF(A134=\"\",\"\",RTD(\"cqg.rtd\", ,\"ContractData\",C134, \"LastTradeToday\",, \"T\"))","v":44.03},{"$f":"IF(A134=\"\",\"\",RTD(\"cqg.rtd\", ,\"ContractData\",C134, \"NetLastTradeToday\",, \"T\"))","v":-0.83000000000000007},{"$f":"IF(A134=\"\",\"\",IFERROR(RTD(\"cqg.rtd\", ,\"ContractData\",C134, \"PerCentNetLastTrade\",, \"T\")/100,\"\"))","v":-1.850200624164066E-2},{"$f":"IF(A134=\"\",\"\",RTD(\"cqg.rtd\", ,\"ContractData\", C134, \"T_CVol\",, \"T\"))","v":1830667.7783609999},134,{"$f":"IFERROR(RANK($J134,INDIRECT((\"$J$\"&\"1\"&\":$J$\"&$A$449)))+COUNTIF($J$1:J134,J134)-1,\"\")","v":435},"S.US.DVN","S.US.REGN"]
[{"$f":"IF(Symbols!A135=\"\",\"\",Symbols!A135)","v":"S.US.DXCM"},1,"S.US.DXCM",{"$f":"IF(A135=\"\",\"\",RTD(\"cqg.rtd\", ,\"ContractData\",C135, \"LongDescription\",, \"T\"))","v":"DEXCOM"},null,null,null,{"$f":"IF(A135=\"\",\"\",RTD(\"cqg.rtd\", ,\"ContractData\",C135, \"LastTradeToday\",, \"T\"))","v":91.05},{"$f":"IF(A135=\"\",\"\",RTD(\"cqg.rtd\", ,\"ContractData\",C135, \"NetLastTradeToday\",, \"T\"))","v":0.25},{"$f":"IF(A135=\"\",\"\",IFERROR(RTD(\"cqg.rtd\", ,\"ContractData\",C135, \"PerCentNetLastTrade\",, \"T\")/100,\"\"))","v":2.753303964757709E-3},{"$f":"IF(A135=\"\",\"\",RTD(\"cqg.rtd\", ,\"ContractData\", C135, \"T_CVol\",, \"T\"))","v":977685.58499400003},135,{"$f":"IFERROR(RANK($J135,INDIRECT((\"$J$\"&\"1\"&\":$J$\"&$A$449)))+COUNTIF($J$1:J135,J135)-1,\"\")","v":305},"S.US.DXCM","S.US.AZO"]
[{"$f":"IF(Symbols!A136=\"\",\"\",Symbols!A136)","v":"S.US.EBAY"},1,"S.US.EBAY",{"$f":"IF(A136=\"\",\"\",RTD(\"cqg.rtd\", ,\"ContractData\",C136, \"LongDescription\",, \"T\"))","v":"EBAY INC."},null,null,null,{"$f":"IF(A136=\"\",\"\",RTD(\"cqg.rtd\", ,\"ContractData\",C136, \"LastTradeToday\",, \"T\"))","v":104.46000000000001},{"$f":"IF(A136=\"\",\"\",RTD(\"cqg.rtd\", ,\"ContractData\",C136, \"NetLastTradeToday\",, \"T\"))","v":2.15},{"$f":"IF(A136=\"\",\"\",IFERROR(RTD(\"cqg.rtd\", ,\"ContractData\",C136, \"PerCentNetLastTrade\",, \"T\")/100,\"\"))","v":2.1014563581272606E-2},{"$f":"IF(A136=\"\",\"\",RTD(\"cqg.rtd\", ,\"ContractData\", C136, \"T_CVol\",, \"T\"))","v":510572.61629699997},136,{"$f":"IFERROR(RANK($J136,INDIRECT((\"$J$\"&\"1\"&\":$J$\"&$A$449)))+COUNTIF($J$1:J136,J136)-1,\"\")","v":50},"S.US.EBAY","S.US.ES"]
[{"$f":"IF(Symbols!A137=\"\",\"\",Symbols!A137)","v":"S.US.ECL"},0,"S.US.ECL",{"$f":"IF(A137=\"\",\"\",RTD(\"cqg.rtd\", ,\"ContractData\",C137, \"LongDescription\",, \"T\"))","v":"Ecolab Inc"},null,null,null,{"$f":"IF(A137=\"\",\"\",RTD(\"cqg.rtd\", ,\"ContractData\",C137, \"LastTradeToday\",, \"T\"))","v":277.97000000000003},{"$f":"IF(A137=\"\",\"\",RTD(\"cqg.rtd\", ,\"ContractData\",C137, \"NetLastTradeToday\",, \"T\"))","v":-0.46},{"$f":"IF(A137=\"\",\"\",IFERROR(RTD(\"cqg.rtd\", ,\"ContractData\",C137, \"PerCentNetLastTrade\",, \"T\")/100,\"\"))","v":-1.6521208203139029E-3},{"$f":"IF(A137=\"\",\"\",RTD(\"cqg.rtd\", ,\"ContractData\", C137, \"T_CVol\",, \"T\"))","v":106589.27153300001},137,{"$f":"IFERROR(RANK($J137,INDIRECT((\"$J$\"&\"1\"&\":$J$\"&$A$449)))+COUNTIF($J$1:J137,J137)-1,\"\")","v":360},"S.US.ECL","S.US.NWSA"]
[{"$f":"IF(Symbols!A138=\"\",\"\",Symbols!A138)","v":"S.US.ED"},1,"S.US.ED",{"$f":"IF(A138=\"\",\"\",RTD(\"cqg.rtd\", ,\"ContractData\",C138, \"LongDescription\",, \"T\"))","v":"Consol Edison Hldg Co"},null,null,null,{"$f":"IF(A138=\"\",\"\",RTD(\"cqg.rtd\", ,\"ContractData\",C138, \"LastTradeToday\",, \"T\"))","v":108.4},{"$f":"IF(A138=\"\",\"\",RTD(\"cqg.rtd\", ,\"ContractData\",C138, \"NetLastTradeToday\",, \"T\"))","v":0.62},{"$f":"IF(A138=\"\",\"\",IFERROR(RTD(\"cqg.rtd\", ,\"ContractData\",C138, \"PerCentNetLastTrade\",, \"T\")/100,\"\"))","v":5.7524587121915013E-3},{"$f":"IF(A138=\"\",\"\",RTD(\"cqg.rtd\", ,\"ContractData\", C138, \"T_CVol\",, \"T\"))","v":147253.405077},138,{"$f":"IFERROR(RANK($J138,INDIRECT((\"$J$\"&\"1\"&\":$J$\"&$A$449)))+COUNTIF($J$1:J138,J138)-1,\"\")","v":259},"S.US.ED","S.US.ABT"]
[{"$f":"IF(Symbols!A139=\"\",\"\",Symbols!A139)","v":"S.US.EFX"},1,"S.US.EFX",{"$f":"IF(A139=\"\",\"\",RTD(\"cqg.rtd\", ,\"ContractData\",C139, \"LongDescription\",, \"T\"))","v":"Equifax Inc"},null,null,null,{"$f":"IF(A139=\"\",\"\",RTD(\"cqg.rtd\", ,\"ContractData\",C139, \"LastTradeToday\",, \"T\"))","v":183.63},{"$f":"IF(A139=\"\",\"\",RTD(\"cqg.rtd\", ,\"ContractData\",C139, \"NetLastTradeToday\",, \"T\"))","v":3.17},{"$f":"IF(A139=\"\",\"\",IFERROR(RTD(\"cqg.rtd\", ,\"ContractData\",C139, \"PerCentNetLastTrade\",, \"T\")/100,\"\"))","v":1.7566219660866675E-2},{"$f":"IF(A139=\"\",\"\",RTD(\"cqg.rtd\", ,\"ContractData\", C139, \"T_CVol\",, \"T\"))","v":64707.683723000002},139,{"$f":"IFERROR(RANK($J139,INDIRECT((\"$J$\"&\"1\"&\":$J$\"&$A$449)))+COUNTIF($J$1:J139,J139)-1,\"\")","v":76},"S.US.EFX","S.US.EXC"]
[{"$f":"IF(Symbols!A140=\"\",\"\",Symbols!A140)","v":"S.US.EG"},1,"S.US.EG",{"$f":"IF(A140=\"\",\"\",RTD(\"cqg.rtd\", ,\"ContractData\",C140, \"LongDescription\",, \"T\"))","v":"Everest Group, Ltd."},null,null,null,{"$f":"IF(A140=\"\",\"\",RTD(\"cqg.rtd\", ,\"ContractData\",C140, \"LastTradeToday\",, \"T\"))","v":365},{"$f":"IF(A140=\"\",\"\",RTD(\"cqg.rtd\", ,\"ContractData\",C140, \"NetLastTradeToday\",, \"T\"))","v":1.33},{"$f":"IF(A140=\"\",\"\",IFERROR(RTD(\"cqg.rtd\", ,\"ContractData\",C140, \"PerCentNetLastTrade\",, \"T\")/100,\"\"))","v":3.6571617125415899E-3},{"$f":"IF(A140=\"\",\"\",RTD(\"cqg.rtd\", ,\"ContractData\", C140, \"T_CVol\",, \"T\"))","v":32862.752636999998},140,{"$f":"IFERROR(RANK($J140,INDIRECT((\"$J$\"&\"1\"&\":$J$\"&$A$449)))+COUNTIF($J$1:J140,J140)-1,\"\")","v":291},"S.US.EG","S.US.PGR"]
[{"$f":"IF(Symbols!A141=\"\",\"\",Symbols!A141)","v":"S.US.EIX"},1,"S.US.EIX",{"$f":"IF(A141=\"\",\"\",RTD(\"cqg.rtd\", ,\"ContractData\",C141, \"LongDescription\",, \"T\"))","v":"Edison International"},null,null,null,{"$f":"IF(A141=\"\",\"\",RTD(\"cqg.rtd\", ,\"ContractData\",C141, \"LastTradeToday\",, \"T\"))","v":70.790000000000006},{"$f":"IF(A141=\"\",\"\",RTD(\"cqg.rtd\", ,\"ContractData\",C141, \"NetLastTradeToday\",, \"T\"))","v":1.3900000000000001},{"$f":"IF(A141=\"\",\"\",IFERROR(RTD(\"cqg.rtd\", ,\"ContractData\",C141, \"PerCentNetLastTrade\",, \"T\")/100,\"\"))","v":2.0028818443804032E-2},{"$f":"IF(A141=\"\",\"\",RTD(\"cqg.rtd\", ,\"ContractData\", C141, \"T_CVol\",, \"T\"))","v":331083.72689300001},141,{"$f":"IFERROR(RANK($J141,INDIRECT((\"$J$\"&\"1\"&\":$J$\"&$A$449)))+COUNTIF($J$1:J141,J141)-1,\"\")","v":59},"S.US.EIX","S.US.CTSH"]
[{"$f":"IF(Symbols!A142=\"\",\"\",Symbols!A142)","v":"S.US.EL"},1,"S.US.EL",{"$f":"IF(A142=\"\",\"\",RTD(\"cqg.rtd\", ,\"ContractData\",C142, \"LongDescription\",, \"T\"))","v":"Estee Lauder Companies"},null,null,null,{"$f":"IF(A142=\"\",\"\",RTD(\"cqg.rtd\", ,\"ContractData\",C142, \"LastTradeToday\",, \"T\"))","v":88.31},{"$f":"IF(A142=\"\",\"\",RTD(\"cqg.rtd\", ,\"ContractData\",C142, \"NetLastTradeToday\",, \"T\"))","v":0.63},{"$f":"IF(A142=\"\",\"\",IFERROR(RTD(\"cqg.rtd\", ,\"ContractData\",C142, \"PerCentNetLastTrade\",, \"T\")/100,\"\"))","v":7.1852189781021905E-3},{"$f":"IF(A142=\"\",\"\",RTD(\"cqg.rtd\", ,\"ContractData\", C142, \"T_CVol\",, \"T\"))","v":179231.22710399999},142,{"$f":"IFERROR(RANK($J142,INDIRECT((\"$J$\"&\"1\"&\":$J$\"&$A$449)))+COUNTIF($J$1:J142,J142)-1,\"\")","v":226},"S.US.EL","S.US.HSY"]
[{"$f":"IF(Symbols!A143=\"\",\"\",Symbols!A143)","v":"S.US.ELV"},1,"S.US.ELV",{"$f":"IF(A143=\"\",\"\",RTD(\"cqg.rtd\", ,\"ContractData\",C143, \"LongDescription\",, \"T\"))","v":"Elevance Health, Inc."},null,null,null,{"$f":"IF(A143=\"\",\"\",RTD(\"cqg.rtd\", ,\"ContractData\",C143, \"LastTradeToday\",, \"T\"))","v":403.12},{"$f":"IF(A143=\"\",\"\",RTD(\"cqg.rtd\", ,\"ContractData\",C143, \"NetLastTradeToday\",, \"T\"))","v":3.98},{"$f":"IF(A143=\"\",\"\",IFERROR(RTD(\"cqg.rtd\", ,\"ContractData\",C143, \"PerCentNetLastTrade\",, \"T\")/100,\"\"))","v":9.9714385929748958E-3},{"$f":"IF(A143=\"\",\"\",RTD(\"cqg.rtd\", ,\"ContractData\", C143, \"T_CVol\",, \"T\"))","v":92722.607613999993},143,{"$f":"IFERROR(RANK($J143,INDIRECT((\"$J$\"&\"1\"&\":$J$\"&$A$449)))+COUNTIF($J$1:J143,J143)-1,\"\")","v":163},"S.US.ELV","S.US.LOW"]
[{"$f":"IF(Symbols!A144=\"\",\"\",Symbols!A144)","v":"S.US.EMR"},0,"S.US.EMR",{"$f":"IF(A144=\"\",\"\",RTD(\"cqg.rtd\", ,\"ContractData\",C144, \"LongDescription\",, \"T\"))","v":"Emerson Electric Co"},null,null,null,{"$f":"IF(A144=\"\",\"\",RTD(\"cqg.rtd\", ,\"ContractData\",C144, \"LastTradeToday\",, \"T\"))","v":161.52000000000001},{"$f":"IF(A144=\"\",\"\",RTD(\"cqg.rtd\", ,\"ContractData\",C144, \"NetLastTradeToday\",, \"T\"))","v":-2.2800000000000002},{"$f":"IF(A144=\"\",\"\",IFERROR(RTD(\"cqg.rtd\", ,\"ContractData\",C144, \"PerCentNetLastTrade\",, \"T\")/100,\"\"))","v":-1.3919413919413919E-2},{"$f":"IF(A144=\"\",\"\",RTD(\"cqg.rtd\", ,\"ContractData\", C144, \"T_CVol\",, \"T\"))","v":372863.897589},144,{"$f":"IFERROR(RANK($J144,INDIRECT((\"$J$\"&\"1\"&\":$J$\"&$A$449)))+COUNTIF($J$1:J144,J144)-1,\"\")","v":429},"S.US.EMR","S.US.DOC"]
[{"$f":"IF(Symbols!A145=\"\",\"\",Symbols!A145)","v":"S.US.EOG"},0,"S.US.EOG",{"$f":"IF(A145=\"\",\"\",RTD(\"cqg.rtd\", ,\"ContractData\",C145, \"LongDescription\",, \"T\"))","v":"EOG Resources"},null,null,null,{"$f":"IF(A145=\"\",\"\",RTD(\"cqg.rtd\", ,\"ContractData\",C145, \"LastTradeToday\",, \"T\"))","v":141.67000000000002},{"$f":"IF(A145=\"\",\"\",RTD(\"cqg.rtd\", ,\"ContractData\",C145, \"NetLastTradeToday\",, \"T\"))","v":-1.47},{"$f":"IF(A145=\"\",\"\",IFERROR(RTD(\"cqg.rtd\", ,\"ContractData\",C145, \"PerCentNetLastTrade\",, \"T\")/100,\"\"))","v":-1.0269666061198826E-2},{"$f":"IF(A145=\"\",\"\",RTD(\"cqg.rtd\", ,\"ContractData\", C145, \"T_CVol\",, \"T\"))","v":555819.744832},145,{"$f":"IFERROR(RANK($J145,INDIRECT((\"$J$\"&\"1\"&\":$J$\"&$A$449)))+COUNTIF($J$1:J145,J145)-1,\"\")","v":417},"S.US.EOG","S.US.VEEV"]
[{"$f":"IF(Symbols!A146=\"\",\"\",Symbols!A146)","v":"S.US.EQIX"},1,"S.US.EQIX",{"$f":"IF(A146=\"\",\"\",RTD(\"cqg.rtd\", ,\"ContractData\",C146, \"LongDescription\",, \"T\"))","v":"EQUINIX, INC."},null,null,null,{"$f":"IF(A146=\"\",\"\",RTD(\"cqg.rtd\", ,\"ContractData\",C146, \"LastTradeToday\",, \"T\"))","v":1075.43},{"$f":"IF(A146=\"\",\"\",RTD(\"cqg.rtd\", ,\"ContractData\",C146, \"NetLastTradeToday\",, \"T\"))","v":6.26},{"$f":"IF(A146=\"\",\"\",IFERROR(RTD(\"cqg.rtd\", ,\"ContractData\",C146, \"PerCentNetLastTrade\",, \"T\")/100,\"\"))","v":5.8550090256928268E-3},{"$f":"IF(A146=\"\",\"\",RTD(\"cqg.rtd\", ,\"ContractData\", C146, \"T_CVol\",, \"T\"))","v":35882.768218999998},146,{"$f":"IFERROR(RANK($J146,INDIRECT((\"$J$\"&\"1\"&\":$J$\"&$A$449)))+COUNTIF($J$1:J146,J146)-1,\"\")","v":255},"S.US.EQIX","S.US.CL"]
[{"$f":"IF(Symbols!A147=\"\",\"\",Symbols!A147)","v":"S.US.EQR"},1,"S.US.EQR",{"$f":"IF(A147=\"\",\"\",RTD(\"cqg.rtd\", ,\"ContractData\",C147, \"LongDescription\",, \"T\"))","v":"Equity Residential Properties Trust"},null,null,null,{"$f":"IF(A147=\"\",\"\",RTD(\"cqg.rtd\", ,\"ContractData\",C147, \"LastTradeToday\",, \"T\"))","v":66.52},{"$f":"IF(A147=\"\",\"\",RTD(\"cqg.rtd\", ,\"ContractData\",C147, \"NetLastTradeToday\",, \"T\"))","v":2.1},{"$f":"IF(A147=\"\",\"\",IFERROR(RTD(\"cqg.rtd\", ,\"ContractData\",C147, \"PerCentNetLastTrade\",, \"T\")/100,\"\"))","v":3.2598571872089414E-2},{"$f":"IF(A147=\"\",\"\",RTD(\"cqg.rtd\", ,\"ContractData\", C147, \"T_CVol\",, \"T\"))","v":785281.637017},147,{"$f":"IFERROR(RANK($J147,INDIRECT((\"$J$\"&\"1\"&\":$J$\"&$A$449)))+COUNTIF($J$1:J147,J147)-1,\"\")","v":14},"S.US.EQR","S.US.ADBE"]
[{"$f":"IF(Symbols!A148=\"\",\"\",Symbols!A148)","v":"S.US.EQT"},0,"S.US.EQT",{"$f":"IF(A148=\"\",\"\",RTD(\"cqg.rtd\", ,\"ContractData\",C148, \"LongDescription\",, \"T\"))","v":"EQT Corp"},null,null,null,{"$f":"IF(A148=\"\",\"\",RTD(\"cqg.rtd\", ,\"ContractData\",C148, \"LastTradeToday\",, \"T\"))","v":53.99},{"$f":"IF(A148=\"\",\"\",RTD(\"cqg.rtd\", ,\"ContractData\",C148, \"NetLastTradeToday\",, \"T\"))","v":-7.0000000000000007E-2},{"$f":"IF(A148=\"\",\"\",IFERROR(RTD(\"cqg.rtd\", ,\"ContractData\",C148, \"PerCentNetLastTrade\",, \"T\")/100,\"\"))","v":-1.2948575656677767E-3},{"$f":"IF(A148=\"\",\"\",RTD(\"cqg.rtd\", ,\"ContractData\", C148, \"T_CVol\",, \"T\"))","v":1028825.2310640001},148,{"$f":"IFERROR(RANK($J148,INDIRECT((\"$J$\"&\"1\"&\":$J$\"&$A$449)))+COUNTIF($J$1:J148,J148)-1,\"\")","v":355},"S.US.EQT","S.US.TGT"]
[{"$f":"IF(Symbols!A149=\"\",\"\",Symbols!A149)","v":"S.US.ERIE"},0,"S.US.ERIE",{"$f":"IF(A149=\"\",\"\",RTD(\"cqg.rtd\", ,\"ContractData\",C149, \"LongDescription\",, \"T\"))","v":"Erie Indemnity Co"},null,null,null,{"$f":"IF(A149=\"\",\"\",RTD(\"cqg.rtd\", ,\"ContractData\",C149, \"LastTradeToday\",, \"T\"))","v":257.2},{"$f":"IF(A149=\"\",\"\",RTD(\"cqg.rtd\", ,\"ContractData\",C149, \"NetLastTradeToday\",, \"T\"))","v":-0.97},{"$f":"IF(A149=\"\",\"\",IFERROR(RTD(\"cqg.rtd\", ,\"ContractData\",C149, \"PerCentNetLastTrade\",, \"T\")/100,\"\"))","v":-3.7572142386799396E-3},{"$f":"IF(A149=\"\",\"\",RTD(\"cqg.rtd\", ,\"ContractData\", C149, \"T_CVol\",, \"T\"))","v":23177.103497},149,{"$f":"IFERROR(RANK($J149,INDIRECT((\"$J$\"&\"1\"&\":$J$\"&$A$449)))+COUNTIF($J$1:J149,J149)-1,\"\")","v":382},"S.US.ERIE","S.US.GILD"]
[{"$f":"IF(Symbols!A150=\"\",\"\",Symbols!A150)","v":"S.US.ES"},1,"S.US.ES",{"$f":"IF(A150=\"\",\"\",RTD(\"cqg.rtd\", ,\"ContractData\",C150, \"LongDescription\",, \"T\"))","v":"Eversource Energy"},null,null,null,{"$f":"IF(A150=\"\",\"\",RTD(\"cqg.rtd\", ,\"ContractData\",C150, \"LastTradeToday\",, \"T\"))","v":72.400000000000006},{"$f":"IF(A150=\"\",\"\",RTD(\"cqg.rtd\", ,\"ContractData\",C150, \"NetLastTradeToday\",, \"T\"))","v":0.85},{"$f":"IF(A150=\"\",\"\",IFERROR(RTD(\"cqg.rtd\", ,\"ContractData\",C150, \"PerCentNetLastTrade\",, \"T\")/100,\"\"))","v":1.187980433263452E-2},{"$f":"IF(A150=\"\",\"\",RTD(\"cqg.rtd\", ,\"ContractData\", C150, \"T_CVol\",, \"T\"))","v":143904.08734599999},150,{"$f":"IFERROR(RANK($J150,INDIRECT((\"$J$\"&\"1\"&\":$J$\"&$A$449)))+COUNTIF($J$1:J150,J150)-1,\"\")","v":136},"S.US.ES","S.US.CPAY"]
[{"$f":"IF(Symbols!A151=\"\",\"\",Symbols!A151)","v":"S.US.ESS"},1,"S.US.ESS",{"$f":"IF(A151=\"\",\"\",RTD(\"cqg.rtd\", ,\"ContractData\",C151, \"LongDescription\",, \"T\"))","v":"Essex Property Trust Inc"},null,null,null,{"$f":"IF(A151=\"\",\"\",RTD(\"cqg.rtd\", ,\"ContractData\",C151, \"LastTradeToday\",, \"T\"))","v":288.72000000000003},{"$f":"IF(A151=\"\",\"\",RTD(\"cqg.rtd\", ,\"ContractData\",C151, \"NetLastTradeToday\",, \"T\"))","v":7.45},{"$f":"IF(A151=\"\",\"\",IFERROR(RTD(\"cqg.rtd\", ,\"ContractData\",C151, \"PerCentNetLastTrade\",, \"T\")/100,\"\"))","v":2.6487005368507132E-2},{"$f":"IF(A151=\"\",\"\",RTD(\"cqg.rtd\", ,\"ContractData\", C151, \"T_CVol\",, \"T\"))","v":33503.249185000001},151,{"$f":"IFERROR(RANK($J151,INDIRECT((\"$J$\"&\"1\"&\":$J$\"&$A$449)))+COUNTIF($J$1:J151,J151)-1,\"\")","v":29},"S.US.ESS","S.US.DLR"]
[{"$f":"IF(Symbols!A152=\"\",\"\",Symbols!A152)","v":"S.US.ETN"},0,"S.US.ETN",{"$f":"IF(A152=\"\",\"\",RTD(\"cqg.rtd\", ,\"ContractData\",C152, \"LongDescription\",, \"T\"))","v":"Eaton Corporation"},null,null,null,{"$f":"IF(A152=\"\",\"\",RTD(\"cqg.rtd\", ,\"ContractData\",C152, \"LastTradeToday\",, \"T\"))","v":455.12},{"$f":"IF(A152=\"\",\"\",RTD(\"cqg.rtd\", ,\"ContractData\",C152, \"NetLastTradeToday\",, \"T\"))","v":-4.84},{"$f":"IF(A152=\"\",\"\",IFERROR(RTD(\"cqg.rtd\", ,\"ContractData\",C152, \"PerCentNetLastTrade\",, \"T\")/100,\"\"))","v":-1.0522654143838595E-2},{"$f":"IF(A152=\"\",\"\",RTD(\"cqg.rtd\", ,\"ContractData\", C152, \"T_CVol\",, \"T\"))","v":205921.34651900001},152,{"$f":"IFERROR(RANK($J152,INDIRECT((\"$J$\"&\"1\"&\":$J$\"&$A$449)))+COUNTIF($J$1:J152,J152)-1,\"\")","v":420},"S.US.ETN","S.US.SNPS"]
[{"$f":"IF(Symbols!A153=\"\",\"\",Symbols!A153)","v":"S.US.ETR"},0,"S.US.ETR",{"$f":"IF(A153=\"\",\"\",RTD(\"cqg.rtd\", ,\"ContractData\",C153, \"LongDescription\",, \"T\"))","v":"Entergy Corporation"},null,null,null,{"$f":"IF(A153=\"\",\"\",RTD(\"cqg.rtd\", ,\"ContractData\",C153, \"LastTradeToday\",, \"T\"))","v":107.35000000000001},{"$f":"IF(A153=\"\",\"\",RTD(\"cqg.rtd\", ,\"ContractData\",C153, \"NetLastTradeToday\",, \"T\"))","v":-0.5},{"$f":"IF(A153=\"\",\"\",IFERROR(RTD(\"cqg.rtd\", ,\"ContractData\",C153, \"PerCentNetLastTrade\",, \"T\")/100,\"\"))","v":-4.6360686138154847E-3},{"$f":"IF(A153=\"\",\"\",RTD(\"cqg.rtd\", ,\"ContractData\", C153, \"T_CVol\",, \"T\"))","v":230778.31456599999},153,{"$f":"IFERROR(RANK($J153,INDIRECT((\"$J$\"&\"1\"&\":$J$\"&$A$449)))+COUNTIF($J$1:J153,J153)-1,\"\")","v":387},"S.US.ETR","S.US.NWS"]
[{"$f":"IF(Symbols!A154=\"\",\"\",Symbols!A154)","v":"S.US.EVRG"},1,"S.US.EVRG",{"$f":"IF(A154=\"\",\"\",RTD(\"cqg.rtd\", ,\"ContractData\",C154, \"LongDescription\",, \"T\"))","v":"Evergy, Inc."},null,null,null,{"$f":"IF(A154=\"\",\"\",RTD(\"cqg.rtd\", ,\"ContractData\",C154, \"LastTradeToday\",, \"T\"))","v":83.66},{"$f":"IF(A154=\"\",\"\",RTD(\"cqg.rtd\", ,\"ContractData\",C154, \"NetLastTradeToday\",, \"T\"))","v":0.34},{"$f":"IF(A154=\"\",\"\",IFERROR(RTD(\"cqg.rtd\", ,\"ContractData\",C154, \"PerCentNetLastTrade\",, \"T\")/100,\"\"))","v":4.0806529044647146E-3},{"$f":"IF(A154=\"\",\"\",RTD(\"cqg.rtd\", ,\"ContractData\", C154, \"T_CVol\",, \"T\"))","v":141030.67404000001},154,{"$f":"IFERROR(RANK($J154,INDIRECT((\"$J$\"&\"1\"&\":$J$\"&$A$449)))+COUNTIF($J$1:J154,J154)-1,\"\")","v":280},"S.US.EVRG","S.US.COIN"]
[{"$f":"IF(Symbols!A155=\"\",\"\",Symbols!A155)","v":"S.US.EW"},1,"S.US.EW",{"$f":"IF(A155=\"\",\"\",RTD(\"cqg.rtd\", ,\"ContractData\",C155, \"LongDescription\",, \"T\"))","v":"Edwards LifeSciences"},null,null,null,{"$f":"IF(A155=\"\",\"\",RTD(\"cqg.rtd\", ,\"ContractData\",C155, \"LastTradeToday\",, \"T\"))","v":93.41},{"$f":"IF(A155=\"\",\"\",RTD(\"cqg.rtd\", ,\"ContractData\",C155, \"NetLastTradeToday\",, \"T\"))","v":0.36},{"$f":"IF(A155=\"\",\"\",IFERROR(RTD(\"cqg.rtd\", ,\"ContractData\",C155, \"PerCentNetLastTrade\",, \"T\")/100,\"\"))","v":3.8688876947877487E-3},{"$f":"IF(A155=\"\",\"\",RTD(\"cqg.rtd\", ,\"ContractData\", C155, \"T_CVol\",, \"T\"))","v":181856.97034299999},155,{"$f":"IFERROR(RANK($J155,INDIRECT((\"$J$\"&\"1\"&\":$J$\"&$A$449)))+COUNTIF($J$1:J155,J155)-1,\"\")","v":284},"S.US.EW","S.US.CSX"]
[{"$f":"IF(Symbols!A156=\"\",\"\",Symbols!A156)","v":"S.US.EXC"},1,"S.US.EXC",{"$f":"IF(A156=\"\",\"\",RTD(\"cqg.rtd\", ,\"ContractData\",C156, \"LongDescription\",, \"T\"))","v":"EXELON CORP CMN STK"},null,null,null,{"$f":"IF(A156=\"\",\"\",RTD(\"cqg.rtd\", ,\"ContractData\",C156, \"LastTradeToday\",, \"T\"))","v":45.75},{"$f":"IF(A156=\"\",\"\",RTD(\"cqg.rtd\", ,\"ContractData\",C156, \"NetLastTradeToday\",, \"T\"))","v":0.53},{"$f":"IF(A156=\"\",\"\",IFERROR(RTD(\"cqg.rtd\", ,\"ContractData\",C156, \"PerCentNetLastTrade\",, \"T\")/100,\"\"))","v":1.1720477664750111E-2},{"$f":"IF(A156=\"\",\"\",RTD(\"cqg.rtd\", ,\"ContractData\", C156, \"T_CVol\",, \"T\"))","v":524436.47892999998},156,{"$f":"IFERROR(RANK($J156,INDIRECT((\"$J$\"&\"1\"&\":$J$\"&$A$449)))+COUNTIF($J$1:J156,J156)-1,\"\")","v":139},"S.US.EXC","S.US.CME"]
[{"$f":"IF(Symbols!A157=\"\",\"\",Symbols!A157)","v":"S.US.EXE"},0,"S.US.EXE",{"$f":"IF(A157=\"\",\"\",RTD(\"cqg.rtd\", ,\"ContractData\",C157, \"LongDescription\",, \"T\"))","v":"EXPAND ENERGY COR CS"},null,null,null,{"$f":"IF(A157=\"\",\"\",RTD(\"cqg.rtd\", ,\"ContractData\",C157, \"LastTradeToday\",, \"T\"))","v":94.56},{"$f":"IF(A157=\"\",\"\",RTD(\"cqg.rtd\", ,\"ContractData\",C157, \"NetLastTradeToday\",, \"T\"))","v":-1.72},{"$f":"IF(A157=\"\",\"\",IFERROR(RTD(\"cqg.rtd\", ,\"ContractData\",C157, \"PerCentNetLastTrade\",, \"T\")/100,\"\"))","v":-1.7864561695056087E-2},{"$f":"IF(A157=\"\",\"\",RTD(\"cqg.rtd\", ,\"ContractData\", C157, \"T_CVol\",, \"T\"))","v":242022.339672},157,{"$f":"IFERROR(RANK($J157,INDIRECT((\"$J$\"&\"1\"&\":$J$\"&$A$449)))+COUNTIF($J$1:J157,J157)-1,\"\")","v":434},"S.US.EXE","S.US.KO"]
[{"$f":"IF(Symbols!A158=\"\",\"\",Symbols!A158)","v":"S.US.EXPD"},1,"S.US.EXPD",{"$f":"IF(A158=\"\",\"\",RTD(\"cqg.rtd\", ,\"ContractData\",C158, \"LongDescription\",, \"T\"))","v":"Expeditors Intl of WA Inc"},null,null,null,{"$f":"IF(A158=\"\",\"\",RTD(\"cqg.rtd\", ,\"ContractData\",C158, \"LastTradeToday\",, \"T\"))","v":186.02},{"$f":"IF(A158=\"\",\"\",RTD(\"cqg.rtd\", ,\"ContractData\",C158, \"NetLastTradeToday\",, \"T\"))","v":1.55},{"$f":"IF(A158=\"\",\"\",IFERROR(RTD(\"cqg.rtd\", ,\"ContractData\",C158, \"PerCentNetLastTrade\",, \"T\")/100,\"\"))","v":8.4024502629153792E-3},{"$f":"IF(A158=\"\",\"\",RTD(\"cqg.rtd\", ,\"ContractData\", C158, \"T_CVol\",, \"T\"))","v":108008.891966},158,{"$f":"IFERROR(RANK($J158,INDIRECT((\"$J$\"&\"1\"&\":$J$\"&$A$449)))+COUNTIF($J$1:J158,J158)-1,\"\")","v":199},"S.US.EXPD","S.US.VRSK"]
[{"$f":"IF(Symbols!A159=\"\",\"\",Symbols!A159)","v":"S.US.EXR"},1,"S.US.EXR",{"$f":"IF(A159=\"\",\"\",RTD(\"cqg.rtd\", ,\"ContractData\",C159, \"LongDescription\",, \"T\"))","v":"Extra Space Storage Inc"},null,null,null,{"$f":"IF(A159=\"\",\"\",RTD(\"cqg.rtd\", ,\"ContractData\",C159, \"LastTradeToday\",, \"T\"))","v":149.5},{"$f":"IF(A159=\"\",\"\",RTD(\"cqg.rtd\", ,\"ContractData\",C159, \"NetLastTradeToday\",, \"T\"))","v":2.74},{"$f":"IF(A159=\"\",\"\",IFERROR(RTD(\"cqg.rtd\", ,\"ContractData\",C159, \"PerCentNetLastTrade\",, \"T\")/100,\"\"))","v":1.8669937312619244E-2},{"$f":"IF(A159=\"\",\"\",RTD(\"cqg.rtd\", ,\"ContractData\", C159, \"T_CVol\",, \"T\"))","v":82742.088690000004},159,{"$f":"IFERROR(RANK($J159,INDIRECT((\"$J$\"&\"1\"&\":$J$\"&$A$449)))+COUNTIF($J$1:J159,J159)-1,\"\")","v":67},"S.US.EXR","S.US.UPS"]
[{"$f":"IF(Symbols!A160=\"\",\"\",Symbols!A160)","v":"S.US.F"},1,"S.US.F",{"$f":"IF(A160=\"\",\"\",RTD(\"cqg.rtd\", ,\"ContractData\",C160, \"LongDescription\",, \"T\"))","v":"Ford Motor Company"},null,null,null,{"$f":"IF(A160=\"\",\"\",RTD(\"cqg.rtd\", ,\"ContractData\",C160, \"LastTradeToday\",, \"T\"))","v":14},{"$f":"IF(A160=\"\",\"\",RTD(\"cqg.rtd\", ,\"ContractData\",C160, \"NetLastTradeToday\",, \"T\"))","v":0.17},{"$f":"IF(A160=\"\",\"\",IFERROR(RTD(\"cqg.rtd\", ,\"ContractData\",C160, \"PerCentNetLastTrade\",, \"T\")/100,\"\"))","v":1.2292118582791034E-2},{"$f":"IF(A160=\"\",\"\",RTD(\"cqg.rtd\", ,\"ContractData\", C160, \"T_CVol\",, \"T\"))","v":4804745.1924050003},160,{"$f":"IFERROR(RANK($J160,INDIRECT((\"$J$\"&\"1\"&\":$J$\"&$A$449)))+COUNTIF($J$1:J160,J160)-1,\"\")","v":129},"S.US.F","S.US.RSG"]
[{"$f":"IF(Symbols!A161=\"\",\"\",Symbols!A161)","v":"S.US.FANG"},0,"S.US.FANG",{"$f":"IF(A161=\"\",\"\",RTD(\"cqg.rtd\", ,\"ContractData\",C161, \"LongDescription\",, \"T\"))","v":"DIAMONDBACK ENERGY"},null,null,null,{"$f":"IF(A161=\"\",\"\",RTD(\"cqg.rtd\", ,\"ContractData\",C161, \"LastTradeToday\",, \"T\"))","v":198.18},{"$f":"IF(A161=\"\",\"\",RTD(\"cqg.rtd\", ,\"ContractData\",C161, \"NetLastTradeToday\",, \"T\"))","v":-2.66},{"$f":"IF(A161=\"\",\"\",IFERROR(RTD(\"cqg.rtd\", ,\"ContractData\",C161, \"PerCentNetLastTrade\",, \"T\")/100,\"\"))","v":-1.3244373630750848E-2},{"$f":"IF(A161=\"\",\"\",RTD(\"cqg.rtd\", ,\"ContractData\", C161, \"T_CVol\",, \"T\"))","v":161354.88923},161,{"$f":"IFERROR(RANK($J161,INDIRECT((\"$J$\"&\"1\"&\":$J$\"&$A$449)))+COUNTIF($J$1:J161,J161)-1,\"\")","v":426},"S.US.FANG","S.US.DECK"]
[{"$f":"IF(Symbols!A162=\"\",\"\",Symbols!A162)","v":"S.US.FAST"},0,"S.US.FAST",{"$f":"IF(A162=\"\",\"\",RTD(\"cqg.rtd\", ,\"ContractData\",C162, \"LongDescription\",, \"T\"))","v":"Fastenal Co"},null,null,null,{"$f":"IF(A162=\"\",\"\",RTD(\"cqg.rtd\", ,\"ContractData\",C162, \"LastTradeToday\",, \"T\"))","v":52.06},{"$f":"IF(A162=\"\",\"\",RTD(\"cqg.rtd\", ,\"ContractData\",C162, \"NetLastTradeToday\",, \"T\"))","v":-0.16},{"$f":"IF(A162=\"\",\"\",IFERROR(RTD(\"cqg.rtd\", ,\"ContractData\",C162, \"PerCentNetLastTrade\",, \"T\")/100,\"\"))","v":-3.0639601685178092E-3},{"$f":"IF(A162=\"\",\"\",RTD(\"cqg.rtd\", ,\"ContractData\", C162, \"T_CVol\",, \"T\"))","v":657582.42894400004},162,{"$f":"IFERROR(RANK($J162,INDIRECT((\"$J$\"&\"1\"&\":$J$\"&$A$449)))+COUNTIF($J$1:J162,J162)-1,\"\")","v":371},"S.US.FAST","S.US.ALGN"]
[{"$f":"IF(Symbols!A163=\"\",\"\",Symbols!A163)","v":"S.US.FCX"},0,"S.US.FCX",{"$f":"IF(A163=\"\",\"\",RTD(\"cqg.rtd\", ,\"ContractData\",C163, \"LongDescription\",, \"T\"))","v":"Freeport-McMoRan Inc."},null,null,null,{"$f":"IF(A163=\"\",\"\",RTD(\"cqg.rtd\", ,\"ContractData\",C163, \"LastTradeToday\",, \"T\"))","v":68.2},{"$f":"IF(A163=\"\",\"\",RTD(\"cqg.rtd\", ,\"ContractData\",C163, \"NetLastTradeToday\",, \"T\"))","v":-1.02},{"$f":"IF(A163=\"\",\"\",IFERROR(RTD(\"cqg.rtd\", ,\"ContractData\",C163, \"PerCentNetLastTrade\",, \"T\")/100,\"\"))","v":-1.4735625541750938E-2},{"$f":"IF(A163=\"\",\"\",RTD(\"cqg.rtd\", ,\"ContractData\", C163, \"T_CVol\",, \"T\"))","v":1872363.601362},163,{"$f":"IFERROR(RANK($J163,INDIRECT((\"$J$\"&\"1\"&\":$J$\"&$A$449)))+COUNTIF($J$1:J163,J163)-1,\"\")","v":431},"S.US.FCX","S.US.ELV"]
[{"$f":"IF(Symbols!A164=\"\",\"\",Symbols!A164)","v":"S.US.FDS"},1,"S.US.FDS",{"$f":"IF(A164=\"\",\"\",RTD(\"cqg.rtd\", ,\"ContractData\",C164, \"LongDescription\",, \"T\"))","v":"Factet Research"},null,null,null,{"$f":"IF(A164=\"\",\"\",RTD(\"cqg.rtd\", ,\"ContractData\",C164, \"LastTradeToday\",, \"T\"))","v":280.39},{"$f":"IF(A164=\"\",\"\",RTD(\"cqg.rtd\", ,\"ContractData\",C164, \"NetLastTradeToday\",, \"T\"))","v":2.4},{"$f":"IF(A164=\"\",\"\",IFERROR(RTD(\"cqg.rtd\", ,\"ContractData\",C164, \"PerCentNetLastTrade\",, \"T\")/100,\"\"))","v":8.6334040792834278E-3},{"$f":"IF(A164=\"\",\"\",RTD(\"cqg.rtd\", ,\"ContractData\", C164, \"T_CVol\",, \"T\"))","v":53430.805567000003},164,{"$f":"IFERROR(RANK($J164,INDIRECT((\"$J$\"&\"1\"&\":$J$\"&$A$449)))+COUNTIF($J$1:J164,J164)-1,\"\")","v":193},"S.US.FDS","S.US.COO"]
[{"$f":"IF(Symbols!A165=\"\",\"\",Symbols!A165)","v":"S.US.FDX"},1,"S.US.FDX",{"$f":"IF(A165=\"\",\"\",RTD(\"cqg.rtd\", ,\"ContractData\",C165, \"LongDescription\",, \"T\"))","v":"FedEx Corp"},null,null,null,{"$f":"IF(A165=\"\",\"\",RTD(\"cqg.rtd\", ,\"ContractData\",C165, \"LastTradeToday\",, \"T\"))","v":331.14},{"$f":"IF(A165=\"\",\"\",RTD(\"cqg.rtd\", ,\"ContractData\",C165, \"NetLastTradeToday\",, \"T\"))","v":4.37},{"$f":"IF(A165=\"\",\"\",IFERROR(RTD(\"cqg.rtd\", ,\"ContractData\",C165, \"PerCentNetLastTrade\",, \"T\")/100,\"\"))","v":1.3373320684273342E-2},{"$f":"IF(A165=\"\",\"\",RTD(\"cqg.rtd\", ,\"ContractData\", C165, \"T_CVol\",, \"T\"))","v":300637.58502300002},165,{"$f":"IFERROR(RANK($J165,INDIRECT((\"$J$\"&\"1\"&\":$J$\"&$A$449)))+COUNTIF($J$1:J165,J165)-1,\"\")","v":111},"S.US.FDX","S.US.LYV"]
[{"$f":"IF(Symbols!A166=\"\",\"\",Symbols!A166)","v":"S.US.FDXF"},1,"S.US.FDXF",{"$f":"IF(A166=\"\",\"\",RTD(\"cqg.rtd\", ,\"ContractData\",C166, \"LongDescription\",, \"T\"))","v":"FedEx Freight Holding Company, Inc."},null,null,null,{"$f":"IF(A166=\"\",\"\",RTD(\"cqg.rtd\", ,\"ContractData\",C166, \"LastTradeToday\",, \"T\"))","v":144.49},{"$f":"IF(A166=\"\",\"\",RTD(\"cqg.rtd\", ,\"ContractData\",C166, \"NetLastTradeToday\",, \"T\"))","v":3.25},{"$f":"IF(A166=\"\",\"\",IFERROR(RTD(\"cqg.rtd\", ,\"ContractData\",C166, \"PerCentNetLastTrade\",, \"T\")/100,\"\"))","v":2.3010478617955254E-2},{"$f":"IF(A166=\"\",\"\",RTD(\"cqg.rtd\", ,\"ContractData\", C166, \"T_CVol\",, \"T\"))","v":73653.419775000002},166,{"$f":"IFERROR(RANK($J166,INDIRECT((\"$J$\"&\"1\"&\":$J$\"&$A$449)))+COUNTIF($J$1:J166,J166)-1,\"\")","v":42},"S.US.FDXF","S.US.SOLV"]
[{"$f":"IF(Symbols!A167=\"\",\"\",Symbols!A167)","v":"S.US.FE"},1,"S.US.FE",{"$f":"IF(A167=\"\",\"\",RTD(\"cqg.rtd\", ,\"ContractData\",C167, \"LongDescription\",, \"T\"))","v":"FirstEnergy Corp"},null,null,null,{"$f":"IF(A167=\"\",\"\",RTD(\"cqg.rtd\", ,\"ContractData\",C167, \"LastTradeToday\",, \"T\"))","v":47.300000000000004},{"$f":"IF(A167=\"\",\"\",RTD(\"cqg.rtd\", ,\"ContractData\",C167, \"NetLastTradeToday\",, \"T\"))","v":0.28999999999999998},{"$f":"IF(A167=\"\",\"\",IFERROR(RTD(\"cqg.rtd\", ,\"ContractData\",C167, \"PerCentNetLastTrade\",, \"T\")/100,\"\"))","v":6.1689002339927676E-3},{"$f":"IF(A167=\"\",\"\",RTD(\"cqg.rtd\", ,\"ContractData\", C167, \"T_CVol\",, \"T\"))","v":197380.395346},167,{"$f":"IFERROR(RANK($J167,INDIRECT((\"$J$\"&\"1\"&\":$J$\"&$A$449)))+COUNTIF($J$1:J167,J167)-1,\"\")","v":245},"S.US.FE","S.US.MCO"]
[{"$f":"IF(Symbols!A168=\"\",\"\",Symbols!A168)","v":"S.US.FERG"},0,"S.US.FERG",{"$f":"IF(A168=\"\",\"\",RTD(\"cqg.rtd\", ,\"ContractData\",C168, \"LongDescription\",, \"T\"))","v":"Ferguson plc"},null,null,null,{"$f":"IF(A168=\"\",\"\",RTD(\"cqg.rtd\", ,\"ContractData\",C168, \"LastTradeToday\",, \"T\"))","v":244.3},{"$f":"IF(A168=\"\",\"\",RTD(\"cqg.rtd\", ,\"ContractData\",C168, \"NetLastTradeToday\",, \"T\"))","v":-0.88},{"$f":"IF(A168=\"\",\"\",IFERROR(RTD(\"cqg.rtd\", ,\"ContractData\",C168, \"PerCentNetLastTrade\",, \"T\")/100,\"\"))","v":-3.5891997715963779E-3},{"$f":"IF(A168=\"\",\"\",RTD(\"cqg.rtd\", ,\"ContractData\", C168, \"T_CVol\",, \"T\"))","v":158470.73568099999},168,{"$f":"IFERROR(RANK($J168,INDIRECT((\"$J$\"&\"1\"&\":$J$\"&$A$449)))+COUNTIF($J$1:J168,J168)-1,\"\")","v":378},"S.US.FERG","S.US.CRM"]
[{"$f":"IF(Symbols!A169=\"\",\"\",Symbols!A169)","v":"S.US.FFIV"},0,"S.US.FFIV",{"$f":"IF(A169=\"\",\"\",RTD(\"cqg.rtd\", ,\"ContractData\",C169, \"LongDescription\",, \"T\"))","v":"F5, INC. COMMON STK"},null,null,null,{"$f":"IF(A169=\"\",\"\",RTD(\"cqg.rtd\", ,\"ContractData\",C169, \"LastTradeToday\",, \"T\"))","v":422.42},{"$f":"IF(A169=\"\",\"\",RTD(\"cqg.rtd\", ,\"ContractData\",C169, \"NetLastTradeToday\",, \"T\"))","v":-0.53},{"$f":"IF(A169=\"\",\"\",IFERROR(RTD(\"cqg.rtd\", ,\"ContractData\",C169, \"PerCentNetLastTrade\",, \"T\")/100,\"\"))","v":-1.2531032036883793E-3},{"$f":"IF(A169=\"\",\"\",RTD(\"cqg.rtd\", ,\"ContractData\", C169, \"T_CVol\",, \"T\"))","v":52304.520519999998},169,{"$f":"IFERROR(RANK($J169,INDIRECT((\"$J$\"&\"1\"&\":$J$\"&$A$449)))+COUNTIF($J$1:J169,J169)-1,\"\")","v":353},"S.US.FFIV","S.US.O"]
[{"$f":"IF(Symbols!A170=\"\",\"\",Symbols!A170)","v":"S.US.FICO"},1,"S.US.FICO",{"$f":"IF(A170=\"\",\"\",RTD(\"cqg.rtd\", ,\"ContractData\",C170, \"LongDescription\",, \"T\"))","v":"Fair Isaac Inc"},null,null,null,{"$f":"IF(A170=\"\",\"\",RTD(\"cqg.rtd\", ,\"ContractData\",C170, \"LastTradeToday\",, \"T\"))","v":1076.22},{"$f":"IF(A170=\"\",\"\",RTD(\"cqg.rtd\", ,\"ContractData\",C170, \"NetLastTradeToday\",, \"T\"))","v":32.01},{"$f":"IF(A170=\"\",\"\",IFERROR(RTD(\"cqg.rtd\", ,\"ContractData\",C170, \"PerCentNetLastTrade\",, \"T\")/100,\"\"))","v":3.0654753354210359E-2},{"$f":"IF(A170=\"\",\"\",RTD(\"cqg.rtd\", ,\"ContractData\", C170, \"T_CVol\",, \"T\"))","v":38502.972170000001},170,{"$f":"IFERROR(RANK($J170,INDIRECT((\"$J$\"&\"1\"&\":$J$\"&$A$449)))+COUNTIF($J$1:J170,J170)-1,\"\")","v":18},"S.US.FICO","S.US.XEL"]
[{"$f":"IF(Symbols!A171=\"\",\"\",Symbols!A171)","v":"S.US.FIS"},1,"S.US.FIS",{"$f":"IF(A171=\"\",\"\",RTD(\"cqg.rtd\", ,\"ContractData\",C171, \"LongDescription\",, \"T\"))","v":"Fidelity National Info Services"},null,null,null,{"$f":"IF(A171=\"\",\"\",RTD(\"cqg.rtd\", ,\"ContractData\",C171, \"LastTradeToday\",, \"T\"))","v":42.9},{"$f":"IF(A171=\"\",\"\",RTD(\"cqg.rtd\", ,\"ContractData\",C171, \"NetLastTradeToday\",, \"T\"))","v":0.98},{"$f":"IF(A171=\"\",\"\",IFERROR(RTD(\"cqg.rtd\", ,\"ContractData\",C171, \"PerCentNetLastTrade\",, \"T\")/100,\"\"))","v":2.3377862595419848E-2},{"$f":"IF(A171=\"\",\"\",RTD(\"cqg.rtd\", ,\"ContractData\", C171, \"T_CVol\",, \"T\"))","v":532867.41445000004},171,{"$f":"IFERROR(RANK($J171,INDIRECT((\"$J$\"&\"1\"&\":$J$\"&$A$449)))+COUNTIF($J$1:J171,J171)-1,\"\")","v":39},"S.US.FIS","S.US.C"]
[{"$f":"IF(Symbols!A172=\"\",\"\",Symbols!A172)","v":"S.US.FISV"},1,"S.US.FISV",{"$f":"IF(A172=\"\",\"\",RTD(\"cqg.rtd\", ,\"ContractData\",C172, \"LongDescription\",, \"T\"))","v":"FISERV, INC. CMN STK"},null,null,null,{"$f":"IF(A172=\"\",\"\",RTD(\"cqg.rtd\", ,\"ContractData\",C172, \"LastTradeToday\",, \"T\"))","v":53.120000000000005},{"$f":"IF(A172=\"\",\"\",RTD(\"cqg.rtd\", ,\"ContractData\",C172, \"NetLastTradeToday\",, \"T\"))","v":1.56},{"$f":"IF(A172=\"\",\"\",IFERROR(RTD(\"cqg.rtd\", ,\"ContractData\",C172, \"PerCentNetLastTrade\",, \"T\")/100,\"\"))","v":3.0256012412723039E-2},{"$f":"IF(A172=\"\",\"\",RTD(\"cqg.rtd\", ,\"ContractData\", C172, \"T_CVol\",, \"T\"))","v":1314216.8520239999},172,{"$f":"IFERROR(RANK($J172,INDIRECT((\"$J$\"&\"1\"&\":$J$\"&$A$449)))+COUNTIF($J$1:J172,J172)-1,\"\")","v":19},"S.US.FISV","S.US.AIZ"]
[{"$f":"IF(Symbols!A173=\"\",\"\",Symbols!A173)","v":"S.US.FITB"},1,"S.US.FITB",{"$f":"IF(A173=\"\",\"\",RTD(\"cqg.rtd\", ,\"ContractData\",C173, \"LongDescription\",, \"T\"))","v":"FIFTH THIRD BNCP"},null,null,null,{"$f":"IF(A173=\"\",\"\",RTD(\"cqg.rtd\", ,\"ContractData\",C173, \"LastTradeToday\",, \"T\"))","v":58.35},{"$f":"IF(A173=\"\",\"\",RTD(\"cqg.rtd\", ,\"ContractData\",C173, \"NetLastTradeToday\",, \"T\"))","v":0.34},{"$f":"IF(A173=\"\",\"\",IFERROR(RTD(\"cqg.rtd\", ,\"ContractData\",C173, \"PerCentNetLastTrade\",, \"T\")/100,\"\"))","v":5.8610584382003108E-3},{"$f":"IF(A173=\"\",\"\",RTD(\"cqg.rtd\", ,\"ContractData\", C173, \"T_CVol\",, \"T\"))","v":560905.93527500005},173,{"$f":"IFERROR(RANK($J173,INDIRECT((\"$J$\"&\"1\"&\":$J$\"&$A$449)))+COUNTIF($J$1:J173,J173)-1,\"\")","v":254},"S.US.FITB","S.US.KEY"]
[{"$f":"IF(Symbols!A174=\"\",\"\",Symbols!A174)","v":"S.US.FOX"},1,"S.US.FOX",{"$f":"IF(A174=\"\",\"\",RTD(\"cqg.rtd\", ,\"ContractData\",C174, \"LongDescription\",, \"T\"))","v":"FOX CORP CM B"},null,null,null,{"$f":"IF(A174=\"\",\"\",RTD(\"cqg.rtd\", ,\"ContractData\",C174, \"LastTradeToday\",, \"T\"))","v":57.32},{"$f":"IF(A174=\"\",\"\",RTD(\"cqg.rtd\", ,\"ContractData\",C174, \"NetLastTradeToday\",, \"T\"))","v":1.35},{"$f":"IF(A174=\"\",\"\",IFERROR(RTD(\"cqg.rtd\", ,\"ContractData\",C174, \"PerCentNetLastTrade\",, \"T\")/100,\"\"))","v":2.4120064320171521E-2},{"$f":"IF(A174=\"\",\"\",RTD(\"cqg.rtd\", ,\"ContractData\", C174, \"T_CVol\",, \"T\"))","v":80562.434116999997},174,{"$f":"IFERROR(RANK($J174,INDIRECT((\"$J$\"&\"1\"&\":$J$\"&$A$449)))+COUNTIF($J$1:J174,J174)-1,\"\")","v":33},"S.US.FOX","S.US.PLD"]
[{"$f":"IF(Symbols!A175=\"\",\"\",Symbols!A175)","v":"S.US.FOXA"},1,"S.US.FOXA",{"$f":"IF(A175=\"\",\"\",RTD(\"cqg.rtd\", ,\"ContractData\",C175, \"LongDescription\",, \"T\"))","v":"FOX CORP CM A"},null,null,null,{"$f":"IF(A175=\"\",\"\",RTD(\"cqg.rtd\", ,\"ContractData\",C175, \"LastTradeToday\",, \"T\"))","v":64.55},{"$f":"IF(A175=\"\",\"\",RTD(\"cqg.rtd\", ,\"ContractData\",C175, \"NetLastTradeToday\",, \"T\"))","v":1.5},{"$f":"IF(A175=\"\",\"\",IFERROR(RTD(\"cqg.rtd\", ,\"ContractData\",C175, \"PerCentNetLastTrade\",, \"T\")/100,\"\"))","v":2.3790642347343377E-2},{"$f":"IF(A175=\"\",\"\",RTD(\"cqg.rtd\", ,\"ContractData\", C175, \"T_CVol\",, \"T\"))","v":466259.019012},175,{"$f":"IFERROR(RANK($J175,INDIRECT((\"$J$\"&\"1\"&\":$J$\"&$A$449)))+COUNTIF($J$1:J175,J175)-1,\"\")","v":38},"S.US.FOXA","S.US.GNRC"]
[{"$f":"IF(Symbols!A176=\"\",\"\",Symbols!A176)","v":"S.US.FRT"},1,"S.US.FRT",{"$f":"IF(A176=\"\",\"\",RTD(\"cqg.rtd\", ,\"ContractData\",C176, \"LongDescription\",, \"T\"))","v":"Federal Realty Invstmt Trst"},null,null,null,{"$f":"IF(A176=\"\",\"\",RTD(\"cqg.rtd\", ,\"ContractData\",C176, \"LastTradeToday\",, \"T\"))","v":118.86},{"$f":"IF(A176=\"\",\"\",RTD(\"cqg.rtd\", ,\"ContractData\",C176, \"NetLastTradeToday\",, \"T\"))","v":1.6500000000000001},{"$f":"IF(A176=\"\",\"\",IFERROR(RTD(\"cqg.rtd\", ,\"ContractData\",C176, \"PerCentNetLastTrade\",, \"T\")/100,\"\"))","v":1.4077297158945483E-2},{"$f":"IF(A176=\"\",\"\",RTD(\"cqg.rtd\", ,\"ContractData\", C176, \"T_CVol\",, \"T\"))","v":43250.233507999998},176,{"$f":"IFERROR(RANK($J176,INDIRECT((\"$J$\"&\"1\"&\":$J$\"&$A$449)))+COUNTIF($J$1:J176,J176)-1,\"\")","v":104},"S.US.FRT","S.US.PFG"]
[{"$f":"IF(Symbols!A177=\"\",\"\",Symbols!A177)","v":"S.US.FTNT"},1,"S.US.FTNT",{"$f":"IF(A177=\"\",\"\",RTD(\"cqg.rtd\", ,\"ContractData\",C177, \"LongDescription\",, \"T\"))","v":"Fortinet, Inc."},null,null,null,{"$f":"IF(A177=\"\",\"\",RTD(\"cqg.rtd\", ,\"ContractData\",C177, \"LastTradeToday\",, \"T\"))","v":163.58000000000001},{"$f":"IF(A177=\"\",\"\",RTD(\"cqg.rtd\", ,\"ContractData\",C177, \"NetLastTradeToday\",, \"T\"))","v":2.74},{"$f":"IF(A177=\"\",\"\",IFERROR(RTD(\"cqg.rtd\", ,\"ContractData\",C177, \"PerCentNetLastTrade\",, \"T\")/100,\"\"))","v":1.7035563292713257E-2},{"$f":"IF(A177=\"\",\"\",RTD(\"cqg.rtd\", ,\"ContractData\", C177, \"T_CVol\",, \"T\"))","v":508013.87165699998},177,{"$f":"IFERROR(RANK($J177,INDIRECT((\"$J$\"&\"1\"&\":$J$\"&$A$449)))+COUNTIF($J$1:J177,J177)-1,\"\")","v":81},"S.US.FTNT","S.US.AAPL"]
[{"$f":"IF(Symbols!A178=\"\",\"\",Symbols!A178)","v":"S.US.FTV"},0,"S.US.FTV",{"$f":"IF(A178=\"\",\"\",RTD(\"cqg.rtd\", ,\"ContractData\",C178, \"LongDescription\",, \"T\"))","v":"Fortive Corporation"},null,null,null,{"$f":"IF(A178=\"\",\"\",RTD(\"cqg.rtd\", ,\"ContractData\",C178, \"LastTradeToday\",, \"T\"))","v":61.480000000000004},{"$f":"IF(A178=\"\",\"\",RTD(\"cqg.rtd\", ,\"ContractData\",C178, \"NetLastTradeToday\",, \"T\"))","v":-0.06},{"$f":"IF(A178=\"\",\"\",IFERROR(RTD(\"cqg.rtd\", ,\"ContractData\",C178, \"PerCentNetLastTrade\",, \"T\")/100,\"\"))","v":-9.7497562560935978E-4},{"$f":"IF(A178=\"\",\"\",RTD(\"cqg.rtd\", ,\"ContractData\", C178, \"T_CVol\",, \"T\"))","v":210682.97590399999},178,{"$f":"IFERROR(RANK($J178,INDIRECT((\"$J$\"&\"1\"&\":$J$\"&$A$449)))+COUNTIF($J$1:J178,J178)-1,\"\")","v":350},"S.US.FTV","S.US.NVR"]
[{"$f":"IF(Symbols!A179=\"\",\"\",Symbols!A179)","v":"S.US.GD"},0,"S.US.GD",{"$f":"IF(A179=\"\",\"\",RTD(\"cqg.rtd\", ,\"ContractData\",C179, \"LongDescription\",, \"T\"))","v":"General Dynamics Corp"},null,null,null,{"$f":"IF(A179=\"\",\"\",RTD(\"cqg.rtd\", ,\"ContractData\",C179, \"LastTradeToday\",, \"T\"))","v":392.99},{"$f":"IF(A179=\"\",\"\",RTD(\"cqg.rtd\", ,\"ContractData\",C179, \"NetLastTradeToday\",, \"T\"))","v":-1.22},{"$f":"IF(A179=\"\",\"\",IFERROR(RTD(\"cqg.rtd\", ,\"ContractData\",C179, \"PerCentNetLastTrade\",, \"T\")/100,\"\"))","v":-3.0947971893153397E-3},{"$f":"IF(A179=\"\",\"\",RTD(\"cqg.rtd\", ,\"ContractData\", C179, \"T_CVol\",, \"T\"))","v":62367.390462000003},179,{"$f":"IFERROR(RANK($J179,INDIRECT((\"$J$\"&\"1\"&\":$J$\"&$A$449)))+COUNTIF($J$1:J179,J179)-1,\"\")","v":372},"S.US.GD","S.US.REG"]
[{"$f":"IF(Symbols!A180=\"\",\"\",Symbols!A180)","v":"S.US.GDDY"},1,"S.US.GDDY",{"$f":"IF(A180=\"\",\"\",RTD(\"cqg.rtd\", ,\"ContractData\",C180, \"LongDescription\",, \"T\"))","v":"GoDaddy Inc."},null,null,null,{"$f":"IF(A180=\"\",\"\",RTD(\"cqg.rtd\", ,\"ContractData\",C180, \"LastTradeToday\",, \"T\"))","v":93.11},{"$f":"IF(A180=\"\",\"\",RTD(\"cqg.rtd\", ,\"ContractData\",C180, \"NetLastTradeToday\",, \"T\"))","v":1.29},{"$f":"IF(A180=\"\",\"\",IFERROR(RTD(\"cqg.rtd\", ,\"ContractData\",C180, \"PerCentNetLastTrade\",, \"T\")/100,\"\"))","v":1.4049226747985189E-2},{"$f":"IF(A180=\"\",\"\",RTD(\"cqg.rtd\", ,\"ContractData\", C180, \"T_CVol\",, \"T\"))","v":148375.90938500001},180,{"$f":"IFERROR(RANK($J180,INDIRECT((\"$J$\"&\"1\"&\":$J$\"&$A$449)))+COUNTIF($J$1:J180,J180)-1,\"\")","v":105},"S.US.GDDY","S.US.MET"]
[{"$f":"IF(Symbols!A181=\"\",\"\",Symbols!A181)","v":"S.US.GE"},0,"S.US.GE",{"$f":"IF(A181=\"\",\"\",RTD(\"cqg.rtd\", ,\"ContractData\",C181, \"LongDescription\",, \"T\"))","v":"General Electric Co"},null,null,null,{"$f":"IF(A181=\"\",\"\",RTD(\"cqg.rtd\", ,\"ContractData\",C181, \"LastTradeToday\",, \"T\"))","v":362.7},{"$f":"IF(A181=\"\",\"\",RTD(\"cqg.rtd\", ,\"ContractData\",C181, \"NetLastTradeToday\",, \"T\"))","v":-2.63},{"$f":"IF(A181=\"\",\"\",IFERROR(RTD(\"cqg.rtd\", ,\"ContractData\",C181, \"PerCentNetLastTrade\",, \"T\")/100,\"\"))","v":-7.1989707935291381E-3},{"$f":"IF(A181=\"\",\"\",RTD(\"cqg.rtd\", ,\"ContractData\", C181, \"T_CVol\",, \"T\"))","v":385370.41412999999},181,{"$f":"IFERROR(RANK($J181,INDIRECT((\"$J$\"&\"1\"&\":$J$\"&$A$449)))+COUNTIF($J$1:J181,J181)-1,\"\")","v":404},"S.US.GE","S.US.ICE"]
[{"$f":"IF(Symbols!A182=\"\",\"\",Symbols!A182)","v":"S.US.GEHC"},1,"S.US.GEHC",{"$f":"IF(A182=\"\",\"\",RTD(\"cqg.rtd\", ,\"ContractData\",C182, \"LongDescription\",, \"T\"))","v":"GE HEALTHCARE CM"},null,null,null,{"$f":"IF(A182=\"\",\"\",RTD(\"cqg.rtd\", ,\"ContractData\",C182, \"LastTradeToday\",, \"T\"))","v":73.78},{"$f":"IF(A182=\"\",\"\",RTD(\"cqg.rtd\", ,\"ContractData\",C182, \"NetLastTradeToday\",, \"T\"))","v":1.5},{"$f":"IF(A182=\"\",\"\",IFERROR(RTD(\"cqg.rtd\", ,\"ContractData\",C182, \"PerCentNetLastTrade\",, \"T\")/100,\"\"))","v":2.0752628666297731E-2},{"$f":"IF(A182=\"\",\"\",RTD(\"cqg.rtd\", ,\"ContractData\", C182, \"T_CVol\",, \"T\"))","v":404661.22969499999},182,{"$f":"IFERROR(RANK($J182,INDIRECT((\"$J$\"&\"1\"&\":$J$\"&$A$449)))+COUNTIF($J$1:J182,J182)-1,\"\")","v":52},"S.US.GEHC","S.US.IBM"]
[{"$f":"IF(Symbols!A183=\"\",\"\",Symbols!A183)","v":"S.US.GEN"},1,"S.US.GEN",{"$f":"IF(A183=\"\",\"\",RTD(\"cqg.rtd\", ,\"ContractData\",C183, \"LongDescription\",, \"T\"))","v":"GEN DIGITAL INC. CMN"},null,null,null,{"$f":"IF(A183=\"\",\"\",RTD(\"cqg.rtd\", ,\"ContractData\",C183, \"LastTradeToday\",, \"T\"))","v":29.060000000000002},{"$f":"IF(A183=\"\",\"\",RTD(\"cqg.rtd\", ,\"ContractData\",C183, \"NetLastTradeToday\",, \"T\"))","v":0.42},{"$f":"IF(A183=\"\",\"\",IFERROR(RTD(\"cqg.rtd\", ,\"ContractData\",C183, \"PerCentNetLastTrade\",, \"T\")/100,\"\"))","v":1.4664804469273741E-2},{"$f":"IF(A183=\"\",\"\",RTD(\"cqg.rtd\", ,\"ContractData\", C183, \"T_CVol\",, \"T\"))","v":452672.48840600002},183,{"$f":"IFERROR(RANK($J183,INDIRECT((\"$J$\"&\"1\"&\":$J$\"&$A$449)))+COUNTIF($J$1:J183,J183)-1,\"\")","v":96},"S.US.GEN","S.US.OMC"]
[{"$f":"IF(Symbols!A184=\"\",\"\",Symbols!A184)","v":"S.US.GILD"},1,"S.US.GILD",{"$f":"IF(A184=\"\",\"\",RTD(\"cqg.rtd\", ,\"ContractData\",C184, \"LongDescription\",, \"T\"))","v":"GILEAD SCIENCES, INC"},null,null,null,{"$f":"IF(A184=\"\",\"\",RTD(\"cqg.rtd\", ,\"ContractData\",C184, \"LastTradeToday\",, \"T\"))","v":137.41},{"$f":"IF(A184=\"\",\"\",RTD(\"cqg.rtd\", ,\"ContractData\",C184, \"NetLastTradeToday\",, \"T\"))","v":1.54},{"$f":"IF(A184=\"\",\"\",IFERROR(RTD(\"cqg.rtd\", ,\"ContractData\",C184, \"PerCentNetLastTrade\",, \"T\")/100,\"\"))","v":1.1334363730036063E-2},{"$f":"IF(A184=\"\",\"\",RTD(\"cqg.rtd\", ,\"ContractData\", C184, \"T_CVol\",, \"T\"))","v":608928.44058499997},184,{"$f":"IFERROR(RANK($J184,INDIRECT((\"$J$\"&\"1\"&\":$J$\"&$A$449)))+COUNTIF($J$1:J184,J184)-1,\"\")","v":149},"S.US.GILD","S.US.CHD"]
[{"$f":"IF(Symbols!A185=\"\",\"\",Symbols!A185)","v":"S.US.GIS"},1,"S.US.GIS",{"$f":"IF(A185=\"\",\"\",RTD(\"cqg.rtd\", ,\"ContractData\",C185, \"LongDescription\",, \"T\"))","v":"General Mills Inc"},null,null,null,{"$f":"IF(A185=\"\",\"\",RTD(\"cqg.rtd\", ,\"ContractData\",C185, \"LastTradeToday\",, \"T\"))","v":39.01},{"$f":"IF(A185=\"\",\"\",RTD(\"cqg.rtd\", ,\"ContractData\",C185, \"NetLastTradeToday\",, \"T\"))","v":0.83000000000000007},{"$f":"IF(A185=\"\",\"\",IFERROR(RTD(\"cqg.rtd\", ,\"ContractData\",C185, \"PerCentNetLastTrade\",, \"T\")/100,\"\"))","v":2.1739130434782608E-2},{"$f":"IF(A185=\"\",\"\",RTD(\"cqg.rtd\", ,\"ContractData\", C185, \"T_CVol\",, \"T\"))","v":1306123.3096100001},185,{"$f":"IFERROR(RANK($J185,INDIRECT((\"$J$\"&\"1\"&\":$J$\"&$A$449)))+COUNTIF($J$1:J185,J185)-1,\"\")","v":46},"S.US.GIS","S.US.CFG"]
[{"$f":"IF(Symbols!A186=\"\",\"\",Symbols!A186)","v":"S.US.GL"},1,"S.US.GL",{"$f":"IF(A186=\"\",\"\",RTD(\"cqg.rtd\", ,\"ContractData\",C186, \"LongDescription\",, \"T\"))","v":"Globe Life Inc."},null,null,null,{"$f":"IF(A186=\"\",\"\",RTD(\"cqg.rtd\", ,\"ContractData\",C186, \"LastTradeToday\",, \"T\"))","v":181.02},{"$f":"IF(A186=\"\",\"\",RTD(\"cqg.rtd\", ,\"ContractData\",C186, \"NetLastTradeToday\",, \"T\"))","v":3.11},{"$f":"IF(A186=\"\",\"\",IFERROR(RTD(\"cqg.rtd\", ,\"ContractData\",C186, \"PerCentNetLastTrade\",, \"T\")/100,\"\"))","v":1.7480748693159461E-2},{"$f":"IF(A186=\"\",\"\",RTD(\"cqg.rtd\", ,\"ContractData\", C186, \"T_CVol\",, \"T\"))","v":117937.028137},186,{"$f":"IFERROR(RANK($J186,INDIRECT((\"$J$\"&\"1\"&\":$J$\"&$A$449)))+COUNTIF($J$1:J186,J186)-1,\"\")","v":78},"S.US.GL","S.US.DUK"]
[{"$f":"IF(Symbols!A187=\"\",\"\",Symbols!A187)","v":"S.US.GLW"},0,"S.US.GLW",{"$f":"IF(A187=\"\",\"\",RTD(\"cqg.rtd\", ,\"ContractData\",C187, \"LongDescription\",, \"T\"))","v":"Corning Incorporated"},null,null,null,{"$f":"IF(A187=\"\",\"\",RTD(\"cqg.rtd\", ,\"ContractData\",C187, \"LastTradeToday\",, \"T\"))","v":166.57},{"$f":"IF(A187=\"\",\"\",RTD(\"cqg.rtd\", ,\"ContractData\",C187, \"NetLastTradeToday\",, \"T\"))","v":-0.87},{"$f":"IF(A187=\"\",\"\",IFERROR(RTD(\"cqg.rtd\", ,\"ContractData\",C187, \"PerCentNetLastTrade\",, \"T\")/100,\"\"))","v":-5.195891065456283E-3},{"$f":"IF(A187=\"\",\"\",RTD(\"cqg.rtd\", ,\"ContractData\", C187, \"T_CVol\",, \"T\"))","v":1250272.5572210001},187,{"$f":"IFERROR(RANK($J187,INDIRECT((\"$J$\"&\"1\"&\":$J$\"&$A$449)))+COUNTIF($J$1:J187,J187)-1,\"\")","v":390},"S.US.GLW","S.US.NDAQ"]
[{"$f":"IF(Symbols!A188=\"\",\"\",Symbols!A188)","v":"S.US.GM"},1,"S.US.GM",{"$f":"IF(A188=\"\",\"\",RTD(\"cqg.rtd\", ,\"ContractData\",C188, \"LongDescription\",, \"T\"))","v":"General Motors Company"},null,null,null,{"$f":"IF(A188=\"\",\"\",RTD(\"cqg.rtd\", ,\"ContractData\",C188, \"LastTradeToday\",, \"T\"))","v":87.28},{"$f":"IF(A188=\"\",\"\",RTD(\"cqg.rtd\", ,\"ContractData\",C188, \"NetLastTradeToday\",, \"T\"))","v":0.52},{"$f":"IF(A188=\"\",\"\",IFERROR(RTD(\"cqg.rtd\", ,\"ContractData\",C188, \"PerCentNetLastTrade\",, \"T\")/100,\"\"))","v":5.9935454126325491E-3},{"$f":"IF(A188=\"\",\"\",RTD(\"cqg.rtd\", ,\"ContractData\", C188, \"T_CVol\",, \"T\"))","v":532946.73061900004},188,{"$f":"IFERROR(RANK($J188,INDIRECT((\"$J$\"&\"1\"&\":$J$\"&$A$449)))+COUNTIF($J$1:J188,J188)-1,\"\")","v":249},"S.US.GM","S.US.MGM"]
[{"$f":"IF(Symbols!A189=\"\",\"\",Symbols!A189)","v":"S.US.GNRC"},{"$f":"IF(A189=\"\",\"\",IF(J189>0,1,0))","v":1},{"$f":"A189","v":"S.US.GNRC"},{"$f":"IF(A189=\"\",\"\",RTD(\"cqg.rtd\", ,\"ContractData\",C189, \"LongDescription\",, \"T\"))","v":"Generac Holdings Inc."},null,null,null,{"$f":"IF(A189=\"\",\"\",RTD(\"cqg.rtd\", ,\"ContractData\",C189, \"LastTradeToday\",, \"T\"))","v":224.01},{"$f":"IF(A189=\"\",\"\",RTD(\"cqg.rtd\", ,\"ContractData\",C189, \"NetLastTradeToday\",, \"T\"))","v":2.11},{"$f":"IF(A189=\"\",\"\",IFERROR(RTD(\"cqg.rtd\", ,\"ContractData\",C189, \"PerCentNetLastTrade\",, \"T\")/100,\"\"))","v":9.5087877422262278E-3},{"$f":"IF(A189=\"\",\"\",RTD(\"cqg.rtd\", ,\"ContractData\", C189, \"T_CVol\",, \"T\"))","v":84062.140002999993},189,{"$f":"IFERROR(RANK($J189,INDIRECT((\"$J$\"&\"1\"&\":$J$\"&$A$449)))+COUNTIF($J$1:J189,J189)-1,\"\")","v":175},"S.US.GNRC","S.US.MDT"]
[{"$f":"IF(Symbols!A190=\"\",\"\",Symbols!A190)","v":"S.US.GPC"},1,"S.US.GPC",{"$f":"IF(A190=\"\",\"\",RTD(\"cqg.rtd\", ,\"ContractData\",C190, \"LongDescription\",, \"T\"))","v":"Genuine Parts Company"},null,null,null,{"$f":"IF(A190=\"\",\"\",RTD(\"cqg.rtd\", ,\"ContractData\",C190, \"LastTradeToday\",, \"T\"))","v":134.86000000000001},{"$f":"IF(A190=\"\",\"\",RTD(\"cqg.rtd\", ,\"ContractData\",C190, \"NetLastTradeToday\",, \"T\"))","v":0.85},{"$f":"IF(A190=\"\",\"\",IFERROR(RTD(\"cqg.rtd\", ,\"ContractData\",C190, \"PerCentNetLastTrade\",, \"T\")/100,\"\"))","v":6.3428102380419368E-3},{"$f":"IF(A190=\"\",\"\",RTD(\"cqg.rtd\", ,\"ContractData\", C190, \"T_CVol\",, \"T\"))","v":90977.697904000001},190,{"$f":"IFERROR(RANK($J190,INDIRECT((\"$J$\"&\"1\"&\":$J$\"&$A$449)))+COUNTIF($J$1:J190,J190)-1,\"\")","v":240},"S.US.GPC","S.US.PG"]
[{"$f":"IF(Symbols!A191=\"\",\"\",Symbols!A191)","v":"S.US.GPN"},1,"S.US.GPN",{"$f":"IF(A191=\"\",\"\",RTD(\"cqg.rtd\", ,\"ContractData\",C191, \"LongDescription\",, \"T\"))","v":"Global Payments"},null,null,null,{"$f":"IF(A191=\"\",\"\",RTD(\"cqg.rtd\", ,\"ContractData\",C191, \"LastTradeToday\",, \"T\"))","v":90.98},{"$f":"IF(A191=\"\",\"\",RTD(\"cqg.rtd\", ,\"ContractData\",C191, \"NetLastTradeToday\",, \"T\"))","v":2.4500000000000002},{"$f":"IF(A191=\"\",\"\",IFERROR(RTD(\"cqg.rtd\", ,\"ContractData\",C191, \"PerCentNetLastTrade\",, \"T\")/100,\"\"))","v":2.7674234722692873E-2},{"$f":"IF(A191=\"\",\"\",RTD(\"cqg.rtd\", ,\"ContractData\", C191, \"T_CVol\",, \"T\"))","v":373623.570251},191,{"$f":"IFERROR(RANK($J191,INDIRECT((\"$J$\"&\"1\"&\":$J$\"&$A$449)))+COUNTIF($J$1:J191,J191)-1,\"\")","v":25},"S.US.GPN","S.US.PNC"]
[{"$f":"IF(Symbols!A192=\"\",\"\",Symbols!A192)","v":"S.US.GRMN"},1,"S.US.GRMN",{"$f":"IF(A192=\"\",\"\",RTD(\"cqg.rtd\", ,\"ContractData\",C192, \"LongDescription\",, \"T\"))","v":"Garmin Ltd"},null,null,null,{"$f":"IF(A192=\"\",\"\",RTD(\"cqg.rtd\", ,\"ContractData\",C192, \"LastTradeToday\",, \"T\"))","v":311.76},{"$f":"IF(A192=\"\",\"\",RTD(\"cqg.rtd\", ,\"ContractData\",C192, \"NetLastTradeToday\",, \"T\"))","v":1.78},{"$f":"IF(A192=\"\",\"\",IFERROR(RTD(\"cqg.rtd\", ,\"ContractData\",C192, \"PerCentNetLastTrade\",, \"T\")/100,\"\"))","v":5.7423059552229169E-3},{"$f":"IF(A192=\"\",\"\",RTD(\"cqg.rtd\", ,\"ContractData\", C192, \"T_CVol\",, \"T\"))","v":67205.528864000007},192,{"$f":"IFERROR(RANK($J192,INDIRECT((\"$J$\"&\"1\"&\":$J$\"&$A$449)))+COUNTIF($J$1:J192,J192)-1,\"\")","v":260},"S.US.GRMN","S.US.KIM"]
[{"$f":"IF(Symbols!A193=\"\",\"\",Symbols!A193)","v":"S.US.GS"},1,"S.US.GS",{"$f":"IF(A193=\"\",\"\",RTD(\"cqg.rtd\", ,\"ContractData\",C193, \"LongDescription\",, \"T\"))","v":"Goldman Sachs Group"},null,null,null,{"$f":"IF(A193=\"\",\"\",RTD(\"cqg.rtd\", ,\"ContractData\",C193, \"LastTradeToday\",, \"T\"))","v":1057.04},{"$f":"IF(A193=\"\",\"\",RTD(\"cqg.rtd\", ,\"ContractData\",C193, \"NetLastTradeToday\",, \"T\"))","v":19.830000000000002},{"$f":"IF(A193=\"\",\"\",IFERROR(RTD(\"cqg.rtd\", ,\"ContractData\",C193, \"PerCentNetLastTrade\",, \"T\")/100,\"\"))","v":1.9118597005428024E-2},{"$f":"IF(A193=\"\",\"\",RTD(\"cqg.rtd\", ,\"ContractData\", C193, \"T_CVol\",, \"T\"))","v":306343.68026499997},193,{"$f":"IFERROR(RANK($J193,INDIRECT((\"$J$\"&\"1\"&\":$J$\"&$A$449)))+COUNTIF($J$1:J193,J193)-1,\"\")","v":62},"S.US.GS","S.US.FDS"]
[{"$f":"IF(Symbols!A194=\"\",\"\",Symbols!A194)","v":"S.US.GWW"},1,"S.US.GWW",{"$f":"IF(A194=\"\",\"\",RTD(\"cqg.rtd\", ,\"ContractData\",C194, \"LongDescription\",, \"T\"))","v":"Grainger (WW) Inc"},null,null,null,{"$f":"IF(A194=\"\",\"\",RTD(\"cqg.rtd\", ,\"ContractData\",C194, \"LastTradeToday\",, \"T\"))","v":1308.75},{"$f":"IF(A194=\"\",\"\",RTD(\"cqg.rtd\", ,\"ContractData\",C194, \"NetLastTradeToday\",, \"T\"))","v":3.87},{"$f":"IF(A194=\"\",\"\",IFERROR(RTD(\"cqg.rtd\", ,\"ContractData\",C194, \"PerCentNetLastTrade\",, \"T\")/100,\"\"))","v":2.9657899576972595E-3},{"$f":"IF(A194=\"\",\"\",RTD(\"cqg.rtd\", ,\"ContractData\", C194, \"T_CVol\",, \"T\"))","v":17716.765454},194,{"$f":"IFERROR(RANK($J194,INDIRECT((\"$J$\"&\"1\"&\":$J$\"&$A$449)))+COUNTIF($J$1:J194,J194)-1,\"\")","v":301},{"$f":"C194","v":"S.US.GWW"},{"$f":"IFERROR(VLOOKUP($L194,$M$1:$N$437,2,FALSE),\"\")","v":"S.US.SRE"}]
[{"$f":"IF(Symbols!A195=\"\",\"\",Symbols!A195)","v":"S.US.HAL"},0,"S.US.HAL",{"$f":"IF(A195=\"\",\"\",RTD(\"cqg.rtd\", ,\"ContractData\",C195, \"LongDescription\",, \"T\"))","v":"Halliburton Company"},null,null,null,{"$f":"IF(A195=\"\",\"\",RTD(\"cqg.rtd\", ,\"ContractData\",C195, \"LastTradeToday\",, \"T\"))","v":32.93},{"$f":"IF(A195=\"\",\"\",RTD(\"cqg.rtd\", ,\"ContractData\",C195, \"NetLastTradeToday\",, \"T\"))","v":-0.36},{"$f":"IF(A195=\"\",\"\",IFERROR(RTD(\"cqg.rtd\", ,\"ContractData\",C195, \"PerCentNetLastTrade\",, \"T\")/100,\"\"))","v":-1.0814058275758487E-2},{"$f":"IF(A195=\"\",\"\",RTD(\"cqg.rtd\", ,\"ContractData\", C195, \"T_CVol\",, \"T\"))","v":1126129.4763720001},{"$f":"L194+1","v":195},{"$f":"IFERROR(RANK($J195,INDIRECT((\"$J$\"&\"1\"&\":$J$\"&$A$449)))+COUNTIF($J$1:J195,J195)-1,\"\")","v":422},"S.US.HAL","S.US.CBOE"]
[{"$f":"IF(Symbols!A196=\"\",\"\",Symbols!A196)","v":"S.US.HAS"},1,"S.US.HAS",{"$f":"IF(A196=\"\",\"\",RTD(\"cqg.rtd\", ,\"ContractData\",C196, \"LongDescription\",, \"T\"))","v":"Hasbro Inc"},null,null,null,{"$f":"IF(A196=\"\",\"\",RTD(\"cqg.rtd\", ,\"ContractData\",C196, \"LastTradeToday\",, \"T\"))","v":95.49},{"$f":"IF(A196=\"\",\"\",RTD(\"cqg.rtd\", ,\"ContractData\",C196, \"NetLastTradeToday\",, \"T\"))","v":0.6},{"$f":"IF(A196=\"\",\"\",IFERROR(RTD(\"cqg.rtd\", ,\"ContractData\",C196, \"PerCentNetLastTrade\",, \"T\")/100,\"\"))","v":6.3231109705975345E-3},{"$f":"IF(A196=\"\",\"\",RTD(\"cqg.rtd\", ,\"ContractData\", C196, \"T_CVol\",, \"T\"))","v":80044.343246999997},196,{"$f":"IFERROR(RANK($J196,INDIRECT((\"$J$\"&\"1\"&\":$J$\"&$A$449)))+COUNTIF($J$1:J196,J196)-1,\"\")","v":242},"S.US.HAS","S.US.ALL"]
[{"$f":"IF(Symbols!A197=\"\",\"\",Symbols!A197)","v":"S.US.HBAN"},1,"S.US.HBAN",{"$f":"IF(A197=\"\",\"\",RTD(\"cqg.rtd\", ,\"ContractData\",C197, \"LongDescription\",, \"T\"))","v":"HUNTINGTON BCSHS"},null,null,null,{"$f":"IF(A197=\"\",\"\",RTD(\"cqg.rtd\", ,\"ContractData\",C197, \"LastTradeToday\",, \"T\"))","v":18},{"$f":"IF(A197=\"\",\"\",RTD(\"cqg.rtd\", ,\"ContractData\",C197, \"NetLastTradeToday\",, \"T\"))","v":0.14000000000000001},{"$f":"IF(A197=\"\",\"\",IFERROR(RTD(\"cqg.rtd\", ,\"ContractData\",C197, \"PerCentNetLastTrade\",, \"T\")/100,\"\"))","v":7.8387458006718928E-3},{"$f":"IF(A197=\"\",\"\",RTD(\"cqg.rtd\", ,\"ContractData\", C197, \"T_CVol\",, \"T\"))","v":1919679.252941},197,{"$f":"IFERROR(RANK($J197,INDIRECT((\"$J$\"&\"1\"&\":$J$\"&$A$449)))+COUNTIF($J$1:J197,J197)-1,\"\")","v":212},"S.US.HBAN","S.US.WY"]
[{"$f":"IF(Symbols!A198=\"\",\"\",Symbols!A198)","v":"S.US.HD"},1,"S.US.HD",{"$f":"IF(A198=\"\",\"\",RTD(\"cqg.rtd\", ,\"ContractData\",C198, \"LongDescription\",, \"T\"))","v":"Home Depot, Inc."},null,null,null,{"$f":"IF(A198=\"\",\"\",RTD(\"cqg.rtd\", ,\"ContractData\",C198, \"LastTradeToday\",, \"T\"))","v":344.91},{"$f":"IF(A198=\"\",\"\",RTD(\"cqg.rtd\", ,\"ContractData\",C198, \"NetLastTradeToday\",, \"T\"))","v":1.48},{"$f":"IF(A198=\"\",\"\",IFERROR(RTD(\"cqg.rtd\", ,\"ContractData\",C198, \"PerCentNetLastTrade\",, \"T\")/100,\"\"))","v":4.3094662667792563E-3},{"$f":"IF(A198=\"\",\"\",RTD(\"cqg.rtd\", ,\"ContractData\", C198, \"T_CVol\",, \"T\"))","v":418924.97036099999},198,{"$f":"IFERROR(RANK($J198,INDIRECT((\"$J$\"&\"1\"&\":$J$\"&$A$449)))+COUNTIF($J$1:J198,J198)-1,\"\")","v":277},"S.US.HD","S.US.PPL"]
[{"$f":"IF(Symbols!A199=\"\",\"\",Symbols!A199)","v":"S.US.HIG"},1,"S.US.HIG",{"$f":"IF(A199=\"\",\"\",RTD(\"cqg.rtd\", ,\"ContractData\",C199, \"LongDescription\",, \"T\"))","v":"The Hartford Insurance Group, Inc."},null,null,null,{"$f":"IF(A199=\"\",\"\",RTD(\"cqg.rtd\", ,\"ContractData\",C199, \"LastTradeToday\",, \"T\"))","v":137.96},{"$f":"IF(A199=\"\",\"\",RTD(\"cqg.rtd\", ,\"ContractData\",C199, \"NetLastTradeToday\",, \"T\"))","v":0.52},{"$f":"IF(A199=\"\",\"\",IFERROR(RTD(\"cqg.rtd\", ,\"ContractData\",C199, \"PerCentNetLastTrade\",, \"T\")/100,\"\"))","v":3.7834691501746217E-3},{"$f":"IF(A199=\"\",\"\",RTD(\"cqg.rtd\", ,\"ContractData\", C199, \"T_CVol\",, \"T\"))","v":129793.094986},199,{"$f":"IFERROR(RANK($J199,INDIRECT((\"$J$\"&\"1\"&\":$J$\"&$A$449)))+COUNTIF($J$1:J199,J199)-1,\"\")","v":286},"S.US.HIG","S.US.EXPD"]
[{"$f":"IF(Symbols!A200=\"\",\"\",Symbols!A200)","v":"S.US.HII"},1,"S.US.HII",{"$f":"IF(A200=\"\",\"\",RTD(\"cqg.rtd\", ,\"ContractData\",C200, \"LongDescription\",, \"T\"))","v":"Huntington Ingalls Industries"},null,null,null,{"$f":"IF(A200=\"\",\"\",RTD(\"cqg.rtd\", ,\"ContractData\",C200, \"LastTradeToday\",, \"T\"))","v":328.26},{"$f":"IF(A200=\"\",\"\",RTD(\"cqg.rtd\", ,\"ContractData\",C200, \"NetLastTradeToday\",, \"T\"))","v":1.46},{"$f":"IF(A200=\"\",\"\",IFERROR(RTD(\"cqg.rtd\", ,\"ContractData\",C200, \"PerCentNetLastTrade\",, \"T\")/100,\"\"))","v":4.4675642594859235E-3},{"$f":"IF(A200=\"\",\"\",RTD(\"cqg.rtd\", ,\"ContractData\", C200, \"T_CVol\",, \"T\"))","v":48291.717139},200,{"$f":"IFERROR(RANK($J200,INDIRECT((\"$J$\"&\"1\"&\":$J$\"&$A$449)))+COUNTIF($J$1:J200,J200)-1,\"\")","v":276},"S.US.HII","S.US.SW"]
[{"$f":"IF(Symbols!A202=\"\",\"\",Symbols!A202)","v":"S.US.HONA"},{"$f":"IF(A201=\"\",\"\",IF(J202>0,1,0))","v":1},"S.US.HONA",{"$f":"IF(A201=\"\",\"\",RTD(\"cqg.rtd\", ,\"ContractData\",C201, \"LongDescription\",, \"T\"))","v":"Honeywell Aerospace Inc"},null,null,null,{"$f":"IF(A201=\"\",\"\",RTD(\"cqg.rtd\", ,\"ContractData\",C201, \"LastTradeToday\",, \"T\"))","v":167.22},{"$f":"IF(A201=\"\",\"\",RTD(\"cqg.rtd\", ,\"ContractData\",C201, \"NetLastTradeToday\",, \"T\"))","v":-0.57999999999999996},{"$f":"IF(A201=\"\",\"\",IFERROR(RTD(\"cqg.rtd\", ,\"ContractData\",C201, \"PerCentNetLastTrade\",, \"T\")/100,\"\"))","v":-3.4564958283671036E-3},{"$f":"IF(A201=\"\",\"\",RTD(\"cqg.rtd\", ,\"ContractData\", C201, \"T_CVol\",, \"T\"))","v":346626.71138400002},201,{"$f":"IFERROR(RANK($J201,INDIRECT((\"$J$\"&\"1\"&\":$J$\"&$A$449)))+COUNTIF($J$1:J201,J201)-1,\"\")","v":377},"S.US.HONA","S.US.USB"]
[{"$f":"IF(Symbols!A203=\"\",\"\",Symbols!A203)","v":"S.US.HPE"},{"$f":"IF(A202=\"\",\"\",IF(J203>0,1,0))","v":1},"S.US.HPE",{"$f":"IF(A202=\"\",\"\",RTD(\"cqg.rtd\", ,\"ContractData\",C202, \"LongDescription\",, \"T\"))","v":"Hewlett Packard Enterprise Company"},null,null,null,{"$f":"IF(A202=\"\",\"\",RTD(\"cqg.rtd\", ,\"ContractData\",C202, \"LastTradeToday\",, \"T\"))","v":61.77},{"$f":"IF(A202=\"\",\"\",RTD(\"cqg.rtd\", ,\"ContractData\",C202, \"NetLastTradeToday\",, \"T\"))","v":2.98},{"$f":"IF(A202=\"\",\"\",IFERROR(RTD(\"cqg.rtd\", ,\"ContractData\",C202, \"PerCentNetLastTrade\",, \"T\")/100,\"\"))","v":5.0688892668821234E-2},{"$f":"IF(A202=\"\",\"\",RTD(\"cqg.rtd\", ,\"ContractData\", C202, \"T_CVol\",, \"T\"))","v":10341334.664455},202,{"$f":"IFERROR(RANK($J202,INDIRECT((\"$J$\"&\"1\"&\":$J$\"&$A$449)))+COUNTIF($J$1:J202,J202)-1,\"\")","v":4},"S.US.HPE","S.US.WEC"]
[{"$f":"IF(Symbols!A204=\"\",\"\",Symbols!A204)","v":"S.US.HPQ"},{"$f":"IF(A203=\"\",\"\",IF(J204>0,1,0))","v":1},"S.US.HPQ",{"$f":"IF(A203=\"\",\"\",RTD(\"cqg.rtd\", ,\"ContractData\",C203, \"LongDescription\",, \"T\"))","v":"Hewlett-Packard Company"},null,null,null,{"$f":"IF(A203=\"\",\"\",RTD(\"cqg.rtd\", ,\"ContractData\",C203, \"LastTradeToday\",, \"T\"))","v":30.32},{"$f":"IF(A203=\"\",\"\",RTD(\"cqg.rtd\", ,\"ContractData\",C203, \"NetLastTradeToday\",, \"T\"))","v":1.04},{"$f":"IF(A203=\"\",\"\",IFERROR(RTD(\"cqg.rtd\", ,\"ContractData\",C203, \"PerCentNetLastTrade\",, \"T\")/100,\"\"))","v":3.5519125683060107E-2},{"$f":"IF(A203=\"\",\"\",RTD(\"cqg.rtd\", ,\"ContractData\", C203, \"T_CVol\",, \"T\"))","v":8592955.5549100004},203,{"$f":"IFERROR(RANK($J203,INDIRECT((\"$J$\"&\"1\"&\":$J$\"&$A$449)))+COUNTIF($J$1:J203,J203)-1,\"\")","v":10},"S.US.HPQ","S.US.MTB"]
[{"$f":"IF(Symbols!A205=\"\",\"\",Symbols!A205)","v":"S.US.HRL"},{"$f":"IF(A204=\"\",\"\",IF(J205>0,1,0))","v":0},"S.US.HRL",{"$f":"IF(A204=\"\",\"\",RTD(\"cqg.rtd\", ,\"ContractData\",C204, \"LongDescription\",, \"T\"))","v":"Hormel Foods Corp"},null,null,null,{"$f":"IF(A204=\"\",\"\",RTD(\"cqg.rtd\", ,\"ContractData\",C204, \"LastTradeToday\",, \"T\"))","v":24.53},{"$f":"IF(A204=\"\",\"\",RTD(\"cqg.rtd\", ,\"ContractData\",C204, \"NetLastTradeToday\",, \"T\"))","v":0.14000000000000001},{"$f":"IF(A204=\"\",\"\",IFERROR(RTD(\"cqg.rtd\", ,\"ContractData\",C204, \"PerCentNetLastTrade\",, \"T\")/100,\"\"))","v":5.7400574005740061E-3},{"$f":"IF(A204=\"\",\"\",RTD(\"cqg.rtd\", ,\"ContractData\", C204, \"T_CVol\",, \"T\"))","v":248015.07579},204,{"$f":"IFERROR(RANK($J204,INDIRECT((\"$J$\"&\"1\"&\":$J$\"&$A$449)))+COUNTIF($J$1:J204,J204)-1,\"\")","v":261},"S.US.HRL","S.US.CDNS"]
[{"$f":"IF(Symbols!A206=\"\",\"\",Symbols!A206)","v":"S.US.HSIC"},{"$f":"IF(A205=\"\",\"\",IF(J206>0,1,0))","v":1},"S.US.HSIC",{"$f":"IF(A205=\"\",\"\",RTD(\"cqg.rtd\", ,\"ContractData\",C205, \"LongDescription\",, \"T\"))","v":"Henry Schein Inc"},null,null,null,{"$f":"IF(A205=\"\",\"\",RTD(\"cqg.rtd\", ,\"ContractData\",C205, \"LastTradeToday\",, \"T\"))","v":90.54},{"$f":"IF(A205=\"\",\"\",RTD(\"cqg.rtd\", ,\"ContractData\",C205, \"NetLastTradeToday\",, \"T\"))","v":-0.2},{"$f":"IF(A205=\"\",\"\",IFERROR(RTD(\"cqg.rtd\", ,\"ContractData\",C205, \"PerCentNetLastTrade\",, \"T\")/100,\"\"))","v":-2.2040996253030638E-3},{"$f":"IF(A205=\"\",\"\",RTD(\"cqg.rtd\", ,\"ContractData\", C205, \"T_CVol\",, \"T\"))","v":90829.494932000001},205,{"$f":"IFERROR(RANK($J205,INDIRECT((\"$J$\"&\"1\"&\":$J$\"&$A$449)))+COUNTIF($J$1:J205,J205)-1,\"\")","v":367},"S.US.HSIC","S.US.NI"]
[{"$f":"IF(Symbols!A207=\"\",\"\",Symbols!A207)","v":"S.US.HST"},{"$f":"IF(A206=\"\",\"\",IF(J207>0,1,0))","v":1},"S.US.HST",{"$f":"IF(A206=\"\",\"\",RTD(\"cqg.rtd\", ,\"ContractData\",C206, \"LongDescription\",, \"T\"))","v":"HOST HTLS & RSRT CM"},null,null,null,{"$f":"IF(A206=\"\",\"\",RTD(\"cqg.rtd\", ,\"ContractData\",C206, \"LastTradeToday\",, \"T\"))","v":22.81},{"$f":"IF(A206=\"\",\"\",RTD(\"cqg.rtd\", ,\"ContractData\",C206, \"NetLastTradeToday\",, \"T\"))","v":0.01},{"$f":"IF(A206=\"\",\"\",IFERROR(RTD(\"cqg.rtd\", ,\"ContractData\",C206, \"PerCentNetLastTrade\",, \"T\")/100,\"\"))","v":4.3859649122807013E-4},{"$f":"IF(A206=\"\",\"\",RTD(\"cqg.rtd\", ,\"ContractData\", C206, \"T_CVol\",, \"T\"))","v":529502.09115400002},206,{"$f":"IFERROR(RANK($J206,INDIRECT((\"$J$\"&\"1\"&\":$J$\"&$A$449)))+COUNTIF($J$1:J206,J206)-1,\"\")","v":333},"S.US.HST","S.US.ZTS"]
[{"$f":"IF(Symbols!A208=\"\",\"\",Symbols!A208)","v":"S.US.HSY"},{"$f":"IF(A207=\"\",\"\",IF(J208>0,1,0))","v":0},"S.US.HSY",{"$f":"IF(A207=\"\",\"\",RTD(\"cqg.rtd\", ,\"ContractData\",C207, \"LongDescription\",, \"T\"))","v":"Hershey Foods Corp"},null,null,null,{"$f":"IF(A207=\"\",\"\",RTD(\"cqg.rtd\", ,\"ContractData\",C207, \"LastTradeToday\",, \"T\"))","v":186.38},{"$f":"IF(A207=\"\",\"\",RTD(\"cqg.rtd\", ,\"ContractData\",C207, \"NetLastTradeToday\",, \"T\"))","v":2.15},{"$f":"IF(A207=\"\",\"\",IFERROR(RTD(\"cqg.rtd\", ,\"ContractData\",C207, \"PerCentNetLastTrade\",, \"T\")/100,\"\"))","v":1.1670194865114258E-2},{"$f":"IF(A207=\"\",\"\",RTD(\"cqg.rtd\", ,\"ContractData\", C207, \"T_CVol\",, \"T\"))","v":122166.429569},207,{"$f":"IFERROR(RANK($J207,INDIRECT((\"$J$\"&\"1\"&\":$J$\"&$A$449)))+COUNTIF($J$1:J207,J207)-1,\"\")","v":142},"S.US.HSY","S.US.LUV"]
[{"$f":"IF(Symbols!A209=\"\",\"\",Symbols!A209)","v":"S.US.HUBB"},{"$f":"IF(A208=\"\",\"\",IF(J209>0,1,0))","v":0},"S.US.HUBB",{"$f":"IF(A208=\"\",\"\",RTD(\"cqg.rtd\", ,\"ContractData\",C208, \"LongDescription\",, \"T\"))","v":"Hubbell Inc Cls B"},null,null,null,{"$f":"IF(A208=\"\",\"\",RTD(\"cqg.rtd\", ,\"ContractData\",C208, \"LastTradeToday\",, \"T\"))","v":508.59000000000003},{"$f":"IF(A208=\"\",\"\",RTD(\"cqg.rtd\", ,\"ContractData\",C208, \"NetLastTradeToday\",, \"T\"))","v":-4.3100000000000005},{"$f":"IF(A208=\"\",\"\",IFERROR(RTD(\"cqg.rtd\", ,\"ContractData\",C208, \"PerCentNetLastTrade\",, \"T\")/100,\"\"))","v":-8.4031975043868199E-3},{"$f":"IF(A208=\"\",\"\",RTD(\"cqg.rtd\", ,\"ContractData\", C208, \"T_CVol\",, \"T\"))","v":48399.345029999997},208,{"$f":"IFERROR(RANK($J208,INDIRECT((\"$J$\"&\"1\"&\":$J$\"&$A$449)))+COUNTIF($J$1:J208,J208)-1,\"\")","v":408},"S.US.HUBB","S.US.CI"]
[{"$f":"IF(Symbols!A210=\"\",\"\",Symbols!A210)","v":"S.US.HUM"},{"$f":"IF(A209=\"\",\"\",IF(J210>0,1,0))","v":1},"S.US.HUM",{"$f":"IF(A209=\"\",\"\",RTD(\"cqg.rtd\", ,\"ContractData\",C209, \"LongDescription\",, \"T\"))","v":"Humana Inc"},null,null,null,{"$f":"IF(A209=\"\",\"\",RTD(\"cqg.rtd\", ,\"ContractData\",C209, \"LastTradeToday\",, \"T\"))","v":385.41},{"$f":"IF(A209=\"\",\"\",RTD(\"cqg.rtd\", ,\"ContractData\",C209, \"NetLastTradeToday\",, \"T\"))","v":-3.42},{"$f":"IF(A209=\"\",\"\",IFERROR(RTD(\"cqg.rtd\", ,\"ContractData\",C209, \"PerCentNetLastTrade\",, \"T\")/100,\"\"))","v":-8.79561762209706E-3},{"$f":"IF(A209=\"\",\"\",RTD(\"cqg.rtd\", ,\"ContractData\", C209, \"T_CVol\",, \"T\"))","v":98317.471848000001},209,{"$f":"IFERROR(RANK($J209,INDIRECT((\"$J$\"&\"1\"&\":$J$\"&$A$449)))+COUNTIF($J$1:J209,J209)-1,\"\")","v":411},"S.US.HUM","S.US.CMS"]
[{"$f":"IF(Symbols!A211=\"\",\"\",Symbols!A211)","v":"S.US.IBM"},{"$f":"IF(A210=\"\",\"\",IF(J211>0,1,0))","v":1},"S.US.IBM",{"$f":"IF(A210=\"\",\"\",RTD(\"cqg.rtd\", ,\"ContractData\",C210, \"LongDescription\",, \"T\"))","v":"International Business Machines"},null,null,null,{"$f":"IF(A210=\"\",\"\",RTD(\"cqg.rtd\", ,\"ContractData\",C210, \"LastTradeToday\",, \"T\"))","v":238.14000000000001},{"$f":"IF(A210=\"\",\"\",RTD(\"cqg.rtd\", ,\"ContractData\",C210, \"NetLastTradeToday\",, \"T\"))","v":2.16},{"$f":"IF(A210=\"\",\"\",IFERROR(RTD(\"cqg.rtd\", ,\"ContractData\",C210, \"PerCentNetLastTrade\",, \"T\")/100,\"\"))","v":9.1533180778032037E-3},{"$f":"IF(A210=\"\",\"\",RTD(\"cqg.rtd\", ,\"ContractData\", C210, \"T_CVol\",, \"T\"))","v":880656.19647700002},210,{"$f":"IFERROR(RANK($J210,INDIRECT((\"$J$\"&\"1\"&\":$J$\"&$A$449)))+COUNTIF($J$1:J210,J210)-1,\"\")","v":182},"S.US.IBM","S.US.PYPL"]
[{"$f":"IF(Symbols!A212=\"\",\"\",Symbols!A212)","v":"S.US.ICE"},{"$f":"IF(A211=\"\",\"\",IF(J212>0,1,0))","v":0},"S.US.ICE",{"$f":"IF(A211=\"\",\"\",RTD(\"cqg.rtd\", ,\"ContractData\",C211, \"LongDescription\",, \"T\"))","v":"Intercontinental, Inc."},null,null,null,{"$f":"IF(A211=\"\",\"\",RTD(\"cqg.rtd\", ,\"ContractData\",C211, \"LastTradeToday\",, \"T\"))","v":152.72},{"$f":"IF(A211=\"\",\"\",RTD(\"cqg.rtd\", ,\"ContractData\",C211, \"NetLastTradeToday\",, \"T\"))","v":1.3900000000000001},{"$f":"IF(A211=\"\",\"\",IFERROR(RTD(\"cqg.rtd\", ,\"ContractData\",C211, \"PerCentNetLastTrade\",, \"T\")/100,\"\"))","v":9.1852243441485487E-3},{"$f":"IF(A211=\"\",\"\",RTD(\"cqg.rtd\", ,\"ContractData\", C211, \"T_CVol\",, \"T\"))","v":219911.77371000001},211,{"$f":"IFERROR(RANK($J211,INDIRECT((\"$J$\"&\"1\"&\":$J$\"&$A$449)))+COUNTIF($J$1:J211,J211)-1,\"\")","v":181},"S.US.ICE","S.US.ADI"]
[{"$f":"IF(Symbols!A213=\"\",\"\",Symbols!A213)","v":"S.US.IEX"},{"$f":"IF(A212=\"\",\"\",IF(J213>0,1,0))","v":1},"S.US.IEX",{"$f":"IF(A212=\"\",\"\",RTD(\"cqg.rtd\", ,\"ContractData\",C212, \"LongDescription\",, \"T\"))","v":"Idex Corp"},null,null,null,{"$f":"IF(A212=\"\",\"\",RTD(\"cqg.rtd\", ,\"ContractData\",C212, \"LastTradeToday\",, \"T\"))","v":240.02},{"$f":"IF(A212=\"\",\"\",RTD(\"cqg.rtd\", ,\"ContractData\",C212, \"NetLastTradeToday\",, \"T\"))","v":-0.5},{"$f":"IF(A212=\"\",\"\",IFERROR(RTD(\"cqg.rtd\", ,\"ContractData\",C212, \"PerCentNetLastTrade\",, \"T\")/100,\"\"))","v":-2.078829203392649E-3},{"$f":"IF(A212=\"\",\"\",RTD(\"cqg.rtd\", ,\"ContractData\", C212, \"T_CVol\",, \"T\"))","v":25663.808187999999},212,{"$f":"IFERROR(RANK($J212,INDIRECT((\"$J$\"&\"1\"&\":$J$\"&$A$449)))+COUNTIF($J$1:J212,J212)-1,\"\")","v":363},"S.US.IEX","S.US.HBAN"]
[{"$f":"IF(Symbols!A214=\"\",\"\",Symbols!A214)","v":"S.US.IFF"},{"$f":"IF(A213=\"\",\"\",IF(J214>0,1,0))","v":1},"S.US.IFF",{"$f":"IF(A213=\"\",\"\",RTD(\"cqg.rtd\", ,\"ContractData\",C213, \"LongDescription\",, \"T\"))","v":"Intl Flvrs & Fragrances"},null,null,null,{"$f":"IF(A213=\"\",\"\",RTD(\"cqg.rtd\", ,\"ContractData\",C213, \"LastTradeToday\",, \"T\"))","v":84.47},{"$f":"IF(A213=\"\",\"\",RTD(\"cqg.rtd\", ,\"ContractData\",C213, \"NetLastTradeToday\",, \"T\"))","v":0.62},{"$f":"IF(A213=\"\",\"\",IFERROR(RTD(\"cqg.rtd\", ,\"ContractData\",C213, \"PerCentNetLastTrade\",, \"T\")/100,\"\"))","v":7.3941562313655342E-3},{"$f":"IF(A213=\"\",\"\",RTD(\"cqg.rtd\", ,\"ContractData\", C213, \"T_CVol\",, \"T\"))","v":106364.633396},213,{"$f":"IFERROR(RANK($J213,INDIRECT((\"$J$\"&\"1\"&\":$J$\"&$A$449)))+COUNTIF($J$1:J213,J213)-1,\"\")","v":223},"S.US.IFF","S.US.D"]
[{"$f":"IF(Symbols!A215=\"\",\"\",Symbols!A215)","v":"S.US.INTC"},{"$f":"IF(A214=\"\",\"\",IF(J215>0,1,0))","v":1},"S.US.INTC",{"$f":"IF(A214=\"\",\"\",RTD(\"cqg.rtd\", ,\"ContractData\",C214, \"LongDescription\",, \"T\"))","v":"INTEL CORP"},null,null,null,{"$f":"IF(A214=\"\",\"\",RTD(\"cqg.rtd\", ,\"ContractData\",C214, \"LastTradeToday\",, \"T\"))","v":105.49000000000001},{"$f":"IF(A214=\"\",\"\",RTD(\"cqg.rtd\", ,\"ContractData\",C214, \"NetLastTradeToday\",, \"T\"))","v":4.54},{"$f":"IF(A214=\"\",\"\",IFERROR(RTD(\"cqg.rtd\", ,\"ContractData\",C214, \"PerCentNetLastTrade\",, \"T\")/100,\"\"))","v":4.4972758791480931E-2},{"$f":"IF(A214=\"\",\"\",RTD(\"cqg.rtd\", ,\"ContractData\", C214, \"T_CVol\",, \"T\"))","v":33117661.434824999},214,{"$f":"IFERROR(RANK($J214,INDIRECT((\"$J$\"&\"1\"&\":$J$\"&$A$449)))+COUNTIF($J$1:J214,J214)-1,\"\")","v":6},"S.US.INTC","S.US.ABNB"]
[{"$f":"IF(Symbols!A216=\"\",\"\",Symbols!A216)","v":"S.US.INTU"},{"$f":"IF(A215=\"\",\"\",IF(J216>0,1,0))","v":1},"S.US.INTU",{"$f":"IF(A215=\"\",\"\",RTD(\"cqg.rtd\", ,\"ContractData\",C215, \"LongDescription\",, \"T\"))","v":"INTUIT INC"},null,null,null,{"$f":"IF(A215=\"\",\"\",RTD(\"cqg.rtd\", ,\"ContractData\",C215, \"LastTradeToday\",, \"T\"))","v":344.57},{"$f":"IF(A215=\"\",\"\",RTD(\"cqg.rtd\", ,\"ContractData\",C215, \"NetLastTradeToday\",, \"T\"))","v":9.86},{"$f":"IF(A215=\"\",\"\",IFERROR(RTD(\"cqg.rtd\", ,\"ContractData\",C215, \"PerCentNetLastTrade\",, \"T\")/100,\"\"))","v":2.9458337067909533E-2},{"$f":"IF(A215=\"\",\"\",RTD(\"cqg.rtd\", ,\"ContractData\", C215, \"T_CVol\",, \"T\"))","v":526869.81200799998},215,{"$f":"IFERROR(RANK($J215,INDIRECT((\"$J$\"&\"1\"&\":$J$\"&$A$449)))+COUNTIF($J$1:J215,J215)-1,\"\")","v":20},"S.US.INTU","S.US.PNW"]
[{"$f":"IF(Symbols!A217=\"\",\"\",Symbols!A217)","v":"S.US.INVH"},{"$f":"IF(A216=\"\",\"\",IF(J217>0,1,0))","v":1},"S.US.INVH",{"$f":"IF(A216=\"\",\"\",RTD(\"cqg.rtd\", ,\"ContractData\",C216, \"LongDescription\",, \"T\"))","v":"Invitation Homes Inc."},null,null,null,{"$f":"IF(A216=\"\",\"\",RTD(\"cqg.rtd\", ,\"ContractData\",C216, \"LastTradeToday\",, \"T\"))","v":30.34},{"$f":"IF(A216=\"\",\"\",RTD(\"cqg.rtd\", ,\"ContractData\",C216, \"NetLastTradeToday\",, \"T\"))","v":0.56000000000000005},{"$f":"IF(A216=\"\",\"\",IFERROR(RTD(\"cqg.rtd\", ,\"ContractData\",C216, \"PerCentNetLastTrade\",, \"T\")/100,\"\"))","v":1.880456682337139E-2},{"$f":"IF(A216=\"\",\"\",RTD(\"cqg.rtd\", ,\"ContractData\", C216, \"T_CVol\",, \"T\"))","v":166785.20008400001},216,{"$f":"IFERROR(RANK($J216,INDIRECT((\"$J$\"&\"1\"&\":$J$\"&$A$449)))+COUNTIF($J$1:J216,J216)-1,\"\")","v":65},"S.US.INVH","S.US.BDX"]
[{"$f":"IF(Symbols!A218=\"\",\"\",Symbols!A218)","v":"S.US.IP"},{"$f":"IF(A217=\"\",\"\",IF(J218>0,1,0))","v":1},"S.US.IP",{"$f":"IF(A217=\"\",\"\",RTD(\"cqg.rtd\", ,\"ContractData\",C217, \"LongDescription\",, \"T\"))","v":"International Paper Co"},null,null,null,{"$f":"IF(A217=\"\",\"\",RTD(\"cqg.rtd\", ,\"ContractData\",C217, \"LastTradeToday\",, \"T\"))","v":41.19},{"$f":"IF(A217=\"\",\"\",RTD(\"cqg.rtd\", ,\"ContractData\",C217, \"NetLastTradeToday\",, \"T\"))","v":0.05},{"$f":"IF(A217=\"\",\"\",IFERROR(RTD(\"cqg.rtd\", ,\"ContractData\",C217, \"PerCentNetLastTrade\",, \"T\")/100,\"\"))","v":1.2153621779290229E-3},{"$f":"IF(A217=\"\",\"\",RTD(\"cqg.rtd\", ,\"ContractData\", C217, \"T_CVol\",, \"T\"))","v":489057.68502799998},217,{"$f":"IFERROR(RANK($J217,INDIRECT((\"$J$\"&\"1\"&\":$J$\"&$A$449)))+COUNTIF($J$1:J217,J217)-1,\"\")","v":319},"S.US.IP","S.US.ADP"]
[{"$f":"IF(Symbols!A219=\"\",\"\",Symbols!A219)","v":"S.US.IQV"},{"$f":"IF(A218=\"\",\"\",IF(J219>0,1,0))","v":0},"S.US.IQV",{"$f":"IF(A218=\"\",\"\",RTD(\"cqg.rtd\", ,\"ContractData\",C218, \"LongDescription\",, \"T\"))","v":"IQVIA Holdings, Inc."},null,null,null,{"$f":"IF(A218=\"\",\"\",RTD(\"cqg.rtd\", ,\"ContractData\",C218, \"LastTradeToday\",, \"T\"))","v":243},{"$f":"IF(A218=\"\",\"\",RTD(\"cqg.rtd\", ,\"ContractData\",C218, \"NetLastTradeToday\",, \"T\"))","v":1.29},{"$f":"IF(A218=\"\",\"\",IFERROR(RTD(\"cqg.rtd\", ,\"ContractData\",C218, \"PerCentNetLastTrade\",, \"T\")/100,\"\"))","v":5.3369740598237557E-3},{"$f":"IF(A218=\"\",\"\",RTD(\"cqg.rtd\", ,\"ContractData\", C218, \"T_CVol\",, \"T\"))","v":112216.182411},218,{"$f":"IFERROR(RANK($J218,INDIRECT((\"$J$\"&\"1\"&\":$J$\"&$A$449)))+COUNTIF($J$1:J218,J218)-1,\"\")","v":270},"S.US.IQV","S.US.SCHW"]
[{"$f":"IF(Symbols!A220=\"\",\"\",Symbols!A220)","v":"S.US.IR"},{"$f":"IF(A219=\"\",\"\",IF(J220>0,1,0))","v":1},"S.US.IR",{"$f":"IF(A219=\"\",\"\",RTD(\"cqg.rtd\", ,\"ContractData\",C219, \"LongDescription\",, \"T\"))","v":"Ingersoll Rand Inc."},null,null,null,{"$f":"IF(A219=\"\",\"\",RTD(\"cqg.rtd\", ,\"ContractData\",C219, \"LastTradeToday\",, \"T\"))","v":84.03},{"$f":"IF(A219=\"\",\"\",RTD(\"cqg.rtd\", ,\"ContractData\",C219, \"NetLastTradeToday\",, \"T\"))","v":-0.73},{"$f":"IF(A219=\"\",\"\",IFERROR(RTD(\"cqg.rtd\", ,\"ContractData\",C219, \"PerCentNetLastTrade\",, \"T\")/100,\"\"))","v":-8.6125530910806988E-3},{"$f":"IF(A219=\"\",\"\",RTD(\"cqg.rtd\", ,\"ContractData\", C219, \"T_CVol\",, \"T\"))","v":272145.04695400002},219,{"$f":"IFERROR(RANK($J219,INDIRECT((\"$J$\"&\"1\"&\":$J$\"&$A$449)))+COUNTIF($J$1:J219,J219)-1,\"\")","v":410},"S.US.IR","S.US.WSM"]
[{"$f":"IF(Symbols!A221=\"\",\"\",Symbols!A221)","v":"S.US.IRM"},{"$f":"IF(A220=\"\",\"\",IF(J221>0,1,0))","v":0},"S.US.IRM",{"$f":"IF(A220=\"\",\"\",RTD(\"cqg.rtd\", ,\"ContractData\",C220, \"LongDescription\",, \"T\"))","v":"Iron Mountain Inc"},null,null,null,{"$f":"IF(A220=\"\",\"\",RTD(\"cqg.rtd\", ,\"ContractData\",C220, \"LastTradeToday\",, \"T\"))","v":126.15},{"$f":"IF(A220=\"\",\"\",RTD(\"cqg.rtd\", ,\"ContractData\",C220, \"NetLastTradeToday\",, \"T\"))","v":1.79},{"$f":"IF(A220=\"\",\"\",IFERROR(RTD(\"cqg.rtd\", ,\"ContractData\",C220, \"PerCentNetLastTrade\",, \"T\")/100,\"\"))","v":1.4393695722097137E-2},{"$f":"IF(A220=\"\",\"\",RTD(\"cqg.rtd\", ,\"ContractData\", C220, \"T_CVol\",, \"T\"))","v":133753.81932099999},220,{"$f":"IFERROR(RANK($J220,INDIRECT((\"$J$\"&\"1\"&\":$J$\"&$A$449)))+COUNTIF($J$1:J220,J220)-1,\"\")","v":97},"S.US.IRM","S.US.PPG"]
[{"$f":"IF(Symbols!A222=\"\",\"\",Symbols!A222)","v":"S.US.IT"},{"$f":"IF(A221=\"\",\"\",IF(J222>0,1,0))","v":0},"S.US.IT",{"$f":"IF(A221=\"\",\"\",RTD(\"cqg.rtd\", ,\"ContractData\",C221, \"LongDescription\",, \"T\"))","v":"Gartner Group"},null,null,null,{"$f":"IF(A221=\"\",\"\",RTD(\"cqg.rtd\", ,\"ContractData\",C221, \"LastTradeToday\",, \"T\"))","v":177.94},{"$f":"IF(A221=\"\",\"\",RTD(\"cqg.rtd\", ,\"ContractData\",C221, \"NetLastTradeToday\",, \"T\"))","v":-1.52},{"$f":"IF(A221=\"\",\"\",IFERROR(RTD(\"cqg.rtd\", ,\"ContractData\",C221, \"PerCentNetLastTrade\",, \"T\")/100,\"\"))","v":-8.4698540064638353E-3},{"$f":"IF(A221=\"\",\"\",RTD(\"cqg.rtd\", ,\"ContractData\", C221, \"T_CVol\",, \"T\"))","v":121167.801615},221,{"$f":"IFERROR(RANK($J221,INDIRECT((\"$J$\"&\"1\"&\":$J$\"&$A$449)))+COUNTIF($J$1:J221,J221)-1,\"\")","v":409},"S.US.IT","S.US.WAT"]
[{"$f":"IF(Symbols!A223=\"\",\"\",Symbols!A223)","v":"S.US.ITW"},{"$f":"IF(A222=\"\",\"\",IF(J223>0,1,0))","v":1},"S.US.ITW",{"$f":"IF(A222=\"\",\"\",RTD(\"cqg.rtd\", ,\"ContractData\",C222, \"LongDescription\",, \"T\"))","v":"Illinois Tools Works Inc"},null,null,null,{"$f":"IF(A222=\"\",\"\",RTD(\"cqg.rtd\", ,\"ContractData\",C222, \"LastTradeToday\",, \"T\"))","v":290.87},{"$f":"IF(A222=\"\",\"\",RTD(\"cqg.rtd\", ,\"ContractData\",C222, \"NetLastTradeToday\",, \"T\"))","v":-1.6400000000000001},{"$f":"IF(A222=\"\",\"\",IFERROR(RTD(\"cqg.rtd\", ,\"ContractData\",C222, \"PerCentNetLastTrade\",, \"T\")/100,\"\"))","v":-5.606645926634987E-3},{"$f":"IF(A222=\"\",\"\",RTD(\"cqg.rtd\", ,\"ContractData\", C222, \"T_CVol\",, \"T\"))","v":79467.257937000002},222,{"$f":"IFERROR(RANK($J222,INDIRECT((\"$J$\"&\"1\"&\":$J$\"&$A$449)))+COUNTIF($J$1:J222,J222)-1,\"\")","v":397},"S.US.ITW","S.US.ADM"]
[{"$f":"IF(Symbols!A224=\"\",\"\",Symbols!A224)","v":"S.US.IVZ"},{"$f":"IF(A223=\"\",\"\",IF(J224>0,1,0))","v":0},"S.US.IVZ",{"$f":"IF(A223=\"\",\"\",RTD(\"cqg.rtd\", ,\"ContractData\",C223, \"LongDescription\",, \"T\"))","v":"Invesco Ltd."},null,null,null,{"$f":"IF(A223=\"\",\"\",RTD(\"cqg.rtd\", ,\"ContractData\",C223, \"LastTradeToday\",, \"T\"))","v":32.19},{"$f":"IF(A223=\"\",\"\",RTD(\"cqg.rtd\", ,\"ContractData\",C223, \"NetLastTradeToday\",, \"T\"))","v":0.65},{"$f":"IF(A223=\"\",\"\",IFERROR(RTD(\"cqg.rtd\", ,\"ContractData\",C223, \"PerCentNetLastTrade\",, \"T\")/100,\"\"))","v":2.0608750792644258E-2},{"$f":"IF(A223=\"\",\"\",RTD(\"cqg.rtd\", ,\"ContractData\", C223, \"T_CVol\",, \"T\"))","v":197115.107992},223,{"$f":"IFERROR(RANK($J223,INDIRECT((\"$J$\"&\"1\"&\":$J$\"&$A$449)))+COUNTIF($J$1:J223,J223)-1,\"\")","v":54},"S.US.IVZ","S.US.IFF"]
[{"$f":"IF(Symbols!A225=\"\",\"\",Symbols!A225)","v":"S.US.J"},{"$f":"IF(A224=\"\",\"\",IF(J225>0,1,0))","v":1},"S.US.J",{"$f":"IF(A224=\"\",\"\",RTD(\"cqg.rtd\", ,\"ContractData\",C224, \"LongDescription\",, \"T\"))","v":"Jacobs Solutions Inc."},null,null,null,{"$f":"IF(A224=\"\",\"\",RTD(\"cqg.rtd\", ,\"ContractData\",C224, \"LastTradeToday\",, \"T\"))","v":144.56},{"$f":"IF(A224=\"\",\"\",RTD(\"cqg.rtd\", ,\"ContractData\",C224, \"NetLastTradeToday\",, \"T\"))","v":-0.81},{"$f":"IF(A224=\"\",\"\",IFERROR(RTD(\"cqg.rtd\", ,\"ContractData\",C224, \"PerCentNetLastTrade\",, \"T\")/100,\"\"))","v":-5.5719887184425944E-3},{"$f":"IF(A224=\"\",\"\",RTD(\"cqg.rtd\", ,\"ContractData\", C224, \"T_CVol\",, \"T\"))","v":37361.194467000001},224,{"$f":"IFERROR(RANK($J224,INDIRECT((\"$J$\"&\"1\"&\":$J$\"&$A$449)))+COUNTIF($J$1:J224,J224)-1,\"\")","v":396},"S.US.J","S.US.SHW"]
[{"$f":"IF(Symbols!A226=\"\",\"\",Symbols!A226)","v":"S.US.JBHT"},{"$f":"IF(A225=\"\",\"\",IF(J226>0,1,0))","v":1},"S.US.JBHT",{"$f":"IF(A225=\"\",\"\",RTD(\"cqg.rtd\", ,\"ContractData\",C225, \"LongDescription\",, \"T\"))","v":"J B HUNT TRANSPORT C"},null,null,null,{"$f":"IF(A225=\"\",\"\",RTD(\"cqg.rtd\", ,\"ContractData\",C225, \"LastTradeToday\",, \"T\"))","v":281.66000000000003},{"$f":"IF(A225=\"\",\"\",RTD(\"cqg.rtd\", ,\"ContractData\",C225, \"NetLastTradeToday\",, \"T\"))","v":5.7},{"$f":"IF(A225=\"\",\"\",IFERROR(RTD(\"cqg.rtd\", ,\"ContractData\",C225, \"PerCentNetLastTrade\",, \"T\")/100,\"\"))","v":2.0655167415567471E-2},{"$f":"IF(A225=\"\",\"\",RTD(\"cqg.rtd\", ,\"ContractData\", C225, \"T_CVol\",, \"T\"))","v":145921.44675100001},225,{"$f":"IFERROR(RANK($J225,INDIRECT((\"$J$\"&\"1\"&\":$J$\"&$A$449)))+COUNTIF($J$1:J225,J225)-1,\"\")","v":53},"S.US.JBHT","S.US.MRSH"]
[{"$f":"IF(Symbols!A227=\"\",\"\",Symbols!A227)","v":"S.US.JBL"},{"$f":"IF(A226=\"\",\"\",IF(J227>0,1,0))","v":0},"S.US.JBL",{"$f":"IF(A226=\"\",\"\",RTD(\"cqg.rtd\", ,\"ContractData\",C226, \"LongDescription\",, \"T\"))","v":"Jabil Inc."},null,null,null,{"$f":"IF(A226=\"\",\"\",RTD(\"cqg.rtd\", ,\"ContractData\",C226, \"LastTradeToday\",, \"T\"))","v":371.32},{"$f":"IF(A226=\"\",\"\",RTD(\"cqg.rtd\", ,\"ContractData\",C226, \"NetLastTradeToday\",, \"T\"))","v":5.16},{"$f":"IF(A226=\"\",\"\",IFERROR(RTD(\"cqg.rtd\", ,\"ContractData\",C226, \"PerCentNetLastTrade\",, \"T\")/100,\"\"))","v":1.4092200131090233E-2},{"$f":"IF(A226=\"\",\"\",RTD(\"cqg.rtd\", ,\"ContractData\", C226, \"T_CVol\",, \"T\"))","v":100516.016345},226,{"$f":"IFERROR(RANK($J226,INDIRECT((\"$J$\"&\"1\"&\":$J$\"&$A$449)))+COUNTIF($J$1:J226,J226)-1,\"\")","v":103},"S.US.JBL","S.US.EL"]
[{"$f":"IF(Symbols!A228=\"\",\"\",Symbols!A228)","v":"S.US.JCI"},{"$f":"IF(A227=\"\",\"\",IF(J228>0,1,0))","v":1},"S.US.JCI",{"$f":"IF(A227=\"\",\"\",RTD(\"cqg.rtd\", ,\"ContractData\",C227, \"LongDescription\",, \"T\"))","v":"Johnson Controls International plc"},null,null,null,{"$f":"IF(A227=\"\",\"\",RTD(\"cqg.rtd\", ,\"ContractData\",C227, \"LastTradeToday\",, \"T\"))","v":152.31},{"$f":"IF(A227=\"\",\"\",RTD(\"cqg.rtd\", ,\"ContractData\",C227, \"NetLastTradeToday\",, \"T\"))","v":-0.48},{"$f":"IF(A227=\"\",\"\",IFERROR(RTD(\"cqg.rtd\", ,\"ContractData\",C227, \"PerCentNetLastTrade\",, \"T\")/100,\"\"))","v":-3.141566856469664E-3},{"$f":"IF(A227=\"\",\"\",RTD(\"cqg.rtd\", ,\"ContractData\", C227, \"T_CVol\",, \"T\"))","v":317283.352641},227,{"$f":"IFERROR(RANK($J227,INDIRECT((\"$J$\"&\"1\"&\":$J$\"&$A$449)))+COUNTIF($J$1:J227,J227)-1,\"\")","v":373},"S.US.JCI","S.US.STT"]
[{"$f":"IF(Symbols!A229=\"\",\"\",Symbols!A229)","v":"S.US.JKHY"},{"$f":"IF(A228=\"\",\"\",IF(J229>0,1,0))","v":1},"S.US.JKHY",{"$f":"IF(A228=\"\",\"\",RTD(\"cqg.rtd\", ,\"ContractData\",C228, \"LongDescription\",, \"T\"))","v":"JACK HENRY & ASSOC"},null,null,null,{"$f":"IF(A228=\"\",\"\",RTD(\"cqg.rtd\", ,\"ContractData\",C228, \"LastTradeToday\",, \"T\"))","v":153.18},{"$f":"IF(A228=\"\",\"\",RTD(\"cqg.rtd\", ,\"ContractData\",C228, \"NetLastTradeToday\",, \"T\"))","v":0.87},{"$f":"IF(A228=\"\",\"\",IFERROR(RTD(\"cqg.rtd\", ,\"ContractData\",C228, \"PerCentNetLastTrade\",, \"T\")/100,\"\"))","v":5.7120346661414219E-3},{"$f":"IF(A228=\"\",\"\",RTD(\"cqg.rtd\", ,\"ContractData\", C228, \"T_CVol\",, \"T\"))","v":42521.519440999997},228,{"$f":"IFERROR(RANK($J228,INDIRECT((\"$J$\"&\"1\"&\":$J$\"&$A$449)))+COUNTIF($J$1:J228,J228)-1,\"\")","v":262},"S.US.JKHY","S.US.ATO"]
[{"$f":"IF(Symbols!A230=\"\",\"\",Symbols!A230)","v":"S.US.JNJ"},{"$f":"IF(A229=\"\",\"\",IF(J230>0,1,0))","v":1},"S.US.JNJ",{"$f":"IF(A229=\"\",\"\",RTD(\"cqg.rtd\", ,\"ContractData\",C229, \"LongDescription\",, \"T\"))","v":"Johnson & Johnson"},null,null,null,{"$f":"IF(A229=\"\",\"\",RTD(\"cqg.rtd\", ,\"ContractData\",C229, \"LastTradeToday\",, \"T\"))","v":261.05},{"$f":"IF(A229=\"\",\"\",RTD(\"cqg.rtd\", ,\"ContractData\",C229, \"NetLastTradeToday\",, \"T\"))","v":0.19},{"$f":"IF(A229=\"\",\"\",IFERROR(RTD(\"cqg.rtd\", ,\"ContractData\",C229, \"PerCentNetLastTrade\",, \"T\")/100,\"\"))","v":7.2836003986812849E-4},{"$f":"IF(A229=\"\",\"\",RTD(\"cqg.rtd\", ,\"ContractData\", C229, \"T_CVol\",, \"T\"))","v":642094.62280400004},229,{"$f":"IFERROR(RANK($J229,INDIRECT((\"$J$\"&\"1\"&\":$J$\"&$A$449)))+COUNTIF($J$1:J229,J229)-1,\"\")","v":329},"S.US.JNJ","S.US.NKE"]
[{"$f":"IF(Symbols!A231=\"\",\"\",Symbols!A231)","v":"S.US.JPM"},{"$f":"IF(A230=\"\",\"\",IF(J231>0,1,0))","v":1},"S.US.JPM",{"$f":"IF(A230=\"\",\"\",RTD(\"cqg.rtd\", ,\"ContractData\",C230, \"LongDescription\",, \"T\"))","v":"JPMorgan Chase & Co."},null,null,null,{"$f":"IF(A230=\"\",\"\",RTD(\"cqg.rtd\", ,\"ContractData\",C230, \"LastTradeToday\",, \"T\"))","v":365.90000000000003},{"$f":"IF(A230=\"\",\"\",RTD(\"cqg.rtd\", ,\"ContractData\",C230, \"NetLastTradeToday\",, \"T\"))","v":0.72},{"$f":"IF(A230=\"\",\"\",IFERROR(RTD(\"cqg.rtd\", ,\"ContractData\",C230, \"PerCentNetLastTrade\",, \"T\")/100,\"\"))","v":1.9716304288296183E-3},{"$f":"IF(A230=\"\",\"\",RTD(\"cqg.rtd\", ,\"ContractData\", C230, \"T_CVol\",, \"T\"))","v":1048711.005296},230,{"$f":"IFERROR(RANK($J230,INDIRECT((\"$J$\"&\"1\"&\":$J$\"&$A$449)))+COUNTIF($J$1:J230,J230)-1,\"\")","v":312},"S.US.JPM","S.US.NRG"]
[{"$f":"IF(Symbols!A232=\"\",\"\",Symbols!A232)","v":"S.US.KDP"},{"$f":"IF(A231=\"\",\"\",IF(J232>0,1,0))","v":1},"S.US.KDP",{"$f":"IF(A231=\"\",\"\",RTD(\"cqg.rtd\", ,\"ContractData\",C231, \"LongDescription\",, \"T\"))","v":"KEURIG DR PEPPER INC"},null,null,null,{"$f":"IF(A231=\"\",\"\",RTD(\"cqg.rtd\", ,\"ContractData\",C231, \"LastTradeToday\",, \"T\"))","v":30.86},{"$f":"IF(A231=\"\",\"\",RTD(\"cqg.rtd\", ,\"ContractData\",C231, \"NetLastTradeToday\",, \"T\"))","v":1.3},{"$f":"IF(A231=\"\",\"\",IFERROR(RTD(\"cqg.rtd\", ,\"ContractData\",C231, \"PerCentNetLastTrade\",, \"T\")/100,\"\"))","v":4.3978349120433018E-2},{"$f":"IF(A231=\"\",\"\",RTD(\"cqg.rtd\", ,\"ContractData\", C231, \"T_CVol\",, \"T\"))","v":1869378.4114369999},231,{"$f":"IFERROR(RANK($J231,INDIRECT((\"$J$\"&\"1\"&\":$J$\"&$A$449)))+COUNTIF($J$1:J231,J231)-1,\"\")","v":7},"S.US.KDP","S.US.SYF"]
[{"$f":"IF(Symbols!A233=\"\",\"\",Symbols!A233)","v":"S.US.KEY"},{"$f":"IF(A232=\"\",\"\",IF(J233>0,1,0))","v":1},"S.US.KEY",{"$f":"IF(A232=\"\",\"\",RTD(\"cqg.rtd\", ,\"ContractData\",C232, \"LongDescription\",, \"T\"))","v":"KeyCorp"},null,null,null,{"$f":"IF(A232=\"\",\"\",RTD(\"cqg.rtd\", ,\"ContractData\",C232, \"LastTradeToday\",, \"T\"))","v":23.11},{"$f":"IF(A232=\"\",\"\",RTD(\"cqg.rtd\", ,\"ContractData\",C232, \"NetLastTradeToday\",, \"T\"))","v":0.22},{"$f":"IF(A232=\"\",\"\",IFERROR(RTD(\"cqg.rtd\", ,\"ContractData\",C232, \"PerCentNetLastTrade\",, \"T\")/100,\"\"))","v":9.6111839231105296E-3},{"$f":"IF(A232=\"\",\"\",RTD(\"cqg.rtd\", ,\"ContractData\", C232, \"T_CVol\",, \"T\"))","v":823158.76665200002},232,{"$f":"IFERROR(RANK($J232,INDIRECT((\"$J$\"&\"1\"&\":$J$\"&$A$449)))+COUNTIF($J$1:J232,J232)-1,\"\")","v":173},"S.US.KEY","S.US.AEP"]
[{"$f":"IF(Symbols!A234=\"\",\"\",Symbols!A234)","v":"S.US.KEYS"},{"$f":"IF(A233=\"\",\"\",IF(J234>0,1,0))","v":1},"S.US.KEYS",{"$f":"IF(A233=\"\",\"\",RTD(\"cqg.rtd\", ,\"ContractData\",C233, \"LongDescription\",, \"T\"))","v":"Keysight Technologies Inc."},null,null,null,{"$f":"IF(A233=\"\",\"\",RTD(\"cqg.rtd\", ,\"ContractData\",C233, \"LastTradeToday\",, \"T\"))","v":354.51},{"$f":"IF(A233=\"\",\"\",RTD(\"cqg.rtd\", ,\"ContractData\",C233, \"NetLastTradeToday\",, \"T\"))","v":0.01},{"$f":"IF(A233=\"\",\"\",IFERROR(RTD(\"cqg.rtd\", ,\"ContractData\",C233, \"PerCentNetLastTrade\",, \"T\")/100,\"\"))","v":2.8208744710860367E-5},{"$f":"IF(A233=\"\",\"\",RTD(\"cqg.rtd\", ,\"ContractData\", C233, \"T_CVol\",, \"T\"))","v":102800.952609},233,{"$f":"IFERROR(RANK($J233,INDIRECT((\"$J$\"&\"1\"&\":$J$\"&$A$449)))+COUNTIF($J$1:J233,J233)-1,\"\")","v":336},"S.US.KEYS","S.US.LDOS"]
[{"$f":"IF(Symbols!A235=\"\",\"\",Symbols!A235)","v":"S.US.KHC"},{"$f":"IF(A234=\"\",\"\",IF(J235>0,1,0))","v":1},"S.US.KHC",{"$f":"IF(A234=\"\",\"\",RTD(\"cqg.rtd\", ,\"ContractData\",C234, \"LongDescription\",, \"T\"))","v":"KRAFT HEINZ CO CMN"},null,null,null,{"$f":"IF(A234=\"\",\"\",RTD(\"cqg.rtd\", ,\"ContractData\",C234, \"LastTradeToday\",, \"T\"))","v":25.22},{"$f":"IF(A234=\"\",\"\",RTD(\"cqg.rtd\", ,\"ContractData\",C234, \"NetLastTradeToday\",, \"T\"))","v":0.69000000000000006},{"$f":"IF(A234=\"\",\"\",IFERROR(RTD(\"cqg.rtd\", ,\"ContractData\",C234, \"PerCentNetLastTrade\",, \"T\")/100,\"\"))","v":2.8128821850794947E-2},{"$f":"IF(A234=\"\",\"\",RTD(\"cqg.rtd\", ,\"ContractData\", C234, \"T_CVol\",, \"T\"))","v":2345680.7240630002},234,{"$f":"IFERROR(RANK($J234,INDIRECT((\"$J$\"&\"1\"&\":$J$\"&$A$449)))+COUNTIF($J$1:J234,J234)-1,\"\")","v":24},"S.US.KHC","S.US.AON"]
[{"$f":"IF(Symbols!A236=\"\",\"\",Symbols!A236)","v":"S.US.KIM"},{"$f":"IF(A235=\"\",\"\",IF(J236>0,1,0))","v":1},"S.US.KIM",{"$f":"IF(A235=\"\",\"\",RTD(\"cqg.rtd\", ,\"ContractData\",C235, \"LongDescription\",, \"T\"))","v":"Kimco Realty Corp"},null,null,null,{"$f":"IF(A235=\"\",\"\",RTD(\"cqg.rtd\", ,\"ContractData\",C235, \"LastTradeToday\",, \"T\"))","v":24.39},{"$f":"IF(A235=\"\",\"\",RTD(\"cqg.rtd\", ,\"ContractData\",C235, \"NetLastTradeToday\",, \"T\"))","v":0.21},{"$f":"IF(A235=\"\",\"\",IFERROR(RTD(\"cqg.rtd\", ,\"ContractData\",C235, \"PerCentNetLastTrade\",, \"T\")/100,\"\"))","v":8.6848635235732014E-3},{"$f":"IF(A235=\"\",\"\",RTD(\"cqg.rtd\", ,\"ContractData\", C235, \"T_CVol\",, \"T\"))","v":295894.095333},235,{"$f":"IFERROR(RANK($J235,INDIRECT((\"$J$\"&\"1\"&\":$J$\"&$A$449)))+COUNTIF($J$1:J235,J235)-1,\"\")","v":192},"S.US.KIM","S.US.AIG"]
[{"$f":"IF(Symbols!A237=\"\",\"\",Symbols!A237)","v":"S.US.KKR"},{"$f":"IF(A236=\"\",\"\",IF(J237>0,1,0))","v":1},"S.US.KKR",{"$f":"IF(A236=\"\",\"\",RTD(\"cqg.rtd\", ,\"ContractData\",C236, \"LongDescription\",, \"T\"))","v":"KKR & Co. Inc."},null,null,null,{"$f":"IF(A236=\"\",\"\",RTD(\"cqg.rtd\", ,\"ContractData\",C236, \"LastTradeToday\",, \"T\"))","v":114.43},{"$f":"IF(A236=\"\",\"\",RTD(\"cqg.rtd\", ,\"ContractData\",C236, \"NetLastTradeToday\",, \"T\"))","v":3.5300000000000002},{"$f":"IF(A236=\"\",\"\",IFERROR(RTD(\"cqg.rtd\", ,\"ContractData\",C236, \"PerCentNetLastTrade\",, \"T\")/100,\"\"))","v":3.1830477908025248E-2},{"$f":"IF(A236=\"\",\"\",RTD(\"cqg.rtd\", ,\"ContractData\", C236, \"T_CVol\",, \"T\"))","v":896878.81440899998},236,{"$f":"IFERROR(RANK($J236,INDIRECT((\"$J$\"&\"1\"&\":$J$\"&$A$449)))+COUNTIF($J$1:J236,J236)-1,\"\")","v":16},"S.US.KKR","S.US.CINF"]
[{"$f":"IF(Symbols!A238=\"\",\"\",Symbols!A238)","v":"S.US.KMB"},{"$f":"IF(A237=\"\",\"\",IF(J238>0,1,0))","v":1},"S.US.KMB",{"$f":"IF(A237=\"\",\"\",RTD(\"cqg.rtd\", ,\"ContractData\",C237, \"LongDescription\",, \"T\"))","v":"KIMBERLY CLARK CP"},null,null,null,{"$f":"IF(A237=\"\",\"\",RTD(\"cqg.rtd\", ,\"ContractData\",C237, \"LastTradeToday\",, \"T\"))","v":110.94},{"$f":"IF(A237=\"\",\"\",RTD(\"cqg.rtd\", ,\"ContractData\",C237, \"NetLastTradeToday\",, \"T\"))","v":2.0100000000000002},{"$f":"IF(A237=\"\",\"\",IFERROR(RTD(\"cqg.rtd\", ,\"ContractData\",C237, \"PerCentNetLastTrade\",, \"T\")/100,\"\"))","v":1.8452217020104654E-2},{"$f":"IF(A237=\"\",\"\",RTD(\"cqg.rtd\", ,\"ContractData\", C237, \"T_CVol\",, \"T\"))","v":311168.42011800001},237,{"$f":"IFERROR(RANK($J237,INDIRECT((\"$J$\"&\"1\"&\":$J$\"&$A$449)))+COUNTIF($J$1:J237,J237)-1,\"\")","v":71},"S.US.KMB","S.US.AFL"]
[{"$f":"IF(Symbols!A239=\"\",\"\",Symbols!A239)","v":"S.US.KMI"},{"$f":"IF(A238=\"\",\"\",IF(J239>0,1,0))","v":1},"S.US.KMI",{"$f":"IF(A238=\"\",\"\",RTD(\"cqg.rtd\", ,\"ContractData\",C238, \"LongDescription\",, \"T\"))","v":"Kinder Morgan, Inc."},null,null,null,{"$f":"IF(A238=\"\",\"\",RTD(\"cqg.rtd\", ,\"ContractData\",C238, \"LastTradeToday\",, \"T\"))","v":31.830000000000002},{"$f":"IF(A238=\"\",\"\",RTD(\"cqg.rtd\", ,\"ContractData\",C238, \"NetLastTradeToday\",, \"T\"))","v":0.1},{"$f":"IF(A238=\"\",\"\",IFERROR(RTD(\"cqg.rtd\", ,\"ContractData\",C238, \"PerCentNetLastTrade\",, \"T\")/100,\"\"))","v":3.1515915537346363E-3},{"$f":"IF(A238=\"\",\"\",RTD(\"cqg.rtd\", ,\"ContractData\", C238, \"T_CVol\",, \"T\"))","v":645441.90579800005},238,{"$f":"IFERROR(RANK($J238,INDIRECT((\"$J$\"&\"1\"&\":$J$\"&$A$449)))+COUNTIF($J$1:J238,J238)-1,\"\")","v":298},"S.US.KMI","S.US.ZBRA"]
[{"$f":"IF(Symbols!A240=\"\",\"\",Symbols!A240)","v":"S.US.KO"},{"$f":"IF(A239=\"\",\"\",IF(J240>0,1,0))","v":1},"S.US.KO",{"$f":"IF(A239=\"\",\"\",RTD(\"cqg.rtd\", ,\"ContractData\",C239, \"LongDescription\",, \"T\"))","v":"Coca-Cola Company"},null,null,null,{"$f":"IF(A239=\"\",\"\",RTD(\"cqg.rtd\", ,\"ContractData\",C239, \"LastTradeToday\",, \"T\"))","v":87.62},{"$f":"IF(A239=\"\",\"\",RTD(\"cqg.rtd\", ,\"ContractData\",C239, \"NetLastTradeToday\",, \"T\"))","v":0.91},{"$f":"IF(A239=\"\",\"\",IFERROR(RTD(\"cqg.rtd\", ,\"ContractData\",C239, \"PerCentNetLastTrade\",, \"T\")/100,\"\"))","v":1.0494752623688154E-2},{"$f":"IF(A239=\"\",\"\",RTD(\"cqg.rtd\", ,\"ContractData\", C239, \"T_CVol\",, \"T\"))","v":1338959.352405},239,{"$f":"IFERROR(RANK($J239,INDIRECT((\"$J$\"&\"1\"&\":$J$\"&$A$449)))+COUNTIF($J$1:J239,J239)-1,\"\")","v":157},"S.US.KO","S.US.A"]
[{"$f":"IF(Symbols!A241=\"\",\"\",Symbols!A241)","v":"S.US.KR"},{"$f":"IF(A240=\"\",\"\",IF(J241>0,1,0))","v":1},"S.US.KR",{"$f":"IF(A240=\"\",\"\",RTD(\"cqg.rtd\", ,\"ContractData\",C240, \"LongDescription\",, \"T\"))","v":"Kroger Co (The)"},null,null,null,{"$f":"IF(A240=\"\",\"\",RTD(\"cqg.rtd\", ,\"ContractData\",C240, \"LastTradeToday\",, \"T\"))","v":56.89},{"$f":"IF(A240=\"\",\"\",RTD(\"cqg.rtd\", ,\"ContractData\",C240, \"NetLastTradeToday\",, \"T\"))","v":0.83000000000000007},{"$f":"IF(A240=\"\",\"\",IFERROR(RTD(\"cqg.rtd\", ,\"ContractData\",C240, \"PerCentNetLastTrade\",, \"T\")/100,\"\"))","v":1.4805565465572601E-2},{"$f":"IF(A240=\"\",\"\",RTD(\"cqg.rtd\", ,\"ContractData\", C240, \"T_CVol\",, \"T\"))","v":1235879.6160230001},240,{"$f":"IFERROR(RANK($J240,INDIRECT((\"$J$\"&\"1\"&\":$J$\"&$A$449)))+COUNTIF($J$1:J240,J240)-1,\"\")","v":93},"S.US.KR","S.US.GPC"]
[{"$f":"IF(Symbols!A242=\"\",\"\",Symbols!A242)","v":"S.US.KVUE"},{"$f":"IF(A241=\"\",\"\",IF(J242>0,1,0))","v":0},"S.US.KVUE",{"$f":"IF(A241=\"\",\"\",RTD(\"cqg.rtd\", ,\"ContractData\",C241, \"LongDescription\",, \"T\"))","v":"Kenvue Inc."},null,null,null,{"$f":"IF(A241=\"\",\"\",RTD(\"cqg.rtd\", ,\"ContractData\",C241, \"LastTradeToday\",, \"T\"))","v":19.260000000000002},{"$f":"IF(A241=\"\",\"\",RTD(\"cqg.rtd\", ,\"ContractData\",C241, \"NetLastTradeToday\",, \"T\"))","v":0.28000000000000003},{"$f":"IF(A241=\"\",\"\",IFERROR(RTD(\"cqg.rtd\", ,\"ContractData\",C241, \"PerCentNetLastTrade\",, \"T\")/100,\"\"))","v":1.4752370916754479E-2},{"$f":"IF(A241=\"\",\"\",RTD(\"cqg.rtd\", ,\"ContractData\", C241, \"T_CVol\",, \"T\"))","v":1580156.1261770001},241,{"$f":"IFERROR(RANK($J241,INDIRECT((\"$J$\"&\"1\"&\":$J$\"&$A$449)))+COUNTIF($J$1:J241,J241)-1,\"\")","v":94},"S.US.KVUE","S.US.RF"]
[{"$f":"IF(Symbols!A243=\"\",\"\",Symbols!A243)","v":"S.US.L"},{"$f":"IF(A242=\"\",\"\",IF(J243>0,1,0))","v":1},"S.US.L",{"$f":"IF(A242=\"\",\"\",RTD(\"cqg.rtd\", ,\"ContractData\",C242, \"LongDescription\",, \"T\"))","v":"Loews Corporation"},null,null,null,{"$f":"IF(A242=\"\",\"\",RTD(\"cqg.rtd\", ,\"ContractData\",C242, \"LastTradeToday\",, \"T\"))","v":113.11},{"$f":"IF(A242=\"\",\"\",RTD(\"cqg.rtd\", ,\"ContractData\",C242, \"NetLastTradeToday\",, \"T\"))","v":-0.02},{"$f":"IF(A242=\"\",\"\",IFERROR(RTD(\"cqg.rtd\", ,\"ContractData\",C242, \"PerCentNetLastTrade\",, \"T\")/100,\"\"))","v":-1.7678776628657296E-4},{"$f":"IF(A242=\"\",\"\",RTD(\"cqg.rtd\", ,\"ContractData\", C242, \"T_CVol\",, \"T\"))","v":24373.374954999999},242,{"$f":"IFERROR(RANK($J242,INDIRECT((\"$J$\"&\"1\"&\":$J$\"&$A$449)))+COUNTIF($J$1:J242,J242)-1,\"\")","v":342},"S.US.L","S.US.HAS"]
[{"$f":"IF(Symbols!A244=\"\",\"\",Symbols!A244)","v":"S.US.LDOS"},{"$f":"IF(A243=\"\",\"\",IF(J244>0,1,0))","v":1},"S.US.LDOS",{"$f":"IF(A243=\"\",\"\",RTD(\"cqg.rtd\", ,\"ContractData\",C243, \"LongDescription\",, \"T\"))","v":"Leidos Holdings, Inc."},null,null,null,{"$f":"IF(A243=\"\",\"\",RTD(\"cqg.rtd\", ,\"ContractData\",C243, \"LastTradeToday\",, \"T\"))","v":141.32},{"$f":"IF(A243=\"\",\"\",RTD(\"cqg.rtd\", ,\"ContractData\",C243, \"NetLastTradeToday\",, \"T\"))","v":0.94000000000000006},{"$f":"IF(A243=\"\",\"\",IFERROR(RTD(\"cqg.rtd\", ,\"ContractData\",C243, \"PerCentNetLastTrade\",, \"T\")/100,\"\"))","v":6.6961105570594107E-3},{"$f":"IF(A243=\"\",\"\",RTD(\"cqg.rtd\", ,\"ContractData\", C243, \"T_CVol\",, \"T\"))","v":196856.964722},243,{"$f":"IFERROR(RANK($J243,INDIRECT((\"$J$\"&\"1\"&\":$J$\"&$A$449)))+COUNTIF($J$1:J243,J243)-1,\"\")","v":233},"S.US.LDOS","S.US.V"]
[{"$f":"IF(Symbols!A245=\"\",\"\",Symbols!A245)","v":"S.US.LEN"},{"$f":"IF(A244=\"\",\"\",IF(J245>0,1,0))","v":0},"S.US.LEN",{"$f":"IF(A244=\"\",\"\",RTD(\"cqg.rtd\", ,\"ContractData\",C244, \"LongDescription\",, \"T\"))","v":"Lennar Corp"},null,null,null,{"$f":"IF(A244=\"\",\"\",RTD(\"cqg.rtd\", ,\"ContractData\",C244, \"LastTradeToday\",, \"T\"))","v":87.5},{"$f":"IF(A244=\"\",\"\",RTD(\"cqg.rtd\", ,\"ContractData\",C244, \"NetLastTradeToday\",, \"T\"))","v":2.3000000000000003},{"$f":"IF(A244=\"\",\"\",IFERROR(RTD(\"cqg.rtd\", ,\"ContractData\",C244, \"PerCentNetLastTrade\",, \"T\")/100,\"\"))","v":2.699530516431925E-2},{"$f":"IF(A244=\"\",\"\",RTD(\"cqg.rtd\", ,\"ContractData\", C244, \"T_CVol\",, \"T\"))","v":250318.00092600001},244,{"$f":"IFERROR(RANK($J244,INDIRECT((\"$J$\"&\"1\"&\":$J$\"&$A$449)))+COUNTIF($J$1:J244,J244)-1,\"\")","v":26},"S.US.LEN","S.US.AMGN"]
[{"$f":"IF(Symbols!A246=\"\",\"\",Symbols!A246)","v":"S.US.LH"},{"$f":"IF(A245=\"\",\"\",IF(J246>0,1,0))","v":1},"S.US.LH",{"$f":"IF(A245=\"\",\"\",RTD(\"cqg.rtd\", ,\"ContractData\",C245, \"LongDescription\",, \"T\"))","v":"Laboratory Corp of Amer"},null,null,null,{"$f":"IF(A245=\"\",\"\",RTD(\"cqg.rtd\", ,\"ContractData\",C245, \"LastTradeToday\",, \"T\"))","v":323.36},{"$f":"IF(A245=\"\",\"\",RTD(\"cqg.rtd\", ,\"ContractData\",C245, \"NetLastTradeToday\",, \"T\"))","v":-0.12},{"$f":"IF(A245=\"\",\"\",IFERROR(RTD(\"cqg.rtd\", ,\"ContractData\",C245, \"PerCentNetLastTrade\",, \"T\")/100,\"\"))","v":-3.7096574749598119E-4},{"$f":"IF(A245=\"\",\"\",RTD(\"cqg.rtd\", ,\"ContractData\", C245, \"T_CVol\",, \"T\"))","v":37356.767884000001},245,{"$f":"IFERROR(RANK($J245,INDIRECT((\"$J$\"&\"1\"&\":$J$\"&$A$449)))+COUNTIF($J$1:J245,J245)-1,\"\")","v":345},"S.US.LH","S.US.FE"]
[{"$f":"IF(Symbols!A247=\"\",\"\",Symbols!A247)","v":"S.US.LHX"},{"$f":"IF(A246=\"\",\"\",IF(J247>0,1,0))","v":1},"S.US.LHX",{"$f":"IF(A246=\"\",\"\",RTD(\"cqg.rtd\", ,\"ContractData\",C246, \"LongDescription\",, \"T\"))","v":"L3Harris Technologies, Inc."},null,null,null,{"$f":"IF(A246=\"\",\"\",RTD(\"cqg.rtd\", ,\"ContractData\",C246, \"LastTradeToday\",, \"T\"))","v":291.09000000000003},{"$f":"IF(A246=\"\",\"\",RTD(\"cqg.rtd\", ,\"ContractData\",C246, \"NetLastTradeToday\",, \"T\"))","v":0.35000000000000003},{"$f":"IF(A246=\"\",\"\",IFERROR(RTD(\"cqg.rtd\", ,\"ContractData\",C246, \"PerCentNetLastTrade\",, \"T\")/100,\"\"))","v":1.2038247231203137E-3},{"$f":"IF(A246=\"\",\"\",RTD(\"cqg.rtd\", ,\"ContractData\", C246, \"T_CVol\",, \"T\"))","v":149588.389333},246,{"$f":"IFERROR(RANK($J246,INDIRECT((\"$J$\"&\"1\"&\":$J$\"&$A$449)))+COUNTIF($J$1:J246,J246)-1,\"\")","v":320},"S.US.LHX","S.US.APD"]
[{"$f":"IF(Symbols!A248=\"\",\"\",Symbols!A248)","v":"S.US.LII"},{"$f":"IF(A247=\"\",\"\",IF(J248>0,1,0))","v":1},"S.US.LII",{"$f":"IF(A247=\"\",\"\",RTD(\"cqg.rtd\", ,\"ContractData\",C247, \"LongDescription\",, \"T\"))","v":"Lennox Internatl"},null,null,null,{"$f":"IF(A247=\"\",\"\",RTD(\"cqg.rtd\", ,\"ContractData\",C247, \"LastTradeToday\",, \"T\"))","v":422.55},{"$f":"IF(A247=\"\",\"\",RTD(\"cqg.rtd\", ,\"ContractData\",C247, \"NetLastTradeToday\",, \"T\"))","v":1.6400000000000001},{"$f":"IF(A247=\"\",\"\",IFERROR(RTD(\"cqg.rtd\", ,\"ContractData\",C247, \"PerCentNetLastTrade\",, \"T\")/100,\"\"))","v":3.8963198783587938E-3},{"$f":"IF(A247=\"\",\"\",RTD(\"cqg.rtd\", ,\"ContractData\", C247, \"T_CVol\",, \"T\"))","v":49841.979545000002},247,{"$f":"IFERROR(RANK($J247,INDIRECT((\"$J$\"&\"1\"&\":$J$\"&$A$449)))+COUNTIF($J$1:J247,J247)-1,\"\")","v":282},"S.US.LII","S.US.TSCO"]
[{"$f":"IF(Symbols!A249=\"\",\"\",Symbols!A249)","v":"S.US.LIN"},{"$f":"IF(A248=\"\",\"\",IF(J249>0,1,0))","v":0},"S.US.LIN",{"$f":"IF(A248=\"\",\"\",RTD(\"cqg.rtd\", ,\"ContractData\",C248, \"LongDescription\",, \"T\"))","v":"Linde PLC"},null,null,null,{"$f":"IF(A248=\"\",\"\",RTD(\"cqg.rtd\", ,\"ContractData\",C248, \"LastTradeToday\",, \"T\"))","v":481.95},{"$f":"IF(A248=\"\",\"\",RTD(\"cqg.rtd\", ,\"ContractData\",C248, \"NetLastTradeToday\",, \"T\"))","v":2.52},{"$f":"IF(A248=\"\",\"\",IFERROR(RTD(\"cqg.rtd\", ,\"ContractData\",C248, \"PerCentNetLastTrade\",, \"T\")/100,\"\"))","v":5.2562417871222077E-3},{"$f":"IF(A248=\"\",\"\",RTD(\"cqg.rtd\", ,\"ContractData\", C248, \"T_CVol\",, \"T\"))","v":242734.70699899999},248,{"$f":"IFERROR(RANK($J248,INDIRECT((\"$J$\"&\"1\"&\":$J$\"&$A$449)))+COUNTIF($J$1:J248,J248)-1,\"\")","v":272},"S.US.LIN","S.US.WRB"]
[{"$f":"IF(Symbols!A250=\"\",\"\",Symbols!A250)","v":"S.US.LMT"},{"$f":"IF(A249=\"\",\"\",IF(J250>0,1,0))","v":1},"S.US.LMT",{"$f":"IF(A249=\"\",\"\",RTD(\"cqg.rtd\", ,\"ContractData\",C249, \"LongDescription\",, \"T\"))","v":"Lockheed Martin Corp"},null,null,null,{"$f":"IF(A249=\"\",\"\",RTD(\"cqg.rtd\", ,\"ContractData\",C249, \"LastTradeToday\",, \"T\"))","v":603.4},{"$f":"IF(A249=\"\",\"\",RTD(\"cqg.rtd\", ,\"ContractData\",C249, \"NetLastTradeToday\",, \"T\"))","v":-3.3200000000000003},{"$f":"IF(A249=\"\",\"\",IFERROR(RTD(\"cqg.rtd\", ,\"ContractData\",C249, \"PerCentNetLastTrade\",, \"T\")/100,\"\"))","v":-5.4720464135021097E-3},{"$f":"IF(A249=\"\",\"\",RTD(\"cqg.rtd\", ,\"ContractData\", C249, \"T_CVol\",, \"T\"))","v":108345.89028199999},249,{"$f":"IFERROR(RANK($J249,INDIRECT((\"$J$\"&\"1\"&\":$J$\"&$A$449)))+COUNTIF($J$1:J249,J249)-1,\"\")","v":394},"S.US.LMT","S.US.GM"]
[{"$f":"IF(Symbols!A251=\"\",\"\",Symbols!A251)","v":"S.US.LNT"},{"$f":"IF(A250=\"\",\"\",IF(J251>0,1,0))","v":1},"S.US.LNT",{"$f":"IF(A250=\"\",\"\",RTD(\"cqg.rtd\", ,\"ContractData\",C250, \"LongDescription\",, \"T\"))","v":"ALLIANT ENERGY CMN"},null,null,null,{"$f":"IF(A250=\"\",\"\",RTD(\"cqg.rtd\", ,\"ContractData\",C250, \"LastTradeToday\",, \"T\"))","v":70.66},{"$f":"IF(A250=\"\",\"\",RTD(\"cqg.rtd\", ,\"ContractData\",C250, \"NetLastTradeToday\",, \"T\"))","v":0.42},{"$f":"IF(A250=\"\",\"\",IFERROR(RTD(\"cqg.rtd\", ,\"ContractData\",C250, \"PerCentNetLastTrade\",, \"T\")/100,\"\"))","v":5.9794988610478361E-3},{"$f":"IF(A250=\"\",\"\",RTD(\"cqg.rtd\", ,\"ContractData\", C250, \"T_CVol\",, \"T\"))","v":540756.37604300003},250,{"$f":"IFERROR(RANK($J250,INDIRECT((\"$J$\"&\"1\"&\":$J$\"&$A$449)))+COUNTIF($J$1:J250,J250)-1,\"\")","v":250},"S.US.LNT","S.US.LNT"]
[{"$f":"IF(Symbols!A252=\"\",\"\",Symbols!A252)","v":"S.US.LOW"},{"$f":"IF(A251=\"\",\"\",IF(J252>0,1,0))","v":0},"S.US.LOW",{"$f":"IF(A251=\"\",\"\",RTD(\"cqg.rtd\", ,\"ContractData\",C251, \"LongDescription\",, \"T\"))","v":"Lowes Companies Inc"},null,null,null,{"$f":"IF(A251=\"\",\"\",RTD(\"cqg.rtd\", ,\"ContractData\",C251, \"LastTradeToday\",, \"T\"))","v":218.48000000000002},{"$f":"IF(A251=\"\",\"\",RTD(\"cqg.rtd\", ,\"ContractData\",C251, \"NetLastTradeToday\",, \"T\"))","v":2.5100000000000002},{"$f":"IF(A251=\"\",\"\",IFERROR(RTD(\"cqg.rtd\", ,\"ContractData\",C251, \"PerCentNetLastTrade\",, \"T\")/100,\"\"))","v":1.1621984534889105E-2},{"$f":"IF(A251=\"\",\"\",RTD(\"cqg.rtd\", ,\"ContractData\", C251, \"T_CVol\",, \"T\"))","v":327951.07431},251,{"$f":"IFERROR(RANK($J251,INDIRECT((\"$J$\"&\"1\"&\":$J$\"&$A$449)))+COUNTIF($J$1:J251,J251)-1,\"\")","v":143},"S.US.LOW","S.US.AEE"]
[{"$f":"IF(Symbols!A253=\"\",\"\",Symbols!A253)","v":"S.US.LULU"},{"$f":"IF(A252=\"\",\"\",IF(J253>0,1,0))","v":1},{"$f":"A252","v":"S.US.LULU"},{"$f":"IF(A252=\"\",\"\",RTD(\"cqg.rtd\", ,\"ContractData\",C252, \"LongDescription\",, \"T\"))","v":"LULULEMON ATHLETICA"},null,null,null,{"$f":"IF(A252=\"\",\"\",RTD(\"cqg.rtd\", ,\"ContractData\",C252, \"LastTradeToday\",, \"T\"))","v":120.85000000000001},{"$f":"IF(A252=\"\",\"\",RTD(\"cqg.rtd\", ,\"ContractData\",C252, \"NetLastTradeToday\",, \"T\"))","v":-0.02},{"$f":"IF(A252=\"\",\"\",IFERROR(RTD(\"cqg.rtd\", ,\"ContractData\",C252, \"PerCentNetLastTrade\",, \"T\")/100,\"\"))","v":-1.654670306941342E-4},{"$f":"IF(A252=\"\",\"\",RTD(\"cqg.rtd\", ,\"ContractData\", C252, \"T_CVol\",, \"T\"))","v":468556.87553000002},252,{"$f":"IFERROR(RANK($J252,INDIRECT((\"$J$\"&\"1\"&\":$J$\"&$A$449)))+COUNTIF($J$1:J252,J252)-1,\"\")","v":340},"S.US.LULU","S.US.ACGL"]
[{"$f":"IF(Symbols!A254=\"\",\"\",Symbols!A254)","v":"S.US.LUV"},{"$f":"IF(A253=\"\",\"\",IF(J254>0,1,0))","v":0},"S.US.LUV",{"$f":"IF(A253=\"\",\"\",RTD(\"cqg.rtd\", ,\"ContractData\",C253, \"LongDescription\",, \"T\"))","v":"Southwest Airlines Co"},null,null,null,{"$f":"IF(A253=\"\",\"\",RTD(\"cqg.rtd\", ,\"ContractData\",C253, \"LastTradeToday\",, \"T\"))","v":45.34},{"$f":"IF(A253=\"\",\"\",RTD(\"cqg.rtd\", ,\"ContractData\",C253, \"NetLastTradeToday\",, \"T\"))","v":0.36},{"$f":"IF(A253=\"\",\"\",IFERROR(RTD(\"cqg.rtd\", ,\"ContractData\",C253, \"PerCentNetLastTrade\",, \"T\")/100,\"\"))","v":8.0035571365051142E-3},{"$f":"IF(A253=\"\",\"\",RTD(\"cqg.rtd\", ,\"ContractData\", C253, \"T_CVol\",, \"T\"))","v":562102.29820700001},253,{"$f":"IFERROR(RANK($J253,INDIRECT((\"$J$\"&\"1\"&\":$J$\"&$A$449)))+COUNTIF($J$1:J253,J253)-1,\"\")","v":207},"S.US.LUV","S.US.CNP"]
[{"$f":"IF(Symbols!A255=\"\",\"\",Symbols!A255)","v":"S.US.LYB"},{"$f":"IF(A254=\"\",\"\",IF(J255>0,1,0))","v":1},"S.US.LYB",{"$f":"IF(A254=\"\",\"\",RTD(\"cqg.rtd\", ,\"ContractData\",C254, \"LongDescription\",, \"T\"))","v":"LyondellBasell Industries NV Class A"},null,null,null,{"$f":"IF(A254=\"\",\"\",RTD(\"cqg.rtd\", ,\"ContractData\",C254, \"LastTradeToday\",, \"T\"))","v":62.22},{"$f":"IF(A254=\"\",\"\",RTD(\"cqg.rtd\", ,\"ContractData\",C254, \"NetLastTradeToday\",, \"T\"))","v":-0.57999999999999996},{"$f":"IF(A254=\"\",\"\",IFERROR(RTD(\"cqg.rtd\", ,\"ContractData\",C254, \"PerCentNetLastTrade\",, \"T\")/100,\"\"))","v":-9.2356687898089169E-3},{"$f":"IF(A254=\"\",\"\",RTD(\"cqg.rtd\", ,\"ContractData\", C254, \"T_CVol\",, \"T\"))","v":305272.90711700002},254,{"$f":"IFERROR(RANK($J254,INDIRECT((\"$J$\"&\"1\"&\":$J$\"&$A$449)))+COUNTIF($J$1:J254,J254)-1,\"\")","v":414},"S.US.LYB","S.US.FITB"]
[{"$f":"IF(Symbols!A256=\"\",\"\",Symbols!A256)","v":"S.US.LYV"},{"$f":"IF(A255=\"\",\"\",IF(J256>0,1,0))","v":1},"S.US.LYV",{"$f":"IF(A255=\"\",\"\",RTD(\"cqg.rtd\", ,\"ContractData\",C255, \"LongDescription\",, \"T\"))","v":"Live Nation Entertainment Inc"},null,null,null,{"$f":"IF(A255=\"\",\"\",RTD(\"cqg.rtd\", ,\"ContractData\",C255, \"LastTradeToday\",, \"T\"))","v":187.16},{"$f":"IF(A255=\"\",\"\",RTD(\"cqg.rtd\", ,\"ContractData\",C255, \"NetLastTradeToday\",, \"T\"))","v":1.83},{"$f":"IF(A255=\"\",\"\",IFERROR(RTD(\"cqg.rtd\", ,\"ContractData\",C255, \"PerCentNetLastTrade\",, \"T\")/100,\"\"))","v":9.8742783143581717E-3},{"$f":"IF(A255=\"\",\"\",RTD(\"cqg.rtd\", ,\"ContractData\", C255, \"T_CVol\",, \"T\"))","v":148778.06309499999},255,{"$f":"IFERROR(RANK($J255,INDIRECT((\"$J$\"&\"1\"&\":$J$\"&$A$449)))+COUNTIF($J$1:J255,J255)-1,\"\")","v":165},"S.US.LYV","S.US.EQIX"]
[{"$f":"IF(Symbols!A257=\"\",\"\",Symbols!A257)","v":"S.US.MA"},{"$f":"IF(A256=\"\",\"\",IF(J257>0,1,0))","v":1},"S.US.MA",{"$f":"IF(A256=\"\",\"\",RTD(\"cqg.rtd\", ,\"ContractData\",C256, \"LongDescription\",, \"T\"))","v":"Mastercard Inc."},null,null,null,{"$f":"IF(A256=\"\",\"\",RTD(\"cqg.rtd\", ,\"ContractData\",C256, \"LastTradeToday\",, \"T\"))","v":561.9},{"$f":"IF(A256=\"\",\"\",RTD(\"cqg.rtd\", ,\"ContractData\",C256, \"NetLastTradeToday\",, \"T\"))","v":2.17},{"$f":"IF(A256=\"\",\"\",IFERROR(RTD(\"cqg.rtd\", ,\"ContractData\",C256, \"PerCentNetLastTrade\",, \"T\")/100,\"\"))","v":3.8768692047951693E-3},{"$f":"IF(A256=\"\",\"\",RTD(\"cqg.rtd\", ,\"ContractData\", C256, \"T_CVol\",, \"T\"))","v":278269.49454099999},256,{"$f":"IFERROR(RANK($J256,INDIRECT((\"$J$\"&\"1\"&\":$J$\"&$A$449)))+COUNTIF($J$1:J256,J256)-1,\"\")","v":283},"S.US.MA","S.US.CRH"]
[{"$f":"IF(Symbols!A258=\"\",\"\",Symbols!A258)","v":"S.US.MAA"},{"$f":"IF(A257=\"\",\"\",IF(J258>0,1,0))","v":1},"S.US.MAA",{"$f":"IF(A257=\"\",\"\",RTD(\"cqg.rtd\", ,\"ContractData\",C257, \"LongDescription\",, \"T\"))","v":"Mid-America Apt Communities Inc"},null,null,null,{"$f":"IF(A257=\"\",\"\",RTD(\"cqg.rtd\", ,\"ContractData\",C257, \"LastTradeToday\",, \"T\"))","v":135.38},{"$f":"IF(A257=\"\",\"\",RTD(\"cqg.rtd\", ,\"ContractData\",C257, \"NetLastTradeToday\",, \"T\"))","v":3.0500000000000003},{"$f":"IF(A257=\"\",\"\",IFERROR(RTD(\"cqg.rtd\", ,\"ContractData\",C257, \"PerCentNetLastTrade\",, \"T\")/100,\"\"))","v":2.3048439507292375E-2},{"$f":"IF(A257=\"\",\"\",RTD(\"cqg.rtd\", ,\"ContractData\", C257, \"T_CVol\",, \"T\"))","v":74901.666280000005},257,{"$f":"IFERROR(RANK($J257,INDIRECT((\"$J$\"&\"1\"&\":$J$\"&$A$449)))+COUNTIF($J$1:J257,J257)-1,\"\")","v":41},"S.US.MAA","S.US.PEG"]
[{"$f":"IF(Symbols!A259=\"\",\"\",Symbols!A259)","v":"S.US.MAS"},{"$f":"IF(A258=\"\",\"\",IF(J259>0,1,0))","v":1},"S.US.MAS",{"$f":"IF(A258=\"\",\"\",RTD(\"cqg.rtd\", ,\"ContractData\",C258, \"LongDescription\",, \"T\"))","v":"Masco Corporation"},null,null,null,{"$f":"IF(A258=\"\",\"\",RTD(\"cqg.rtd\", ,\"ContractData\",C258, \"LastTradeToday\",, \"T\"))","v":76.02},{"$f":"IF(A258=\"\",\"\",RTD(\"cqg.rtd\", ,\"ContractData\",C258, \"NetLastTradeToday\",, \"T\"))","v":1.3800000000000001},{"$f":"IF(A258=\"\",\"\",IFERROR(RTD(\"cqg.rtd\", ,\"ContractData\",C258, \"PerCentNetLastTrade\",, \"T\")/100,\"\"))","v":1.8488745980707395E-2},{"$f":"IF(A258=\"\",\"\",RTD(\"cqg.rtd\", ,\"ContractData\", C258, \"T_CVol\",, \"T\"))","v":200369.64460299999},258,{"$f":"IFERROR(RANK($J258,INDIRECT((\"$J$\"&\"1\"&\":$J$\"&$A$449)))+COUNTIF($J$1:J258,J258)-1,\"\")","v":70},{"$f":"C258","v":"S.US.MAS"},{"$f":"IFERROR(VLOOKUP($L258,$M$1:$N$437,2,FALSE),\"\")","v":"S.US.DRI"}]
[{"$f":"IF(Symbols!A260=\"\",\"\",Symbols!A260)","v":"S.US.MCD"},{"$f":"IF(A259=\"\",\"\",IF(J260>0,1,0))","v":1},"S.US.MCD",{"$f":"IF(A259=\"\",\"\",RTD(\"cqg.rtd\", ,\"ContractData\",C259, \"LongDescription\",, \"T\"))","v":"McDonald's Corporation"},null,null,null,{"$f":"IF(A259=\"\",\"\",RTD(\"cqg.rtd\", ,\"ContractData\",C259, \"LastTradeToday\",, \"T\"))","v":276.29000000000002},{"$f":"IF(A259=\"\",\"\",RTD(\"cqg.rtd\", ,\"ContractData\",C259, \"NetLastTradeToday\",, \"T\"))","v":0.59},{"$f":"IF(A259=\"\",\"\",IFERROR(RTD(\"cqg.rtd\", ,\"ContractData\",C259, \"PerCentNetLastTrade\",, \"T\")/100,\"\"))","v":2.1400072542618791E-3},{"$f":"IF(A259=\"\",\"\",RTD(\"cqg.rtd\", ,\"ContractData\", C259, \"T_CVol\",, \"T\"))","v":614820.59646399994},{"$f":"L258+1","v":259},{"$f":"IFERROR(RANK($J259,INDIRECT((\"$J$\"&\"1\"&\":$J$\"&$A$449)))+COUNTIF($J$1:J259,J259)-1,\"\")","v":311},"S.US.MCD","S.US.ED"]
[{"$f":"IF(Symbols!A261=\"\",\"\",Symbols!A261)","v":"S.US.MCHP"},{"$f":"IF(A260=\"\",\"\",IF(J261>0,1,0))","v":0},"S.US.MCHP",{"$f":"IF(A260=\"\",\"\",RTD(\"cqg.rtd\", ,\"ContractData\",C260, \"LongDescription\",, \"T\"))","v":"MICROCHIP TECHNOLOGY"},null,null,null,{"$f":"IF(A260=\"\",\"\",RTD(\"cqg.rtd\", ,\"ContractData\",C260, \"LastTradeToday\",, \"T\"))","v":79.510000000000005},{"$f":"IF(A260=\"\",\"\",RTD(\"cqg.rtd\", ,\"ContractData\",C260, \"NetLastTradeToday\",, \"T\"))","v":7.0000000000000007E-2},{"$f":"IF(A260=\"\",\"\",IFERROR(RTD(\"cqg.rtd\", ,\"ContractData\",C260, \"PerCentNetLastTrade\",, \"T\")/100,\"\"))","v":8.811681772406849E-4},{"$f":"IF(A260=\"\",\"\",RTD(\"cqg.rtd\", ,\"ContractData\", C260, \"T_CVol\",, \"T\"))","v":806147.99464299995},260,{"$f":"IFERROR(RANK($J260,INDIRECT((\"$J$\"&\"1\"&\":$J$\"&$A$449)))+COUNTIF($J$1:J260,J260)-1,\"\")","v":325},"S.US.MCHP","S.US.GRMN"]
[{"$f":"IF(Symbols!A262=\"\",\"\",Symbols!A262)","v":"S.US.MCK"},{"$f":"IF(A261=\"\",\"\",IF(J262>0,1,0))","v":1},"S.US.MCK",{"$f":"IF(A261=\"\",\"\",RTD(\"cqg.rtd\", ,\"ContractData\",C261, \"LongDescription\",, \"T\"))","v":"McKesson Corporation"},null,null,null,{"$f":"IF(A261=\"\",\"\",RTD(\"cqg.rtd\", ,\"ContractData\",C261, \"LastTradeToday\",, \"T\"))","v":867.29},{"$f":"IF(A261=\"\",\"\",RTD(\"cqg.rtd\", ,\"ContractData\",C261, \"NetLastTradeToday\",, \"T\"))","v":-11.44},{"$f":"IF(A261=\"\",\"\",IFERROR(RTD(\"cqg.rtd\", ,\"ContractData\",C261, \"PerCentNetLastTrade\",, \"T\")/100,\"\"))","v":-1.3018788478827399E-2},{"$f":"IF(A261=\"\",\"\",RTD(\"cqg.rtd\", ,\"ContractData\", C261, \"T_CVol\",, \"T\"))","v":137986.068696},261,{"$f":"IFERROR(RANK($J261,INDIRECT((\"$J$\"&\"1\"&\":$J$\"&$A$449)))+COUNTIF($J$1:J261,J261)-1,\"\")","v":424},"S.US.MCK","S.US.HRL"]
[{"$f":"IF(Symbols!A263=\"\",\"\",Symbols!A263)","v":"S.US.MCO"},{"$f":"IF(A262=\"\",\"\",IF(J263>0,1,0))","v":1},"S.US.MCO",{"$f":"IF(A262=\"\",\"\",RTD(\"cqg.rtd\", ,\"ContractData\",C262, \"LongDescription\",, \"T\"))","v":"Moodys Corp"},null,null,null,{"$f":"IF(A262=\"\",\"\",RTD(\"cqg.rtd\", ,\"ContractData\",C262, \"LastTradeToday\",, \"T\"))","v":482.54},{"$f":"IF(A262=\"\",\"\",RTD(\"cqg.rtd\", ,\"ContractData\",C262, \"NetLastTradeToday\",, \"T\"))","v":4.7},{"$f":"IF(A262=\"\",\"\",IFERROR(RTD(\"cqg.rtd\", ,\"ContractData\",C262, \"PerCentNetLastTrade\",, \"T\")/100,\"\"))","v":9.8359283442156376E-3},{"$f":"IF(A262=\"\",\"\",RTD(\"cqg.rtd\", ,\"ContractData\", C262, \"T_CVol\",, \"T\"))","v":90538.598952},262,{"$f":"IFERROR(RANK($J262,INDIRECT((\"$J$\"&\"1\"&\":$J$\"&$A$449)))+COUNTIF($J$1:J262,J262)-1,\"\")","v":167},"S.US.MCO","S.US.JKHY"]
[{"$f":"IF(Symbols!A264=\"\",\"\",Symbols!A264)","v":"S.US.MDLZ"},{"$f":"IF(A263=\"\",\"\",IF(J264>0,1,0))","v":1},"S.US.MDLZ",{"$f":"IF(A263=\"\",\"\",RTD(\"cqg.rtd\", ,\"ContractData\",C263, \"LongDescription\",, \"T\"))","v":"MONDELEZ INTL CMN A"},null,null,null,{"$f":"IF(A263=\"\",\"\",RTD(\"cqg.rtd\", ,\"ContractData\",C263, \"LastTradeToday\",, \"T\"))","v":63.34},{"$f":"IF(A263=\"\",\"\",RTD(\"cqg.rtd\", ,\"ContractData\",C263, \"NetLastTradeToday\",, \"T\"))","v":1.1599999999999999},{"$f":"IF(A263=\"\",\"\",IFERROR(RTD(\"cqg.rtd\", ,\"ContractData\",C263, \"PerCentNetLastTrade\",, \"T\")/100,\"\"))","v":1.8655516243165006E-2},{"$f":"IF(A263=\"\",\"\",RTD(\"cqg.rtd\", ,\"ContractData\", C263, \"T_CVol\",, \"T\"))","v":639991.13532300002},263,{"$f":"IFERROR(RANK($J263,INDIRECT((\"$J$\"&\"1\"&\":$J$\"&$A$449)))+COUNTIF($J$1:J263,J263)-1,\"\")","v":69},"S.US.MDLZ","S.US.CB"]
[{"$f":"IF(Symbols!A265=\"\",\"\",Symbols!A265)","v":"S.US.MDT"},{"$f":"IF(A264=\"\",\"\",IF(J265>0,1,0))","v":1},"S.US.MDT",{"$f":"IF(A264=\"\",\"\",RTD(\"cqg.rtd\", ,\"ContractData\",C264, \"LongDescription\",, \"T\"))","v":"Medtronic Inc"},null,null,null,{"$f":"IF(A264=\"\",\"\",RTD(\"cqg.rtd\", ,\"ContractData\",C264, \"LastTradeToday\",, \"T\"))","v":91.56},{"$f":"IF(A264=\"\",\"\",RTD(\"cqg.rtd\", ,\"ContractData\",C264, \"NetLastTradeToday\",, \"T\"))","v":0.8},{"$f":"IF(A264=\"\",\"\",IFERROR(RTD(\"cqg.rtd\", ,\"ContractData\",C264, \"PerCentNetLastTrade\",, \"T\")/100,\"\"))","v":8.8144557073600704E-3},{"$f":"IF(A264=\"\",\"\",RTD(\"cqg.rtd\", ,\"ContractData\", C264, \"T_CVol\",, \"T\"))","v":880298.03081599995},264,{"$f":"IFERROR(RANK($J264,INDIRECT((\"$J$\"&\"1\"&\":$J$\"&$A$449)))+COUNTIF($J$1:J264,J264)-1,\"\")","v":189},"S.US.MDT","S.US.DTE"]
[{"$f":"IF(Symbols!A266=\"\",\"\",Symbols!A266)","v":"S.US.MET"},{"$f":"IF(A265=\"\",\"\",IF(J266>0,1,0))","v":1},"S.US.MET",{"$f":"IF(A265=\"\",\"\",RTD(\"cqg.rtd\", ,\"ContractData\",C265, \"LongDescription\",, \"T\"))","v":"MetLife Inc"},null,null,null,{"$f":"IF(A265=\"\",\"\",RTD(\"cqg.rtd\", ,\"ContractData\",C265, \"LastTradeToday\",, \"T\"))","v":97.56},{"$f":"IF(A265=\"\",\"\",RTD(\"cqg.rtd\", ,\"ContractData\",C265, \"NetLastTradeToday\",, \"T\"))","v":0.9},{"$f":"IF(A265=\"\",\"\",IFERROR(RTD(\"cqg.rtd\", ,\"ContractData\",C265, \"PerCentNetLastTrade\",, \"T\")/100,\"\"))","v":9.3109869646182501E-3},{"$f":"IF(A265=\"\",\"\",RTD(\"cqg.rtd\", ,\"ContractData\", C265, \"T_CVol\",, \"T\"))","v":192628.98383499999},265,{"$f":"IFERROR(RANK($J265,INDIRECT((\"$J$\"&\"1\"&\":$J$\"&$A$449)))+COUNTIF($J$1:J265,J265)-1,\"\")","v":180},"S.US.MET","S.US.COF"]
[{"$f":"IF(Symbols!A267=\"\",\"\",Symbols!A267)","v":"S.US.MGM"},{"$f":"IF(A266=\"\",\"\",IF(J267>0,1,0))","v":1},"S.US.MGM",{"$f":"IF(A266=\"\",\"\",RTD(\"cqg.rtd\", ,\"ContractData\",C266, \"LongDescription\",, \"T\"))","v":"MGM Resorts International"},null,null,null,{"$f":"IF(A266=\"\",\"\",RTD(\"cqg.rtd\", ,\"ContractData\",C266, \"LastTradeToday\",, \"T\"))","v":44.37},{"$f":"IF(A266=\"\",\"\",RTD(\"cqg.rtd\", ,\"ContractData\",C266, \"NetLastTradeToday\",, \"T\"))","v":0.39},{"$f":"IF(A266=\"\",\"\",IFERROR(RTD(\"cqg.rtd\", ,\"ContractData\",C266, \"PerCentNetLastTrade\",, \"T\")/100,\"\"))","v":8.8676671214188256E-3},{"$f":"IF(A266=\"\",\"\",RTD(\"cqg.rtd\", ,\"ContractData\", C266, \"T_CVol\",, \"T\"))","v":153688.630301},266,{"$f":"IFERROR(RANK($J266,INDIRECT((\"$J$\"&\"1\"&\":$J$\"&$A$449)))+COUNTIF($J$1:J266,J266)-1,\"\")","v":188},"S.US.MGM","S.US.NTRS"]
[{"$f":"IF(Symbols!A268=\"\",\"\",Symbols!A268)","v":"S.US.MKC"},{"$f":"IF(A267=\"\",\"\",IF(J268>0,1,0))","v":1},"S.US.MKC",{"$f":"IF(A267=\"\",\"\",RTD(\"cqg.rtd\", ,\"ContractData\",C267, \"LongDescription\",, \"T\"))","v":"McCormick & Company Inc"},null,null,null,{"$f":"IF(A267=\"\",\"\",RTD(\"cqg.rtd\", ,\"ContractData\",C267, \"LastTradeToday\",, \"T\"))","v":54.480000000000004},{"$f":"IF(A267=\"\",\"\",RTD(\"cqg.rtd\", ,\"ContractData\",C267, \"NetLastTradeToday\",, \"T\"))","v":1.51},{"$f":"IF(A267=\"\",\"\",IFERROR(RTD(\"cqg.rtd\", ,\"ContractData\",C267, \"PerCentNetLastTrade\",, \"T\")/100,\"\"))","v":2.8506701906739665E-2},{"$f":"IF(A267=\"\",\"\",RTD(\"cqg.rtd\", ,\"ContractData\", C267, \"T_CVol\",, \"T\"))","v":213514.29415199999},267,{"$f":"IFERROR(RANK($J267,INDIRECT((\"$J$\"&\"1\"&\":$J$\"&$A$449)))+COUNTIF($J$1:J267,J267)-1,\"\")","v":22},"S.US.MKC","S.US.TEL"]
[{"$f":"IF(Symbols!A269=\"\",\"\",Symbols!A269)","v":"S.US.MLM"},{"$f":"IF(A268=\"\",\"\",IF(J269>0,1,0))","v":0},"S.US.MLM",{"$f":"IF(A268=\"\",\"\",RTD(\"cqg.rtd\", ,\"ContractData\",C268, \"LongDescription\",, \"T\"))","v":"Martin Marietta Materials Inc"},null,null,null,{"$f":"IF(A268=\"\",\"\",RTD(\"cqg.rtd\", ,\"ContractData\",C268, \"LastTradeToday\",, \"T\"))","v":551.53},{"$f":"IF(A268=\"\",\"\",RTD(\"cqg.rtd\", ,\"ContractData\",C268, \"NetLastTradeToday\",, \"T\"))","v":7.63},{"$f":"IF(A268=\"\",\"\",IFERROR(RTD(\"cqg.rtd\", ,\"ContractData\",C268, \"PerCentNetLastTrade\",, \"T\")/100,\"\"))","v":1.4028314028314028E-2},{"$f":"IF(A268=\"\",\"\",RTD(\"cqg.rtd\", ,\"ContractData\", C268, \"T_CVol\",, \"T\"))","v":73400.998991},268,{"$f":"IFERROR(RANK($J268,INDIRECT((\"$J$\"&\"1\"&\":$J$\"&$A$449)))+COUNTIF($J$1:J268,J268)-1,\"\")","v":106},"S.US.MLM","S.US.BRO"]
[{"$f":"IF(Symbols!A270=\"\",\"\",Symbols!A270)","v":"S.US.MMM"},{"$f":"IF(A269=\"\",\"\",IF(J270>0,1,0))","v":1},"S.US.MMM",{"$f":"IF(A269=\"\",\"\",RTD(\"cqg.rtd\", ,\"ContractData\",C269, \"LongDescription\",, \"T\"))","v":"3M Company"},null,null,null,{"$f":"IF(A269=\"\",\"\",RTD(\"cqg.rtd\", ,\"ContractData\",C269, \"LastTradeToday\",, \"T\"))","v":182.79},{"$f":"IF(A269=\"\",\"\",RTD(\"cqg.rtd\", ,\"ContractData\",C269, \"NetLastTradeToday\",, \"T\"))","v":-0.99},{"$f":"IF(A269=\"\",\"\",IFERROR(RTD(\"cqg.rtd\", ,\"ContractData\",C269, \"PerCentNetLastTrade\",, \"T\")/100,\"\"))","v":-5.3868756121449556E-3},{"$f":"IF(A269=\"\",\"\",RTD(\"cqg.rtd\", ,\"ContractData\", C269, \"T_CVol\",, \"T\"))","v":305027.23234400002},269,{"$f":"IFERROR(RANK($J269,INDIRECT((\"$J$\"&\"1\"&\":$J$\"&$A$449)))+COUNTIF($J$1:J269,J269)-1,\"\")","v":391},"S.US.MMM","S.US.CEG"]
[{"$f":"IF(Symbols!A271=\"\",\"\",Symbols!A271)","v":"S.US.MO"},{"$f":"IF(A270=\"\",\"\",IF(J271>0,1,0))","v":0},"S.US.MO",{"$f":"IF(A270=\"\",\"\",RTD(\"cqg.rtd\", ,\"ContractData\",C270, \"LongDescription\",, \"T\"))","v":"Altria Group Inc"},null,null,null,{"$f":"IF(A270=\"\",\"\",RTD(\"cqg.rtd\", ,\"ContractData\",C270, \"LastTradeToday\",, \"T\"))","v":65.86},{"$f":"IF(A270=\"\",\"\",RTD(\"cqg.rtd\", ,\"ContractData\",C270, \"NetLastTradeToday\",, \"T\"))","v":1.48},{"$f":"IF(A270=\"\",\"\",IFERROR(RTD(\"cqg.rtd\", ,\"ContractData\",C270, \"PerCentNetLastTrade\",, \"T\")/100,\"\"))","v":2.2988505747126436E-2},{"$f":"IF(A270=\"\",\"\",RTD(\"cqg.rtd\", ,\"ContractData\", C270, \"T_CVol\",, \"T\"))","v":2202975.4325589999},270,{"$f":"IFERROR(RANK($J270,INDIRECT((\"$J$\"&\"1\"&\":$J$\"&$A$449)))+COUNTIF($J$1:J270,J270)-1,\"\")","v":43},"S.US.MO","S.US.IQV"]
[{"$f":"IF(Symbols!A272=\"\",\"\",Symbols!A272)","v":"S.US.MOS"},{"$f":"IF(A271=\"\",\"\",IF(J272>0,1,0))","v":1},"S.US.MOS",{"$f":"IF(A271=\"\",\"\",RTD(\"cqg.rtd\", ,\"ContractData\",C271, \"LongDescription\",, \"T\"))","v":"Mosaic Company"},null,null,null,{"$f":"IF(A271=\"\",\"\",RTD(\"cqg.rtd\", ,\"ContractData\",C271, \"LastTradeToday\",, \"T\"))","v":22.45},{"$f":"IF(A271=\"\",\"\",RTD(\"cqg.rtd\", ,\"ContractData\",C271, \"NetLastTradeToday\",, \"T\"))","v":-0.15},{"$f":"IF(A271=\"\",\"\",IFERROR(RTD(\"cqg.rtd\", ,\"ContractData\",C271, \"PerCentNetLastTrade\",, \"T\")/100,\"\"))","v":-6.6371681415929203E-3},{"$f":"IF(A271=\"\",\"\",RTD(\"cqg.rtd\", ,\"ContractData\", C271, \"T_CVol\",, \"T\"))","v":1112310.5179610001},271,{"$f":"IFERROR(RANK($J271,INDIRECT((\"$J$\"&\"1\"&\":$J$\"&$A$449)))+COUNTIF($J$1:J271,J271)-1,\"\")","v":401},"S.US.MOS","S.US.BIIB"]
[{"$f":"IF(Symbols!A273=\"\",\"\",Symbols!A273)","v":"S.US.MPC"},{"$f":"IF(A272=\"\",\"\",IF(J273>0,1,0))","v":1},"S.US.MPC",{"$f":"IF(A272=\"\",\"\",RTD(\"cqg.rtd\", ,\"ContractData\",C272, \"LongDescription\",, \"T\"))","v":"Marathon Petroleum Corporation"},null,null,null,{"$f":"IF(A272=\"\",\"\",RTD(\"cqg.rtd\", ,\"ContractData\",C272, \"LastTradeToday\",, \"T\"))","v":349.55},{"$f":"IF(A272=\"\",\"\",RTD(\"cqg.rtd\", ,\"ContractData\",C272, \"NetLastTradeToday\",, \"T\"))","v":1.3},{"$f":"IF(A272=\"\",\"\",IFERROR(RTD(\"cqg.rtd\", ,\"ContractData\",C272, \"PerCentNetLastTrade\",, \"T\")/100,\"\"))","v":3.7329504666188083E-3},{"$f":"IF(A272=\"\",\"\",RTD(\"cqg.rtd\", ,\"ContractData\", C272, \"T_CVol\",, \"T\"))","v":344775.07010999997},272,{"$f":"IFERROR(RANK($J272,INDIRECT((\"$J$\"&\"1\"&\":$J$\"&$A$449)))+COUNTIF($J$1:J272,J272)-1,\"\")","v":288},"S.US.MPC","S.US.LIN"]
[{"$f":"IF(Symbols!A274=\"\",\"\",Symbols!A274)","v":"S.US.MRK"},{"$f":"IF(A273=\"\",\"\",IF(J274>0,1,0))","v":1},"S.US.MRK",{"$f":"IF(A273=\"\",\"\",RTD(\"cqg.rtd\", ,\"ContractData\",C273, \"LongDescription\",, \"T\"))","v":"Merck & Co Inc"},null,null,null,{"$f":"IF(A273=\"\",\"\",RTD(\"cqg.rtd\", ,\"ContractData\",C273, \"LastTradeToday\",, \"T\"))","v":134.69999999999999},{"$f":"IF(A273=\"\",\"\",RTD(\"cqg.rtd\", ,\"ContractData\",C273, \"NetLastTradeToday\",, \"T\"))","v":1.78},{"$f":"IF(A273=\"\",\"\",IFERROR(RTD(\"cqg.rtd\", ,\"ContractData\",C273, \"PerCentNetLastTrade\",, \"T\")/100,\"\"))","v":1.3391513692446583E-2},{"$f":"IF(A273=\"\",\"\",RTD(\"cqg.rtd\", ,\"ContractData\", C273, \"T_CVol\",, \"T\"))","v":963214.97030199994},273,{"$f":"IFERROR(RANK($J273,INDIRECT((\"$J$\"&\"1\"&\":$J$\"&$A$449)))+COUNTIF($J$1:J273,J273)-1,\"\")","v":110},"S.US.MRK","S.US.TRV"]
[{"$f":"IF(Symbols!A275=\"\",\"\",Symbols!A275)","v":"S.US.MRNA"},{"$f":"IF(A274=\"\",\"\",IF(J275>0,1,0))","v":1},"S.US.MRNA",{"$f":"IF(A274=\"\",\"\",RTD(\"cqg.rtd\", ,\"ContractData\",C274, \"LongDescription\",, \"T\"))","v":"MODERNA INC CS"},null,null,null,{"$f":"IF(A274=\"\",\"\",RTD(\"cqg.rtd\", ,\"ContractData\",C274, \"LastTradeToday\",, \"T\"))","v":63.97},{"$f":"IF(A274=\"\",\"\",RTD(\"cqg.rtd\", ,\"ContractData\",C274, \"NetLastTradeToday\",, \"T\"))","v":0.28999999999999998},{"$f":"IF(A274=\"\",\"\",IFERROR(RTD(\"cqg.rtd\", ,\"ContractData\",C274, \"PerCentNetLastTrade\",, \"T\")/100,\"\"))","v":4.5547353541699389E-3},{"$f":"IF(A274=\"\",\"\",RTD(\"cqg.rtd\", ,\"ContractData\", C274, \"T_CVol\",, \"T\"))","v":1094450.1035440001},274,{"$f":"IFERROR(RANK($J274,INDIRECT((\"$J$\"&\"1\"&\":$J$\"&$A$449)))+COUNTIF($J$1:J274,J274)-1,\"\")","v":275},"S.US.MRNA","S.US.COST"]
[{"$f":"IF(Symbols!A276=\"\",\"\",Symbols!A276)","v":"S.US.MRSH"},{"$f":"IF(A275=\"\",\"\",IF(J276>0,1,0))","v":1},"S.US.MRSH",{"$f":"IF(A275=\"\",\"\",RTD(\"cqg.rtd\", ,\"ContractData\",C275, \"LongDescription\",, \"T\"))","v":"Marsh"},null,null,null,{"$f":"IF(A275=\"\",\"\",RTD(\"cqg.rtd\", ,\"ContractData\",C275, \"LastTradeToday\",, \"T\"))","v":190.22},{"$f":"IF(A275=\"\",\"\",RTD(\"cqg.rtd\", ,\"ContractData\",C275, \"NetLastTradeToday\",, \"T\"))","v":1.36},{"$f":"IF(A275=\"\",\"\",IFERROR(RTD(\"cqg.rtd\", ,\"ContractData\",C275, \"PerCentNetLastTrade\",, \"T\")/100,\"\"))","v":7.2011013449115747E-3},{"$f":"IF(A275=\"\",\"\",RTD(\"cqg.rtd\", ,\"ContractData\", C275, \"T_CVol\",, \"T\"))","v":128859.960854},275,{"$f":"IFERROR(RANK($J275,INDIRECT((\"$J$\"&\"1\"&\":$J$\"&$A$449)))+COUNTIF($J$1:J275,J275)-1,\"\")","v":225},"S.US.MRSH","S.US.MRNA"]
[{"$f":"IF(Symbols!A277=\"\",\"\",Symbols!A277)","v":"S.US.MRVL"},{"$f":"IF(A276=\"\",\"\",IF(J277>0,1,0))","v":1},"S.US.MRVL",{"$f":"IF(A276=\"\",\"\",RTD(\"cqg.rtd\", ,\"ContractData\",C276, \"LongDescription\",, \"T\"))","v":"MARVELL TECH INC CMN"},null,null,null,{"$f":"IF(A276=\"\",\"\",RTD(\"cqg.rtd\", ,\"ContractData\",C276, \"LastTradeToday\",, \"T\"))","v":227.70000000000002},{"$f":"IF(A276=\"\",\"\",RTD(\"cqg.rtd\", ,\"ContractData\",C276, \"NetLastTradeToday\",, \"T\"))","v":10.620000000000001},{"$f":"IF(A276=\"\",\"\",IFERROR(RTD(\"cqg.rtd\", ,\"ContractData\",C276, \"PerCentNetLastTrade\",, \"T\")/100,\"\"))","v":4.8922056384742951E-2},{"$f":"IF(A276=\"\",\"\",RTD(\"cqg.rtd\", ,\"ContractData\", C276, \"T_CVol\",, \"T\"))","v":4883783.6012199996},276,{"$f":"IFERROR(RANK($J276,INDIRECT((\"$J$\"&\"1\"&\":$J$\"&$A$449)))+COUNTIF($J$1:J276,J276)-1,\"\")","v":5},"S.US.MRVL","S.US.HII"]
[{"$f":"IF(Symbols!A278=\"\",\"\",Symbols!A278)","v":"S.US.MS"},{"$f":"IF(A277=\"\",\"\",IF(J278>0,1,0))","v":1},"S.US.MS",{"$f":"IF(A277=\"\",\"\",RTD(\"cqg.rtd\", ,\"ContractData\",C277, \"LongDescription\",, \"T\"))","v":"Morgan Stanley"},null,null,null,{"$f":"IF(A277=\"\",\"\",RTD(\"cqg.rtd\", ,\"ContractData\",C277, \"LastTradeToday\",, \"T\"))","v":221.87},{"$f":"IF(A277=\"\",\"\",RTD(\"cqg.rtd\", ,\"ContractData\",C277, \"NetLastTradeToday\",, \"T\"))","v":4.2300000000000004},{"$f":"IF(A277=\"\",\"\",IFERROR(RTD(\"cqg.rtd\", ,\"ContractData\",C277, \"PerCentNetLastTrade\",, \"T\")/100,\"\"))","v":1.9435765484285977E-2},{"$f":"IF(A277=\"\",\"\",RTD(\"cqg.rtd\", ,\"ContractData\", C277, \"T_CVol\",, \"T\"))","v":471635.96269800002},277,{"$f":"IFERROR(RANK($J277,INDIRECT((\"$J$\"&\"1\"&\":$J$\"&$A$449)))+COUNTIF($J$1:J277,J277)-1,\"\")","v":61},"S.US.MS","S.US.HD"]
[{"$f":"IF(Symbols!A279=\"\",\"\",Symbols!A279)","v":"S.US.MSCI"},{"$f":"IF(A278=\"\",\"\",IF(J279>0,1,0))","v":0},"S.US.MSCI",{"$f":"IF(A278=\"\",\"\",RTD(\"cqg.rtd\", ,\"ContractData\",C278, \"LongDescription\",, \"T\"))","v":"MSCI, Inc."},null,null,null,{"$f":"IF(A278=\"\",\"\",RTD(\"cqg.rtd\", ,\"ContractData\",C278, \"LastTradeToday\",, \"T\"))","v":565.06000000000006},{"$f":"IF(A278=\"\",\"\",RTD(\"cqg.rtd\", ,\"ContractData\",C278, \"NetLastTradeToday\",, \"T\"))","v":2.0499999999999998},{"$f":"IF(A278=\"\",\"\",IFERROR(RTD(\"cqg.rtd\", ,\"ContractData\",C278, \"PerCentNetLastTrade\",, \"T\")/100,\"\"))","v":3.6411431413296393E-3},{"$f":"IF(A278=\"\",\"\",RTD(\"cqg.rtd\", ,\"ContractData\", C278, \"T_CVol\",, \"T\"))","v":99316.372963000002},278,{"$f":"IFERROR(RANK($J278,INDIRECT((\"$J$\"&\"1\"&\":$J$\"&$A$449)))+COUNTIF($J$1:J278,J278)-1,\"\")","v":292},"S.US.MSCI","S.US.OKE"]
[{"$f":"IF(Symbols!A280=\"\",\"\",Symbols!A280)","v":"S.US.MSI"},{"$f":"IF(A279=\"\",\"\",IF(J280>0,1,0))","v":1},"S.US.MSI",{"$f":"IF(A279=\"\",\"\",RTD(\"cqg.rtd\", ,\"ContractData\",C279, \"LongDescription\",, \"T\"))","v":"Motorola Solutions, Inc."},null,null,null,{"$f":"IF(A279=\"\",\"\",RTD(\"cqg.rtd\", ,\"ContractData\",C279, \"LastTradeToday\",, \"T\"))","v":467.31},{"$f":"IF(A279=\"\",\"\",RTD(\"cqg.rtd\", ,\"ContractData\",C279, \"NetLastTradeToday\",, \"T\"))","v":-2.4300000000000002},{"$f":"IF(A279=\"\",\"\",IFERROR(RTD(\"cqg.rtd\", ,\"ContractData\",C279, \"PerCentNetLastTrade\",, \"T\")/100,\"\"))","v":-5.1730744667262737E-3},{"$f":"IF(A279=\"\",\"\",RTD(\"cqg.rtd\", ,\"ContractData\", C279, \"T_CVol\",, \"T\"))","v":40903.112224999997},279,{"$f":"IFERROR(RANK($J279,INDIRECT((\"$J$\"&\"1\"&\":$J$\"&$A$449)))+COUNTIF($J$1:J279,J279)-1,\"\")","v":389},"S.US.MSI","S.US.SWK"]
[{"$f":"IF(Symbols!A281=\"\",\"\",Symbols!A281)","v":"S.US.MTB"},{"$f":"IF(A280=\"\",\"\",IF(J281>0,1,0))","v":0},"S.US.MTB",{"$f":"IF(A280=\"\",\"\",RTD(\"cqg.rtd\", ,\"ContractData\",C280, \"LongDescription\",, \"T\"))","v":"M&T Bank Corp"},null,null,null,{"$f":"IF(A280=\"\",\"\",RTD(\"cqg.rtd\", ,\"ContractData\",C280, \"LastTradeToday\",, \"T\"))","v":255.63},{"$f":"IF(A280=\"\",\"\",RTD(\"cqg.rtd\", ,\"ContractData\",C280, \"NetLastTradeToday\",, \"T\"))","v":2.08},{"$f":"IF(A280=\"\",\"\",IFERROR(RTD(\"cqg.rtd\", ,\"ContractData\",C280, \"PerCentNetLastTrade\",, \"T\")/100,\"\"))","v":8.2035101557878139E-3},{"$f":"IF(A280=\"\",\"\",RTD(\"cqg.rtd\", ,\"ContractData\", C280, \"T_CVol\",, \"T\"))","v":77227.651845},280,{"$f":"IFERROR(RANK($J280,INDIRECT((\"$J$\"&\"1\"&\":$J$\"&$A$449)))+COUNTIF($J$1:J280,J280)-1,\"\")","v":203},"S.US.MTB","S.US.EVRG"]
[{"$f":"IF(Symbols!A282=\"\",\"\",Symbols!A282)","v":"S.US.MTD"},{"$f":"IF(A281=\"\",\"\",IF(J282>0,1,0))","v":1},"S.US.MTD",{"$f":"IF(A281=\"\",\"\",RTD(\"cqg.rtd\", ,\"ContractData\",C281, \"LongDescription\",, \"T\"))","v":"Mettler-Toledo Internatl Inc"},null,null,null,{"$f":"IF(A281=\"\",\"\",RTD(\"cqg.rtd\", ,\"ContractData\",C281, \"LastTradeToday\",, \"T\"))","v":1431.33},{"$f":"IF(A281=\"\",\"\",RTD(\"cqg.rtd\", ,\"ContractData\",C281, \"NetLastTradeToday\",, \"T\"))","v":-7.2},{"$f":"IF(A281=\"\",\"\",IFERROR(RTD(\"cqg.rtd\", ,\"ContractData\",C281, \"PerCentNetLastTrade\",, \"T\")/100,\"\"))","v":-5.0051093824946304E-3},{"$f":"IF(A281=\"\",\"\",RTD(\"cqg.rtd\", ,\"ContractData\", C281, \"T_CVol\",, \"T\"))","v":12059.238716},281,{"$f":"IFERROR(RANK($J281,INDIRECT((\"$J$\"&\"1\"&\":$J$\"&$A$449)))+COUNTIF($J$1:J281,J281)-1,\"\")","v":388},"S.US.MTD","S.US.TROW"]
[{"$f":"IF(Symbols!A283=\"\",\"\",Symbols!A283)","v":"S.US.NCLH"},{"$f":"IF(A282=\"\",\"\",IF(J283>0,1,0))","v":1},"S.US.NCLH",{"$f":"IF(A282=\"\",\"\",RTD(\"cqg.rtd\", ,\"ContractData\",C282, \"LongDescription\",, \"T\"))","v":"Norwegian Cruise Line"},null,null,null,{"$f":"IF(A282=\"\",\"\",RTD(\"cqg.rtd\", ,\"ContractData\",C282, \"LastTradeToday\",, \"T\"))","v":19.34},{"$f":"IF(A282=\"\",\"\",RTD(\"cqg.rtd\", ,\"ContractData\",C282, \"NetLastTradeToday\",, \"T\"))","v":0.42},{"$f":"IF(A282=\"\",\"\",IFERROR(RTD(\"cqg.rtd\", ,\"ContractData\",C282, \"PerCentNetLastTrade\",, \"T\")/100,\"\"))","v":2.2198731501057081E-2},{"$f":"IF(A282=\"\",\"\",RTD(\"cqg.rtd\", ,\"ContractData\", C282, \"T_CVol\",, \"T\"))","v":1860431.785566},282,{"$f":"IFERROR(RANK($J282,INDIRECT((\"$J$\"&\"1\"&\":$J$\"&$A$449)))+COUNTIF($J$1:J282,J282)-1,\"\")","v":45},"S.US.NCLH","S.US.LII"]
[{"$f":"IF(Symbols!A284=\"\",\"\",Symbols!A284)","v":"S.US.NDAQ"},{"$f":"IF(A283=\"\",\"\",IF(J284>0,1,0))","v":0},"S.US.NDAQ",{"$f":"IF(A283=\"\",\"\",RTD(\"cqg.rtd\", ,\"ContractData\",C283, \"LongDescription\",, \"T\"))","v":"NASDAQ, INC. CMN STK"},null,null,null,{"$f":"IF(A283=\"\",\"\",RTD(\"cqg.rtd\", ,\"ContractData\",C283, \"LastTradeToday\",, \"T\"))","v":96.51},{"$f":"IF(A283=\"\",\"\",RTD(\"cqg.rtd\", ,\"ContractData\",C283, \"NetLastTradeToday\",, \"T\"))","v":0.85},{"$f":"IF(A283=\"\",\"\",IFERROR(RTD(\"cqg.rtd\", ,\"ContractData\",C283, \"PerCentNetLastTrade\",, \"T\")/100,\"\"))","v":8.8856366297302945E-3},{"$f":"IF(A283=\"\",\"\",RTD(\"cqg.rtd\", ,\"ContractData\", C283, \"T_CVol\",, \"T\"))","v":202241.27025199999},283,{"$f":"IFERROR(RANK($J283,INDIRECT((\"$J$\"&\"1\"&\":$J$\"&$A$449)))+COUNTIF($J$1:J283,J283)-1,\"\")","v":187},"S.US.NDAQ","S.US.MA"]
[{"$f":"IF(Symbols!A285=\"\",\"\",Symbols!A285)","v":"S.US.NDSN"},{"$f":"IF(A284=\"\",\"\",IF(J285>0,1,0))","v":1},"S.US.NDSN",{"$f":"IF(A284=\"\",\"\",RTD(\"cqg.rtd\", ,\"ContractData\",C284, \"LongDescription\",, \"T\"))","v":"Nordson Corporation"},null,null,null,{"$f":"IF(A284=\"\",\"\",RTD(\"cqg.rtd\", ,\"ContractData\",C284, \"LastTradeToday\",, \"T\"))","v":308.47000000000003},{"$f":"IF(A284=\"\",\"\",RTD(\"cqg.rtd\", ,\"ContractData\",C284, \"NetLastTradeToday\",, \"T\"))","v":-2.79},{"$f":"IF(A284=\"\",\"\",IFERROR(RTD(\"cqg.rtd\", ,\"ContractData\",C284, \"PerCentNetLastTrade\",, \"T\")/100,\"\"))","v":-8.9635674355843988E-3},{"$f":"IF(A284=\"\",\"\",RTD(\"cqg.rtd\", ,\"ContractData\", C284, \"T_CVol\",, \"T\"))","v":24102.342196000001},284,{"$f":"IFERROR(RANK($J284,INDIRECT((\"$J$\"&\"1\"&\":$J$\"&$A$449)))+COUNTIF($J$1:J284,J284)-1,\"\")","v":413},"S.US.NDSN","S.US.EW"]
[{"$f":"IF(Symbols!A286=\"\",\"\",Symbols!A286)","v":"S.US.NEE"},{"$f":"IF(A285=\"\",\"\",IF(J286>0,1,0))","v":1},"S.US.NEE",{"$f":"IF(A285=\"\",\"\",RTD(\"cqg.rtd\", ,\"ContractData\",C285, \"LongDescription\",, \"T\"))","v":"Nextera Energy, Inc."},null,null,null,{"$f":"IF(A285=\"\",\"\",RTD(\"cqg.rtd\", ,\"ContractData\",C285, \"LastTradeToday\",, \"T\"))","v":86.11},{"$f":"IF(A285=\"\",\"\",RTD(\"cqg.rtd\", ,\"ContractData\",C285, \"NetLastTradeToday\",, \"T\"))","v":0.33},{"$f":"IF(A285=\"\",\"\",IFERROR(RTD(\"cqg.rtd\", ,\"ContractData\",C285, \"PerCentNetLastTrade\",, \"T\")/100,\"\"))","v":3.8470505945441828E-3},{"$f":"IF(A285=\"\",\"\",RTD(\"cqg.rtd\", ,\"ContractData\", C285, \"T_CVol\",, \"T\"))","v":1881016.5931869999},285,{"$f":"IFERROR(RANK($J285,INDIRECT((\"$J$\"&\"1\"&\":$J$\"&$A$449)))+COUNTIF($J$1:J285,J285)-1,\"\")","v":285},"S.US.NEE","S.US.NEE"]
[{"$f":"IF(Symbols!A287=\"\",\"\",Symbols!A287)","v":"S.US.NI"},{"$f":"IF(A286=\"\",\"\",IF(J287>0,1,0))","v":1},"S.US.NI",{"$f":"IF(A286=\"\",\"\",RTD(\"cqg.rtd\", ,\"ContractData\",C286, \"LongDescription\",, \"T\"))","v":"NiSource Inc"},null,null,null,{"$f":"IF(A286=\"\",\"\",RTD(\"cqg.rtd\", ,\"ContractData\",C286, \"LastTradeToday\",, \"T\"))","v":42.33},{"$f":"IF(A286=\"\",\"\",RTD(\"cqg.rtd\", ,\"ContractData\",C286, \"NetLastTradeToday\",, \"T\"))","v":0.34},{"$f":"IF(A286=\"\",\"\",IFERROR(RTD(\"cqg.rtd\", ,\"ContractData\",C286, \"PerCentNetLastTrade\",, \"T\")/100,\"\"))","v":8.0971659919028341E-3},{"$f":"IF(A286=\"\",\"\",RTD(\"cqg.rtd\", ,\"ContractData\", C286, \"T_CVol\",, \"T\"))","v":675507.04958500003},286,{"$f":"IFERROR(RANK($J286,INDIRECT((\"$J$\"&\"1\"&\":$J$\"&$A$449)))+COUNTIF($J$1:J286,J286)-1,\"\")","v":205},"S.US.NI","S.US.HIG"]
[{"$f":"IF(Symbols!A288=\"\",\"\",Symbols!A288)","v":"S.US.NKE"},{"$f":"IF(A287=\"\",\"\",IF(J288>0,1,0))","v":1},"S.US.NKE",{"$f":"IF(A287=\"\",\"\",RTD(\"cqg.rtd\", ,\"ContractData\",C287, \"LongDescription\",, \"T\"))","v":"NIKE Inc ClsB"},null,null,null,{"$f":"IF(A287=\"\",\"\",RTD(\"cqg.rtd\", ,\"ContractData\",C287, \"LastTradeToday\",, \"T\"))","v":40.79},{"$f":"IF(A287=\"\",\"\",RTD(\"cqg.rtd\", ,\"ContractData\",C287, \"NetLastTradeToday\",, \"T\"))","v":0.28000000000000003},{"$f":"IF(A287=\"\",\"\",IFERROR(RTD(\"cqg.rtd\", ,\"ContractData\",C287, \"PerCentNetLastTrade\",, \"T\")/100,\"\"))","v":6.9118736114539628E-3},{"$f":"IF(A287=\"\",\"\",RTD(\"cqg.rtd\", ,\"ContractData\", C287, \"T_CVol\",, \"T\"))","v":5786964.54208},287,{"$f":"IFERROR(RANK($J287,INDIRECT((\"$J$\"&\"1\"&\":$J$\"&$A$449)))+COUNTIF($J$1:J287,J287)-1,\"\")","v":229},"S.US.NKE","S.US.SO"]
[{"$f":"IF(Symbols!A289=\"\",\"\",Symbols!A289)","v":"S.US.NOC"},{"$f":"IF(A288=\"\",\"\",IF(J289>0,1,0))","v":0},"S.US.NOC",{"$f":"IF(A288=\"\",\"\",RTD(\"cqg.rtd\", ,\"ContractData\",C288, \"LongDescription\",, \"T\"))","v":"Northrop Grumman Corporation"},null,null,null,{"$f":"IF(A288=\"\",\"\",RTD(\"cqg.rtd\", ,\"ContractData\",C288, \"LastTradeToday\",, \"T\"))","v":577.74},{"$f":"IF(A288=\"\",\"\",RTD(\"cqg.rtd\", ,\"ContractData\",C288, \"NetLastTradeToday\",, \"T\"))","v":0.42},{"$f":"IF(A288=\"\",\"\",IFERROR(RTD(\"cqg.rtd\", ,\"ContractData\",C288, \"PerCentNetLastTrade\",, \"T\")/100,\"\"))","v":7.2749948035751401E-4},{"$f":"IF(A288=\"\",\"\",RTD(\"cqg.rtd\", ,\"ContractData\", C288, \"T_CVol\",, \"T\"))","v":37071.882514999998},288,{"$f":"IFERROR(RANK($J288,INDIRECT((\"$J$\"&\"1\"&\":$J$\"&$A$449)))+COUNTIF($J$1:J288,J288)-1,\"\")","v":330},"S.US.NOC","S.US.MPC"]
[{"$f":"IF(Symbols!A290=\"\",\"\",Symbols!A290)","v":"S.US.NOW"},{"$f":"IF(A289=\"\",\"\",IF(J290>0,1,0))","v":1},"S.US.NOW",{"$f":"IF(A289=\"\",\"\",RTD(\"cqg.rtd\", ,\"ContractData\",C289, \"LongDescription\",, \"T\"))","v":"ServiceNow, Inc."},null,null,null,{"$f":"IF(A289=\"\",\"\",RTD(\"cqg.rtd\", ,\"ContractData\",C289, \"LastTradeToday\",, \"T\"))","v":124.73},{"$f":"IF(A289=\"\",\"\",RTD(\"cqg.rtd\", ,\"ContractData\",C289, \"NetLastTradeToday\",, \"T\"))","v":-0.21},{"$f":"IF(A289=\"\",\"\",IFERROR(RTD(\"cqg.rtd\", ,\"ContractData\",C289, \"PerCentNetLastTrade\",, \"T\")/100,\"\"))","v":-1.6808067872578838E-3},{"$f":"IF(A289=\"\",\"\",RTD(\"cqg.rtd\", ,\"ContractData\", C289, \"T_CVol\",, \"T\"))","v":2844865.7296440001},289,{"$f":"IFERROR(RANK($J289,INDIRECT((\"$J$\"&\"1\"&\":$J$\"&$A$449)))+COUNTIF($J$1:J289,J289)-1,\"\")","v":361},"S.US.NOW","S.US.NXPI"]
[{"$f":"IF(Symbols!A291=\"\",\"\",Symbols!A291)","v":"S.US.NRG"},{"$f":"IF(A290=\"\",\"\",IF(J291>0,1,0))","v":1},"S.US.NRG",{"$f":"IF(A290=\"\",\"\",RTD(\"cqg.rtd\", ,\"ContractData\",C290, \"LongDescription\",, \"T\"))","v":"NRG Energy Inc"},null,null,null,{"$f":"IF(A290=\"\",\"\",RTD(\"cqg.rtd\", ,\"ContractData\",C290, \"LastTradeToday\",, \"T\"))","v":121.49000000000001},{"$f":"IF(A290=\"\",\"\",RTD(\"cqg.rtd\", ,\"ContractData\",C290, \"NetLastTradeToday\",, \"T\"))","v":0.83000000000000007},{"$f":"IF(A290=\"\",\"\",IFERROR(RTD(\"cqg.rtd\", ,\"ContractData\",C290, \"PerCentNetLastTrade\",, \"T\")/100,\"\"))","v":6.8788330847008115E-3},{"$f":"IF(A290=\"\",\"\",RTD(\"cqg.rtd\", ,\"ContractData\", C290, \"T_CVol\",, \"T\"))","v":122356.03834},290,{"$f":"IFERROR(RANK($J290,INDIRECT((\"$J$\"&\"1\"&\":$J$\"&$A$449)))+COUNTIF($J$1:J290,J290)-1,\"\")","v":230},"S.US.NRG","S.US.TT"]
[{"$f":"IF(Symbols!A292=\"\",\"\",Symbols!A292)","v":"S.US.NSC"},{"$f":"IF(A291=\"\",\"\",IF(J292>0,1,0))","v":1},"S.US.NSC",{"$f":"IF(A291=\"\",\"\",RTD(\"cqg.rtd\", ,\"ContractData\",C291, \"LongDescription\",, \"T\"))","v":"Norfolk Southern Corp"},null,null,null,{"$f":"IF(A291=\"\",\"\",RTD(\"cqg.rtd\", ,\"ContractData\",C291, \"LastTradeToday\",, \"T\"))","v":339.77},{"$f":"IF(A291=\"\",\"\",RTD(\"cqg.rtd\", ,\"ContractData\",C291, \"NetLastTradeToday\",, \"T\"))","v":4.3600000000000003},{"$f":"IF(A291=\"\",\"\",IFERROR(RTD(\"cqg.rtd\", ,\"ContractData\",C291, \"PerCentNetLastTrade\",, \"T\")/100,\"\"))","v":1.2999016129513132E-2},{"$f":"IF(A291=\"\",\"\",RTD(\"cqg.rtd\", ,\"ContractData\", C291, \"T_CVol\",, \"T\"))","v":45103.450596000002},291,{"$f":"IFERROR(RANK($J291,INDIRECT((\"$J$\"&\"1\"&\":$J$\"&$A$449)))+COUNTIF($J$1:J291,J291)-1,\"\")","v":116},"S.US.NSC","S.US.EG"]
[{"$f":"IF(Symbols!A293=\"\",\"\",Symbols!A293)","v":"S.US.NTAP"},{"$f":"IF(A292=\"\",\"\",IF(J293>0,1,0))","v":1},"S.US.NTAP",{"$f":"IF(A292=\"\",\"\",RTD(\"cqg.rtd\", ,\"ContractData\",C292, \"LongDescription\",, \"T\"))","v":"NETAPP, INC."},null,null,null,{"$f":"IF(A292=\"\",\"\",RTD(\"cqg.rtd\", ,\"ContractData\",C292, \"LastTradeToday\",, \"T\"))","v":207.05},{"$f":"IF(A292=\"\",\"\",RTD(\"cqg.rtd\", ,\"ContractData\",C292, \"NetLastTradeToday\",, \"T\"))","v":5},{"$f":"IF(A292=\"\",\"\",IFERROR(RTD(\"cqg.rtd\", ,\"ContractData\",C292, \"PerCentNetLastTrade\",, \"T\")/100,\"\"))","v":2.4746349913387776E-2},{"$f":"IF(A292=\"\",\"\",RTD(\"cqg.rtd\", ,\"ContractData\", C292, \"T_CVol\",, \"T\"))","v":357431.457153},292,{"$f":"IFERROR(RANK($J292,INDIRECT((\"$J$\"&\"1\"&\":$J$\"&$A$449)))+COUNTIF($J$1:J292,J292)-1,\"\")","v":32},"S.US.NTAP","S.US.MSCI"]
[{"$f":"IF(Symbols!A294=\"\",\"\",Symbols!A294)","v":"S.US.NTRS"},{"$f":"IF(A293=\"\",\"\",IF(J294>0,1,0))","v":1},"S.US.NTRS",{"$f":"IF(A293=\"\",\"\",RTD(\"cqg.rtd\", ,\"ContractData\",C293, \"LongDescription\",, \"T\"))","v":"Northern Trust Corp"},null,null,null,{"$f":"IF(A293=\"\",\"\",RTD(\"cqg.rtd\", ,\"ContractData\",C293, \"LastTradeToday\",, \"T\"))","v":192.4},{"$f":"IF(A293=\"\",\"\",RTD(\"cqg.rtd\", ,\"ContractData\",C293, \"NetLastTradeToday\",, \"T\"))","v":1.07},{"$f":"IF(A293=\"\",\"\",IFERROR(RTD(\"cqg.rtd\", ,\"ContractData\",C293, \"PerCentNetLastTrade\",, \"T\")/100,\"\"))","v":5.5924319239011137E-3},{"$f":"IF(A293=\"\",\"\",RTD(\"cqg.rtd\", ,\"ContractData\", C293, \"T_CVol\",, \"T\"))","v":48511.117766000003},293,{"$f":"IFERROR(RANK($J293,INDIRECT((\"$J$\"&\"1\"&\":$J$\"&$A$449)))+COUNTIF($J$1:J293,J293)-1,\"\")","v":266},"S.US.NTRS","S.US.WM"]
[{"$f":"IF(Symbols!A295=\"\",\"\",Symbols!A295)","v":"S.US.NUE"},{"$f":"IF(A294=\"\",\"\",IF(J295>0,1,0))","v":1},"S.US.NUE",{"$f":"IF(A294=\"\",\"\",RTD(\"cqg.rtd\", ,\"ContractData\",C294, \"LongDescription\",, \"T\"))","v":"Nucor Corp"},null,null,null,{"$f":"IF(A294=\"\",\"\",RTD(\"cqg.rtd\", ,\"ContractData\",C294, \"LastTradeToday\",, \"T\"))","v":272.60000000000002},{"$f":"IF(A294=\"\",\"\",RTD(\"cqg.rtd\", ,\"ContractData\",C294, \"NetLastTradeToday\",, \"T\"))","v":0.79},{"$f":"IF(A294=\"\",\"\",IFERROR(RTD(\"cqg.rtd\", ,\"ContractData\",C294, \"PerCentNetLastTrade\",, \"T\")/100,\"\"))","v":2.9064419999264191E-3},{"$f":"IF(A294=\"\",\"\",RTD(\"cqg.rtd\", ,\"ContractData\", C294, \"T_CVol\",, \"T\"))","v":74066.552226},294,{"$f":"IFERROR(RANK($J294,INDIRECT((\"$J$\"&\"1\"&\":$J$\"&$A$449)))+COUNTIF($J$1:J294,J294)-1,\"\")","v":302},"S.US.NUE","S.US.SYY"]
[{"$f":"IF(Symbols!A296=\"\",\"\",Symbols!A296)","v":"S.US.NVR"},{"$f":"IF(A295=\"\",\"\",IF(J296>0,1,0))","v":1},"S.US.NVR",{"$f":"IF(A295=\"\",\"\",RTD(\"cqg.rtd\", ,\"ContractData\",C295, \"LongDescription\",, \"T\"))","v":"NVR Inc"},null,null,null,{"$f":"IF(A295=\"\",\"\",RTD(\"cqg.rtd\", ,\"ContractData\",C295, \"LastTradeToday\",, \"T\"))","v":6353.07},{"$f":"IF(A295=\"\",\"\",RTD(\"cqg.rtd\", ,\"ContractData\",C295, \"NetLastTradeToday\",, \"T\"))","v":59.120000000000005},{"$f":"IF(A295=\"\",\"\",IFERROR(RTD(\"cqg.rtd\", ,\"ContractData\",C295, \"PerCentNetLastTrade\",, \"T\")/100,\"\"))","v":9.3931473875706033E-3},{"$f":"IF(A295=\"\",\"\",RTD(\"cqg.rtd\", ,\"ContractData\", C295, \"T_CVol\",, \"T\"))","v":2381.088041},295,{"$f":"IFERROR(RANK($J295,INDIRECT((\"$J$\"&\"1\"&\":$J$\"&$A$449)))+COUNTIF($J$1:J295,J295)-1,\"\")","v":178},"S.US.NVR","S.US.APTV"]
[{"$f":"IF(Symbols!A297=\"\",\"\",Symbols!A297)","v":"S.US.NWS"},{"$f":"IF(A296=\"\",\"\",IF(J297>0,1,0))","v":1},"S.US.NWS",{"$f":"IF(A296=\"\",\"\",RTD(\"cqg.rtd\", ,\"ContractData\",C296, \"LongDescription\",, \"T\"))","v":"NEWS CP CL B CMN ST"},null,null,null,{"$f":"IF(A296=\"\",\"\",RTD(\"cqg.rtd\", ,\"ContractData\",C296, \"LastTradeToday\",, \"T\"))","v":33.03},{"$f":"IF(A296=\"\",\"\",RTD(\"cqg.rtd\", ,\"ContractData\",C296, \"NetLastTradeToday\",, \"T\"))","v":0.35000000000000003},{"$f":"IF(A296=\"\",\"\",IFERROR(RTD(\"cqg.rtd\", ,\"ContractData\",C296, \"PerCentNetLastTrade\",, \"T\")/100,\"\"))","v":1.0709914320685434E-2},{"$f":"IF(A296=\"\",\"\",RTD(\"cqg.rtd\", ,\"ContractData\", C296, \"T_CVol\",, \"T\"))","v":1253609.021432},296,{"$f":"IFERROR(RANK($J296,INDIRECT((\"$J$\"&\"1\"&\":$J$\"&$A$449)))+COUNTIF($J$1:J296,J296)-1,\"\")","v":153},"S.US.NWS","S.US.T"]
[{"$f":"IF(Symbols!A298=\"\",\"\",Symbols!A298)","v":"S.US.NWSA"},{"$f":"IF(A297=\"\",\"\",IF(J298>0,1,0))","v":1},"S.US.NWSA",{"$f":"IF(A297=\"\",\"\",RTD(\"cqg.rtd\", ,\"ContractData\",C297, \"LongDescription\",, \"T\"))","v":"NEWS CP CL A CMN ST"},null,null,null,{"$f":"IF(A297=\"\",\"\",RTD(\"cqg.rtd\", ,\"ContractData\",C297, \"LastTradeToday\",, \"T\"))","v":29.01},{"$f":"IF(A297=\"\",\"\",RTD(\"cqg.rtd\", ,\"ContractData\",C297, \"NetLastTradeToday\",, \"T\"))","v":0.34},{"$f":"IF(A297=\"\",\"\",IFERROR(RTD(\"cqg.rtd\", ,\"ContractData\",C297, \"PerCentNetLastTrade\",, \"T\")/100,\"\"))","v":1.1859086152772933E-2},{"$f":"IF(A297=\"\",\"\",RTD(\"cqg.rtd\", ,\"ContractData\", C297, \"T_CVol\",, \"T\"))","v":362381.35390300001},297,{"$f":"IFERROR(RANK($J297,INDIRECT((\"$J$\"&\"1\"&\":$J$\"&$A$449)))+COUNTIF($J$1:J297,J297)-1,\"\")","v":137},"S.US.NWSA","S.US.PSX"]
[{"$f":"IF(Symbols!A299=\"\",\"\",Symbols!A299)","v":"S.US.NXPI"},{"$f":"IF(A298=\"\",\"\",IF(J299>0,1,0))","v":1},"S.US.NXPI",{"$f":"IF(A298=\"\",\"\",RTD(\"cqg.rtd\", ,\"ContractData\",C298, \"LongDescription\",, \"T\"))","v":"NXP SEMICONDUCTORS"},null,null,null,{"$f":"IF(A298=\"\",\"\",RTD(\"cqg.rtd\", ,\"ContractData\",C298, \"LastTradeToday\",, \"T\"))","v":234.28},{"$f":"IF(A298=\"\",\"\",RTD(\"cqg.rtd\", ,\"ContractData\",C298, \"NetLastTradeToday\",, \"T\"))","v":0.87},{"$f":"IF(A298=\"\",\"\",IFERROR(RTD(\"cqg.rtd\", ,\"ContractData\",C298, \"PerCentNetLastTrade\",, \"T\")/100,\"\"))","v":3.7273467289319225E-3},{"$f":"IF(A298=\"\",\"\",RTD(\"cqg.rtd\", ,\"ContractData\", C298, \"T_CVol\",, \"T\"))","v":422659.90135200002},298,{"$f":"IFERROR(RANK($J298,INDIRECT((\"$J$\"&\"1\"&\":$J$\"&$A$449)))+COUNTIF($J$1:J298,J298)-1,\"\")","v":289},"S.US.NXPI","S.US.KMI"]
[{"$f":"IF(Symbols!A300=\"\",\"\",Symbols!A300)","v":"S.US.O"},{"$f":"IF(A299=\"\",\"\",IF(J300>0,1,0))","v":1},"S.US.O",{"$f":"IF(A299=\"\",\"\",RTD(\"cqg.rtd\", ,\"ContractData\",C299, \"LongDescription\",, \"T\"))","v":"Realty Income Corp"},null,null,null,{"$f":"IF(A299=\"\",\"\",RTD(\"cqg.rtd\", ,\"ContractData\",C299, \"LastTradeToday\",, \"T\"))","v":63.2},{"$f":"IF(A299=\"\",\"\",RTD(\"cqg.rtd\", ,\"ContractData\",C299, \"NetLastTradeToday\",, \"T\"))","v":0.61},{"$f":"IF(A299=\"\",\"\",IFERROR(RTD(\"cqg.rtd\", ,\"ContractData\",C299, \"PerCentNetLastTrade\",, \"T\")/100,\"\"))","v":9.7459658092347023E-3},{"$f":"IF(A299=\"\",\"\",RTD(\"cqg.rtd\", ,\"ContractData\", C299, \"T_CVol\",, \"T\"))","v":951841.47491999995},299,{"$f":"IFERROR(RANK($J299,INDIRECT((\"$J$\"&\"1\"&\":$J$\"&$A$449)))+COUNTIF($J$1:J299,J299)-1,\"\")","v":169},"S.US.O","S.US.DVA"]
[{"$f":"IF(Symbols!A301=\"\",\"\",Symbols!A301)","v":"S.US.ODFL"},{"$f":"IF(A300=\"\",\"\",IF(J301>0,1,0))","v":1},"S.US.ODFL",{"$f":"IF(A300=\"\",\"\",RTD(\"cqg.rtd\", ,\"ContractData\",C300, \"LongDescription\",, \"T\"))","v":"OLD DOMINION FREIG##"},null,null,null,{"$f":"IF(A300=\"\",\"\",RTD(\"cqg.rtd\", ,\"ContractData\",C300, \"LastTradeToday\",, \"T\"))","v":217.01},{"$f":"IF(A300=\"\",\"\",RTD(\"cqg.rtd\", ,\"ContractData\",C300, \"NetLastTradeToday\",, \"T\"))","v":4.46},{"$f":"IF(A300=\"\",\"\",IFERROR(RTD(\"cqg.rtd\", ,\"ContractData\",C300, \"PerCentNetLastTrade\",, \"T\")/100,\"\"))","v":2.098329804751823E-2},{"$f":"IF(A300=\"\",\"\",RTD(\"cqg.rtd\", ,\"ContractData\", C300, \"T_CVol\",, \"T\"))","v":93880.004828000005},300,{"$f":"IFERROR(RANK($J300,INDIRECT((\"$J$\"&\"1\"&\":$J$\"&$A$449)))+COUNTIF($J$1:J300,J300)-1,\"\")","v":51},"S.US.ODFL","S.US.TJX"]
[{"$f":"IF(Symbols!A302=\"\",\"\",Symbols!A302)","v":"S.US.OKE"},{"$f":"IF(A301=\"\",\"\",IF(J302>0,1,0))","v":1},"S.US.OKE",{"$f":"IF(A301=\"\",\"\",RTD(\"cqg.rtd\", ,\"ContractData\",C301, \"LongDescription\",, \"T\"))","v":"ONEOK Inc New"},null,null,null,{"$f":"IF(A301=\"\",\"\",RTD(\"cqg.rtd\", ,\"ContractData\",C301, \"LastTradeToday\",, \"T\"))","v":92.86},{"$f":"IF(A301=\"\",\"\",RTD(\"cqg.rtd\", ,\"ContractData\",C301, \"NetLastTradeToday\",, \"T\"))","v":0.39},{"$f":"IF(A301=\"\",\"\",IFERROR(RTD(\"cqg.rtd\", ,\"ContractData\",C301, \"PerCentNetLastTrade\",, \"T\")/100,\"\"))","v":4.2175840813236725E-3},{"$f":"IF(A301=\"\",\"\",RTD(\"cqg.rtd\", ,\"ContractData\", C301, \"T_CVol\",, \"T\"))","v":707647.656969},301,{"$f":"IFERROR(RANK($J301,INDIRECT((\"$J$\"&\"1\"&\":$J$\"&$A$449)))+COUNTIF($J$1:J301,J301)-1,\"\")","v":278},"S.US.OKE","S.US.GWW"]
[{"$f":"IF(Symbols!A303=\"\",\"\",Symbols!A303)","v":"S.US.OMC"},{"$f":"IF(A302=\"\",\"\",IF(J303>0,1,0))","v":0},"S.US.OMC",{"$f":"IF(A302=\"\",\"\",RTD(\"cqg.rtd\", ,\"ContractData\",C302, \"LongDescription\",, \"T\"))","v":"Omnicom Group Inc"},null,null,null,{"$f":"IF(A302=\"\",\"\",RTD(\"cqg.rtd\", ,\"ContractData\",C302, \"LastTradeToday\",, \"T\"))","v":86.29},{"$f":"IF(A302=\"\",\"\",RTD(\"cqg.rtd\", ,\"ContractData\",C302, \"NetLastTradeToday\",, \"T\"))","v":0.78},{"$f":"IF(A302=\"\",\"\",IFERROR(RTD(\"cqg.rtd\", ,\"ContractData\",C302, \"PerCentNetLastTrade\",, \"T\")/100,\"\"))","v":9.1217401473511865E-3},{"$f":"IF(A302=\"\",\"\",RTD(\"cqg.rtd\", ,\"ContractData\", C302, \"T_CVol\",, \"T\"))","v":252143.45536699999},302,{"$f":"IFERROR(RANK($J302,INDIRECT((\"$J$\"&\"1\"&\":$J$\"&$A$449)))+COUNTIF($J$1:J302,J302)-1,\"\")","v":183},"S.US.OMC","S.US.NUE"]
[{"$f":"IF(Symbols!A304=\"\",\"\",Symbols!A304)","v":"S.US.ON"},{"$f":"IF(A303=\"\",\"\",IF(J304>0,1,0))","v":1},"S.US.ON",{"$f":"IF(A303=\"\",\"\",RTD(\"cqg.rtd\", ,\"ContractData\",C303, \"LongDescription\",, \"T\"))","v":"ON SEMICONDUCTOR"},null,null,null,{"$f":"IF(A303=\"\",\"\",RTD(\"cqg.rtd\", ,\"ContractData\",C303, \"LastTradeToday\",, \"T\"))","v":83.19},{"$f":"IF(A303=\"\",\"\",RTD(\"cqg.rtd\", ,\"ContractData\",C303, \"NetLastTradeToday\",, \"T\"))","v":-0.18},{"$f":"IF(A303=\"\",\"\",IFERROR(RTD(\"cqg.rtd\", ,\"ContractData\",C303, \"PerCentNetLastTrade\",, \"T\")/100,\"\"))","v":-2.1603456553048487E-3},{"$f":"IF(A303=\"\",\"\",RTD(\"cqg.rtd\", ,\"ContractData\", C303, \"T_CVol\",, \"T\"))","v":796770.65038000001},303,{"$f":"IFERROR(RANK($J303,INDIRECT((\"$J$\"&\"1\"&\":$J$\"&$A$449)))+COUNTIF($J$1:J303,J303)-1,\"\")","v":366},"S.US.ON","S.US.AMP"]
[{"$f":"IF(Symbols!A305=\"\",\"\",Symbols!A305)","v":"S.US.ORCL"},{"$f":"IF(A304=\"\",\"\",IF(J305>0,1,0))","v":0},"S.US.ORCL",{"$f":"IF(A304=\"\",\"\",RTD(\"cqg.rtd\", ,\"ContractData\",C304, \"LongDescription\",, \"T\"))","v":"Oracle Corporation"},null,null,null,{"$f":"IF(A304=\"\",\"\",RTD(\"cqg.rtd\", ,\"ContractData\",C304, \"LastTradeToday\",, \"T\"))","v":157.64000000000001},{"$f":"IF(A304=\"\",\"\",RTD(\"cqg.rtd\", ,\"ContractData\",C304, \"NetLastTradeToday\",, \"T\"))","v":4.33},{"$f":"IF(A304=\"\",\"\",IFERROR(RTD(\"cqg.rtd\", ,\"ContractData\",C304, \"PerCentNetLastTrade\",, \"T\")/100,\"\"))","v":2.8248956158663883E-2},{"$f":"IF(A304=\"\",\"\",RTD(\"cqg.rtd\", ,\"ContractData\", C304, \"T_CVol\",, \"T\"))","v":7115673.3593340004},304,{"$f":"IFERROR(RANK($J304,INDIRECT((\"$J$\"&\"1\"&\":$J$\"&$A$449)))+COUNTIF($J$1:J304,J304)-1,\"\")","v":23},"S.US.ORCL","S.US.PKG"]
[{"$f":"IF(Symbols!A306=\"\",\"\",Symbols!A306)","v":"S.US.OTIS"},{"$f":"IF(A305=\"\",\"\",IF(J306>0,1,0))","v":0},"S.US.OTIS",{"$f":"IF(A305=\"\",\"\",RTD(\"cqg.rtd\", ,\"ContractData\",C305, \"LongDescription\",, \"T\"))","v":"Otis Worldwide Corporation"},null,null,null,{"$f":"IF(A305=\"\",\"\",RTD(\"cqg.rtd\", ,\"ContractData\",C305, \"LastTradeToday\",, \"T\"))","v":73.42},{"$f":"IF(A305=\"\",\"\",RTD(\"cqg.rtd\", ,\"ContractData\",C305, \"NetLastTradeToday\",, \"T\"))","v":-0.55000000000000004},{"$f":"IF(A305=\"\",\"\",IFERROR(RTD(\"cqg.rtd\", ,\"ContractData\",C305, \"PerCentNetLastTrade\",, \"T\")/100,\"\"))","v":-7.435446802757875E-3},{"$f":"IF(A305=\"\",\"\",RTD(\"cqg.rtd\", ,\"ContractData\", C305, \"T_CVol\",, \"T\"))","v":346888.93152500002},305,{"$f":"IFERROR(RANK($J305,INDIRECT((\"$J$\"&\"1\"&\":$J$\"&$A$449)))+COUNTIF($J$1:J305,J305)-1,\"\")","v":405},"S.US.OTIS","S.US.DXCM"]
[{"$f":"IF(Symbols!A307=\"\",\"\",Symbols!A307)","v":"S.US.OXY"},{"$f":"IF(A306=\"\",\"\",IF(J307>0,1,0))","v":1},"S.US.OXY",{"$f":"IF(A306=\"\",\"\",RTD(\"cqg.rtd\", ,\"ContractData\",C306, \"LongDescription\",, \"T\"))","v":"Occidental Petroleum"},null,null,null,{"$f":"IF(A306=\"\",\"\",RTD(\"cqg.rtd\", ,\"ContractData\",C306, \"LastTradeToday\",, \"T\"))","v":57.76},{"$f":"IF(A306=\"\",\"\",RTD(\"cqg.rtd\", ,\"ContractData\",C306, \"NetLastTradeToday\",, \"T\"))","v":-0.79},{"$f":"IF(A306=\"\",\"\",IFERROR(RTD(\"cqg.rtd\", ,\"ContractData\",C306, \"PerCentNetLastTrade\",, \"T\")/100,\"\"))","v":-1.3492741246797607E-2},{"$f":"IF(A306=\"\",\"\",RTD(\"cqg.rtd\", ,\"ContractData\", C306, \"T_CVol\",, \"T\"))","v":1081101.5497409999},306,{"$f":"IFERROR(RANK($J306,INDIRECT((\"$J$\"&\"1\"&\":$J$\"&$A$449)))+COUNTIF($J$1:J306,J306)-1,\"\")","v":427},"S.US.OXY","S.US.AMZN"]
[{"$f":"IF(Symbols!A308=\"\",\"\",Symbols!A308)","v":"S.US.PANW"},{"$f":"IF(A307=\"\",\"\",IF(J308>0,1,0))","v":1},"S.US.PANW",{"$f":"IF(A307=\"\",\"\",RTD(\"cqg.rtd\", ,\"ContractData\",C307, \"LongDescription\",, \"T\"))","v":"PALO ALTO NTWKS CM"},null,null,null,{"$f":"IF(A307=\"\",\"\",RTD(\"cqg.rtd\", ,\"ContractData\",C307, \"LastTradeToday\",, \"T\"))","v":395.97},{"$f":"IF(A307=\"\",\"\",RTD(\"cqg.rtd\", ,\"ContractData\",C307, \"NetLastTradeToday\",, \"T\"))","v":8.9600000000000009},{"$f":"IF(A307=\"\",\"\",IFERROR(RTD(\"cqg.rtd\", ,\"ContractData\",C307, \"PerCentNetLastTrade\",, \"T\")/100,\"\"))","v":2.3151856541174645E-2},{"$f":"IF(A307=\"\",\"\",RTD(\"cqg.rtd\", ,\"ContractData\", C307, \"T_CVol\",, \"T\"))","v":1030486.839108},307,{"$f":"IFERROR(RANK($J307,INDIRECT((\"$J$\"&\"1\"&\":$J$\"&$A$449)))+COUNTIF($J$1:J307,J307)-1,\"\")","v":40},"S.US.PANW","S.US.AOS"]
[{"$f":"IF(Symbols!A309=\"\",\"\",Symbols!A309)","v":"S.US.PAYX"},{"$f":"IF(A308=\"\",\"\",IF(J309>0,1,0))","v":0},"S.US.PAYX",{"$f":"IF(A308=\"\",\"\",RTD(\"cqg.rtd\", ,\"ContractData\",C308, \"LongDescription\",, \"T\"))","v":"PAYCHEX, INC."},null,null,null,{"$f":"IF(A308=\"\",\"\",RTD(\"cqg.rtd\", ,\"ContractData\",C308, \"LastTradeToday\",, \"T\"))","v":121.83},{"$f":"IF(A308=\"\",\"\",RTD(\"cqg.rtd\", ,\"ContractData\",C308, \"NetLastTradeToday\",, \"T\"))","v":1.46},{"$f":"IF(A308=\"\",\"\",IFERROR(RTD(\"cqg.rtd\", ,\"ContractData\",C308, \"PerCentNetLastTrade\",, \"T\")/100,\"\"))","v":1.2129268090055663E-2},{"$f":"IF(A308=\"\",\"\",RTD(\"cqg.rtd\", ,\"ContractData\", C308, \"T_CVol\",, \"T\"))","v":231644.69096400001},308,{"$f":"IFERROR(RANK($J308,INDIRECT((\"$J$\"&\"1\"&\":$J$\"&$A$449)))+COUNTIF($J$1:J308,J308)-1,\"\")","v":132},"S.US.PAYX","S.US.CARR"]
[{"$f":"IF(Symbols!A310=\"\",\"\",Symbols!A310)","v":"S.US.PCAR"},{"$f":"IF(A309=\"\",\"\",IF(J310>0,1,0))","v":1},"S.US.PCAR",{"$f":"IF(A309=\"\",\"\",RTD(\"cqg.rtd\", ,\"ContractData\",C309, \"LongDescription\",, \"T\"))","v":"PACCAR INC."},null,null,null,{"$f":"IF(A309=\"\",\"\",RTD(\"cqg.rtd\", ,\"ContractData\",C309, \"LastTradeToday\",, \"T\"))","v":130.29},{"$f":"IF(A309=\"\",\"\",RTD(\"cqg.rtd\", ,\"ContractData\",C309, \"NetLastTradeToday\",, \"T\"))","v":-0.77},{"$f":"IF(A309=\"\",\"\",IFERROR(RTD(\"cqg.rtd\", ,\"ContractData\",C309, \"PerCentNetLastTrade\",, \"T\")/100,\"\"))","v":-5.8751716770944606E-3},{"$f":"IF(A309=\"\",\"\",RTD(\"cqg.rtd\", ,\"ContractData\", C309, \"T_CVol\",, \"T\"))","v":171558.55295700001},309,{"$f":"IFERROR(RANK($J309,INDIRECT((\"$J$\"&\"1\"&\":$J$\"&$A$449)))+COUNTIF($J$1:J309,J309)-1,\"\")","v":398},"S.US.PCAR","S.US.CRL"]
[{"$f":"IF(Symbols!A311=\"\",\"\",Symbols!A311)","v":"S.US.PCG"},{"$f":"IF(A310=\"\",\"\",IF(J311>0,1,0))","v":1},"S.US.PCG",{"$f":"IF(A310=\"\",\"\",RTD(\"cqg.rtd\", ,\"ContractData\",C310, \"LongDescription\",, \"T\"))","v":"PG&E Corp Hldg Co"},null,null,null,{"$f":"IF(A310=\"\",\"\",RTD(\"cqg.rtd\", ,\"ContractData\",C310, \"LastTradeToday\",, \"T\"))","v":17.650000000000002},{"$f":"IF(A310=\"\",\"\",RTD(\"cqg.rtd\", ,\"ContractData\",C310, \"NetLastTradeToday\",, \"T\"))","v":0.27},{"$f":"IF(A310=\"\",\"\",IFERROR(RTD(\"cqg.rtd\", ,\"ContractData\",C310, \"PerCentNetLastTrade\",, \"T\")/100,\"\"))","v":1.5535097813578827E-2},{"$f":"IF(A310=\"\",\"\",RTD(\"cqg.rtd\", ,\"ContractData\", C310, \"T_CVol\",, \"T\"))","v":2232673.208294},310,{"$f":"IFERROR(RANK($J310,INDIRECT((\"$J$\"&\"1\"&\":$J$\"&$A$449)))+COUNTIF($J$1:J310,J310)-1,\"\")","v":90},"S.US.PCG","S.US.VLTO"]
[{"$f":"IF(Symbols!A312=\"\",\"\",Symbols!A312)","v":"S.US.PEG"},{"$f":"IF(A311=\"\",\"\",IF(J312>0,1,0))","v":1},"S.US.PEG",{"$f":"IF(A311=\"\",\"\",RTD(\"cqg.rtd\", ,\"ContractData\",C311, \"LongDescription\",, \"T\"))","v":"Pub Svc Entrpr Grp Inc"},null,null,null,{"$f":"IF(A311=\"\",\"\",RTD(\"cqg.rtd\", ,\"ContractData\",C311, \"LastTradeToday\",, \"T\"))","v":76.31},{"$f":"IF(A311=\"\",\"\",RTD(\"cqg.rtd\", ,\"ContractData\",C311, \"NetLastTradeToday\",, \"T\"))","v":0.44},{"$f":"IF(A311=\"\",\"\",IFERROR(RTD(\"cqg.rtd\", ,\"ContractData\",C311, \"PerCentNetLastTrade\",, \"T\")/100,\"\"))","v":5.7993936997495724E-3},{"$f":"IF(A311=\"\",\"\",RTD(\"cqg.rtd\", ,\"ContractData\", C311, \"T_CVol\",, \"T\"))","v":302917.76306600001},311,{"$f":"IFERROR(RANK($J311,INDIRECT((\"$J$\"&\"1\"&\":$J$\"&$A$449)))+COUNTIF($J$1:J311,J311)-1,\"\")","v":257},"S.US.PEG","S.US.MCD"]
[{"$f":"IF(Symbols!A313=\"\",\"\",Symbols!A313)","v":"S.US.PEP"},{"$f":"IF(A312=\"\",\"\",IF(J313>0,1,0))","v":1},"S.US.PEP",{"$f":"IF(A312=\"\",\"\",RTD(\"cqg.rtd\", ,\"ContractData\",C312, \"LongDescription\",, \"T\"))","v":"PepsiCo Inc"},null,null,null,{"$f":"IF(A312=\"\",\"\",RTD(\"cqg.rtd\", ,\"ContractData\",C312, \"LastTradeToday\",, \"T\"))","v":140.41},{"$f":"IF(A312=\"\",\"\",RTD(\"cqg.rtd\", ,\"ContractData\",C312, \"NetLastTradeToday\",, \"T\"))","v":1.71},{"$f":"IF(A312=\"\",\"\",IFERROR(RTD(\"cqg.rtd\", ,\"ContractData\",C312, \"PerCentNetLastTrade\",, \"T\")/100,\"\"))","v":1.2328767123287671E-2},{"$f":"IF(A312=\"\",\"\",RTD(\"cqg.rtd\", ,\"ContractData\", C312, \"T_CVol\",, \"T\"))","v":872162.03965399996},312,{"$f":"IFERROR(RANK($J312,INDIRECT((\"$J$\"&\"1\"&\":$J$\"&$A$449)))+COUNTIF($J$1:J312,J312)-1,\"\")","v":128},"S.US.PEP","S.US.JPM"]
[{"$f":"IF(Symbols!A314=\"\",\"\",Symbols!A314)","v":"S.US.PFE"},{"$f":"IF(A313=\"\",\"\",IF(J314>0,1,0))","v":1},"S.US.PFE",{"$f":"IF(A313=\"\",\"\",RTD(\"cqg.rtd\", ,\"ContractData\",C313, \"LongDescription\",, \"T\"))","v":"Pfizer Inc"},null,null,null,{"$f":"IF(A313=\"\",\"\",RTD(\"cqg.rtd\", ,\"ContractData\",C313, \"LastTradeToday\",, \"T\"))","v":26.72},{"$f":"IF(A313=\"\",\"\",RTD(\"cqg.rtd\", ,\"ContractData\",C313, \"NetLastTradeToday\",, \"T\"))","v":0.41000000000000003},{"$f":"IF(A313=\"\",\"\",IFERROR(RTD(\"cqg.rtd\", ,\"ContractData\",C313, \"PerCentNetLastTrade\",, \"T\")/100,\"\"))","v":1.5583428354237932E-2},{"$f":"IF(A313=\"\",\"\",RTD(\"cqg.rtd\", ,\"ContractData\", C313, \"T_CVol\",, \"T\"))","v":5131630.9848250002},313,{"$f":"IFERROR(RANK($J313,INDIRECT((\"$J$\"&\"1\"&\":$J$\"&$A$449)))+COUNTIF($J$1:J313,J313)-1,\"\")","v":89},"S.US.PFE","S.US.VLO"]
[{"$f":"IF(Symbols!A315=\"\",\"\",Symbols!A315)","v":"S.US.PFG"},{"$f":"IF(A314=\"\",\"\",IF(J315>0,1,0))","v":1},"S.US.PFG",{"$f":"IF(A314=\"\",\"\",RTD(\"cqg.rtd\", ,\"ContractData\",C314, \"LongDescription\",, \"T\"))","v":"PRINCIPAL FINL GROUP"},null,null,null,{"$f":"IF(A314=\"\",\"\",RTD(\"cqg.rtd\", ,\"ContractData\",C314, \"LastTradeToday\",, \"T\"))","v":114.85000000000001},{"$f":"IF(A314=\"\",\"\",RTD(\"cqg.rtd\", ,\"ContractData\",C314, \"NetLastTradeToday\",, \"T\"))","v":1.08},{"$f":"IF(A314=\"\",\"\",IFERROR(RTD(\"cqg.rtd\", ,\"ContractData\",C314, \"PerCentNetLastTrade\",, \"T\")/100,\"\"))","v":9.492836424364947E-3},{"$f":"IF(A314=\"\",\"\",RTD(\"cqg.rtd\", ,\"ContractData\", C314, \"T_CVol\",, \"T\"))","v":51684.815401},314,{"$f":"IFERROR(RANK($J314,INDIRECT((\"$J$\"&\"1\"&\":$J$\"&$A$449)))+COUNTIF($J$1:J314,J314)-1,\"\")","v":176},"S.US.PFG","S.US.BR"]
[{"$f":"IF(Symbols!A316=\"\",\"\",Symbols!A316)","v":"S.US.PG"},{"$f":"IF(A315=\"\",\"\",IF(J316>0,1,0))","v":1},"S.US.PG",{"$f":"IF(A315=\"\",\"\",RTD(\"cqg.rtd\", ,\"ContractData\",C315, \"LongDescription\",, \"T\"))","v":"Procter & Gamble Co"},null,null,null,{"$f":"IF(A315=\"\",\"\",RTD(\"cqg.rtd\", ,\"ContractData\",C315, \"LastTradeToday\",, \"T\"))","v":145.34},{"$f":"IF(A315=\"\",\"\",RTD(\"cqg.rtd\", ,\"ContractData\",C315, \"NetLastTradeToday\",, \"T\"))","v":1.26},{"$f":"IF(A315=\"\",\"\",IFERROR(RTD(\"cqg.rtd\", ,\"ContractData\",C315, \"PerCentNetLastTrade\",, \"T\")/100,\"\"))","v":8.7451415880066621E-3},{"$f":"IF(A315=\"\",\"\",RTD(\"cqg.rtd\", ,\"ContractData\", C315, \"T_CVol\",, \"T\"))","v":942170.38390599994},315,{"$f":"IFERROR(RANK($J315,INDIRECT((\"$J$\"&\"1\"&\":$J$\"&$A$449)))+COUNTIF($J$1:J315,J315)-1,\"\")","v":190},"S.US.PG","S.US.TXN"]
[{"$f":"IF(Symbols!A317=\"\",\"\",Symbols!A317)","v":"S.US.PGR"},{"$f":"IF(A316=\"\",\"\",IF(J317>0,1,0))","v":0},{"$f":"A316","v":"S.US.PGR"},{"$f":"IF(A316=\"\",\"\",RTD(\"cqg.rtd\", ,\"ContractData\",C316, \"LongDescription\",, \"T\"))","v":"Progressive Corp"},null,null,null,{"$f":"IF(A316=\"\",\"\",RTD(\"cqg.rtd\", ,\"ContractData\",C316, \"LastTradeToday\",, \"T\"))","v":209.8},{"$f":"IF(A316=\"\",\"\",RTD(\"cqg.rtd\", ,\"ContractData\",C316, \"NetLastTradeToday\",, \"T\"))","v":2.4300000000000002},{"$f":"IF(A316=\"\",\"\",IFERROR(RTD(\"cqg.rtd\", ,\"ContractData\",C316, \"PerCentNetLastTrade\",, \"T\")/100,\"\"))","v":1.1718184886917105E-2},{"$f":"IF(A316=\"\",\"\",RTD(\"cqg.rtd\", ,\"ContractData\", C316, \"T_CVol\",, \"T\"))","v":331964.57446199999},316,{"$f":"IFERROR(RANK($J316,INDIRECT((\"$J$\"&\"1\"&\":$J$\"&$A$449)))+COUNTIF($J$1:J316,J316)-1,\"\")","v":140},"S.US.PGR","S.US.BAC"]
[{"$f":"IF(Symbols!A318=\"\",\"\",Symbols!A318)","v":"S.US.PH"},{"$f":"IF(A317=\"\",\"\",IF(J318>0,1,0))","v":1},"S.US.PH",{"$f":"IF(A317=\"\",\"\",RTD(\"cqg.rtd\", ,\"ContractData\",C317, \"LongDescription\",, \"T\"))","v":"Parker-Hannifin Corp"},null,null,null,{"$f":"IF(A317=\"\",\"\",RTD(\"cqg.rtd\", ,\"ContractData\",C317, \"LastTradeToday\",, \"T\"))","v":1059.32},{"$f":"IF(A317=\"\",\"\",RTD(\"cqg.rtd\", ,\"ContractData\",C317, \"NetLastTradeToday\",, \"T\"))","v":-10.200000000000001},{"$f":"IF(A317=\"\",\"\",IFERROR(RTD(\"cqg.rtd\", ,\"ContractData\",C317, \"PerCentNetLastTrade\",, \"T\")/100,\"\"))","v":-9.5369885556137336E-3},{"$f":"IF(A317=\"\",\"\",RTD(\"cqg.rtd\", ,\"ContractData\", C317, \"T_CVol\",, \"T\"))","v":53873.896140999997},317,{"$f":"IFERROR(RANK($J317,INDIRECT((\"$J$\"&\"1\"&\":$J$\"&$A$449)))+COUNTIF($J$1:J317,J317)-1,\"\")","v":416},"S.US.PH","S.US.TYL"]
[{"$f":"IF(Symbols!A319=\"\",\"\",Symbols!A319)","v":"S.US.PHM"},{"$f":"IF(A318=\"\",\"\",IF(J319>0,1,0))","v":1},"S.US.PHM",{"$f":"IF(A318=\"\",\"\",RTD(\"cqg.rtd\", ,\"ContractData\",C318, \"LongDescription\",, \"T\"))","v":"PulteGroup Inc"},null,null,null,{"$f":"IF(A318=\"\",\"\",RTD(\"cqg.rtd\", ,\"ContractData\",C318, \"LastTradeToday\",, \"T\"))","v":130.78},{"$f":"IF(A318=\"\",\"\",RTD(\"cqg.rtd\", ,\"ContractData\",C318, \"NetLastTradeToday\",, \"T\"))","v":1.62},{"$f":"IF(A318=\"\",\"\",IFERROR(RTD(\"cqg.rtd\", ,\"ContractData\",C318, \"PerCentNetLastTrade\",, \"T\")/100,\"\"))","v":1.2542582842985444E-2},{"$f":"IF(A318=\"\",\"\",RTD(\"cqg.rtd\", ,\"ContractData\", C318, \"T_CVol\",, \"T\"))","v":99266.219668999998},318,{"$f":"IFERROR(RANK($J318,INDIRECT((\"$J$\"&\"1\"&\":$J$\"&$A$449)))+COUNTIF($J$1:J318,J318)-1,\"\")","v":122},"S.US.PHM","S.US.TPL"]
[{"$f":"IF(Symbols!A320=\"\",\"\",Symbols!A320)","v":"S.US.PKG"},{"$f":"IF(A319=\"\",\"\",IF(J320>0,1,0))","v":1},"S.US.PKG",{"$f":"IF(A319=\"\",\"\",RTD(\"cqg.rtd\", ,\"ContractData\",C319, \"LongDescription\",, \"T\"))","v":"Packaging Corp of America"},null,null,null,{"$f":"IF(A319=\"\",\"\",RTD(\"cqg.rtd\", ,\"ContractData\",C319, \"LastTradeToday\",, \"T\"))","v":257.05},{"$f":"IF(A319=\"\",\"\",RTD(\"cqg.rtd\", ,\"ContractData\",C319, \"NetLastTradeToday\",, \"T\"))","v":0.74},{"$f":"IF(A319=\"\",\"\",IFERROR(RTD(\"cqg.rtd\", ,\"ContractData\",C319, \"PerCentNetLastTrade\",, \"T\")/100,\"\"))","v":2.8871288673871483E-3},{"$f":"IF(A319=\"\",\"\",RTD(\"cqg.rtd\", ,\"ContractData\", C319, \"T_CVol\",, \"T\"))","v":26639.825483000001},319,{"$f":"IFERROR(RANK($J319,INDIRECT((\"$J$\"&\"1\"&\":$J$\"&$A$449)))+COUNTIF($J$1:J319,J319)-1,\"\")","v":304},"S.US.PKG","S.US.IP"]
[{"$f":"IF(Symbols!A321=\"\",\"\",Symbols!A321)","v":"S.US.PLD"},{"$f":"IF(A320=\"\",\"\",IF(J321>0,1,0))","v":1},"S.US.PLD",{"$f":"IF(A320=\"\",\"\",RTD(\"cqg.rtd\", ,\"ContractData\",C320, \"LongDescription\",, \"T\"))","v":"Prologis, Inc"},null,null,null,{"$f":"IF(A320=\"\",\"\",RTD(\"cqg.rtd\", ,\"ContractData\",C320, \"LastTradeToday\",, \"T\"))","v":142.07},{"$f":"IF(A320=\"\",\"\",RTD(\"cqg.rtd\", ,\"ContractData\",C320, \"NetLastTradeToday\",, \"T\"))","v":1.34},{"$f":"IF(A320=\"\",\"\",IFERROR(RTD(\"cqg.rtd\", ,\"ContractData\",C320, \"PerCentNetLastTrade\",, \"T\")/100,\"\"))","v":9.5217792936829401E-3},{"$f":"IF(A320=\"\",\"\",RTD(\"cqg.rtd\", ,\"ContractData\", C320, \"T_CVol\",, \"T\"))","v":696221.86927200004},320,{"$f":"IFERROR(RANK($J320,INDIRECT((\"$J$\"&\"1\"&\":$J$\"&$A$449)))+COUNTIF($J$1:J320,J320)-1,\"\")","v":174},"S.US.PLD","S.US.LHX"]
[{"$f":"IF(Symbols!A322=\"\",\"\",Symbols!A322)","v":"S.US.PM"},{"$f":"IF(A321=\"\",\"\",IF(J322>0,1,0))","v":1},"S.US.PM",{"$f":"IF(A321=\"\",\"\",RTD(\"cqg.rtd\", ,\"ContractData\",C321, \"LongDescription\",, \"T\"))","v":"Philip Morris International"},null,null,null,{"$f":"IF(A321=\"\",\"\",RTD(\"cqg.rtd\", ,\"ContractData\",C321, \"LastTradeToday\",, \"T\"))","v":190.62},{"$f":"IF(A321=\"\",\"\",RTD(\"cqg.rtd\", ,\"ContractData\",C321, \"NetLastTradeToday\",, \"T\"))","v":4.43},{"$f":"IF(A321=\"\",\"\",IFERROR(RTD(\"cqg.rtd\", ,\"ContractData\",C321, \"PerCentNetLastTrade\",, \"T\")/100,\"\"))","v":2.3792899726086256E-2},{"$f":"IF(A321=\"\",\"\",RTD(\"cqg.rtd\", ,\"ContractData\", C321, \"T_CVol\",, \"T\"))","v":482502.49757100001},321,{"$f":"IFERROR(RANK($J321,INDIRECT((\"$J$\"&\"1\"&\":$J$\"&$A$449)))+COUNTIF($J$1:J321,J321)-1,\"\")","v":37},"S.US.PM","S.US.WTW"]
[{"$f":"IF(Symbols!A323=\"\",\"\",Symbols!A323)","v":"S.US.PNC"},{"$f":"IF(A322=\"\",\"\",IF(J323>0,1,0))","v":1},"S.US.PNC",{"$f":"IF(A322=\"\",\"\",RTD(\"cqg.rtd\", ,\"ContractData\",C322, \"LongDescription\",, \"T\"))","v":"PNC Fincl Svcs Grp Inc"},null,null,null,{"$f":"IF(A322=\"\",\"\",RTD(\"cqg.rtd\", ,\"ContractData\",C322, \"LastTradeToday\",, \"T\"))","v":257.69},{"$f":"IF(A322=\"\",\"\",RTD(\"cqg.rtd\", ,\"ContractData\",C322, \"NetLastTradeToday\",, \"T\"))","v":2.23},{"$f":"IF(A322=\"\",\"\",IFERROR(RTD(\"cqg.rtd\", ,\"ContractData\",C322, \"PerCentNetLastTrade\",, \"T\")/100,\"\"))","v":8.7293509747122834E-3},{"$f":"IF(A322=\"\",\"\",RTD(\"cqg.rtd\", ,\"ContractData\", C322, \"T_CVol\",, \"T\"))","v":76177.336290000007},322,{"$f":"IFERROR(RANK($J322,INDIRECT((\"$J$\"&\"1\"&\":$J$\"&$A$449)))+COUNTIF($J$1:J322,J322)-1,\"\")","v":191},{"$f":"C322","v":"S.US.PNC"},{"$f":"IFERROR(VLOOKUP($L322,$M$1:$N$437,2,FALSE),\"\")","v":"S.US.WMB"}]
[{"$f":"IF(Symbols!A324=\"\",\"\",Symbols!A324)","v":"S.US.PNR"},{"$f":"IF(A323=\"\",\"\",IF(J324>0,1,0))","v":1},"S.US.PNR",{"$f":"IF(A323=\"\",\"\",RTD(\"cqg.rtd\", ,\"ContractData\",C323, \"LongDescription\",, \"T\"))","v":"Pentair Ltd."},null,null,null,{"$f":"IF(A323=\"\",\"\",RTD(\"cqg.rtd\", ,\"ContractData\",C323, \"LastTradeToday\",, \"T\"))","v":65.820000000000007},{"$f":"IF(A323=\"\",\"\",RTD(\"cqg.rtd\", ,\"ContractData\",C323, \"NetLastTradeToday\",, \"T\"))","v":0.05},{"$f":"IF(A323=\"\",\"\",IFERROR(RTD(\"cqg.rtd\", ,\"ContractData\",C323, \"PerCentNetLastTrade\",, \"T\")/100,\"\"))","v":7.6022502660787596E-4},{"$f":"IF(A323=\"\",\"\",RTD(\"cqg.rtd\", ,\"ContractData\", C323, \"T_CVol\",, \"T\"))","v":193281.59350799999},{"$f":"L322+1","v":323},{"$f":"IFERROR(RANK($J323,INDIRECT((\"$J$\"&\"1\"&\":$J$\"&$A$449)))+COUNTIF($J$1:J323,J323)-1,\"\")","v":328},"S.US.PNR","S.US.BALL"]
[{"$f":"IF(Symbols!A325=\"\",\"\",Symbols!A325)","v":"S.US.PNW"},{"$f":"IF(A324=\"\",\"\",IF(J325>0,1,0))","v":1},"S.US.PNW",{"$f":"IF(A324=\"\",\"\",RTD(\"cqg.rtd\", ,\"ContractData\",C324, \"LongDescription\",, \"T\"))","v":"Pinnacle West Captl Corp"},null,null,null,{"$f":"IF(A324=\"\",\"\",RTD(\"cqg.rtd\", ,\"ContractData\",C324, \"LastTradeToday\",, \"T\"))","v":101.18},{"$f":"IF(A324=\"\",\"\",RTD(\"cqg.rtd\", ,\"ContractData\",C324, \"NetLastTradeToday\",, \"T\"))","v":0.78},{"$f":"IF(A324=\"\",\"\",IFERROR(RTD(\"cqg.rtd\", ,\"ContractData\",C324, \"PerCentNetLastTrade\",, \"T\")/100,\"\"))","v":7.7689243027888443E-3},{"$f":"IF(A324=\"\",\"\",RTD(\"cqg.rtd\", ,\"ContractData\", C324, \"T_CVol\",, \"T\"))","v":103690.247986},324,{"$f":"IFERROR(RANK($J324,INDIRECT((\"$J$\"&\"1\"&\":$J$\"&$A$449)))+COUNTIF($J$1:J324,J324)-1,\"\")","v":215},"S.US.PNW","S.US.CTAS"]
[{"$f":"IF(Symbols!A326=\"\",\"\",Symbols!A326)","v":"S.US.PPG"},{"$f":"IF(A325=\"\",\"\",IF(J326>0,1,0))","v":1},"S.US.PPG",{"$f":"IF(A325=\"\",\"\",RTD(\"cqg.rtd\", ,\"ContractData\",C325, \"LongDescription\",, \"T\"))","v":"PPG Industries Inc"},null,null,null,{"$f":"IF(A325=\"\",\"\",RTD(\"cqg.rtd\", ,\"ContractData\",C325, \"LastTradeToday\",, \"T\"))","v":115.46000000000001},{"$f":"IF(A325=\"\",\"\",RTD(\"cqg.rtd\", ,\"ContractData\",C325, \"NetLastTradeToday\",, \"T\"))","v":0.86},{"$f":"IF(A325=\"\",\"\",IFERROR(RTD(\"cqg.rtd\", ,\"ContractData\",C325, \"PerCentNetLastTrade\",, \"T\")/100,\"\"))","v":7.5043630017452012E-3},{"$f":"IF(A325=\"\",\"\",RTD(\"cqg.rtd\", ,\"ContractData\", C325, \"T_CVol\",, \"T\"))","v":112333.539474},325,{"$f":"IFERROR(RANK($J325,INDIRECT((\"$J$\"&\"1\"&\":$J$\"&$A$449)))+COUNTIF($J$1:J325,J325)-1,\"\")","v":220},"S.US.PPG","S.US.MCHP"]
[{"$f":"IF(Symbols!A327=\"\",\"\",Symbols!A327)","v":"S.US.PPL"},{"$f":"IF(A326=\"\",\"\",IF(J327>0,1,0))","v":1},"S.US.PPL",{"$f":"IF(A326=\"\",\"\",RTD(\"cqg.rtd\", ,\"ContractData\",C326, \"LongDescription\",, \"T\"))","v":"PPL Corp"},null,null,null,{"$f":"IF(A326=\"\",\"\",RTD(\"cqg.rtd\", ,\"ContractData\",C326, \"LastTradeToday\",, \"T\"))","v":35.76},{"$f":"IF(A326=\"\",\"\",RTD(\"cqg.rtd\", ,\"ContractData\",C326, \"NetLastTradeToday\",, \"T\"))","v":0.3},{"$f":"IF(A326=\"\",\"\",IFERROR(RTD(\"cqg.rtd\", ,\"ContractData\",C326, \"PerCentNetLastTrade\",, \"T\")/100,\"\"))","v":8.4602368866328256E-3},{"$f":"IF(A326=\"\",\"\",RTD(\"cqg.rtd\", ,\"ContractData\", C326, \"T_CVol\",, \"T\"))","v":498221.51973399997},326,{"$f":"IFERROR(RANK($J326,INDIRECT((\"$J$\"&\"1\"&\":$J$\"&$A$449)))+COUNTIF($J$1:J326,J326)-1,\"\")","v":198},"S.US.PPL","S.US.VRTX"]
[{"$f":"IF(Symbols!A328=\"\",\"\",Symbols!A328)","v":"S.US.PRU"},{"$f":"IF(A327=\"\",\"\",IF(J328>0,1,0))","v":1},"S.US.PRU",{"$f":"IF(A327=\"\",\"\",RTD(\"cqg.rtd\", ,\"ContractData\",C327, \"LongDescription\",, \"T\"))","v":"Prudential Financial Inc"},null,null,null,{"$f":"IF(A327=\"\",\"\",RTD(\"cqg.rtd\", ,\"ContractData\",C327, \"LastTradeToday\",, \"T\"))","v":124.35000000000001},{"$f":"IF(A327=\"\",\"\",RTD(\"cqg.rtd\", ,\"ContractData\",C327, \"NetLastTradeToday\",, \"T\"))","v":1.61},{"$f":"IF(A327=\"\",\"\",IFERROR(RTD(\"cqg.rtd\", ,\"ContractData\",C327, \"PerCentNetLastTrade\",, \"T\")/100,\"\"))","v":1.3117158220628972E-2},{"$f":"IF(A327=\"\",\"\",RTD(\"cqg.rtd\", ,\"ContractData\", C327, \"T_CVol\",, \"T\"))","v":136887.37043000001},327,{"$f":"IFERROR(RANK($J327,INDIRECT((\"$J$\"&\"1\"&\":$J$\"&$A$449)))+COUNTIF($J$1:J327,J327)-1,\"\")","v":114},"S.US.PRU","S.US.RMD"]
[{"$f":"IF(Symbols!A329=\"\",\"\",Symbols!A329)","v":"S.US.PSA"},{"$f":"IF(A328=\"\",\"\",IF(J329>0,1,0))","v":1},"S.US.PSA",{"$f":"IF(A328=\"\",\"\",RTD(\"cqg.rtd\", ,\"ContractData\",C328, \"LongDescription\",, \"T\"))","v":"Public Storage Inc"},null,null,null,{"$f":"IF(A328=\"\",\"\",RTD(\"cqg.rtd\", ,\"ContractData\",C328, \"LastTradeToday\",, \"T\"))","v":328.82},{"$f":"IF(A328=\"\",\"\",RTD(\"cqg.rtd\", ,\"ContractData\",C328, \"NetLastTradeToday\",, \"T\"))","v":5.24},{"$f":"IF(A328=\"\",\"\",IFERROR(RTD(\"cqg.rtd\", ,\"ContractData\",C328, \"PerCentNetLastTrade\",, \"T\")/100,\"\"))","v":1.6193831509982076E-2},{"$f":"IF(A328=\"\",\"\",RTD(\"cqg.rtd\", ,\"ContractData\", C328, \"T_CVol\",, \"T\"))","v":67794.932983000006},328,{"$f":"IFERROR(RANK($J328,INDIRECT((\"$J$\"&\"1\"&\":$J$\"&$A$449)))+COUNTIF($J$1:J328,J328)-1,\"\")","v":84},"S.US.PSA","S.US.PNR"]
[{"$f":"IF(Symbols!A330=\"\",\"\",Symbols!A330)","v":"S.US.PSKY"},{"$f":"IF(A329=\"\",\"\",IF(J330>0,1,0))","v":1},"S.US.PSKY",{"$f":"IF(A329=\"\",\"\",RTD(\"cqg.rtd\", ,\"ContractData\",C329, \"LongDescription\",, \"T\"))","v":"PARAMOUNT SKYDN B"},null,null,null,{"$f":"IF(A329=\"\",\"\",RTD(\"cqg.rtd\", ,\"ContractData\",C329, \"LastTradeToday\",, \"T\"))","v":10},{"$f":"IF(A329=\"\",\"\",RTD(\"cqg.rtd\", ,\"ContractData\",C329, \"NetLastTradeToday\",, \"T\"))","v":0.5},{"$f":"IF(A329=\"\",\"\",IFERROR(RTD(\"cqg.rtd\", ,\"ContractData\",C329, \"PerCentNetLastTrade\",, \"T\")/100,\"\"))","v":5.2631578947368425E-2},{"$f":"IF(A329=\"\",\"\",RTD(\"cqg.rtd\", ,\"ContractData\", C329, \"T_CVol\",, \"T\"))","v":2463149.0046629999},329,{"$f":"IFERROR(RANK($J329,INDIRECT((\"$J$\"&\"1\"&\":$J$\"&$A$449)))+COUNTIF($J$1:J329,J329)-1,\"\")","v":3},"S.US.PSKY","S.US.JNJ"]
[{"$f":"IF(Symbols!A331=\"\",\"\",Symbols!A331)","v":"S.US.PSX"},{"$f":"IF(A330=\"\",\"\",IF(J331>0,1,0))","v":1},"S.US.PSX",{"$f":"IF(A330=\"\",\"\",RTD(\"cqg.rtd\", ,\"ContractData\",C330, \"LongDescription\",, \"T\"))","v":"Phillips 66 Common Stock"},null,null,null,{"$f":"IF(A330=\"\",\"\",RTD(\"cqg.rtd\", ,\"ContractData\",C330, \"LastTradeToday\",, \"T\"))","v":226.31},{"$f":"IF(A330=\"\",\"\",RTD(\"cqg.rtd\", ,\"ContractData\",C330, \"NetLastTradeToday\",, \"T\"))","v":0.73},{"$f":"IF(A330=\"\",\"\",IFERROR(RTD(\"cqg.rtd\", ,\"ContractData\",C330, \"PerCentNetLastTrade\",, \"T\")/100,\"\"))","v":3.236102491355617E-3},{"$f":"IF(A330=\"\",\"\",RTD(\"cqg.rtd\", ,\"ContractData\", C330, \"T_CVol\",, \"T\"))","v":272939.97013600002},330,{"$f":"IFERROR(RANK($J330,INDIRECT((\"$J$\"&\"1\"&\":$J$\"&$A$449)))+COUNTIF($J$1:J330,J330)-1,\"\")","v":297},"S.US.PSX","S.US.NOC"]
[{"$f":"IF(Symbols!A332=\"\",\"\",Symbols!A332)","v":"S.US.PTC"},{"$f":"IF(A331=\"\",\"\",IF(J332>0,1,0))","v":1},"S.US.PTC",{"$f":"IF(A331=\"\",\"\",RTD(\"cqg.rtd\", ,\"ContractData\",C331, \"LongDescription\",, \"T\"))","v":"PTC INC."},null,null,null,{"$f":"IF(A331=\"\",\"\",RTD(\"cqg.rtd\", ,\"ContractData\",C331, \"LastTradeToday\",, \"T\"))","v":148},{"$f":"IF(A331=\"\",\"\",RTD(\"cqg.rtd\", ,\"ContractData\",C331, \"NetLastTradeToday\",, \"T\"))","v":0.01},{"$f":"IF(A331=\"\",\"\",IFERROR(RTD(\"cqg.rtd\", ,\"ContractData\",C331, \"PerCentNetLastTrade\",, \"T\")/100,\"\"))","v":6.7572133252246771E-5},{"$f":"IF(A331=\"\",\"\",RTD(\"cqg.rtd\", ,\"ContractData\", C331, \"T_CVol\",, \"T\"))","v":65902.310945999998},331,{"$f":"IFERROR(RANK($J331,INDIRECT((\"$J$\"&\"1\"&\":$J$\"&$A$449)))+COUNTIF($J$1:J331,J331)-1,\"\")","v":334},"S.US.PTC","S.US.CLX"]
[{"$f":"IF(Symbols!A333=\"\",\"\",Symbols!A333)","v":"S.US.PYPL"},{"$f":"IF(A332=\"\",\"\",IF(J333>0,1,0))","v":1},"S.US.PYPL",{"$f":"IF(A332=\"\",\"\",RTD(\"cqg.rtd\", ,\"ContractData\",C332, \"LongDescription\",, \"T\"))","v":"PAYPAL HOLDINGS"},null,null,null,{"$f":"IF(A332=\"\",\"\",RTD(\"cqg.rtd\", ,\"ContractData\",C332, \"LastTradeToday\",, \"T\"))","v":59.67},{"$f":"IF(A332=\"\",\"\",RTD(\"cqg.rtd\", ,\"ContractData\",C332, \"NetLastTradeToday\",, \"T\"))","v":0.47000000000000003},{"$f":"IF(A332=\"\",\"\",IFERROR(RTD(\"cqg.rtd\", ,\"ContractData\",C332, \"PerCentNetLastTrade\",, \"T\")/100,\"\"))","v":7.9391891891891896E-3},{"$f":"IF(A332=\"\",\"\",RTD(\"cqg.rtd\", ,\"ContractData\", C332, \"T_CVol\",, \"T\"))","v":2239665.0440750001},332,{"$f":"IFERROR(RANK($J332,INDIRECT((\"$J$\"&\"1\"&\":$J$\"&$A$449)))+COUNTIF($J$1:J332,J332)-1,\"\")","v":210},"S.US.PYPL","S.US.VMC"]
[{"$f":"IF(Symbols!A334=\"\",\"\",Symbols!A334)","v":"S.US.Q"},{"$f":"IF(A333=\"\",\"\",IF(J334>0,1,0))","v":1},"S.US.Q",{"$f":"IF(A333=\"\",\"\",RTD(\"cqg.rtd\", ,\"ContractData\",C333, \"LongDescription\",, \"T\"))","v":"Qnity Electronics Inc."},null,null,null,{"$f":"IF(A333=\"\",\"\",RTD(\"cqg.rtd\", ,\"ContractData\",C333, \"LastTradeToday\",, \"T\"))","v":144.05000000000001},{"$f":"IF(A333=\"\",\"\",RTD(\"cqg.rtd\", ,\"ContractData\",C333, \"NetLastTradeToday\",, \"T\"))","v":1.97},{"$f":"IF(A333=\"\",\"\",IFERROR(RTD(\"cqg.rtd\", ,\"ContractData\",C333, \"PerCentNetLastTrade\",, \"T\")/100,\"\"))","v":1.3865427927927927E-2},{"$f":"IF(A333=\"\",\"\",RTD(\"cqg.rtd\", ,\"ContractData\", C333, \"T_CVol\",, \"T\"))","v":151129.142333},333,{"$f":"IFERROR(RANK($J333,INDIRECT((\"$J$\"&\"1\"&\":$J$\"&$A$449)))+COUNTIF($J$1:J333,J333)-1,\"\")","v":109},"S.US.Q","S.US.HST"]
[{"$f":"IF(Symbols!A335=\"\",\"\",Symbols!A335)","v":"S.US.QCOM"},{"$f":"IF(A334=\"\",\"\",IF(J335>0,1,0))","v":1},"S.US.QCOM",{"$f":"IF(A334=\"\",\"\",RTD(\"cqg.rtd\", ,\"ContractData\",C334, \"LongDescription\",, \"T\"))","v":"QUALCOMM Inc"},null,null,null,{"$f":"IF(A334=\"\",\"\",RTD(\"cqg.rtd\", ,\"ContractData\",C334, \"LastTradeToday\",, \"T\"))","v":165.88},{"$f":"IF(A334=\"\",\"\",RTD(\"cqg.rtd\", ,\"ContractData\",C334, \"NetLastTradeToday\",, \"T\"))","v":2.81},{"$f":"IF(A334=\"\",\"\",IFERROR(RTD(\"cqg.rtd\", ,\"ContractData\",C334, \"PerCentNetLastTrade\",, \"T\")/100,\"\"))","v":1.723186361685166E-2},{"$f":"IF(A334=\"\",\"\",RTD(\"cqg.rtd\", ,\"ContractData\", C334, \"T_CVol\",, \"T\"))","v":1641234.64797},334,{"$f":"IFERROR(RANK($J334,INDIRECT((\"$J$\"&\"1\"&\":$J$\"&$A$449)))+COUNTIF($J$1:J334,J334)-1,\"\")","v":80},"S.US.QCOM","S.US.PTC"]
[{"$f":"IF(Symbols!A336=\"\",\"\",Symbols!A336)","v":"S.US.REG"},{"$f":"IF(A335=\"\",\"\",IF(J336>0,1,0))","v":1},"S.US.REG",{"$f":"IF(A335=\"\",\"\",RTD(\"cqg.rtd\", ,\"ContractData\",C335, \"LongDescription\",, \"T\"))","v":"REGENCY CENTERS CMN"},null,null,null,{"$f":"IF(A335=\"\",\"\",RTD(\"cqg.rtd\", ,\"ContractData\",C335, \"LastTradeToday\",, \"T\"))","v":76.45},{"$f":"IF(A335=\"\",\"\",RTD(\"cqg.rtd\", ,\"ContractData\",C335, \"NetLastTradeToday\",, \"T\"))","v":0.71},{"$f":"IF(A335=\"\",\"\",IFERROR(RTD(\"cqg.rtd\", ,\"ContractData\",C335, \"PerCentNetLastTrade\",, \"T\")/100,\"\"))","v":9.3741748085555861E-3},{"$f":"IF(A335=\"\",\"\",RTD(\"cqg.rtd\", ,\"ContractData\", C335, \"T_CVol\",, \"T\"))","v":108856.269778},335,{"$f":"IFERROR(RANK($J335,INDIRECT((\"$J$\"&\"1\"&\":$J$\"&$A$449)))+COUNTIF($J$1:J335,J335)-1,\"\")","v":179},"S.US.REG","S.US.DHR"]
[{"$f":"IF(Symbols!A337=\"\",\"\",Symbols!A337)","v":"S.US.REGN"},{"$f":"IF(A336=\"\",\"\",IF(J337>0,1,0))","v":1},"S.US.REGN",{"$f":"IF(A336=\"\",\"\",RTD(\"cqg.rtd\", ,\"ContractData\",C336, \"LongDescription\",, \"T\"))","v":"REGENERON PHARMACEUT"},null,null,null,{"$f":"IF(A336=\"\",\"\",RTD(\"cqg.rtd\", ,\"ContractData\",C336, \"LastTradeToday\",, \"T\"))","v":807.63},{"$f":"IF(A336=\"\",\"\",RTD(\"cqg.rtd\", ,\"ContractData\",C336, \"NetLastTradeToday\",, \"T\"))","v":9.64},{"$f":"IF(A336=\"\",\"\",IFERROR(RTD(\"cqg.rtd\", ,\"ContractData\",C336, \"PerCentNetLastTrade\",, \"T\")/100,\"\"))","v":1.2080351884108824E-2},{"$f":"IF(A336=\"\",\"\",RTD(\"cqg.rtd\", ,\"ContractData\", C336, \"T_CVol\",, \"T\"))","v":85947.932472},336,{"$f":"IFERROR(RANK($J336,INDIRECT((\"$J$\"&\"1\"&\":$J$\"&$A$449)))+COUNTIF($J$1:J336,J336)-1,\"\")","v":134},"S.US.REGN","S.US.KEYS"]
[{"$f":"IF(Symbols!A338=\"\",\"\",Symbols!A338)","v":"S.US.RF"},{"$f":"IF(A337=\"\",\"\",IF(J338>0,1,0))","v":0},"S.US.RF",{"$f":"IF(A337=\"\",\"\",RTD(\"cqg.rtd\", ,\"ContractData\",C337, \"LongDescription\",, \"T\"))","v":"Regions Financial Corp"},null,null,null,{"$f":"IF(A337=\"\",\"\",RTD(\"cqg.rtd\", ,\"ContractData\",C337, \"LastTradeToday\",, \"T\"))","v":31.8},{"$f":"IF(A337=\"\",\"\",RTD(\"cqg.rtd\", ,\"ContractData\",C337, \"NetLastTradeToday\",, \"T\"))","v":0.2},{"$f":"IF(A337=\"\",\"\",IFERROR(RTD(\"cqg.rtd\", ,\"ContractData\",C337, \"PerCentNetLastTrade\",, \"T\")/100,\"\"))","v":6.3291139240506337E-3},{"$f":"IF(A337=\"\",\"\",RTD(\"cqg.rtd\", ,\"ContractData\", C337, \"T_CVol\",, \"T\"))","v":834501.51430100005},337,{"$f":"IFERROR(RANK($J337,INDIRECT((\"$J$\"&\"1\"&\":$J$\"&$A$449)))+COUNTIF($J$1:J337,J337)-1,\"\")","v":241},"S.US.RF","S.US.AES"]
[{"$f":"IF(Symbols!A339=\"\",\"\",Symbols!A339)","v":"S.US.RJF"},{"$f":"IF(A338=\"\",\"\",IF(J339>0,1,0))","v":1},"S.US.RJF",{"$f":"IF(A338=\"\",\"\",RTD(\"cqg.rtd\", ,\"ContractData\",C338, \"LongDescription\",, \"T\"))","v":"Raymond James Fincl Inc"},null,null,null,{"$f":"IF(A338=\"\",\"\",RTD(\"cqg.rtd\", ,\"ContractData\",C338, \"LastTradeToday\",, \"T\"))","v":181.15},{"$f":"IF(A338=\"\",\"\",RTD(\"cqg.rtd\", ,\"ContractData\",C338, \"NetLastTradeToday\",, \"T\"))","v":-0.03},{"$f":"IF(A338=\"\",\"\",IFERROR(RTD(\"cqg.rtd\", ,\"ContractData\",C338, \"PerCentNetLastTrade\",, \"T\")/100,\"\"))","v":-1.6558118997681863E-4},{"$f":"IF(A338=\"\",\"\",RTD(\"cqg.rtd\", ,\"ContractData\", C338, \"T_CVol\",, \"T\"))","v":66471.254631000003},338,{"$f":"IFERROR(RANK($J338,INDIRECT((\"$J$\"&\"1\"&\":$J$\"&$A$449)))+COUNTIF($J$1:J338,J338)-1,\"\")","v":341},"S.US.RJF","S.US.BA"]
[{"$f":"IF(Symbols!A340=\"\",\"\",Symbols!A340)","v":"S.US.RMD"},{"$f":"IF(A339=\"\",\"\",IF(J340>0,1,0))","v":0},"S.US.RMD",{"$f":"IF(A339=\"\",\"\",RTD(\"cqg.rtd\", ,\"ContractData\",C339, \"LongDescription\",, \"T\"))","v":"Resmed Inc"},null,null,null,{"$f":"IF(A339=\"\",\"\",RTD(\"cqg.rtd\", ,\"ContractData\",C339, \"LastTradeToday\",, \"T\"))","v":226.18},{"$f":"IF(A339=\"\",\"\",RTD(\"cqg.rtd\", ,\"ContractData\",C339, \"NetLastTradeToday\",, \"T\"))","v":0.18},{"$f":"IF(A339=\"\",\"\",IFERROR(RTD(\"cqg.rtd\", ,\"ContractData\",C339, \"PerCentNetLastTrade\",, \"T\")/100,\"\"))","v":7.9646017699115039E-4},{"$f":"IF(A339=\"\",\"\",RTD(\"cqg.rtd\", ,\"ContractData\", C339, \"T_CVol\",, \"T\"))","v":128084.795941},339,{"$f":"IFERROR(RANK($J339,INDIRECT((\"$J$\"&\"1\"&\":$J$\"&$A$449)))+COUNTIF($J$1:J339,J339)-1,\"\")","v":327},"S.US.RMD","S.US.DGX"]
[{"$f":"IF(Symbols!A341=\"\",\"\",Symbols!A341)","v":"S.US.ROK"},{"$f":"IF(A340=\"\",\"\",IF(J341>0,1,0))","v":0},"S.US.ROK",{"$f":"IF(A340=\"\",\"\",RTD(\"cqg.rtd\", ,\"ContractData\",C340, \"LongDescription\",, \"T\"))","v":"Rockwell Automation Inc"},null,null,null,{"$f":"IF(A340=\"\",\"\",RTD(\"cqg.rtd\", ,\"ContractData\",C340, \"LastTradeToday\",, \"T\"))","v":448.44},{"$f":"IF(A340=\"\",\"\",RTD(\"cqg.rtd\", ,\"ContractData\",C340, \"NetLastTradeToday\",, \"T\"))","v":-2.95},{"$f":"IF(A340=\"\",\"\",IFERROR(RTD(\"cqg.rtd\", ,\"ContractData\",C340, \"PerCentNetLastTrade\",, \"T\")/100,\"\"))","v":-6.5353685283236233E-3},{"$f":"IF(A340=\"\",\"\",RTD(\"cqg.rtd\", ,\"ContractData\", C340, \"T_CVol\",, \"T\"))","v":49017.127594999998},340,{"$f":"IFERROR(RANK($J340,INDIRECT((\"$J$\"&\"1\"&\":$J$\"&$A$449)))+COUNTIF($J$1:J340,J340)-1,\"\")","v":400},"S.US.ROK","S.US.LULU"]
[{"$f":"IF(Symbols!A342=\"\",\"\",Symbols!A342)","v":"S.US.ROP"},{"$f":"IF(A341=\"\",\"\",IF(J342>0,1,0))","v":0},"S.US.ROP",{"$f":"IF(A341=\"\",\"\",RTD(\"cqg.rtd\", ,\"ContractData\",C341, \"LongDescription\",, \"T\"))","v":"ROPER TECH CMN"},null,null,null,{"$f":"IF(A341=\"\",\"\",RTD(\"cqg.rtd\", ,\"ContractData\",C341, \"LastTradeToday\",, \"T\"))","v":394.41},{"$f":"IF(A341=\"\",\"\",RTD(\"cqg.rtd\", ,\"ContractData\",C341, \"NetLastTradeToday\",, \"T\"))","v":-0.82000000000000006},{"$f":"IF(A341=\"\",\"\",IFERROR(RTD(\"cqg.rtd\", ,\"ContractData\",C341, \"PerCentNetLastTrade\",, \"T\")/100,\"\"))","v":-2.0747412898818409E-3},{"$f":"IF(A341=\"\",\"\",RTD(\"cqg.rtd\", ,\"ContractData\", C341, \"T_CVol\",, \"T\"))","v":50918.062726999997},341,{"$f":"IFERROR(RANK($J341,INDIRECT((\"$J$\"&\"1\"&\":$J$\"&$A$449)))+COUNTIF($J$1:J341,J341)-1,\"\")","v":362},"S.US.ROP","S.US.RJF"]
[{"$f":"IF(Symbols!A343=\"\",\"\",Symbols!A343)","v":"S.US.ROST"},{"$f":"IF(A342=\"\",\"\",IF(J343>0,1,0))","v":1},"S.US.ROST",{"$f":"IF(A342=\"\",\"\",RTD(\"cqg.rtd\", ,\"ContractData\",C342, \"LongDescription\",, \"T\"))","v":"ROSS STORES, INC."},null,null,null,{"$f":"IF(A342=\"\",\"\",RTD(\"cqg.rtd\", ,\"ContractData\",C342, \"LastTradeToday\",, \"T\"))","v":246.20000000000002},{"$f":"IF(A342=\"\",\"\",RTD(\"cqg.rtd\", ,\"ContractData\",C342, \"NetLastTradeToday\",, \"T\"))","v":-2.0499999999999998},{"$f":"IF(A342=\"\",\"\",IFERROR(RTD(\"cqg.rtd\", ,\"ContractData\",C342, \"PerCentNetLastTrade\",, \"T\")/100,\"\"))","v":-8.2578046324269898E-3},{"$f":"IF(A342=\"\",\"\",RTD(\"cqg.rtd\", ,\"ContractData\", C342, \"T_CVol\",, \"T\"))","v":356988.82296399999},342,{"$f":"IFERROR(RANK($J342,INDIRECT((\"$J$\"&\"1\"&\":$J$\"&$A$449)))+COUNTIF($J$1:J342,J342)-1,\"\")","v":407},"S.US.ROST","S.US.L"]
[{"$f":"IF(Symbols!A344=\"\",\"\",Symbols!A344)","v":"S.US.RSG"},{"$f":"IF(A343=\"\",\"\",IF(J344>0,1,0))","v":0},"S.US.RSG",{"$f":"IF(A343=\"\",\"\",RTD(\"cqg.rtd\", ,\"ContractData\",C343, \"LongDescription\",, \"T\"))","v":"Republic Services Inc ClA"},null,null,null,{"$f":"IF(A343=\"\",\"\",RTD(\"cqg.rtd\", ,\"ContractData\",C343, \"LastTradeToday\",, \"T\"))","v":216.47},{"$f":"IF(A343=\"\",\"\",RTD(\"cqg.rtd\", ,\"ContractData\",C343, \"NetLastTradeToday\",, \"T\"))","v":2.21},{"$f":"IF(A343=\"\",\"\",IFERROR(RTD(\"cqg.rtd\", ,\"ContractData\",C343, \"PerCentNetLastTrade\",, \"T\")/100,\"\"))","v":1.0314571081863157E-2},{"$f":"IF(A343=\"\",\"\",RTD(\"cqg.rtd\", ,\"ContractData\", C343, \"T_CVol\",, \"T\"))","v":144134.73705600001},343,{"$f":"IFERROR(RANK($J343,INDIRECT((\"$J$\"&\"1\"&\":$J$\"&$A$449)))+COUNTIF($J$1:J343,J343)-1,\"\")","v":160},"S.US.RSG","S.US.DPZ"]
[{"$f":"IF(Symbols!A345=\"\",\"\",Symbols!A345)","v":"S.US.RVTY"},{"$f":"IF(A344=\"\",\"\",IF(J345>0,1,0))","v":1},"S.US.RVTY",{"$f":"IF(A344=\"\",\"\",RTD(\"cqg.rtd\", ,\"ContractData\",C344, \"LongDescription\",, \"T\"))","v":"Revvity Inc."},null,null,null,{"$f":"IF(A344=\"\",\"\",RTD(\"cqg.rtd\", ,\"ContractData\",C344, \"LastTradeToday\",, \"T\"))","v":117.72},{"$f":"IF(A344=\"\",\"\",RTD(\"cqg.rtd\", ,\"ContractData\",C344, \"NetLastTradeToday\",, \"T\"))","v":-0.16},{"$f":"IF(A344=\"\",\"\",IFERROR(RTD(\"cqg.rtd\", ,\"ContractData\",C344, \"PerCentNetLastTrade\",, \"T\")/100,\"\"))","v":-1.357312521208008E-3},{"$f":"IF(A344=\"\",\"\",RTD(\"cqg.rtd\", ,\"ContractData\", C344, \"T_CVol\",, \"T\"))","v":100574.804508},344,{"$f":"IFERROR(RANK($J344,INDIRECT((\"$J$\"&\"1\"&\":$J$\"&$A$449)))+COUNTIF($J$1:J344,J344)-1,\"\")","v":357},"S.US.RVTY","S.US.BNY"]
[{"$f":"IF(Symbols!A346=\"\",\"\",Symbols!A346)","v":"S.US.SBAC"},{"$f":"IF(A345=\"\",\"\",IF(J346>0,1,0))","v":1},"S.US.SBAC",{"$f":"IF(A345=\"\",\"\",RTD(\"cqg.rtd\", ,\"ContractData\",C345, \"LongDescription\",, \"T\"))","v":"SBA COMMUNICATIONS"},null,null,null,{"$f":"IF(A345=\"\",\"\",RTD(\"cqg.rtd\", ,\"ContractData\",C345, \"LastTradeToday\",, \"T\"))","v":185.5},{"$f":"IF(A345=\"\",\"\",RTD(\"cqg.rtd\", ,\"ContractData\",C345, \"NetLastTradeToday\",, \"T\"))","v":2.42},{"$f":"IF(A345=\"\",\"\",IFERROR(RTD(\"cqg.rtd\", ,\"ContractData\",C345, \"PerCentNetLastTrade\",, \"T\")/100,\"\"))","v":1.3218265239239677E-2},{"$f":"IF(A345=\"\",\"\",RTD(\"cqg.rtd\", ,\"ContractData\", C345, \"T_CVol\",, \"T\"))","v":97433.626539000004},345,{"$f":"IFERROR(RANK($J345,INDIRECT((\"$J$\"&\"1\"&\":$J$\"&$A$449)))+COUNTIF($J$1:J345,J345)-1,\"\")","v":112},"S.US.SBAC","S.US.LH"]
[{"$f":"IF(Symbols!A347=\"\",\"\",Symbols!A347)","v":"S.US.SBUX"},{"$f":"IF(A346=\"\",\"\",IF(J347>0,1,0))","v":1},"S.US.SBUX",{"$f":"IF(A346=\"\",\"\",RTD(\"cqg.rtd\", ,\"ContractData\",C346, \"LongDescription\",, \"T\"))","v":"Starbucks Corp"},null,null,null,{"$f":"IF(A346=\"\",\"\",RTD(\"cqg.rtd\", ,\"ContractData\",C346, \"LastTradeToday\",, \"T\"))","v":110.22},{"$f":"IF(A346=\"\",\"\",RTD(\"cqg.rtd\", ,\"ContractData\",C346, \"NetLastTradeToday\",, \"T\"))","v":1.73},{"$f":"IF(A346=\"\",\"\",IFERROR(RTD(\"cqg.rtd\", ,\"ContractData\",C346, \"PerCentNetLastTrade\",, \"T\")/100,\"\"))","v":1.5946170153931238E-2},{"$f":"IF(A346=\"\",\"\",RTD(\"cqg.rtd\", ,\"ContractData\", C346, \"T_CVol\",, \"T\"))","v":966388.32406000001},346,{"$f":"IFERROR(RANK($J346,INDIRECT((\"$J$\"&\"1\"&\":$J$\"&$A$449)))+COUNTIF($J$1:J346,J346)-1,\"\")","v":86},"S.US.SBUX","S.US.TECH"]
[{"$f":"IF(Symbols!A348=\"\",\"\",Symbols!A348)","v":"S.US.SCHW"},{"$f":"IF(A347=\"\",\"\",IF(J348>0,1,0))","v":1},"S.US.SCHW",{"$f":"IF(A347=\"\",\"\",RTD(\"cqg.rtd\", ,\"ContractData\",C347, \"LongDescription\",, \"T\"))","v":"Charles Schwab Corp"},null,null,null,{"$f":"IF(A347=\"\",\"\",RTD(\"cqg.rtd\", ,\"ContractData\",C347, \"LastTradeToday\",, \"T\"))","v":110.17},{"$f":"IF(A347=\"\",\"\",RTD(\"cqg.rtd\", ,\"ContractData\",C347, \"NetLastTradeToday\",, \"T\"))","v":0.83000000000000007},{"$f":"IF(A347=\"\",\"\",IFERROR(RTD(\"cqg.rtd\", ,\"ContractData\",C347, \"PerCentNetLastTrade\",, \"T\")/100,\"\"))","v":7.5910005487470275E-3},{"$f":"IF(A347=\"\",\"\",RTD(\"cqg.rtd\", ,\"ContractData\", C347, \"T_CVol\",, \"T\"))","v":598520.99412199995},347,{"$f":"IFERROR(RANK($J347,INDIRECT((\"$J$\"&\"1\"&\":$J$\"&$A$449)))+COUNTIF($J$1:J347,J347)-1,\"\")","v":218},"S.US.SCHW","S.US.CVX"]
[{"$f":"IF(Symbols!A349=\"\",\"\",Symbols!A349)","v":"S.US.SHW"},{"$f":"IF(A348=\"\",\"\",IF(J349>0,1,0))","v":1},"S.US.SHW",{"$f":"IF(A348=\"\",\"\",RTD(\"cqg.rtd\", ,\"ContractData\",C348, \"LongDescription\",, \"T\"))","v":"Sherwin-Williams Co"},null,null,null,{"$f":"IF(A348=\"\",\"\",RTD(\"cqg.rtd\", ,\"ContractData\",C348, \"LastTradeToday\",, \"T\"))","v":362.8},{"$f":"IF(A348=\"\",\"\",RTD(\"cqg.rtd\", ,\"ContractData\",C348, \"NetLastTradeToday\",, \"T\"))","v":2.6},{"$f":"IF(A348=\"\",\"\",IFERROR(RTD(\"cqg.rtd\", ,\"ContractData\",C348, \"PerCentNetLastTrade\",, \"T\")/100,\"\"))","v":7.2182121043864525E-3},{"$f":"IF(A348=\"\",\"\",RTD(\"cqg.rtd\", ,\"ContractData\", C348, \"T_CVol\",, \"T\"))","v":173060.350523},348,{"$f":"IFERROR(RANK($J348,INDIRECT((\"$J$\"&\"1\"&\":$J$\"&$A$449)))+COUNTIF($J$1:J348,J348)-1,\"\")","v":224},"S.US.SHW","S.US.CTVA"]
[{"$f":"IF(Symbols!A350=\"\",\"\",Symbols!A350)","v":"S.US.SJM"},{"$f":"IF(A349=\"\",\"\",IF(J350>0,1,0))","v":0},"S.US.SJM",{"$f":"IF(A349=\"\",\"\",RTD(\"cqg.rtd\", ,\"ContractData\",C349, \"LongDescription\",, \"T\"))","v":"SMUCKER JM CO"},null,null,null,{"$f":"IF(A349=\"\",\"\",RTD(\"cqg.rtd\", ,\"ContractData\",C349, \"LastTradeToday\",, \"T\"))","v":120.45},{"$f":"IF(A349=\"\",\"\",RTD(\"cqg.rtd\", ,\"ContractData\",C349, \"NetLastTradeToday\",, \"T\"))","v":1.6600000000000001},{"$f":"IF(A349=\"\",\"\",IFERROR(RTD(\"cqg.rtd\", ,\"ContractData\",C349, \"PerCentNetLastTrade\",, \"T\")/100,\"\"))","v":1.3974240255913796E-2},{"$f":"IF(A349=\"\",\"\",RTD(\"cqg.rtd\", ,\"ContractData\", C349, \"T_CVol\",, \"T\"))","v":90492.950945000004},349,{"$f":"IFERROR(RANK($J349,INDIRECT((\"$J$\"&\"1\"&\":$J$\"&$A$449)))+COUNTIF($J$1:J349,J349)-1,\"\")","v":108},"S.US.SJM","S.US.STLD"]
[{"$f":"IF(Symbols!A351=\"\",\"\",Symbols!A351)","v":"S.US.SLB"},{"$f":"IF(A350=\"\",\"\",IF(J351>0,1,0))","v":1},{"$f":"A350","v":"S.US.SLB"},{"$f":"IF(A350=\"\",\"\",RTD(\"cqg.rtd\", ,\"ContractData\",C350, \"LongDescription\",, \"T\"))","v":"SLB"},null,null,null,{"$f":"IF(A350=\"\",\"\",RTD(\"cqg.rtd\", ,\"ContractData\",C350, \"LastTradeToday\",, \"T\"))","v":51.89},{"$f":"IF(A350=\"\",\"\",RTD(\"cqg.rtd\", ,\"ContractData\",C350, \"NetLastTradeToday\",, \"T\"))","v":-0.72},{"$f":"IF(A350=\"\",\"\",IFERROR(RTD(\"cqg.rtd\", ,\"ContractData\",C350, \"PerCentNetLastTrade\",, \"T\")/100,\"\"))","v":-1.3685611100551227E-2},{"$f":"IF(A350=\"\",\"\",RTD(\"cqg.rtd\", ,\"ContractData\", C350, \"T_CVol\",, \"T\"))","v":1178064.963585},350,{"$f":"IFERROR(RANK($J350,INDIRECT((\"$J$\"&\"1\"&\":$J$\"&$A$449)))+COUNTIF($J$1:J350,J350)-1,\"\")","v":428},"S.US.SLB","S.US.FTV"]
[{"$f":"IF(Symbols!A352=\"\",\"\",Symbols!A352)","v":"S.US.SMCI"},{"$f":"IF(A351=\"\",\"\",IF(J352>0,1,0))","v":0},"S.US.SMCI",{"$f":"IF(A351=\"\",\"\",RTD(\"cqg.rtd\", ,\"ContractData\",C351, \"LongDescription\",, \"T\"))","v":"Super Micro Computer"},null,null,null,{"$f":"IF(A351=\"\",\"\",RTD(\"cqg.rtd\", ,\"ContractData\",C351, \"LastTradeToday\",, \"T\"))","v":41.61},{"$f":"IF(A351=\"\",\"\",RTD(\"cqg.rtd\", ,\"ContractData\",C351, \"NetLastTradeToday\",, \"T\"))","v":3.99},{"$f":"IF(A351=\"\",\"\",IFERROR(RTD(\"cqg.rtd\", ,\"ContractData\",C351, \"PerCentNetLastTrade\",, \"T\")/100,\"\"))","v":0.10608880616857219},{"$f":"IF(A351=\"\",\"\",RTD(\"cqg.rtd\", ,\"ContractData\", C351, \"T_CVol\",, \"T\"))","v":38617346.731009997},351,{"$f":"IFERROR(RANK($J351,INDIRECT((\"$J$\"&\"1\"&\":$J$\"&$A$449)))+COUNTIF($J$1:J351,J351)-1,\"\")","v":1},"S.US.SMCI","S.US.DD"]
[{"$f":"IF(Symbols!A353=\"\",\"\",Symbols!A353)","v":"S.US.SNA"},{"$f":"IF(A352=\"\",\"\",IF(J353>0,1,0))","v":1},"S.US.SNA",{"$f":"IF(A352=\"\",\"\",RTD(\"cqg.rtd\", ,\"ContractData\",C352, \"LongDescription\",, \"T\"))","v":"Snap-On Tools Corp"},null,null,null,{"$f":"IF(A352=\"\",\"\",RTD(\"cqg.rtd\", ,\"ContractData\",C352, \"LastTradeToday\",, \"T\"))","v":406.23},{"$f":"IF(A352=\"\",\"\",RTD(\"cqg.rtd\", ,\"ContractData\",C352, \"NetLastTradeToday\",, \"T\"))","v":-2.21},{"$f":"IF(A352=\"\",\"\",IFERROR(RTD(\"cqg.rtd\", ,\"ContractData\",C352, \"PerCentNetLastTrade\",, \"T\")/100,\"\"))","v":-5.4108314562726469E-3},{"$f":"IF(A352=\"\",\"\",RTD(\"cqg.rtd\", ,\"ContractData\", C352, \"T_CVol\",, \"T\"))","v":20604.814328},352,{"$f":"IFERROR(RANK($J352,INDIRECT((\"$J$\"&\"1\"&\":$J$\"&$A$449)))+COUNTIF($J$1:J352,J352)-1,\"\")","v":392},"S.US.SNA","S.US.TRGP"]
[{"$f":"IF(Symbols!A354=\"\",\"\",Symbols!A354)","v":"S.US.SNPS"},{"$f":"IF(A353=\"\",\"\",IF(J354>0,1,0))","v":1},"S.US.SNPS",{"$f":"IF(A353=\"\",\"\",RTD(\"cqg.rtd\", ,\"ContractData\",C353, \"LongDescription\",, \"T\"))","v":"SYNOPSYS, INC."},null,null,null,{"$f":"IF(A353=\"\",\"\",RTD(\"cqg.rtd\", ,\"ContractData\",C353, \"LastTradeToday\",, \"T\"))","v":416.78000000000003},{"$f":"IF(A353=\"\",\"\",RTD(\"cqg.rtd\", ,\"ContractData\",C353, \"NetLastTradeToday\",, \"T\"))","v":4.46},{"$f":"IF(A353=\"\",\"\",IFERROR(RTD(\"cqg.rtd\", ,\"ContractData\",C353, \"PerCentNetLastTrade\",, \"T\")/100,\"\"))","v":1.0816841288319752E-2},{"$f":"IF(A353=\"\",\"\",RTD(\"cqg.rtd\", ,\"ContractData\", C353, \"T_CVol\",, \"T\"))","v":246989.831626},353,{"$f":"IFERROR(RANK($J353,INDIRECT((\"$J$\"&\"1\"&\":$J$\"&$A$449)))+COUNTIF($J$1:J353,J353)-1,\"\")","v":152},"S.US.SNPS","S.US.FFIV"]
[{"$f":"IF(Symbols!A355=\"\",\"\",Symbols!A355)","v":"S.US.SO"},{"$f":"IF(A354=\"\",\"\",IF(J355>0,1,0))","v":1},"S.US.SO",{"$f":"IF(A354=\"\",\"\",RTD(\"cqg.rtd\", ,\"ContractData\",C354, \"LongDescription\",, \"T\"))","v":"Southern Company"},null,null,null,{"$f":"IF(A354=\"\",\"\",RTD(\"cqg.rtd\", ,\"ContractData\",C354, \"LastTradeToday\",, \"T\"))","v":92.87},{"$f":"IF(A354=\"\",\"\",RTD(\"cqg.rtd\", ,\"ContractData\",C354, \"NetLastTradeToday\",, \"T\"))","v":0.35000000000000003},{"$f":"IF(A354=\"\",\"\",IFERROR(RTD(\"cqg.rtd\", ,\"ContractData\",C354, \"PerCentNetLastTrade\",, \"T\")/100,\"\"))","v":3.7829658452226546E-3},{"$f":"IF(A354=\"\",\"\",RTD(\"cqg.rtd\", ,\"ContractData\", C354, \"T_CVol\",, \"T\"))","v":466424.45412900002},354,{"$f":"IFERROR(RANK($J354,INDIRECT((\"$J$\"&\"1\"&\":$J$\"&$A$449)))+COUNTIF($J$1:J354,J354)-1,\"\")","v":287},"S.US.SO","S.US.TMO"]
[{"$f":"IF(Symbols!A356=\"\",\"\",Symbols!A356)","v":"S.US.SOLV"},{"$f":"IF(A355=\"\",\"\",IF(J356>0,1,0))","v":1},"S.US.SOLV",{"$f":"IF(A355=\"\",\"\",RTD(\"cqg.rtd\", ,\"ContractData\",C355, \"LongDescription\",, \"T\"))","v":"Solventum Corporation"},null,null,null,{"$f":"IF(A355=\"\",\"\",RTD(\"cqg.rtd\", ,\"ContractData\",C355, \"LastTradeToday\",, \"T\"))","v":86.13},{"$f":"IF(A355=\"\",\"\",RTD(\"cqg.rtd\", ,\"ContractData\",C355, \"NetLastTradeToday\",, \"T\"))","v":0.84},{"$f":"IF(A355=\"\",\"\",IFERROR(RTD(\"cqg.rtd\", ,\"ContractData\",C355, \"PerCentNetLastTrade\",, \"T\")/100,\"\"))","v":9.8487513190291948E-3},{"$f":"IF(A355=\"\",\"\",RTD(\"cqg.rtd\", ,\"ContractData\", C355, \"T_CVol\",, \"T\"))","v":69435.201042999994},355,{"$f":"IFERROR(RANK($J355,INDIRECT((\"$J$\"&\"1\"&\":$J$\"&$A$449)))+COUNTIF($J$1:J355,J355)-1,\"\")","v":166},"S.US.SOLV","S.US.EQT"]
[{"$f":"IF(Symbols!A357=\"\",\"\",Symbols!A357)","v":"S.US.SPG"},{"$f":"IF(A356=\"\",\"\",IF(J357>0,1,0))","v":1},"S.US.SPG",{"$f":"IF(A356=\"\",\"\",RTD(\"cqg.rtd\", ,\"ContractData\",C356, \"LongDescription\",, \"T\"))","v":"Simon Property Grp"},null,null,null,{"$f":"IF(A356=\"\",\"\",RTD(\"cqg.rtd\", ,\"ContractData\",C356, \"LastTradeToday\",, \"T\"))","v":223.37},{"$f":"IF(A356=\"\",\"\",RTD(\"cqg.rtd\", ,\"ContractData\",C356, \"NetLastTradeToday\",, \"T\"))","v":2.81},{"$f":"IF(A356=\"\",\"\",IFERROR(RTD(\"cqg.rtd\", ,\"ContractData\",C356, \"PerCentNetLastTrade\",, \"T\")/100,\"\"))","v":1.2740297424737033E-2},{"$f":"IF(A356=\"\",\"\",RTD(\"cqg.rtd\", ,\"ContractData\", C356, \"T_CVol\",, \"T\"))","v":90262.193744000004},356,{"$f":"IFERROR(RANK($J356,INDIRECT((\"$J$\"&\"1\"&\":$J$\"&$A$449)))+COUNTIF($J$1:J356,J356)-1,\"\")","v":120},"S.US.SPG","S.US.STE"]
[{"$f":"IF(Symbols!A358=\"\",\"\",Symbols!A358)","v":"S.US.SPGI"},{"$f":"IF(A357=\"\",\"\",IF(J358>0,1,0))","v":1},"S.US.SPGI",{"$f":"IF(A357=\"\",\"\",RTD(\"cqg.rtd\", ,\"ContractData\",C357, \"LongDescription\",, \"T\"))","v":"S&P Global Inc."},null,null,null,{"$f":"IF(A357=\"\",\"\",RTD(\"cqg.rtd\", ,\"ContractData\",C357, \"LastTradeToday\",, \"T\"))","v":417.3},{"$f":"IF(A357=\"\",\"\",RTD(\"cqg.rtd\", ,\"ContractData\",C357, \"NetLastTradeToday\",, \"T\"))","v":7.2},{"$f":"IF(A357=\"\",\"\",IFERROR(RTD(\"cqg.rtd\", ,\"ContractData\",C357, \"PerCentNetLastTrade\",, \"T\")/100,\"\"))","v":1.755669348939283E-2},{"$f":"IF(A357=\"\",\"\",RTD(\"cqg.rtd\", ,\"ContractData\", C357, \"T_CVol\",, \"T\"))","v":417413.58756700001},357,{"$f":"IFERROR(RANK($J357,INDIRECT((\"$J$\"&\"1\"&\":$J$\"&$A$449)))+COUNTIF($J$1:J357,J357)-1,\"\")","v":77},"S.US.SPGI","S.US.RVTY"]
[{"$f":"IF(Symbols!A359=\"\",\"\",Symbols!A359)","v":"S.US.SRE"},{"$f":"IF(A358=\"\",\"\",IF(J359>0,1,0))","v":0},"S.US.SRE",{"$f":"IF(A358=\"\",\"\",RTD(\"cqg.rtd\", ,\"ContractData\",C358, \"LongDescription\",, \"T\"))","v":"Sempra"},null,null,null,{"$f":"IF(A358=\"\",\"\",RTD(\"cqg.rtd\", ,\"ContractData\",C358, \"LastTradeToday\",, \"T\"))","v":86.66},{"$f":"IF(A358=\"\",\"\",RTD(\"cqg.rtd\", ,\"ContractData\",C358, \"NetLastTradeToday\",, \"T\"))","v":0.74},{"$f":"IF(A358=\"\",\"\",IFERROR(RTD(\"cqg.rtd\", ,\"ContractData\",C358, \"PerCentNetLastTrade\",, \"T\")/100,\"\"))","v":8.6126629422718804E-3},{"$f":"IF(A358=\"\",\"\",RTD(\"cqg.rtd\", ,\"ContractData\", C358, \"T_CVol\",, \"T\"))","v":547395.837711},358,{"$f":"IFERROR(RANK($J358,INDIRECT((\"$J$\"&\"1\"&\":$J$\"&$A$449)))+COUNTIF($J$1:J358,J358)-1,\"\")","v":194},"S.US.SRE","S.US.AXP"]
[{"$f":"IF(Symbols!A360=\"\",\"\",Symbols!A360)","v":"S.US.STE"},{"$f":"IF(A359=\"\",\"\",IF(J360>0,1,0))","v":0},"S.US.STE",{"$f":"IF(A359=\"\",\"\",RTD(\"cqg.rtd\", ,\"ContractData\",C359, \"LongDescription\",, \"T\"))","v":"STERIS plc"},null,null,null,{"$f":"IF(A359=\"\",\"\",RTD(\"cqg.rtd\", ,\"ContractData\",C359, \"LastTradeToday\",, \"T\"))","v":236.28},{"$f":"IF(A359=\"\",\"\",RTD(\"cqg.rtd\", ,\"ContractData\",C359, \"NetLastTradeToday\",, \"T\"))","v":-0.32},{"$f":"IF(A359=\"\",\"\",IFERROR(RTD(\"cqg.rtd\", ,\"ContractData\",C359, \"PerCentNetLastTrade\",, \"T\")/100,\"\"))","v":-1.3524936601859679E-3},{"$f":"IF(A359=\"\",\"\",RTD(\"cqg.rtd\", ,\"ContractData\", C359, \"T_CVol\",, \"T\"))","v":47889.548853},359,{"$f":"IFERROR(RANK($J359,INDIRECT((\"$J$\"&\"1\"&\":$J$\"&$A$449)))+COUNTIF($J$1:J359,J359)-1,\"\")","v":356},"S.US.STE","S.US.ADSK"]
[{"$f":"IF(Symbols!A361=\"\",\"\",Symbols!A361)","v":"S.US.STLD"},{"$f":"IF(A360=\"\",\"\",IF(J361>0,1,0))","v":1},"S.US.STLD",{"$f":"IF(A360=\"\",\"\",RTD(\"cqg.rtd\", ,\"ContractData\",C360, \"LongDescription\",, \"T\"))","v":"Steel Dynamics Inc"},null,null,null,{"$f":"IF(A360=\"\",\"\",RTD(\"cqg.rtd\", ,\"ContractData\",C360, \"LastTradeToday\",, \"T\"))","v":262.93},{"$f":"IF(A360=\"\",\"\",RTD(\"cqg.rtd\", ,\"ContractData\",C360, \"NetLastTradeToday\",, \"T\"))","v":-0.25},{"$f":"IF(A360=\"\",\"\",IFERROR(RTD(\"cqg.rtd\", ,\"ContractData\",C360, \"PerCentNetLastTrade\",, \"T\")/100,\"\"))","v":-9.4992020670263703E-4},{"$f":"IF(A360=\"\",\"\",RTD(\"cqg.rtd\", ,\"ContractData\", C360, \"T_CVol\",, \"T\"))","v":48258.135963000001},360,{"$f":"IFERROR(RANK($J360,INDIRECT((\"$J$\"&\"1\"&\":$J$\"&$A$449)))+COUNTIF($J$1:J360,J360)-1,\"\")","v":349},"S.US.STLD","S.US.ECL"]
[{"$f":"IF(Symbols!A362=\"\",\"\",Symbols!A362)","v":"S.US.STT"},{"$f":"IF(A361=\"\",\"\",IF(J362>0,1,0))","v":1},"S.US.STT",{"$f":"IF(A361=\"\",\"\",RTD(\"cqg.rtd\", ,\"ContractData\",C361, \"LongDescription\",, \"T\"))","v":"State Street Corp"},null,null,null,{"$f":"IF(A361=\"\",\"\",RTD(\"cqg.rtd\", ,\"ContractData\",C361, \"LastTradeToday\",, \"T\"))","v":191.46},{"$f":"IF(A361=\"\",\"\",RTD(\"cqg.rtd\", ,\"ContractData\",C361, \"NetLastTradeToday\",, \"T\"))","v":1.35},{"$f":"IF(A361=\"\",\"\",IFERROR(RTD(\"cqg.rtd\", ,\"ContractData\",C361, \"PerCentNetLastTrade\",, \"T\")/100,\"\"))","v":7.101151964652044E-3},{"$f":"IF(A361=\"\",\"\",RTD(\"cqg.rtd\", ,\"ContractData\", C361, \"T_CVol\",, \"T\"))","v":146528.73429699999},361,{"$f":"IFERROR(RANK($J361,INDIRECT((\"$J$\"&\"1\"&\":$J$\"&$A$449)))+COUNTIF($J$1:J361,J361)-1,\"\")","v":227},"S.US.STT","S.US.NOW"]
[{"$f":"IF(Symbols!A363=\"\",\"\",Symbols!A363)","v":"S.US.STX"},{"$f":"IF(A362=\"\",\"\",IF(J363>0,1,0))","v":1},"S.US.STX",{"$f":"IF(A362=\"\",\"\",RTD(\"cqg.rtd\", ,\"ContractData\",C362, \"LongDescription\",, \"T\"))","v":"SEAGATE TCH HLDGS OR"},null,null,null,{"$f":"IF(A362=\"\",\"\",RTD(\"cqg.rtd\", ,\"ContractData\",C362, \"LastTradeToday\",, \"T\"))","v":894.38},{"$f":"IF(A362=\"\",\"\",RTD(\"cqg.rtd\", ,\"ContractData\",C362, \"NetLastTradeToday\",, \"T\"))","v":16.170000000000002},{"$f":"IF(A362=\"\",\"\",IFERROR(RTD(\"cqg.rtd\", ,\"ContractData\",C362, \"PerCentNetLastTrade\",, \"T\")/100,\"\"))","v":1.8412452602452715E-2},{"$f":"IF(A362=\"\",\"\",RTD(\"cqg.rtd\", ,\"ContractData\", C362, \"T_CVol\",, \"T\"))","v":720460.84139800002},362,{"$f":"IFERROR(RANK($J362,INDIRECT((\"$J$\"&\"1\"&\":$J$\"&$A$449)))+COUNTIF($J$1:J362,J362)-1,\"\")","v":72},"S.US.STX","S.US.ROP"]
[{"$f":"IF(Symbols!A364=\"\",\"\",Symbols!A364)","v":"S.US.STZ"},{"$f":"IF(A363=\"\",\"\",IF(J364>0,1,0))","v":1},"S.US.STZ",{"$f":"IF(A363=\"\",\"\",RTD(\"cqg.rtd\", ,\"ContractData\",C363, \"LongDescription\",, \"T\"))","v":"Constellation Brands Inc"},null,null,null,{"$f":"IF(A363=\"\",\"\",RTD(\"cqg.rtd\", ,\"ContractData\",C363, \"LastTradeToday\",, \"T\"))","v":136.66},{"$f":"IF(A363=\"\",\"\",RTD(\"cqg.rtd\", ,\"ContractData\",C363, \"NetLastTradeToday\",, \"T\"))","v":2.7},{"$f":"IF(A363=\"\",\"\",IFERROR(RTD(\"cqg.rtd\", ,\"ContractData\",C363, \"PerCentNetLastTrade\",, \"T\")/100,\"\"))","v":2.0155270229919378E-2},{"$f":"IF(A363=\"\",\"\",RTD(\"cqg.rtd\", ,\"ContractData\", C363, \"T_CVol\",, \"T\"))","v":292803.05656699999},363,{"$f":"IFERROR(RANK($J363,INDIRECT((\"$J$\"&\"1\"&\":$J$\"&$A$449)))+COUNTIF($J$1:J363,J363)-1,\"\")","v":57},"S.US.STZ","S.US.IEX"]
[{"$f":"IF(Symbols!A365=\"\",\"\",Symbols!A365)","v":"S.US.SW"},{"$f":"IF(A364=\"\",\"\",IF(J365>0,1,0))","v":1},"S.US.SW",{"$f":"IF(A364=\"\",\"\",RTD(\"cqg.rtd\", ,\"ContractData\",C364, \"LongDescription\",, \"T\"))","v":"Smurfit Westrock Plc"},null,null,null,{"$f":"IF(A364=\"\",\"\",RTD(\"cqg.rtd\", ,\"ContractData\",C364, \"LastTradeToday\",, \"T\"))","v":49.660000000000004},{"$f":"IF(A364=\"\",\"\",RTD(\"cqg.rtd\", ,\"ContractData\",C364, \"NetLastTradeToday\",, \"T\"))","v":0.41000000000000003},{"$f":"IF(A364=\"\",\"\",IFERROR(RTD(\"cqg.rtd\", ,\"ContractData\",C364, \"PerCentNetLastTrade\",, \"T\")/100,\"\"))","v":8.3248730964467013E-3},{"$f":"IF(A364=\"\",\"\",RTD(\"cqg.rtd\", ,\"ContractData\", C364, \"T_CVol\",, \"T\"))","v":443979.86315400002},364,{"$f":"IFERROR(RANK($J364,INDIRECT((\"$J$\"&\"1\"&\":$J$\"&$A$449)))+COUNTIF($J$1:J364,J364)-1,\"\")","v":200},"S.US.SW","S.US.AJG"]
[{"$f":"IF(Symbols!A366=\"\",\"\",Symbols!A366)","v":"S.US.SWK"},{"$f":"IF(A365=\"\",\"\",IF(J366>0,1,0))","v":0},"S.US.SWK",{"$f":"IF(A365=\"\",\"\",RTD(\"cqg.rtd\", ,\"ContractData\",C365, \"LongDescription\",, \"T\"))","v":"Stanley Black and Decker Inc"},null,null,null,{"$f":"IF(A365=\"\",\"\",RTD(\"cqg.rtd\", ,\"ContractData\",C365, \"LastTradeToday\",, \"T\"))","v":103.32000000000001},{"$f":"IF(A365=\"\",\"\",RTD(\"cqg.rtd\", ,\"ContractData\",C365, \"NetLastTradeToday\",, \"T\"))","v":0.42},{"$f":"IF(A365=\"\",\"\",IFERROR(RTD(\"cqg.rtd\", ,\"ContractData\",C365, \"PerCentNetLastTrade\",, \"T\")/100,\"\"))","v":4.0816326530612249E-3},{"$f":"IF(A365=\"\",\"\",RTD(\"cqg.rtd\", ,\"ContractData\", C365, \"T_CVol\",, \"T\"))","v":123556.885438},365,{"$f":"IFERROR(RANK($J365,INDIRECT((\"$J$\"&\"1\"&\":$J$\"&$A$449)))+COUNTIF($J$1:J365,J365)-1,\"\")","v":279},"S.US.SWK","S.US.WFC"]
[{"$f":"IF(Symbols!A367=\"\",\"\",Symbols!A367)","v":"S.US.SWKS"},{"$f":"IF(A366=\"\",\"\",IF(J367>0,1,0))","v":1},"S.US.SWKS",{"$f":"IF(A366=\"\",\"\",RTD(\"cqg.rtd\", ,\"ContractData\",C366, \"LongDescription\",, \"T\"))","v":"SKYWORKS SOLUTIONS##"},null,null,null,{"$f":"IF(A366=\"\",\"\",RTD(\"cqg.rtd\", ,\"ContractData\",C366, \"LastTradeToday\",, \"T\"))","v":69.3},{"$f":"IF(A366=\"\",\"\",RTD(\"cqg.rtd\", ,\"ContractData\",C366, \"NetLastTradeToday\",, \"T\"))","v":-0.38},{"$f":"IF(A366=\"\",\"\",IFERROR(RTD(\"cqg.rtd\", ,\"ContractData\",C366, \"PerCentNetLastTrade\",, \"T\")/100,\"\"))","v":-5.4535017221584384E-3},{"$f":"IF(A366=\"\",\"\",RTD(\"cqg.rtd\", ,\"ContractData\", C366, \"T_CVol\",, \"T\"))","v":593070.12438099994},366,{"$f":"IFERROR(RANK($J366,INDIRECT((\"$J$\"&\"1\"&\":$J$\"&$A$449)))+COUNTIF($J$1:J366,J366)-1,\"\")","v":393},"S.US.SWKS","S.US.ON"]
[{"$f":"IF(Symbols!A368=\"\",\"\",Symbols!A368)","v":"S.US.SYF"},{"$f":"IF(A367=\"\",\"\",IF(J368>0,1,0))","v":0},"S.US.SYF",{"$f":"IF(A367=\"\",\"\",RTD(\"cqg.rtd\", ,\"ContractData\",C367, \"LongDescription\",, \"T\"))","v":"Synchrony Financial"},null,null,null,{"$f":"IF(A367=\"\",\"\",RTD(\"cqg.rtd\", ,\"ContractData\",C367, \"LastTradeToday\",, \"T\"))","v":79.95},{"$f":"IF(A367=\"\",\"\",RTD(\"cqg.rtd\", ,\"ContractData\",C367, \"NetLastTradeToday\",, \"T\"))","v":0.54},{"$f":"IF(A367=\"\",\"\",IFERROR(RTD(\"cqg.rtd\", ,\"ContractData\",C367, \"PerCentNetLastTrade\",, \"T\")/100,\"\"))","v":6.800151114469211E-3},{"$f":"IF(A367=\"\",\"\",RTD(\"cqg.rtd\", ,\"ContractData\", C367, \"T_CVol\",, \"T\"))","v":284672.09398200002},367,{"$f":"IFERROR(RANK($J367,INDIRECT((\"$J$\"&\"1\"&\":$J$\"&$A$449)))+COUNTIF($J$1:J367,J367)-1,\"\")","v":231},"S.US.SYF","S.US.HSIC"]
[{"$f":"IF(Symbols!A369=\"\",\"\",Symbols!A369)","v":"S.US.SYK"},{"$f":"IF(A368=\"\",\"\",IF(J369>0,1,0))","v":1},"S.US.SYK",{"$f":"IF(A368=\"\",\"\",RTD(\"cqg.rtd\", ,\"ContractData\",C368, \"LongDescription\",, \"T\"))","v":"Stryker Corp"},null,null,null,{"$f":"IF(A368=\"\",\"\",RTD(\"cqg.rtd\", ,\"ContractData\",C368, \"LastTradeToday\",, \"T\"))","v":346.16},{"$f":"IF(A368=\"\",\"\",RTD(\"cqg.rtd\", ,\"ContractData\",C368, \"NetLastTradeToday\",, \"T\"))","v":-1.05},{"$f":"IF(A368=\"\",\"\",IFERROR(RTD(\"cqg.rtd\", ,\"ContractData\",C368, \"PerCentNetLastTrade\",, \"T\")/100,\"\"))","v":-3.0241064485469885E-3},{"$f":"IF(A368=\"\",\"\",RTD(\"cqg.rtd\", ,\"ContractData\", C368, \"T_CVol\",, \"T\"))","v":237900.584129},368,{"$f":"IFERROR(RANK($J368,INDIRECT((\"$J$\"&\"1\"&\":$J$\"&$A$449)))+COUNTIF($J$1:J368,J368)-1,\"\")","v":370},"S.US.SYK","S.US.COR"]
[{"$f":"IF(Symbols!A370=\"\",\"\",Symbols!A370)","v":"S.US.SYY"},{"$f":"IF(A369=\"\",\"\",IF(J370>0,1,0))","v":1},"S.US.SYY",{"$f":"IF(A369=\"\",\"\",RTD(\"cqg.rtd\", ,\"ContractData\",C369, \"LongDescription\",, \"T\"))","v":"Sysco Corp"},null,null,null,{"$f":"IF(A369=\"\",\"\",RTD(\"cqg.rtd\", ,\"ContractData\",C369, \"LastTradeToday\",, \"T\"))","v":84.97},{"$f":"IF(A369=\"\",\"\",RTD(\"cqg.rtd\", ,\"ContractData\",C369, \"NetLastTradeToday\",, \"T\"))","v":0.28000000000000003},{"$f":"IF(A369=\"\",\"\",IFERROR(RTD(\"cqg.rtd\", ,\"ContractData\",C369, \"PerCentNetLastTrade\",, \"T\")/100,\"\"))","v":3.3061754634549534E-3},{"$f":"IF(A369=\"\",\"\",RTD(\"cqg.rtd\", ,\"ContractData\", C369, \"T_CVol\",, \"T\"))","v":215169.15461200001},369,{"$f":"IFERROR(RANK($J369,INDIRECT((\"$J$\"&\"1\"&\":$J$\"&$A$449)))+COUNTIF($J$1:J369,J369)-1,\"\")","v":294},"S.US.SYY","S.US.DE"]
[{"$f":"IF(Symbols!A371=\"\",\"\",Symbols!A371)","v":"S.US.T"},{"$f":"IF(A370=\"\",\"\",IF(J371>0,1,0))","v":1},"S.US.T",{"$f":"IF(A370=\"\",\"\",RTD(\"cqg.rtd\", ,\"ContractData\",C370, \"LongDescription\",, \"T\"))","v":"AT&T Inc"},null,null,null,{"$f":"IF(A370=\"\",\"\",RTD(\"cqg.rtd\", ,\"ContractData\",C370, \"LastTradeToday\",, \"T\"))","v":24.330000000000002},{"$f":"IF(A370=\"\",\"\",RTD(\"cqg.rtd\", ,\"ContractData\",C370, \"NetLastTradeToday\",, \"T\"))","v":0.08},{"$f":"IF(A370=\"\",\"\",IFERROR(RTD(\"cqg.rtd\", ,\"ContractData\",C370, \"PerCentNetLastTrade\",, \"T\")/100,\"\"))","v":3.2989690721649482E-3},{"$f":"IF(A370=\"\",\"\",RTD(\"cqg.rtd\", ,\"ContractData\", C370, \"T_CVol\",, \"T\"))","v":4591849.5619519996},370,{"$f":"IFERROR(RANK($J370,INDIRECT((\"$J$\"&\"1\"&\":$J$\"&$A$449)))+COUNTIF($J$1:J370,J370)-1,\"\")","v":296},"S.US.T","S.US.SYK"]
[{"$f":"IF(Symbols!A372=\"\",\"\",Symbols!A372)","v":"S.US.TAP"},{"$f":"IF(A371=\"\",\"\",IF(J372>0,1,0))","v":0},"S.US.TAP",{"$f":"IF(A371=\"\",\"\",RTD(\"cqg.rtd\", ,\"ContractData\",C371, \"LongDescription\",, \"T\"))","v":"Molson Coors Beverage Company"},null,null,null,{"$f":"IF(A371=\"\",\"\",RTD(\"cqg.rtd\", ,\"ContractData\",C371, \"LastTradeToday\",, \"T\"))","v":42.2},{"$f":"IF(A371=\"\",\"\",RTD(\"cqg.rtd\", ,\"ContractData\",C371, \"NetLastTradeToday\",, \"T\"))","v":0.63},{"$f":"IF(A371=\"\",\"\",IFERROR(RTD(\"cqg.rtd\", ,\"ContractData\",C371, \"PerCentNetLastTrade\",, \"T\")/100,\"\"))","v":1.5155159971133028E-2},{"$f":"IF(A371=\"\",\"\",RTD(\"cqg.rtd\", ,\"ContractData\", C371, \"T_CVol\",, \"T\"))","v":167111.14025999999},371,{"$f":"IFERROR(RANK($J371,INDIRECT((\"$J$\"&\"1\"&\":$J$\"&$A$449)))+COUNTIF($J$1:J371,J371)-1,\"\")","v":92},"S.US.TAP","S.US.FAST"]
[{"$f":"IF(Symbols!A373=\"\",\"\",Symbols!A373)","v":"S.US.TDY"},{"$f":"IF(A372=\"\",\"\",IF(J373>0,1,0))","v":0},"S.US.TDY",{"$f":"IF(A372=\"\",\"\",RTD(\"cqg.rtd\", ,\"ContractData\",C372, \"LongDescription\",, \"T\"))","v":"Teledyne Technologies Inc"},null,null,null,{"$f":"IF(A372=\"\",\"\",RTD(\"cqg.rtd\", ,\"ContractData\",C372, \"LastTradeToday\",, \"T\"))","v":679.33},{"$f":"IF(A372=\"\",\"\",RTD(\"cqg.rtd\", ,\"ContractData\",C372, \"NetLastTradeToday\",, \"T\"))","v":-7.16},{"$f":"IF(A372=\"\",\"\",IFERROR(RTD(\"cqg.rtd\", ,\"ContractData\",C372, \"PerCentNetLastTrade\",, \"T\")/100,\"\"))","v":-1.0429867878628967E-2},{"$f":"IF(A372=\"\",\"\",RTD(\"cqg.rtd\", ,\"ContractData\", C372, \"T_CVol\",, \"T\"))","v":22486.420588000001},372,{"$f":"IFERROR(RANK($J372,INDIRECT((\"$J$\"&\"1\"&\":$J$\"&$A$449)))+COUNTIF($J$1:J372,J372)-1,\"\")","v":419},"S.US.TDY","S.US.GD"]
[{"$f":"IF(Symbols!A374=\"\",\"\",Symbols!A374)","v":"S.US.TECH"},{"$f":"IF(A373=\"\",\"\",IF(J374>0,1,0))","v":1},"S.US.TECH",{"$f":"IF(A373=\"\",\"\",RTD(\"cqg.rtd\", ,\"ContractData\",C373, \"LongDescription\",, \"T\"))","v":"BIO-TECHNE CP CMN"},null,null,null,{"$f":"IF(A373=\"\",\"\",RTD(\"cqg.rtd\", ,\"ContractData\",C373, \"LastTradeToday\",, \"T\"))","v":72.19},{"$f":"IF(A373=\"\",\"\",RTD(\"cqg.rtd\", ,\"ContractData\",C373, \"NetLastTradeToday\",, \"T\"))","v":-0.04},{"$f":"IF(A373=\"\",\"\",IFERROR(RTD(\"cqg.rtd\", ,\"ContractData\",C373, \"PerCentNetLastTrade\",, \"T\")/100,\"\"))","v":-5.537865152983525E-4},{"$f":"IF(A373=\"\",\"\",RTD(\"cqg.rtd\", ,\"ContractData\", C373, \"T_CVol\",, \"T\"))","v":604985.82123400003},373,{"$f":"IFERROR(RANK($J373,INDIRECT((\"$J$\"&\"1\"&\":$J$\"&$A$449)))+COUNTIF($J$1:J373,J373)-1,\"\")","v":346},"S.US.TECH","S.US.JCI"]
[{"$f":"IF(Symbols!A375=\"\",\"\",Symbols!A375)","v":"S.US.TEL"},{"$f":"IF(A374=\"\",\"\",IF(J375>0,1,0))","v":1},"S.US.TEL",{"$f":"IF(A374=\"\",\"\",RTD(\"cqg.rtd\", ,\"ContractData\",C374, \"LongDescription\",, \"T\"))","v":"TE Connectivity Ltd."},null,null,null,{"$f":"IF(A374=\"\",\"\",RTD(\"cqg.rtd\", ,\"ContractData\",C374, \"LastTradeToday\",, \"T\"))","v":215.39000000000001},{"$f":"IF(A374=\"\",\"\",RTD(\"cqg.rtd\", ,\"ContractData\",C374, \"NetLastTradeToday\",, \"T\"))","v":1.19},{"$f":"IF(A374=\"\",\"\",IFERROR(RTD(\"cqg.rtd\", ,\"ContractData\",C374, \"PerCentNetLastTrade\",, \"T\")/100,\"\"))","v":5.5555555555555558E-3},{"$f":"IF(A374=\"\",\"\",RTD(\"cqg.rtd\", ,\"ContractData\", C374, \"T_CVol\",, \"T\"))","v":123138.854802},374,{"$f":"IFERROR(RANK($J374,INDIRECT((\"$J$\"&\"1\"&\":$J$\"&$A$449)))+COUNTIF($J$1:J374,J374)-1,\"\")","v":267},"S.US.TEL","S.US.CNC"]
[{"$f":"IF(Symbols!A376=\"\",\"\",Symbols!A376)","v":"S.US.TER"},{"$f":"IF(A375=\"\",\"\",IF(J376>0,1,0))","v":1},"S.US.TER",{"$f":"IF(A375=\"\",\"\",RTD(\"cqg.rtd\", ,\"ContractData\",C375, \"LongDescription\",, \"T\"))","v":"TERADYNE INC CMN"},null,null,null,{"$f":"IF(A375=\"\",\"\",RTD(\"cqg.rtd\", ,\"ContractData\",C375, \"LastTradeToday\",, \"T\"))","v":408.06},{"$f":"IF(A375=\"\",\"\",RTD(\"cqg.rtd\", ,\"ContractData\",C375, \"NetLastTradeToday\",, \"T\"))","v":5.32},{"$f":"IF(A375=\"\",\"\",IFERROR(RTD(\"cqg.rtd\", ,\"ContractData\",C375, \"PerCentNetLastTrade\",, \"T\")/100,\"\"))","v":1.3209514823459303E-2},{"$f":"IF(A375=\"\",\"\",RTD(\"cqg.rtd\", ,\"ContractData\", C375, \"T_CVol\",, \"T\"))","v":241877.035252},375,{"$f":"IFERROR(RANK($J375,INDIRECT((\"$J$\"&\"1\"&\":$J$\"&$A$449)))+COUNTIF($J$1:J375,J375)-1,\"\")","v":113},"S.US.TER","S.US.WMT"]
[{"$f":"IF(Symbols!A377=\"\",\"\",Symbols!A377)","v":"S.US.TFC"},{"$f":"IF(A376=\"\",\"\",IF(J377>0,1,0))","v":1},"S.US.TFC",{"$f":"IF(A376=\"\",\"\",RTD(\"cqg.rtd\", ,\"ContractData\",C376, \"LongDescription\",, \"T\"))","v":"Truist Financial Corporation"},null,null,null,{"$f":"IF(A376=\"\",\"\",RTD(\"cqg.rtd\", ,\"ContractData\",C376, \"LastTradeToday\",, \"T\"))","v":53.31},{"$f":"IF(A376=\"\",\"\",RTD(\"cqg.rtd\", ,\"ContractData\",C376, \"NetLastTradeToday\",, \"T\"))","v":0.64},{"$f":"IF(A376=\"\",\"\",IFERROR(RTD(\"cqg.rtd\", ,\"ContractData\",C376, \"PerCentNetLastTrade\",, \"T\")/100,\"\"))","v":1.2151129675337005E-2},{"$f":"IF(A376=\"\",\"\",RTD(\"cqg.rtd\", ,\"ContractData\", C376, \"T_CVol\",, \"T\"))","v":916196.13335599995},376,{"$f":"IFERROR(RANK($J376,INDIRECT((\"$J$\"&\"1\"&\":$J$\"&$A$449)))+COUNTIF($J$1:J376,J376)-1,\"\")","v":131},"S.US.TFC","S.US.CAH"]
[{"$f":"IF(Symbols!A378=\"\",\"\",Symbols!A378)","v":"S.US.TGT"},{"$f":"IF(A377=\"\",\"\",IF(J378>0,1,0))","v":1},"S.US.TGT",{"$f":"IF(A377=\"\",\"\",RTD(\"cqg.rtd\", ,\"ContractData\",C377, \"LongDescription\",, \"T\"))","v":"Target Corp"},null,null,null,{"$f":"IF(A377=\"\",\"\",RTD(\"cqg.rtd\", ,\"ContractData\",C377, \"LastTradeToday\",, \"T\"))","v":155.76},{"$f":"IF(A377=\"\",\"\",RTD(\"cqg.rtd\", ,\"ContractData\",C377, \"NetLastTradeToday\",, \"T\"))","v":1.76},{"$f":"IF(A377=\"\",\"\",IFERROR(RTD(\"cqg.rtd\", ,\"ContractData\",C377, \"PerCentNetLastTrade\",, \"T\")/100,\"\"))","v":1.1428571428571429E-2},{"$f":"IF(A377=\"\",\"\",RTD(\"cqg.rtd\", ,\"ContractData\", C377, \"T_CVol\",, \"T\"))","v":694093.46380799997},377,{"$f":"IFERROR(RANK($J377,INDIRECT((\"$J$\"&\"1\"&\":$J$\"&$A$449)))+COUNTIF($J$1:J377,J377)-1,\"\")","v":148},"S.US.TGT","S.US.HONA"]
[{"$f":"IF(Symbols!A379=\"\",\"\",Symbols!A379)","v":"S.US.TJX"},{"$f":"IF(A378=\"\",\"\",IF(J379>0,1,0))","v":0},"S.US.TJX",{"$f":"IF(A378=\"\",\"\",RTD(\"cqg.rtd\", ,\"ContractData\",C378, \"LongDescription\",, \"T\"))","v":"TJX Companies Inc"},null,null,null,{"$f":"IF(A378=\"\",\"\",RTD(\"cqg.rtd\", ,\"ContractData\",C378, \"LastTradeToday\",, \"T\"))","v":153.08000000000001},{"$f":"IF(A378=\"\",\"\",RTD(\"cqg.rtd\", ,\"ContractData\",C378, \"NetLastTradeToday\",, \"T\"))","v":0.47000000000000003},{"$f":"IF(A378=\"\",\"\",IFERROR(RTD(\"cqg.rtd\", ,\"ContractData\",C378, \"PerCentNetLastTrade\",, \"T\")/100,\"\"))","v":3.0797457571587706E-3},{"$f":"IF(A378=\"\",\"\",RTD(\"cqg.rtd\", ,\"ContractData\", C378, \"T_CVol\",, \"T\"))","v":671396.76870300004},378,{"$f":"IFERROR(RANK($J378,INDIRECT((\"$J$\"&\"1\"&\":$J$\"&$A$449)))+COUNTIF($J$1:J378,J378)-1,\"\")","v":300},"S.US.TJX","S.US.FERG"]
[{"$f":"IF(Symbols!A380=\"\",\"\",Symbols!A380)","v":"S.US.TMO"},{"$f":"IF(A379=\"\",\"\",IF(J380>0,1,0))","v":1},"S.US.TMO",{"$f":"IF(A379=\"\",\"\",RTD(\"cqg.rtd\", ,\"ContractData\",C379, \"LongDescription\",, \"T\"))","v":"Thermo Electron Corp"},null,null,null,{"$f":"IF(A379=\"\",\"\",RTD(\"cqg.rtd\", ,\"ContractData\",C379, \"LastTradeToday\",, \"T\"))","v":602.24},{"$f":"IF(A379=\"\",\"\",RTD(\"cqg.rtd\", ,\"ContractData\",C379, \"NetLastTradeToday\",, \"T\"))","v":-0.77},{"$f":"IF(A379=\"\",\"\",IFERROR(RTD(\"cqg.rtd\", ,\"ContractData\",C379, \"PerCentNetLastTrade\",, \"T\")/100,\"\"))","v":-1.2769274141390691E-3},{"$f":"IF(A379=\"\",\"\",RTD(\"cqg.rtd\", ,\"ContractData\", C379, \"T_CVol\",, \"T\"))","v":248334.247752},379,{"$f":"IFERROR(RANK($J379,INDIRECT((\"$J$\"&\"1\"&\":$J$\"&$A$449)))+COUNTIF($J$1:J379,J379)-1,\"\")","v":354},"S.US.TMO","S.US.UNH"]
[{"$f":"IF(Symbols!A381=\"\",\"\",Symbols!A381)","v":"S.US.TMUS"},{"$f":"IF(A380=\"\",\"\",IF(J381>0,1,0))","v":1},"S.US.TMUS",{"$f":"IF(A380=\"\",\"\",RTD(\"cqg.rtd\", ,\"ContractData\",C380, \"LongDescription\",, \"T\"))","v":"T-MOBILE US CMN"},null,null,null,{"$f":"IF(A380=\"\",\"\",RTD(\"cqg.rtd\", ,\"ContractData\",C380, \"LastTradeToday\",, \"T\"))","v":181.39000000000001},{"$f":"IF(A380=\"\",\"\",RTD(\"cqg.rtd\", ,\"ContractData\",C380, \"NetLastTradeToday\",, \"T\"))","v":4.26},{"$f":"IF(A380=\"\",\"\",IFERROR(RTD(\"cqg.rtd\", ,\"ContractData\",C380, \"PerCentNetLastTrade\",, \"T\")/100,\"\"))","v":2.4050132670919662E-2},{"$f":"IF(A380=\"\",\"\",RTD(\"cqg.rtd\", ,\"ContractData\", C380, \"T_CVol\",, \"T\"))","v":573419.32749399997},380,{"$f":"IFERROR(RANK($J380,INDIRECT((\"$J$\"&\"1\"&\":$J$\"&$A$449)))+COUNTIF($J$1:J380,J380)-1,\"\")","v":34},"S.US.TMUS","S.US.AME"]
[{"$f":"IF(Symbols!A382=\"\",\"\",Symbols!A382)","v":"S.US.TPL"},{"$f":"IF(A381=\"\",\"\",IF(J382>0,1,0))","v":0},"S.US.TPL",{"$f":"IF(A381=\"\",\"\",RTD(\"cqg.rtd\", ,\"ContractData\",C381, \"LongDescription\",, \"T\"))","v":"TEXAS PACIFIC LAND TR"},null,null,null,{"$f":"IF(A381=\"\",\"\",RTD(\"cqg.rtd\", ,\"ContractData\",C381, \"LastTradeToday\",, \"T\"))","v":343.21},{"$f":"IF(A381=\"\",\"\",RTD(\"cqg.rtd\", ,\"ContractData\",C381, \"NetLastTradeToday\",, \"T\"))","v":0.44},{"$f":"IF(A381=\"\",\"\",IFERROR(RTD(\"cqg.rtd\", ,\"ContractData\",C381, \"PerCentNetLastTrade\",, \"T\")/100,\"\"))","v":1.2836595968141904E-3},{"$f":"IF(A381=\"\",\"\",RTD(\"cqg.rtd\", ,\"ContractData\", C381, \"T_CVol\",, \"T\"))","v":54277.616634999998},381,{"$f":"IFERROR(RANK($J381,INDIRECT((\"$J$\"&\"1\"&\":$J$\"&$A$449)))+COUNTIF($J$1:J381,J381)-1,\"\")","v":318},"S.US.TPL","S.US.AVY"]
[{"$f":"IF(Symbols!A383=\"\",\"\",Symbols!A383)","v":"S.US.TRGP"},{"$f":"IF(A382=\"\",\"\",IF(J383>0,1,0))","v":0},"S.US.TRGP",{"$f":"IF(A382=\"\",\"\",RTD(\"cqg.rtd\", ,\"ContractData\",C382, \"LongDescription\",, \"T\"))","v":"Targa Resources Corp"},null,null,null,{"$f":"IF(A382=\"\",\"\",RTD(\"cqg.rtd\", ,\"ContractData\",C382, \"LastTradeToday\",, \"T\"))","v":268.34000000000003},{"$f":"IF(A382=\"\",\"\",RTD(\"cqg.rtd\", ,\"ContractData\",C382, \"NetLastTradeToday\",, \"T\"))","v":-0.33},{"$f":"IF(A382=\"\",\"\",IFERROR(RTD(\"cqg.rtd\", ,\"ContractData\",C382, \"PerCentNetLastTrade\",, \"T\")/100,\"\"))","v":-1.2282726020768973E-3},{"$f":"IF(A382=\"\",\"\",RTD(\"cqg.rtd\", ,\"ContractData\", C382, \"T_CVol\",, \"T\"))","v":93557.915431000001},382,{"$f":"IFERROR(RANK($J382,INDIRECT((\"$J$\"&\"1\"&\":$J$\"&$A$449)))+COUNTIF($J$1:J382,J382)-1,\"\")","v":352},"S.US.TRGP","S.US.ERIE"]
[{"$f":"IF(Symbols!A384=\"\",\"\",Symbols!A384)","v":"S.US.TRMB"},{"$f":"IF(A383=\"\",\"\",IF(J384>0,1,0))","v":1},"S.US.TRMB",{"$f":"IF(A383=\"\",\"\",RTD(\"cqg.rtd\", ,\"ContractData\",C383, \"LongDescription\",, \"T\"))","v":"Trimble Inc."},null,null,null,{"$f":"IF(A383=\"\",\"\",RTD(\"cqg.rtd\", ,\"ContractData\",C383, \"LastTradeToday\",, \"T\"))","v":55.85},{"$f":"IF(A383=\"\",\"\",RTD(\"cqg.rtd\", ,\"ContractData\",C383, \"NetLastTradeToday\",, \"T\"))","v":-0.5},{"$f":"IF(A383=\"\",\"\",IFERROR(RTD(\"cqg.rtd\", ,\"ContractData\",C383, \"PerCentNetLastTrade\",, \"T\")/100,\"\"))","v":-8.8731144631765749E-3},{"$f":"IF(A383=\"\",\"\",RTD(\"cqg.rtd\", ,\"ContractData\", C383, \"T_CVol\",, \"T\"))","v":524928.09993799997},383,{"$f":"IFERROR(RANK($J383,INDIRECT((\"$J$\"&\"1\"&\":$J$\"&$A$449)))+COUNTIF($J$1:J383,J383)-1,\"\")","v":412},"S.US.TRMB","S.US.WAB"]
[{"$f":"IF(Symbols!A385=\"\",\"\",Symbols!A385)","v":"S.US.TROW"},{"$f":"IF(A384=\"\",\"\",IF(J385>0,1,0))","v":1},"S.US.TROW",{"$f":"IF(A384=\"\",\"\",RTD(\"cqg.rtd\", ,\"ContractData\",C384, \"LongDescription\",, \"T\"))","v":"T ROWE PRICE GROUP"},null,null,null,{"$f":"IF(A384=\"\",\"\",RTD(\"cqg.rtd\", ,\"ContractData\",C384, \"LastTradeToday\",, \"T\"))","v":111.86},{"$f":"IF(A384=\"\",\"\",RTD(\"cqg.rtd\", ,\"ContractData\",C384, \"NetLastTradeToday\",, \"T\"))","v":0.44},{"$f":"IF(A384=\"\",\"\",IFERROR(RTD(\"cqg.rtd\", ,\"ContractData\",C384, \"PerCentNetLastTrade\",, \"T\")/100,\"\"))","v":3.9490217196194574E-3},{"$f":"IF(A384=\"\",\"\",RTD(\"cqg.rtd\", ,\"ContractData\", C384, \"T_CVol\",, \"T\"))","v":176421.08502100001},384,{"$f":"IFERROR(RANK($J384,INDIRECT((\"$J$\"&\"1\"&\":$J$\"&$A$449)))+COUNTIF($J$1:J384,J384)-1,\"\")","v":281},"S.US.TROW","S.US.DOV"]
[{"$f":"IF(Symbols!A386=\"\",\"\",Symbols!A386)","v":"S.US.TRV"},{"$f":"IF(A385=\"\",\"\",IF(J386>0,1,0))","v":1},"S.US.TRV",{"$f":"IF(A385=\"\",\"\",RTD(\"cqg.rtd\", ,\"ContractData\",C385, \"LongDescription\",, \"T\"))","v":"Travelers Companies, Inc"},null,null,null,{"$f":"IF(A385=\"\",\"\",RTD(\"cqg.rtd\", ,\"ContractData\",C385, \"LastTradeToday\",, \"T\"))","v":372},{"$f":"IF(A385=\"\",\"\",RTD(\"cqg.rtd\", ,\"ContractData\",C385, \"NetLastTradeToday\",, \"T\"))","v":1.84},{"$f":"IF(A385=\"\",\"\",IFERROR(RTD(\"cqg.rtd\", ,\"ContractData\",C385, \"PerCentNetLastTrade\",, \"T\")/100,\"\"))","v":4.9708234277069377E-3},{"$f":"IF(A385=\"\",\"\",RTD(\"cqg.rtd\", ,\"ContractData\", C385, \"T_CVol\",, \"T\"))","v":169474.00641},385,{"$f":"IFERROR(RANK($J385,INDIRECT((\"$J$\"&\"1\"&\":$J$\"&$A$449)))+COUNTIF($J$1:J385,J385)-1,\"\")","v":273},"S.US.TRV","S.US.UHS"]
[{"$f":"IF(Symbols!A387=\"\",\"\",Symbols!A387)","v":"S.US.TSCO"},{"$f":"IF(A386=\"\",\"\",IF(J387>0,1,0))","v":1},"S.US.TSCO",{"$f":"IF(A386=\"\",\"\",RTD(\"cqg.rtd\", ,\"ContractData\",C386, \"LongDescription\",, \"T\"))","v":"TRACTOR SUPPLY CO ##"},null,null,null,{"$f":"IF(A386=\"\",\"\",RTD(\"cqg.rtd\", ,\"ContractData\",C386, \"LastTradeToday\",, \"T\"))","v":36.64},{"$f":"IF(A386=\"\",\"\",RTD(\"cqg.rtd\", ,\"ContractData\",C386, \"NetLastTradeToday\",, \"T\"))","v":0.22},{"$f":"IF(A386=\"\",\"\",IFERROR(RTD(\"cqg.rtd\", ,\"ContractData\",C386, \"PerCentNetLastTrade\",, \"T\")/100,\"\"))","v":6.0389788635739775E-3},{"$f":"IF(A386=\"\",\"\",RTD(\"cqg.rtd\", ,\"ContractData\", C386, \"T_CVol\",, \"T\"))","v":2023872.869069},386,{"$f":"IFERROR(RANK($J386,INDIRECT((\"$J$\"&\"1\"&\":$J$\"&$A$449)))+COUNTIF($J$1:J386,J386)-1,\"\")","v":247},{"$f":"C386","v":"S.US.TSCO"},{"$f":"IFERROR(VLOOKUP($L386,$M$1:$N$437,2,FALSE),\"\")","v":"S.US.CMI"}]
[{"$f":"IF(Symbols!A388=\"\",\"\",Symbols!A388)","v":"S.US.TSLA"},{"$f":"IF(A387=\"\",\"\",IF(J388>0,1,0))","v":1},"S.US.TSLA",{"$f":"IF(A387=\"\",\"\",RTD(\"cqg.rtd\", ,\"ContractData\",C387, \"LongDescription\",, \"T\"))","v":"TESLA, INC."},null,null,null,{"$f":"IF(A387=\"\",\"\",RTD(\"cqg.rtd\", ,\"ContractData\",C387, \"LastTradeToday\",, \"T\"))","v":332.57},{"$f":"IF(A387=\"\",\"\",RTD(\"cqg.rtd\", ,\"ContractData\",C387, \"NetLastTradeToday\",, \"T\"))","v":5.03},{"$f":"IF(A387=\"\",\"\",IFERROR(RTD(\"cqg.rtd\", ,\"ContractData\",C387, \"PerCentNetLastTrade\",, \"T\")/100,\"\"))","v":1.5358309669933743E-2},{"$f":"IF(A387=\"\",\"\",RTD(\"cqg.rtd\", ,\"ContractData\", C387, \"T_CVol\",, \"T\"))","v":8005892.1113780001},{"$f":"L386+1","v":387},{"$f":"IFERROR(RANK($J387,INDIRECT((\"$J$\"&\"1\"&\":$J$\"&$A$449)))+COUNTIF($J$1:J387,J387)-1,\"\")","v":91},"S.US.TSLA","S.US.ETR"]
[{"$f":"IF(Symbols!A389=\"\",\"\",Symbols!A389)","v":"S.US.TSN"},{"$f":"IF(A388=\"\",\"\",IF(J389>0,1,0))","v":1},"S.US.TSN",{"$f":"IF(A388=\"\",\"\",RTD(\"cqg.rtd\", ,\"ContractData\",C388, \"LongDescription\",, \"T\"))","v":"Tyson Foods Inc ClsA"},null,null,null,{"$f":"IF(A388=\"\",\"\",RTD(\"cqg.rtd\", ,\"ContractData\",C388, \"LastTradeToday\",, \"T\"))","v":56.61},{"$f":"IF(A388=\"\",\"\",RTD(\"cqg.rtd\", ,\"ContractData\",C388, \"NetLastTradeToday\",, \"T\"))","v":0.8},{"$f":"IF(A388=\"\",\"\",IFERROR(RTD(\"cqg.rtd\", ,\"ContractData\",C388, \"PerCentNetLastTrade\",, \"T\")/100,\"\"))","v":1.4334348683031715E-2},{"$f":"IF(A388=\"\",\"\",RTD(\"cqg.rtd\", ,\"ContractData\", C388, \"T_CVol\",, \"T\"))","v":215268.595649},388,{"$f":"IFERROR(RANK($J388,INDIRECT((\"$J$\"&\"1\"&\":$J$\"&$A$449)))+COUNTIF($J$1:J388,J388)-1,\"\")","v":98},"S.US.TSN","S.US.MTD"]
[{"$f":"IF(Symbols!A390=\"\",\"\",Symbols!A390)","v":"S.US.TT"},{"$f":"IF(A389=\"\",\"\",IF(J390>0,1,0))","v":1},"S.US.TT",{"$f":"IF(A389=\"\",\"\",RTD(\"cqg.rtd\", ,\"ContractData\",C389, \"LongDescription\",, \"T\"))","v":"Trane Technologies plc"},null,null,null,{"$f":"IF(A389=\"\",\"\",RTD(\"cqg.rtd\", ,\"ContractData\",C389, \"LastTradeToday\",, \"T\"))","v":480.32},{"$f":"IF(A389=\"\",\"\",RTD(\"cqg.rtd\", ,\"ContractData\",C389, \"NetLastTradeToday\",, \"T\"))","v":1.77},{"$f":"IF(A389=\"\",\"\",IFERROR(RTD(\"cqg.rtd\", ,\"ContractData\",C389, \"PerCentNetLastTrade\",, \"T\")/100,\"\"))","v":3.6986730749138021E-3},{"$f":"IF(A389=\"\",\"\",RTD(\"cqg.rtd\", ,\"ContractData\", C389, \"T_CVol\",, \"T\"))","v":105118.475681},389,{"$f":"IFERROR(RANK($J389,INDIRECT((\"$J$\"&\"1\"&\":$J$\"&$A$449)))+COUNTIF($J$1:J389,J389)-1,\"\")","v":290},"S.US.TT","S.US.MSI"]
[{"$f":"IF(Symbols!A391=\"\",\"\",Symbols!A391)","v":"S.US.TTD"},{"$f":"IF(A390=\"\",\"\",IF(J391>0,1,0))","v":0},"S.US.TTD",{"$f":"IF(A390=\"\",\"\",RTD(\"cqg.rtd\", ,\"ContractData\",C390, \"LongDescription\",, \"T\"))","v":"THE TRADE DESK CL A"},null,null,null,{"$f":"IF(A390=\"\",\"\",RTD(\"cqg.rtd\", ,\"ContractData\",C390, \"LastTradeToday\",, \"T\"))","v":13.88},{"$f":"IF(A390=\"\",\"\",RTD(\"cqg.rtd\", ,\"ContractData\",C390, \"NetLastTradeToday\",, \"T\"))","v":0.39},{"$f":"IF(A390=\"\",\"\",IFERROR(RTD(\"cqg.rtd\", ,\"ContractData\",C390, \"PerCentNetLastTrade\",, \"T\")/100,\"\"))","v":2.8910303928836173E-2},{"$f":"IF(A390=\"\",\"\",RTD(\"cqg.rtd\", ,\"ContractData\", C390, \"T_CVol\",, \"T\"))","v":4880297.9741780004},390,{"$f":"IFERROR(RANK($J390,INDIRECT((\"$J$\"&\"1\"&\":$J$\"&$A$449)))+COUNTIF($J$1:J390,J390)-1,\"\")","v":21},"S.US.TTD","S.US.GLW"]
[{"$f":"IF(Symbols!A392=\"\",\"\",Symbols!A392)","v":"S.US.TTWO"},{"$f":"IF(A391=\"\",\"\",IF(J392>0,1,0))","v":1},"S.US.TTWO",{"$f":"IF(A391=\"\",\"\",RTD(\"cqg.rtd\", ,\"ContractData\",C391, \"LongDescription\",, \"T\"))","v":"TAKE-TWO INTERACTI##"},null,null,null,{"$f":"IF(A391=\"\",\"\",RTD(\"cqg.rtd\", ,\"ContractData\",C391, \"LastTradeToday\",, \"T\"))","v":241.28},{"$f":"IF(A391=\"\",\"\",RTD(\"cqg.rtd\", ,\"ContractData\",C391, \"NetLastTradeToday\",, \"T\"))","v":-1.72},{"$f":"IF(A391=\"\",\"\",IFERROR(RTD(\"cqg.rtd\", ,\"ContractData\",C391, \"PerCentNetLastTrade\",, \"T\")/100,\"\"))","v":-7.0781893004115224E-3},{"$f":"IF(A391=\"\",\"\",RTD(\"cqg.rtd\", ,\"ContractData\", C391, \"T_CVol\",, \"T\"))","v":172985.99240700001},391,{"$f":"IFERROR(RANK($J391,INDIRECT((\"$J$\"&\"1\"&\":$J$\"&$A$449)))+COUNTIF($J$1:J391,J391)-1,\"\")","v":403},"S.US.TTWO","S.US.MMM"]
[{"$f":"IF(Symbols!A393=\"\",\"\",Symbols!A393)","v":"S.US.TXN"},{"$f":"IF(A392=\"\",\"\",IF(J393>0,1,0))","v":0},"S.US.TXN",{"$f":"IF(A392=\"\",\"\",RTD(\"cqg.rtd\", ,\"ContractData\",C392, \"LongDescription\",, \"T\"))","v":"TEXAS INSTRUMENTS"},null,null,null,{"$f":"IF(A392=\"\",\"\",RTD(\"cqg.rtd\", ,\"ContractData\",C392, \"LastTradeToday\",, \"T\"))","v":277.10000000000002},{"$f":"IF(A392=\"\",\"\",RTD(\"cqg.rtd\", ,\"ContractData\",C392, \"NetLastTradeToday\",, \"T\"))","v":0.51},{"$f":"IF(A392=\"\",\"\",IFERROR(RTD(\"cqg.rtd\", ,\"ContractData\",C392, \"PerCentNetLastTrade\",, \"T\")/100,\"\"))","v":1.8438844499078057E-3},{"$f":"IF(A392=\"\",\"\",RTD(\"cqg.rtd\", ,\"ContractData\", C392, \"T_CVol\",, \"T\"))","v":687384.91063499998},392,{"$f":"IFERROR(RANK($J392,INDIRECT((\"$J$\"&\"1\"&\":$J$\"&$A$449)))+COUNTIF($J$1:J392,J392)-1,\"\")","v":315},"S.US.TXN","S.US.SNA"]
[{"$f":"IF(Symbols!A394=\"\",\"\",Symbols!A394)","v":"S.US.TXT"},{"$f":"IF(A393=\"\",\"\",IF(J394>0,1,0))","v":1},"S.US.TXT",{"$f":"IF(A393=\"\",\"\",RTD(\"cqg.rtd\", ,\"ContractData\",C393, \"LongDescription\",, \"T\"))","v":"Textron Inc"},null,null,null,{"$f":"IF(A393=\"\",\"\",RTD(\"cqg.rtd\", ,\"ContractData\",C393, \"LastTradeToday\",, \"T\"))","v":88.4},{"$f":"IF(A393=\"\",\"\",RTD(\"cqg.rtd\", ,\"ContractData\",C393, \"NetLastTradeToday\",, \"T\"))","v":-0.49},{"$f":"IF(A393=\"\",\"\",IFERROR(RTD(\"cqg.rtd\", ,\"ContractData\",C393, \"PerCentNetLastTrade\",, \"T\")/100,\"\"))","v":-5.5124310946113178E-3},{"$f":"IF(A393=\"\",\"\",RTD(\"cqg.rtd\", ,\"ContractData\", C393, \"T_CVol\",, \"T\"))","v":55332.167736000003},393,{"$f":"IFERROR(RANK($J393,INDIRECT((\"$J$\"&\"1\"&\":$J$\"&$A$449)))+COUNTIF($J$1:J393,J393)-1,\"\")","v":395},"S.US.TXT","S.US.SWKS"]
[{"$f":"IF(Symbols!A395=\"\",\"\",Symbols!A395)","v":"S.US.TYL"},{"$f":"IF(A394=\"\",\"\",IF(J395>0,1,0))","v":1},"S.US.TYL",{"$f":"IF(A394=\"\",\"\",RTD(\"cqg.rtd\", ,\"ContractData\",C394, \"LongDescription\",, \"T\"))","v":"TYLER TECHNOLOGIES INC"},null,null,null,{"$f":"IF(A394=\"\",\"\",RTD(\"cqg.rtd\", ,\"ContractData\",C394, \"LastTradeToday\",, \"T\"))","v":318.13},{"$f":"IF(A394=\"\",\"\",RTD(\"cqg.rtd\", ,\"ContractData\",C394, \"NetLastTradeToday\",, \"T\"))","v":0.49},{"$f":"IF(A394=\"\",\"\",IFERROR(RTD(\"cqg.rtd\", ,\"ContractData\",C394, \"PerCentNetLastTrade\",, \"T\")/100,\"\"))","v":1.5426268731897747E-3},{"$f":"IF(A394=\"\",\"\",RTD(\"cqg.rtd\", ,\"ContractData\", C394, \"T_CVol\",, \"T\"))","v":174972.067947},394,{"$f":"IFERROR(RANK($J394,INDIRECT((\"$J$\"&\"1\"&\":$J$\"&$A$449)))+COUNTIF($J$1:J394,J394)-1,\"\")","v":317},"S.US.TYL","S.US.LMT"]
[{"$f":"IF(Symbols!A396=\"\",\"\",Symbols!A396)","v":"S.US.UAL"},{"$f":"IF(A395=\"\",\"\",IF(J396>0,1,0))","v":1},"S.US.UAL",{"$f":"IF(A395=\"\",\"\",RTD(\"cqg.rtd\", ,\"ContractData\",C395, \"LongDescription\",, \"T\"))","v":"UNITED AIRLNS HLD CM"},null,null,null,{"$f":"IF(A395=\"\",\"\",RTD(\"cqg.rtd\", ,\"ContractData\",C395, \"LastTradeToday\",, \"T\"))","v":127.69},{"$f":"IF(A395=\"\",\"\",RTD(\"cqg.rtd\", ,\"ContractData\",C395, \"NetLastTradeToday\",, \"T\"))","v":2.57},{"$f":"IF(A395=\"\",\"\",IFERROR(RTD(\"cqg.rtd\", ,\"ContractData\",C395, \"PerCentNetLastTrade\",, \"T\")/100,\"\"))","v":2.0540281329923277E-2},{"$f":"IF(A395=\"\",\"\",RTD(\"cqg.rtd\", ,\"ContractData\", C395, \"T_CVol\",, \"T\"))","v":462847.595225},395,{"$f":"IFERROR(RANK($J395,INDIRECT((\"$J$\"&\"1\"&\":$J$\"&$A$449)))+COUNTIF($J$1:J395,J395)-1,\"\")","v":56},"S.US.UAL","S.US.TXT"]
[{"$f":"IF(Symbols!A397=\"\",\"\",Symbols!A397)","v":"S.US.UDR"},{"$f":"IF(A396=\"\",\"\",IF(J397>0,1,0))","v":0},"S.US.UDR",{"$f":"IF(A396=\"\",\"\",RTD(\"cqg.rtd\", ,\"ContractData\",C396, \"LongDescription\",, \"T\"))","v":"United Dominion Realty Trust"},null,null,null,{"$f":"IF(A396=\"\",\"\",RTD(\"cqg.rtd\", ,\"ContractData\",C396, \"LastTradeToday\",, \"T\"))","v":38.03},{"$f":"IF(A396=\"\",\"\",RTD(\"cqg.rtd\", ,\"ContractData\",C396, \"NetLastTradeToday\",, \"T\"))","v":0.8},{"$f":"IF(A396=\"\",\"\",IFERROR(RTD(\"cqg.rtd\", ,\"ContractData\",C396, \"PerCentNetLastTrade\",, \"T\")/100,\"\"))","v":2.1488047273704E-2},{"$f":"IF(A396=\"\",\"\",RTD(\"cqg.rtd\", ,\"ContractData\", C396, \"T_CVol\",, \"T\"))","v":288173.77793500002},396,{"$f":"IFERROR(RANK($J396,INDIRECT((\"$J$\"&\"1\"&\":$J$\"&$A$449)))+COUNTIF($J$1:J396,J396)-1,\"\")","v":48},"S.US.UDR","S.US.J"]
[{"$f":"IF(Symbols!A398=\"\",\"\",Symbols!A398)","v":"S.US.UHS"},{"$f":"IF(A397=\"\",\"\",IF(J398>0,1,0))","v":0},"S.US.UHS",{"$f":"IF(A397=\"\",\"\",RTD(\"cqg.rtd\", ,\"ContractData\",C397, \"LongDescription\",, \"T\"))","v":"Universal Health Svcs ClsB"},null,null,null,{"$f":"IF(A397=\"\",\"\",RTD(\"cqg.rtd\", ,\"ContractData\",C397, \"LastTradeToday\",, \"T\"))","v":171.68},{"$f":"IF(A397=\"\",\"\",RTD(\"cqg.rtd\", ,\"ContractData\",C397, \"NetLastTradeToday\",, \"T\"))","v":-0.77},{"$f":"IF(A397=\"\",\"\",IFERROR(RTD(\"cqg.rtd\", ,\"ContractData\",C397, \"PerCentNetLastTrade\",, \"T\")/100,\"\"))","v":-4.4650623369092493E-3},{"$f":"IF(A397=\"\",\"\",RTD(\"cqg.rtd\", ,\"ContractData\", C397, \"T_CVol\",, \"T\"))","v":43895.238092},397,{"$f":"IFERROR(RANK($J397,INDIRECT((\"$J$\"&\"1\"&\":$J$\"&$A$449)))+COUNTIF($J$1:J397,J397)-1,\"\")","v":385},"S.US.UHS","S.US.ITW"]
[{"$f":"IF(Symbols!A399=\"\",\"\",Symbols!A399)","v":"S.US.UNH"},{"$f":"IF(A398=\"\",\"\",IF(J399>0,1,0))","v":1},"S.US.UNH",{"$f":"IF(A398=\"\",\"\",RTD(\"cqg.rtd\", ,\"ContractData\",C398, \"LongDescription\",, \"T\"))","v":"United Health Group Inc"},null,null,null,{"$f":"IF(A398=\"\",\"\",RTD(\"cqg.rtd\", ,\"ContractData\",C398, \"LastTradeToday\",, \"T\"))","v":404.13},{"$f":"IF(A398=\"\",\"\",RTD(\"cqg.rtd\", ,\"ContractData\",C398, \"NetLastTradeToday\",, \"T\"))","v":-1.46},{"$f":"IF(A398=\"\",\"\",IFERROR(RTD(\"cqg.rtd\", ,\"ContractData\",C398, \"PerCentNetLastTrade\",, \"T\")/100,\"\"))","v":-3.5996942725412362E-3},{"$f":"IF(A398=\"\",\"\",RTD(\"cqg.rtd\", ,\"ContractData\", C398, \"T_CVol\",, \"T\"))","v":507625.08847299998},398,{"$f":"IFERROR(RANK($J398,INDIRECT((\"$J$\"&\"1\"&\":$J$\"&$A$449)))+COUNTIF($J$1:J398,J398)-1,\"\")","v":379},"S.US.UNH","S.US.PCAR"]
[{"$f":"IF(Symbols!A400=\"\",\"\",Symbols!A400)","v":"S.US.UNP"},{"$f":"IF(A399=\"\",\"\",IF(J400>0,1,0))","v":1},"S.US.UNP",{"$f":"IF(A399=\"\",\"\",RTD(\"cqg.rtd\", ,\"ContractData\",C399, \"LongDescription\",, \"T\"))","v":"Union Pacific Corp"},null,null,null,{"$f":"IF(A399=\"\",\"\",RTD(\"cqg.rtd\", ,\"ContractData\",C399, \"LastTradeToday\",, \"T\"))","v":297.53000000000003},{"$f":"IF(A399=\"\",\"\",RTD(\"cqg.rtd\", ,\"ContractData\",C399, \"NetLastTradeToday\",, \"T\"))","v":3.8000000000000003},{"$f":"IF(A399=\"\",\"\",IFERROR(RTD(\"cqg.rtd\", ,\"ContractData\",C399, \"PerCentNetLastTrade\",, \"T\")/100,\"\"))","v":1.2937051033261839E-2},{"$f":"IF(A399=\"\",\"\",RTD(\"cqg.rtd\", ,\"ContractData\", C399, \"T_CVol\",, \"T\"))","v":143490.927283},399,{"$f":"IFERROR(RANK($J399,INDIRECT((\"$J$\"&\"1\"&\":$J$\"&$A$449)))+COUNTIF($J$1:J399,J399)-1,\"\")","v":117},"S.US.UNP","S.US.DOW"]
[{"$f":"IF(Symbols!A401=\"\",\"\",Symbols!A401)","v":"S.US.UPS"},{"$f":"IF(A400=\"\",\"\",IF(J401>0,1,0))","v":0},"S.US.UPS",{"$f":"IF(A400=\"\",\"\",RTD(\"cqg.rtd\", ,\"ContractData\",C400, \"LongDescription\",, \"T\"))","v":"United Parcel Svc"},null,null,null,{"$f":"IF(A400=\"\",\"\",RTD(\"cqg.rtd\", ,\"ContractData\",C400, \"LastTradeToday\",, \"T\"))","v":104.99000000000001},{"$f":"IF(A400=\"\",\"\",RTD(\"cqg.rtd\", ,\"ContractData\",C400, \"NetLastTradeToday\",, \"T\"))","v":1.08},{"$f":"IF(A400=\"\",\"\",IFERROR(RTD(\"cqg.rtd\", ,\"ContractData\",C400, \"PerCentNetLastTrade\",, \"T\")/100,\"\"))","v":1.0393609854681936E-2},{"$f":"IF(A400=\"\",\"\",RTD(\"cqg.rtd\", ,\"ContractData\", C400, \"T_CVol\",, \"T\"))","v":471501.95063699997},400,{"$f":"IFERROR(RANK($J400,INDIRECT((\"$J$\"&\"1\"&\":$J$\"&$A$449)))+COUNTIF($J$1:J400,J400)-1,\"\")","v":159},"S.US.UPS","S.US.ROK"]
[{"$f":"IF(Symbols!A402=\"\",\"\",Symbols!A402)","v":"S.US.URI"},{"$f":"IF(A401=\"\",\"\",IF(J402>0,1,0))","v":1},"S.US.URI",{"$f":"IF(A401=\"\",\"\",RTD(\"cqg.rtd\", ,\"ContractData\",C401, \"LongDescription\",, \"T\"))","v":"United Rentals Inc"},null,null,null,{"$f":"IF(A401=\"\",\"\",RTD(\"cqg.rtd\", ,\"ContractData\",C401, \"LastTradeToday\",, \"T\"))","v":1117.26},{"$f":"IF(A401=\"\",\"\",RTD(\"cqg.rtd\", ,\"ContractData\",C401, \"NetLastTradeToday\",, \"T\"))","v":-12.040000000000001},{"$f":"IF(A401=\"\",\"\",IFERROR(RTD(\"cqg.rtd\", ,\"ContractData\",C401, \"PerCentNetLastTrade\",, \"T\")/100,\"\"))","v":-1.0661471708137783E-2},{"$f":"IF(A401=\"\",\"\",RTD(\"cqg.rtd\", ,\"ContractData\", C401, \"T_CVol\",, \"T\"))","v":64271.865723000003},401,{"$f":"IFERROR(RANK($J401,INDIRECT((\"$J$\"&\"1\"&\":$J$\"&$A$449)))+COUNTIF($J$1:J401,J401)-1,\"\")","v":421},"S.US.URI","S.US.MOS"]
[{"$f":"IF(Symbols!A403=\"\",\"\",Symbols!A403)","v":"S.US.USB"},{"$f":"IF(A402=\"\",\"\",IF(J403>0,1,0))","v":1},"S.US.USB",{"$f":"IF(A402=\"\",\"\",RTD(\"cqg.rtd\", ,\"ContractData\",C402, \"LongDescription\",, \"T\"))","v":"U S Bancorp"},null,null,null,{"$f":"IF(A402=\"\",\"\",RTD(\"cqg.rtd\", ,\"ContractData\",C402, \"LastTradeToday\",, \"T\"))","v":65.56},{"$f":"IF(A402=\"\",\"\",RTD(\"cqg.rtd\", ,\"ContractData\",C402, \"NetLastTradeToday\",, \"T\"))","v":0.54},{"$f":"IF(A402=\"\",\"\",IFERROR(RTD(\"cqg.rtd\", ,\"ContractData\",C402, \"PerCentNetLastTrade\",, \"T\")/100,\"\"))","v":8.3051368809597056E-3},{"$f":"IF(A402=\"\",\"\",RTD(\"cqg.rtd\", ,\"ContractData\", C402, \"T_CVol\",, \"T\"))","v":682054.533543},402,{"$f":"IFERROR(RANK($J402,INDIRECT((\"$J$\"&\"1\"&\":$J$\"&$A$449)))+COUNTIF($J$1:J402,J402)-1,\"\")","v":201},"S.US.USB","S.US.XOM"]
[{"$f":"IF(Symbols!A404=\"\",\"\",Symbols!A404)","v":"S.US.V"},{"$f":"IF(A403=\"\",\"\",IF(J404>0,1,0))","v":1},"S.US.V",{"$f":"IF(A403=\"\",\"\",RTD(\"cqg.rtd\", ,\"ContractData\",C403, \"LongDescription\",, \"T\"))","v":"Visa Inc."},null,null,null,{"$f":"IF(A403=\"\",\"\",RTD(\"cqg.rtd\", ,\"ContractData\",C403, \"LastTradeToday\",, \"T\"))","v":361.68},{"$f":"IF(A403=\"\",\"\",RTD(\"cqg.rtd\", ,\"ContractData\",C403, \"NetLastTradeToday\",, \"T\"))","v":2.2600000000000002},{"$f":"IF(A403=\"\",\"\",IFERROR(RTD(\"cqg.rtd\", ,\"ContractData\",C403, \"PerCentNetLastTrade\",, \"T\")/100,\"\"))","v":6.2879082967002399E-3},{"$f":"IF(A403=\"\",\"\",RTD(\"cqg.rtd\", ,\"ContractData\", C403, \"T_CVol\",, \"T\"))","v":560444.19155999995},403,{"$f":"IFERROR(RANK($J403,INDIRECT((\"$J$\"&\"1\"&\":$J$\"&$A$449)))+COUNTIF($J$1:J403,J403)-1,\"\")","v":243},"S.US.V","S.US.TTWO"]
[{"$f":"IF(Symbols!A405=\"\",\"\",Symbols!A405)","v":"S.US.VEEV"},{"$f":"IF(A404=\"\",\"\",IF(J405>0,1,0))","v":1},"S.US.VEEV",{"$f":"IF(A404=\"\",\"\",RTD(\"cqg.rtd\", ,\"ContractData\",C404, \"LongDescription\",, \"T\"))","v":"VEEVA Systems, Inc."},null,null,null,{"$f":"IF(A404=\"\",\"\",RTD(\"cqg.rtd\", ,\"ContractData\",C404, \"LastTradeToday\",, \"T\"))","v":244.29},{"$f":"IF(A404=\"\",\"\",RTD(\"cqg.rtd\", ,\"ContractData\",C404, \"NetLastTradeToday\",, \"T\"))","v":2.7800000000000002},{"$f":"IF(A404=\"\",\"\",IFERROR(RTD(\"cqg.rtd\", ,\"ContractData\",C404, \"PerCentNetLastTrade\",, \"T\")/100,\"\"))","v":1.1510910521303465E-2},{"$f":"IF(A404=\"\",\"\",RTD(\"cqg.rtd\", ,\"ContractData\", C404, \"T_CVol\",, \"T\"))","v":404591.76505599997},404,{"$f":"IFERROR(RANK($J404,INDIRECT((\"$J$\"&\"1\"&\":$J$\"&$A$449)))+COUNTIF($J$1:J404,J404)-1,\"\")","v":145},"S.US.VEEV","S.US.GE"]
[{"$f":"IF(Symbols!A406=\"\",\"\",Symbols!A406)","v":"S.US.VICI"},{"$f":"IF(A405=\"\",\"\",IF(J406>0,1,0))","v":1},"S.US.VICI",{"$f":"IF(A405=\"\",\"\",RTD(\"cqg.rtd\", ,\"ContractData\",C405, \"LongDescription\",, \"T\"))","v":"VICI Properties Inc."},null,null,null,{"$f":"IF(A405=\"\",\"\",RTD(\"cqg.rtd\", ,\"ContractData\",C405, \"LastTradeToday\",, \"T\"))","v":26.39},{"$f":"IF(A405=\"\",\"\",RTD(\"cqg.rtd\", ,\"ContractData\",C405, \"NetLastTradeToday\",, \"T\"))","v":0.32},{"$f":"IF(A405=\"\",\"\",IFERROR(RTD(\"cqg.rtd\", ,\"ContractData\",C405, \"PerCentNetLastTrade\",, \"T\")/100,\"\"))","v":1.2274645186037592E-2},{"$f":"IF(A405=\"\",\"\",RTD(\"cqg.rtd\", ,\"ContractData\", C405, \"T_CVol\",, \"T\"))","v":782310.86441000004},405,{"$f":"IFERROR(RANK($J405,INDIRECT((\"$J$\"&\"1\"&\":$J$\"&$A$449)))+COUNTIF($J$1:J405,J405)-1,\"\")","v":130},"S.US.VICI","S.US.OTIS"]
[{"$f":"IF(Symbols!A407=\"\",\"\",Symbols!A407)","v":"S.US.VLO"},{"$f":"IF(A406=\"\",\"\",IF(J407>0,1,0))","v":1},"S.US.VLO",{"$f":"IF(A406=\"\",\"\",RTD(\"cqg.rtd\", ,\"ContractData\",C406, \"LongDescription\",, \"T\"))","v":"Valero Energy Corp New"},null,null,null,{"$f":"IF(A406=\"\",\"\",RTD(\"cqg.rtd\", ,\"ContractData\",C406, \"LastTradeToday\",, \"T\"))","v":330.85},{"$f":"IF(A406=\"\",\"\",RTD(\"cqg.rtd\", ,\"ContractData\",C406, \"NetLastTradeToday\",, \"T\"))","v":0.64},{"$f":"IF(A406=\"\",\"\",IFERROR(RTD(\"cqg.rtd\", ,\"ContractData\",C406, \"PerCentNetLastTrade\",, \"T\")/100,\"\"))","v":1.9381605644892643E-3},{"$f":"IF(A406=\"\",\"\",RTD(\"cqg.rtd\", ,\"ContractData\", C406, \"T_CVol\",, \"T\"))","v":269783.69621000002},406,{"$f":"IFERROR(RANK($J406,INDIRECT((\"$J$\"&\"1\"&\":$J$\"&$A$449)))+COUNTIF($J$1:J406,J406)-1,\"\")","v":313},"S.US.VLO","S.US.ALLE"]
[{"$f":"IF(Symbols!A408=\"\",\"\",Symbols!A408)","v":"S.US.VLTO"},{"$f":"IF(A407=\"\",\"\",IF(J408>0,1,0))","v":1},"S.US.VLTO",{"$f":"IF(A407=\"\",\"\",RTD(\"cqg.rtd\", ,\"ContractData\",C407, \"LongDescription\",, \"T\"))","v":"Veralto Corporation"},null,null,null,{"$f":"IF(A407=\"\",\"\",RTD(\"cqg.rtd\", ,\"ContractData\",C407, \"LastTradeToday\",, \"T\"))","v":96.89},{"$f":"IF(A407=\"\",\"\",RTD(\"cqg.rtd\", ,\"ContractData\",C407, \"NetLastTradeToday\",, \"T\"))","v":0.22},{"$f":"IF(A407=\"\",\"\",IFERROR(RTD(\"cqg.rtd\", ,\"ContractData\",C407, \"PerCentNetLastTrade\",, \"T\")/100,\"\"))","v":2.2757835936691841E-3},{"$f":"IF(A407=\"\",\"\",RTD(\"cqg.rtd\", ,\"ContractData\", C407, \"T_CVol\",, \"T\"))","v":89759.131064999994},407,{"$f":"IFERROR(RANK($J407,INDIRECT((\"$J$\"&\"1\"&\":$J$\"&$A$449)))+COUNTIF($J$1:J407,J407)-1,\"\")","v":310},"S.US.VLTO","S.US.ROST"]
[{"$f":"IF(Symbols!A409=\"\",\"\",Symbols!A409)","v":"S.US.VMC"},{"$f":"IF(A408=\"\",\"\",IF(J409>0,1,0))","v":1},"S.US.VMC",{"$f":"IF(A408=\"\",\"\",RTD(\"cqg.rtd\", ,\"ContractData\",C408, \"LongDescription\",, \"T\"))","v":"Vulcan Material Co"},null,null,null,{"$f":"IF(A408=\"\",\"\",RTD(\"cqg.rtd\", ,\"ContractData\",C408, \"LastTradeToday\",, \"T\"))","v":280.54000000000002},{"$f":"IF(A408=\"\",\"\",RTD(\"cqg.rtd\", ,\"ContractData\",C408, \"NetLastTradeToday\",, \"T\"))","v":0.16},{"$f":"IF(A408=\"\",\"\",IFERROR(RTD(\"cqg.rtd\", ,\"ContractData\",C408, \"PerCentNetLastTrade\",, \"T\")/100,\"\"))","v":5.7065411227619656E-4},{"$f":"IF(A408=\"\",\"\",RTD(\"cqg.rtd\", ,\"ContractData\", C408, \"T_CVol\",, \"T\"))","v":59124.889324999996},408,{"$f":"IFERROR(RANK($J408,INDIRECT((\"$J$\"&\"1\"&\":$J$\"&$A$449)))+COUNTIF($J$1:J408,J408)-1,\"\")","v":332},"S.US.VMC","S.US.HUBB"]
[{"$f":"IF(Symbols!A410=\"\",\"\",Symbols!A410)","v":"S.US.VRSK"},{"$f":"IF(A409=\"\",\"\",IF(J410>0,1,0))","v":1},"S.US.VRSK",{"$f":"IF(A409=\"\",\"\",RTD(\"cqg.rtd\", ,\"ContractData\",C409, \"LongDescription\",, \"T\"))","v":"VERISK ANALYTICS INC"},null,null,null,{"$f":"IF(A409=\"\",\"\",RTD(\"cqg.rtd\", ,\"ContractData\",C409, \"LastTradeToday\",, \"T\"))","v":182.26},{"$f":"IF(A409=\"\",\"\",RTD(\"cqg.rtd\", ,\"ContractData\",C409, \"NetLastTradeToday\",, \"T\"))","v":1.8800000000000001},{"$f":"IF(A409=\"\",\"\",IFERROR(RTD(\"cqg.rtd\", ,\"ContractData\",C409, \"PerCentNetLastTrade\",, \"T\")/100,\"\"))","v":1.042244151236279E-2},{"$f":"IF(A409=\"\",\"\",RTD(\"cqg.rtd\", ,\"ContractData\", C409, \"T_CVol\",, \"T\"))","v":157997.285982},409,{"$f":"IFERROR(RANK($J409,INDIRECT((\"$J$\"&\"1\"&\":$J$\"&$A$449)))+COUNTIF($J$1:J409,J409)-1,\"\")","v":158},"S.US.VRSK","S.US.IT"]
[{"$f":"IF(Symbols!A411=\"\",\"\",Symbols!A411)","v":"S.US.VRTX"},{"$f":"IF(A410=\"\",\"\",IF(J411>0,1,0))","v":1},"S.US.VRTX",{"$f":"IF(A410=\"\",\"\",RTD(\"cqg.rtd\", ,\"ContractData\",C410, \"LongDescription\",, \"T\"))","v":"VERTEX PHARMACEUTIC"},null,null,null,{"$f":"IF(A410=\"\",\"\",RTD(\"cqg.rtd\", ,\"ContractData\",C410, \"LastTradeToday\",, \"T\"))","v":526.16},{"$f":"IF(A410=\"\",\"\",RTD(\"cqg.rtd\", ,\"ContractData\",C410, \"NetLastTradeToday\",, \"T\"))","v":0.43},{"$f":"IF(A410=\"\",\"\",IFERROR(RTD(\"cqg.rtd\", ,\"ContractData\",C410, \"PerCentNetLastTrade\",, \"T\")/100,\"\"))","v":8.1791033420196681E-4},{"$f":"IF(A410=\"\",\"\",RTD(\"cqg.rtd\", ,\"ContractData\", C410, \"T_CVol\",, \"T\"))","v":83286.097123},410,{"$f":"IFERROR(RANK($J410,INDIRECT((\"$J$\"&\"1\"&\":$J$\"&$A$449)))+COUNTIF($J$1:J410,J410)-1,\"\")","v":326},"S.US.VRTX","S.US.IR"]
[{"$f":"IF(Symbols!A412=\"\",\"\",Symbols!A412)","v":"S.US.VTR"},{"$f":"IF(A411=\"\",\"\",IF(J412>0,1,0))","v":1},"S.US.VTR",{"$f":"IF(A411=\"\",\"\",RTD(\"cqg.rtd\", ,\"ContractData\",C411, \"LongDescription\",, \"T\"))","v":"Ventas Inc"},null,null,null,{"$f":"IF(A411=\"\",\"\",RTD(\"cqg.rtd\", ,\"ContractData\",C411, \"LastTradeToday\",, \"T\"))","v":90.460000000000008},{"$f":"IF(A411=\"\",\"\",RTD(\"cqg.rtd\", ,\"ContractData\",C411, \"NetLastTradeToday\",, \"T\"))","v":1.45},{"$f":"IF(A411=\"\",\"\",IFERROR(RTD(\"cqg.rtd\", ,\"ContractData\",C411, \"PerCentNetLastTrade\",, \"T\")/100,\"\"))","v":1.6290304460173016E-2},{"$f":"IF(A411=\"\",\"\",RTD(\"cqg.rtd\", ,\"ContractData\", C411, \"T_CVol\",, \"T\"))","v":220473.706163},411,{"$f":"IFERROR(RANK($J411,INDIRECT((\"$J$\"&\"1\"&\":$J$\"&$A$449)))+COUNTIF($J$1:J411,J411)-1,\"\")","v":83},"S.US.VTR","S.US.HUM"]
[{"$f":"IF(Symbols!A413=\"\",\"\",Symbols!A413)","v":"S.US.VTRS"},{"$f":"IF(A412=\"\",\"\",IF(J413>0,1,0))","v":1},"S.US.VTRS",{"$f":"IF(A412=\"\",\"\",RTD(\"cqg.rtd\", ,\"ContractData\",C412, \"LongDescription\",, \"T\"))","v":"VIATRIS INC. CMN STK"},null,null,null,{"$f":"IF(A412=\"\",\"\",RTD(\"cqg.rtd\", ,\"ContractData\",C412, \"LastTradeToday\",, \"T\"))","v":16.309999999999999},{"$f":"IF(A412=\"\",\"\",RTD(\"cqg.rtd\", ,\"ContractData\",C412, \"NetLastTradeToday\",, \"T\"))","v":0.21},{"$f":"IF(A412=\"\",\"\",IFERROR(RTD(\"cqg.rtd\", ,\"ContractData\",C412, \"PerCentNetLastTrade\",, \"T\")/100,\"\"))","v":1.3043478260869566E-2},{"$f":"IF(A412=\"\",\"\",RTD(\"cqg.rtd\", ,\"ContractData\", C412, \"T_CVol\",, \"T\"))","v":1601256.100418},412,{"$f":"IFERROR(RANK($J412,INDIRECT((\"$J$\"&\"1\"&\":$J$\"&$A$449)))+COUNTIF($J$1:J412,J412)-1,\"\")","v":115},"S.US.VTRS","S.US.TRMB"]
[{"$f":"IF(Symbols!A414=\"\",\"\",Symbols!A414)","v":"S.US.VZ"},{"$f":"IF(A413=\"\",\"\",IF(J414>0,1,0))","v":0},"S.US.VZ",{"$f":"IF(A413=\"\",\"\",RTD(\"cqg.rtd\", ,\"ContractData\",C413, \"LongDescription\",, \"T\"))","v":"Verizon Communications"},null,null,null,{"$f":"IF(A413=\"\",\"\",RTD(\"cqg.rtd\", ,\"ContractData\",C413, \"LastTradeToday\",, \"T\"))","v":47.56},{"$f":"IF(A413=\"\",\"\",RTD(\"cqg.rtd\", ,\"ContractData\",C413, \"NetLastTradeToday\",, \"T\"))","v":0.57999999999999996},{"$f":"IF(A413=\"\",\"\",IFERROR(RTD(\"cqg.rtd\", ,\"ContractData\",C413, \"PerCentNetLastTrade\",, \"T\")/100,\"\"))","v":1.2345679012345678E-2},{"$f":"IF(A413=\"\",\"\",RTD(\"cqg.rtd\", ,\"ContractData\", C413, \"T_CVol\",, \"T\"))","v":2500179.1323549999},413,{"$f":"IFERROR(RANK($J413,INDIRECT((\"$J$\"&\"1\"&\":$J$\"&$A$449)))+COUNTIF($J$1:J413,J413)-1,\"\")","v":127},"S.US.VZ","S.US.NDSN"]
[{"$f":"IF(Symbols!A415=\"\",\"\",Symbols!A415)","v":"S.US.WAB"},{"$f":"IF(A414=\"\",\"\",IF(J415>0,1,0))","v":1},{"$f":"A414","v":"S.US.WAB"},{"$f":"IF(A414=\"\",\"\",RTD(\"cqg.rtd\", ,\"ContractData\",C414, \"LongDescription\",, \"T\"))","v":"Westinghouse Air Brake Co"},null,null,null,{"$f":"IF(A414=\"\",\"\",RTD(\"cqg.rtd\", ,\"ContractData\",C414, \"LastTradeToday\",, \"T\"))","v":294.42},{"$f":"IF(A414=\"\",\"\",RTD(\"cqg.rtd\", ,\"ContractData\",C414, \"NetLastTradeToday\",, \"T\"))","v":-1.1200000000000001},{"$f":"IF(A414=\"\",\"\",IFERROR(RTD(\"cqg.rtd\", ,\"ContractData\",C414, \"PerCentNetLastTrade\",, \"T\")/100,\"\"))","v":-3.789673140691615E-3},{"$f":"IF(A414=\"\",\"\",RTD(\"cqg.rtd\", ,\"ContractData\", C414, \"T_CVol\",, \"T\"))","v":106088.810709},414,{"$f":"IFERROR(RANK($J414,INDIRECT((\"$J$\"&\"1\"&\":$J$\"&$A$449)))+COUNTIF($J$1:J414,J414)-1,\"\")","v":383},"S.US.WAB","S.US.LYB"]
[{"$f":"IF(Symbols!A416=\"\",\"\",Symbols!A416)","v":"S.US.WAT"},{"$f":"IF(A415=\"\",\"\",IF(J416>0,1,0))","v":1},"S.US.WAT",{"$f":"IF(A415=\"\",\"\",RTD(\"cqg.rtd\", ,\"ContractData\",C415, \"LongDescription\",, \"T\"))","v":"Waters Corporation"},null,null,null,{"$f":"IF(A415=\"\",\"\",RTD(\"cqg.rtd\", ,\"ContractData\",C415, \"LastTradeToday\",, \"T\"))","v":419.27},{"$f":"IF(A415=\"\",\"\",RTD(\"cqg.rtd\", ,\"ContractData\",C415, \"NetLastTradeToday\",, \"T\"))","v":3.12},{"$f":"IF(A415=\"\",\"\",IFERROR(RTD(\"cqg.rtd\", ,\"ContractData\",C415, \"PerCentNetLastTrade\",, \"T\")/100,\"\"))","v":7.4972966478433255E-3},{"$f":"IF(A415=\"\",\"\",RTD(\"cqg.rtd\", ,\"ContractData\", C415, \"T_CVol\",, \"T\"))","v":120041.175806},415,{"$f":"IFERROR(RANK($J415,INDIRECT((\"$J$\"&\"1\"&\":$J$\"&$A$449)))+COUNTIF($J$1:J415,J415)-1,\"\")","v":221},"S.US.WAT","S.US.XYL"]
[{"$f":"IF(Symbols!A417=\"\",\"\",Symbols!A417)","v":"S.US.WBD"},{"$f":"IF(A416=\"\",\"\",IF(J417>0,1,0))","v":1},"S.US.WBD",{"$f":"IF(A416=\"\",\"\",RTD(\"cqg.rtd\", ,\"ContractData\",C416, \"LongDescription\",, \"T\"))","v":"WRNR BRS DS CM WI"},null,null,null,{"$f":"IF(A416=\"\",\"\",RTD(\"cqg.rtd\", ,\"ContractData\",C416, \"LastTradeToday\",, \"T\"))","v":28},{"$f":"IF(A416=\"\",\"\",RTD(\"cqg.rtd\", ,\"ContractData\",C416, \"NetLastTradeToday\",, \"T\"))","v":0.35000000000000003},{"$f":"IF(A416=\"\",\"\",IFERROR(RTD(\"cqg.rtd\", ,\"ContractData\",C416, \"PerCentNetLastTrade\",, \"T\")/100,\"\"))","v":1.2658227848101267E-2},{"$f":"IF(A416=\"\",\"\",RTD(\"cqg.rtd\", ,\"ContractData\", C416, \"T_CVol\",, \"T\"))","v":7291923.27257},416,{"$f":"IFERROR(RANK($J416,INDIRECT((\"$J$\"&\"1\"&\":$J$\"&$A$449)))+COUNTIF($J$1:J416,J416)-1,\"\")","v":121},"S.US.WBD","S.US.PH"]
[{"$f":"IF(Symbols!A418=\"\",\"\",Symbols!A418)","v":"S.US.WDAY"},{"$f":"IF(A417=\"\",\"\",IF(J418>0,1,0))","v":1},"S.US.WDAY",{"$f":"IF(A417=\"\",\"\",RTD(\"cqg.rtd\", ,\"ContractData\",C417, \"LongDescription\",, \"T\"))","v":"WORKDAY INC CL A"},null,null,null,{"$f":"IF(A417=\"\",\"\",RTD(\"cqg.rtd\", ,\"ContractData\",C417, \"LastTradeToday\",, \"T\"))","v":178.09},{"$f":"IF(A417=\"\",\"\",RTD(\"cqg.rtd\", ,\"ContractData\",C417, \"NetLastTradeToday\",, \"T\"))","v":2.8000000000000003},{"$f":"IF(A417=\"\",\"\",IFERROR(RTD(\"cqg.rtd\", ,\"ContractData\",C417, \"PerCentNetLastTrade\",, \"T\")/100,\"\"))","v":1.5973529579553881E-2},{"$f":"IF(A417=\"\",\"\",RTD(\"cqg.rtd\", ,\"ContractData\", C417, \"T_CVol\",, \"T\"))","v":275447.26907099999},417,{"$f":"IFERROR(RANK($J417,INDIRECT((\"$J$\"&\"1\"&\":$J$\"&$A$449)))+COUNTIF($J$1:J417,J417)-1,\"\")","v":85},"S.US.WDAY","S.US.EOG"]
[{"$f":"IF(Symbols!A419=\"\",\"\",Symbols!A419)","v":"S.US.WDC"},{"$f":"IF(A418=\"\",\"\",IF(J419>0,1,0))","v":1},"S.US.WDC",{"$f":"IF(A418=\"\",\"\",RTD(\"cqg.rtd\", ,\"ContractData\",C418, \"LongDescription\",, \"T\"))","v":"WESTERN DIGITAL CP"},null,null,null,{"$f":"IF(A418=\"\",\"\",RTD(\"cqg.rtd\", ,\"ContractData\",C418, \"LastTradeToday\",, \"T\"))","v":483.24},{"$f":"IF(A418=\"\",\"\",RTD(\"cqg.rtd\", ,\"ContractData\",C418, \"NetLastTradeToday\",, \"T\"))","v":29.14},{"$f":"IF(A418=\"\",\"\",IFERROR(RTD(\"cqg.rtd\", ,\"ContractData\",C418, \"PerCentNetLastTrade\",, \"T\")/100,\"\"))","v":6.4170887469720328E-2},{"$f":"IF(A418=\"\",\"\",RTD(\"cqg.rtd\", ,\"ContractData\", C418, \"T_CVol\",, \"T\"))","v":1744815.455174},418,{"$f":"IFERROR(RANK($J418,INDIRECT((\"$J$\"&\"1\"&\":$J$\"&$A$449)))+COUNTIF($J$1:J418,J418)-1,\"\")","v":2},"S.US.WDC","S.US.AMCR"]
[{"$f":"IF(Symbols!A420=\"\",\"\",Symbols!A420)","v":"S.US.WEC"},{"$f":"IF(A419=\"\",\"\",IF(J420>0,1,0))","v":0},"S.US.WEC",{"$f":"IF(A419=\"\",\"\",RTD(\"cqg.rtd\", ,\"ContractData\",C419, \"LongDescription\",, \"T\"))","v":"Wisconsin Energy Corp"},null,null,null,{"$f":"IF(A419=\"\",\"\",RTD(\"cqg.rtd\", ,\"ContractData\",C419, \"LastTradeToday\",, \"T\"))","v":110.01},{"$f":"IF(A419=\"\",\"\",RTD(\"cqg.rtd\", ,\"ContractData\",C419, \"NetLastTradeToday\",, \"T\"))","v":0.9},{"$f":"IF(A419=\"\",\"\",IFERROR(RTD(\"cqg.rtd\", ,\"ContractData\",C419, \"PerCentNetLastTrade\",, \"T\")/100,\"\"))","v":8.2485565026120429E-3},{"$f":"IF(A419=\"\",\"\",RTD(\"cqg.rtd\", ,\"ContractData\", C419, \"T_CVol\",, \"T\"))","v":203403.071039},419,{"$f":"IFERROR(RANK($J419,INDIRECT((\"$J$\"&\"1\"&\":$J$\"&$A$449)))+COUNTIF($J$1:J419,J419)-1,\"\")","v":202},"S.US.WEC","S.US.TDY"]
[{"$f":"IF(Symbols!A421=\"\",\"\",Symbols!A421)","v":"S.US.WFC"},{"$f":"IF(A420=\"\",\"\",IF(J421>0,1,0))","v":1},"S.US.WFC",{"$f":"IF(A420=\"\",\"\",RTD(\"cqg.rtd\", ,\"ContractData\",C420, \"LongDescription\",, \"T\"))","v":"Wells Fargo & Co New"},null,null,null,{"$f":"IF(A420=\"\",\"\",RTD(\"cqg.rtd\", ,\"ContractData\",C420, \"LastTradeToday\",, \"T\"))","v":88.74},{"$f":"IF(A420=\"\",\"\",RTD(\"cqg.rtd\", ,\"ContractData\",C420, \"NetLastTradeToday\",, \"T\"))","v":-0.19},{"$f":"IF(A420=\"\",\"\",IFERROR(RTD(\"cqg.rtd\", ,\"ContractData\",C420, \"PerCentNetLastTrade\",, \"T\")/100,\"\"))","v":-2.1365118632632406E-3},{"$f":"IF(A420=\"\",\"\",RTD(\"cqg.rtd\", ,\"ContractData\", C420, \"T_CVol\",, \"T\"))","v":1051803.2575379999},420,{"$f":"IFERROR(RANK($J420,INDIRECT((\"$J$\"&\"1\"&\":$J$\"&$A$449)))+COUNTIF($J$1:J420,J420)-1,\"\")","v":365},"S.US.WFC","S.US.ETN"]
[{"$f":"IF(Symbols!A422=\"\",\"\",Symbols!A422)","v":"S.US.WM"},{"$f":"IF(A421=\"\",\"\",IF(J422>0,1,0))","v":1},"S.US.WM",{"$f":"IF(A421=\"\",\"\",RTD(\"cqg.rtd\", ,\"ContractData\",C421, \"LongDescription\",, \"T\"))","v":"Waste Mgmt Inc New"},null,null,null,{"$f":"IF(A421=\"\",\"\",RTD(\"cqg.rtd\", ,\"ContractData\",C421, \"LastTradeToday\",, \"T\"))","v":227.13},{"$f":"IF(A421=\"\",\"\",RTD(\"cqg.rtd\", ,\"ContractData\",C421, \"NetLastTradeToday\",, \"T\"))","v":0.81},{"$f":"IF(A421=\"\",\"\",IFERROR(RTD(\"cqg.rtd\", ,\"ContractData\",C421, \"PerCentNetLastTrade\",, \"T\")/100,\"\"))","v":3.5790031813361612E-3},{"$f":"IF(A421=\"\",\"\",RTD(\"cqg.rtd\", ,\"ContractData\", C421, \"T_CVol\",, \"T\"))","v":166372.18364199999},421,{"$f":"IFERROR(RANK($J421,INDIRECT((\"$J$\"&\"1\"&\":$J$\"&$A$449)))+COUNTIF($J$1:J421,J421)-1,\"\")","v":293},"S.US.WM","S.US.URI"]
[{"$f":"IF(Symbols!A423=\"\",\"\",Symbols!A423)","v":"S.US.WMB"},{"$f":"IF(A422=\"\",\"\",IF(J423>0,1,0))","v":0},"S.US.WMB",{"$f":"IF(A422=\"\",\"\",RTD(\"cqg.rtd\", ,\"ContractData\",C422, \"LongDescription\",, \"T\"))","v":"Williams Companies Inc"},null,null,null,{"$f":"IF(A422=\"\",\"\",RTD(\"cqg.rtd\", ,\"ContractData\",C422, \"LastTradeToday\",, \"T\"))","v":73.78},{"$f":"IF(A422=\"\",\"\",RTD(\"cqg.rtd\", ,\"ContractData\",C422, \"NetLastTradeToday\",, \"T\"))","v":0.08},{"$f":"IF(A422=\"\",\"\",IFERROR(RTD(\"cqg.rtd\", ,\"ContractData\",C422, \"PerCentNetLastTrade\",, \"T\")/100,\"\"))","v":1.085481682496608E-3},{"$f":"IF(A422=\"\",\"\",RTD(\"cqg.rtd\", ,\"ContractData\", C422, \"T_CVol\",, \"T\"))","v":396848.62731100002},422,{"$f":"IFERROR(RANK($J422,INDIRECT((\"$J$\"&\"1\"&\":$J$\"&$A$449)))+COUNTIF($J$1:J422,J422)-1,\"\")","v":322},"S.US.WMB","S.US.HAL"]
[{"$f":"IF(Symbols!A424=\"\",\"\",Symbols!A424)","v":"S.US.WMT"},{"$f":"IF(A423=\"\",\"\",IF(J424>0,1,0))","v":1},"S.US.WMT",{"$f":"IF(A423=\"\",\"\",RTD(\"cqg.rtd\", ,\"ContractData\",C423, \"LongDescription\",, \"T\"))","v":"WALMART INC CMN"},null,null,null,{"$f":"IF(A423=\"\",\"\",RTD(\"cqg.rtd\", ,\"ContractData\",C423, \"LastTradeToday\",, \"T\"))","v":115.62},{"$f":"IF(A423=\"\",\"\",RTD(\"cqg.rtd\", ,\"ContractData\",C423, \"NetLastTradeToday\",, \"T\"))","v":-0.39},{"$f":"IF(A423=\"\",\"\",IFERROR(RTD(\"cqg.rtd\", ,\"ContractData\",C423, \"PerCentNetLastTrade\",, \"T\")/100,\"\"))","v":-3.3617791569692267E-3},{"$f":"IF(A423=\"\",\"\",RTD(\"cqg.rtd\", ,\"ContractData\", C423, \"T_CVol\",, \"T\"))","v":3245308.0867590001},423,{"$f":"IFERROR(RANK($J423,INDIRECT((\"$J$\"&\"1\"&\":$J$\"&$A$449)))+COUNTIF($J$1:J423,J423)-1,\"\")","v":375},"S.US.WMT","S.US.APA"]
[{"$f":"IF(Symbols!A425=\"\",\"\",Symbols!A425)","v":"S.US.WRB"},{"$f":"IF(A424=\"\",\"\",IF(J425>0,1,0))","v":1},"S.US.WRB",{"$f":"IF(A424=\"\",\"\",RTD(\"cqg.rtd\", ,\"ContractData\",C424, \"LongDescription\",, \"T\"))","v":"WR Berkley Corp"},null,null,null,{"$f":"IF(A424=\"\",\"\",RTD(\"cqg.rtd\", ,\"ContractData\",C424, \"LastTradeToday\",, \"T\"))","v":70.150000000000006},{"$f":"IF(A424=\"\",\"\",RTD(\"cqg.rtd\", ,\"ContractData\",C424, \"NetLastTradeToday\",, \"T\"))","v":0.42},{"$f":"IF(A424=\"\",\"\",IFERROR(RTD(\"cqg.rtd\", ,\"ContractData\",C424, \"PerCentNetLastTrade\",, \"T\")/100,\"\"))","v":6.0232324680912089E-3},{"$f":"IF(A424=\"\",\"\",RTD(\"cqg.rtd\", ,\"ContractData\", C424, \"T_CVol\",, \"T\"))","v":132685.235679},424,{"$f":"IFERROR(RANK($J424,INDIRECT((\"$J$\"&\"1\"&\":$J$\"&$A$449)))+COUNTIF($J$1:J424,J424)-1,\"\")","v":248},"S.US.WRB","S.US.MCK"]
[{"$f":"IF(Symbols!A426=\"\",\"\",Symbols!A426)","v":"S.US.WSM"},{"$f":"IF(A425=\"\",\"\",IF(J426>0,1,0))","v":0},"S.US.WSM",{"$f":"IF(A425=\"\",\"\",RTD(\"cqg.rtd\", ,\"ContractData\",C425, \"LongDescription\",, \"T\"))","v":"Williams-Sonoma Inc"},null,null,null,{"$f":"IF(A425=\"\",\"\",RTD(\"cqg.rtd\", ,\"ContractData\",C425, \"LastTradeToday\",, \"T\"))","v":246.99},{"$f":"IF(A425=\"\",\"\",RTD(\"cqg.rtd\", ,\"ContractData\",C425, \"NetLastTradeToday\",, \"T\"))","v":1.84},{"$f":"IF(A425=\"\",\"\",IFERROR(RTD(\"cqg.rtd\", ,\"ContractData\",C425, \"PerCentNetLastTrade\",, \"T\")/100,\"\"))","v":7.5056088109320832E-3},{"$f":"IF(A425=\"\",\"\",RTD(\"cqg.rtd\", ,\"ContractData\", C425, \"T_CVol\",, \"T\"))","v":51010.754336999998},425,{"$f":"IFERROR(RANK($J425,INDIRECT((\"$J$\"&\"1\"&\":$J$\"&$A$449)))+COUNTIF($J$1:J425,J425)-1,\"\")","v":219},"S.US.WSM","S.US.WST"]
[{"$f":"IF(Symbols!A427=\"\",\"\",Symbols!A427)","v":"S.US.WST"},{"$f":"IF(A426=\"\",\"\",IF(J427>0,1,0))","v":1},"S.US.WST",{"$f":"IF(A426=\"\",\"\",RTD(\"cqg.rtd\", ,\"ContractData\",C426, \"LongDescription\",, \"T\"))","v":"West Pharmaceuticals Svcs Inc"},null,null,null,{"$f":"IF(A426=\"\",\"\",RTD(\"cqg.rtd\", ,\"ContractData\",C426, \"LastTradeToday\",, \"T\"))","v":347.68},{"$f":"IF(A426=\"\",\"\",RTD(\"cqg.rtd\", ,\"ContractData\",C426, \"NetLastTradeToday\",, \"T\"))","v":-4.6100000000000003},{"$f":"IF(A426=\"\",\"\",IFERROR(RTD(\"cqg.rtd\", ,\"ContractData\",C426, \"PerCentNetLastTrade\",, \"T\")/100,\"\"))","v":-1.3085809986091004E-2},{"$f":"IF(A426=\"\",\"\",RTD(\"cqg.rtd\", ,\"ContractData\", C426, \"T_CVol\",, \"T\"))","v":33585.696154999998},426,{"$f":"IFERROR(RANK($J426,INDIRECT((\"$J$\"&\"1\"&\":$J$\"&$A$449)))+COUNTIF($J$1:J426,J426)-1,\"\")","v":425},"S.US.WST","S.US.FANG"]
[{"$f":"IF(Symbols!A428=\"\",\"\",Symbols!A428)","v":"S.US.WTW"},{"$f":"IF(A427=\"\",\"\",IF(J428>0,1,0))","v":1},"S.US.WTW",{"$f":"IF(A427=\"\",\"\",RTD(\"cqg.rtd\", ,\"ContractData\",C427, \"LongDescription\",, \"T\"))","v":"Willis Towers Watson"},null,null,null,{"$f":"IF(A427=\"\",\"\",RTD(\"cqg.rtd\", ,\"ContractData\",C427, \"LastTradeToday\",, \"T\"))","v":340.68},{"$f":"IF(A427=\"\",\"\",RTD(\"cqg.rtd\", ,\"ContractData\",C427, \"NetLastTradeToday\",, \"T\"))","v":0.39},{"$f":"IF(A427=\"\",\"\",IFERROR(RTD(\"cqg.rtd\", ,\"ContractData\",C427, \"PerCentNetLastTrade\",, \"T\")/100,\"\"))","v":1.1460812836110376E-3},{"$f":"IF(A427=\"\",\"\",RTD(\"cqg.rtd\", ,\"ContractData\", C427, \"T_CVol\",, \"T\"))","v":29748.166476999999},427,{"$f":"IFERROR(RANK($J427,INDIRECT((\"$J$\"&\"1\"&\":$J$\"&$A$449)))+COUNTIF($J$1:J427,J427)-1,\"\")","v":321},"S.US.WTW","S.US.OXY"]
[{"$f":"IF(Symbols!A429=\"\",\"\",Symbols!A429)","v":"S.US.WY"},{"$f":"IF(A428=\"\",\"\",IF(J429>0,1,0))","v":1},"S.US.WY",{"$f":"IF(A428=\"\",\"\",RTD(\"cqg.rtd\", ,\"ContractData\",C428, \"LongDescription\",, \"T\"))","v":"Weyerhaeuser Company"},null,null,null,{"$f":"IF(A428=\"\",\"\",RTD(\"cqg.rtd\", ,\"ContractData\",C428, \"LastTradeToday\",, \"T\"))","v":24.97},{"$f":"IF(A428=\"\",\"\",RTD(\"cqg.rtd\", ,\"ContractData\",C428, \"NetLastTradeToday\",, \"T\"))","v":0.21},{"$f":"IF(A428=\"\",\"\",IFERROR(RTD(\"cqg.rtd\", ,\"ContractData\",C428, \"PerCentNetLastTrade\",, \"T\")/100,\"\"))","v":8.4814216478190634E-3},{"$f":"IF(A428=\"\",\"\",RTD(\"cqg.rtd\", ,\"ContractData\", C428, \"T_CVol\",, \"T\"))","v":417985.64243900002},428,{"$f":"IFERROR(RANK($J428,INDIRECT((\"$J$\"&\"1\"&\":$J$\"&$A$449)))+COUNTIF($J$1:J428,J428)-1,\"\")","v":197},"S.US.WY","S.US.SLB"]
[{"$f":"IF(Symbols!A430=\"\",\"\",Symbols!A430)","v":"S.US.XEL"},{"$f":"IF(A429=\"\",\"\",IF(J430>0,1,0))","v":0},"S.US.XEL",{"$f":"IF(A429=\"\",\"\",RTD(\"cqg.rtd\", ,\"ContractData\",C429, \"LongDescription\",, \"T\"))","v":"Xcel Energy Inc"},null,null,null,{"$f":"IF(A429=\"\",\"\",RTD(\"cqg.rtd\", ,\"ContractData\",C429, \"LastTradeToday\",, \"T\"))","v":79.36},{"$f":"IF(A429=\"\",\"\",RTD(\"cqg.rtd\", ,\"ContractData\",C429, \"NetLastTradeToday\",, \"T\"))","v":0.76},{"$f":"IF(A429=\"\",\"\",IFERROR(RTD(\"cqg.rtd\", ,\"ContractData\",C429, \"PerCentNetLastTrade\",, \"T\")/100,\"\"))","v":9.6692111959287529E-3},{"$f":"IF(A429=\"\",\"\",RTD(\"cqg.rtd\", ,\"ContractData\", C429, \"T_CVol\",, \"T\"))","v":367153.33515200001},429,{"$f":"IFERROR(RANK($J429,INDIRECT((\"$J$\"&\"1\"&\":$J$\"&$A$449)))+COUNTIF($J$1:J429,J429)-1,\"\")","v":170},"S.US.XEL","S.US.EMR"]
[{"$f":"IF(Symbols!A431=\"\",\"\",Symbols!A431)","v":"S.US.XOM"},{"$f":"IF(A430=\"\",\"\",IF(J431>0,1,0))","v":0},"S.US.XOM",{"$f":"IF(A430=\"\",\"\",RTD(\"cqg.rtd\", ,\"ContractData\",C430, \"LongDescription\",, \"T\"))","v":"ExxonMobil Holdings Corporation"},null,null,null,{"$f":"IF(A430=\"\",\"\",RTD(\"cqg.rtd\", ,\"ContractData\",C430, \"LastTradeToday\",, \"T\"))","v":158.68},{"$f":"IF(A430=\"\",\"\",RTD(\"cqg.rtd\", ,\"ContractData\",C430, \"NetLastTradeToday\",, \"T\"))","v":-1.07},{"$f":"IF(A430=\"\",\"\",IFERROR(RTD(\"cqg.rtd\", ,\"ContractData\",C430, \"PerCentNetLastTrade\",, \"T\")/100,\"\"))","v":-6.6979655712050079E-3},{"$f":"IF(A430=\"\",\"\",RTD(\"cqg.rtd\", ,\"ContractData\", C430, \"T_CVol\",, \"T\"))","v":1670176.329808},430,{"$f":"IFERROR(RANK($J430,INDIRECT((\"$J$\"&\"1\"&\":$J$\"&$A$449)))+COUNTIF($J$1:J430,J430)-1,\"\")","v":402},"S.US.XOM","S.US.COP"]
[{"$f":"IF(Symbols!A432=\"\",\"\",Symbols!A432)","v":"S.US.XYL"},{"$f":"IF(A431=\"\",\"\",IF(J432>0,1,0))","v":1},"S.US.XYL",{"$f":"IF(A431=\"\",\"\",RTD(\"cqg.rtd\", ,\"ContractData\",C431, \"LongDescription\",, \"T\"))","v":"Xylem, Inc."},null,null,null,{"$f":"IF(A431=\"\",\"\",RTD(\"cqg.rtd\", ,\"ContractData\",C431, \"LastTradeToday\",, \"T\"))","v":120.78},{"$f":"IF(A431=\"\",\"\",RTD(\"cqg.rtd\", ,\"ContractData\",C431, \"NetLastTradeToday\",, \"T\"))","v":-1.1500000000000001},{"$f":"IF(A431=\"\",\"\",IFERROR(RTD(\"cqg.rtd\", ,\"ContractData\",C431, \"PerCentNetLastTrade\",, \"T\")/100,\"\"))","v":-9.4316411055523665E-3},{"$f":"IF(A431=\"\",\"\",RTD(\"cqg.rtd\", ,\"ContractData\", C431, \"T_CVol\",, \"T\"))","v":111856.32708},431,{"$f":"IFERROR(RANK($J431,INDIRECT((\"$J$\"&\"1\"&\":$J$\"&$A$449)))+COUNTIF($J$1:J431,J431)-1,\"\")","v":415},"S.US.XYL","S.US.FCX"]
[{"$f":"IF(Symbols!A433=\"\",\"\",Symbols!A433)","v":"S.US.XYZ"},{"$f":"IF(A432=\"\",\"\",IF(J433>0,1,0))","v":1},{"$f":"A432","v":"S.US.XYZ"},{"$f":"IF(A432=\"\",\"\",RTD(\"cqg.rtd\", ,\"ContractData\",C432, \"LongDescription\",, \"T\"))","v":"Square, Inc"},null,null,null,{"$f":"IF(A432=\"\",\"\",RTD(\"cqg.rtd\", ,\"ContractData\",C432, \"LastTradeToday\",, \"T\"))","v":80.34},{"$f":"IF(A432=\"\",\"\",RTD(\"cqg.rtd\", ,\"ContractData\",C432, \"NetLastTradeToday\",, \"T\"))","v":2.06},{"$f":"IF(A432=\"\",\"\",IFERROR(RTD(\"cqg.rtd\", ,\"ContractData\",C432, \"PerCentNetLastTrade\",, \"T\")/100,\"\"))","v":2.6315789473684213E-2},{"$f":"IF(A432=\"\",\"\",RTD(\"cqg.rtd\", ,\"ContractData\", C432, \"T_CVol\",, \"T\"))","v":670702.06137300003},432,{"$f":"IFERROR(RANK($J432,INDIRECT((\"$J$\"&\"1\"&\":$J$\"&$A$449)))+COUNTIF($J$1:J432,J432)-1,\"\")","v":30},"S.US.XYZ","S.US.CF"]
[{"$f":"IF(Symbols!A434=\"\",\"\",Symbols!A434)","v":"S.US.YUM"},{"$f":"IF(A433=\"\",\"\",IF(J434>0,1,0))","v":1},"S.US.YUM",{"$f":"IF(A433=\"\",\"\",RTD(\"cqg.rtd\", ,\"ContractData\",C433, \"LongDescription\",, \"T\"))","v":"Yum Brands Inc"},null,null,null,{"$f":"IF(A433=\"\",\"\",RTD(\"cqg.rtd\", ,\"ContractData\",C433, \"LastTradeToday\",, \"T\"))","v":154.38},{"$f":"IF(A433=\"\",\"\",RTD(\"cqg.rtd\", ,\"ContractData\",C433, \"NetLastTradeToday\",, \"T\"))","v":4.04},{"$f":"IF(A433=\"\",\"\",IFERROR(RTD(\"cqg.rtd\", ,\"ContractData\",C433, \"PerCentNetLastTrade\",, \"T\")/100,\"\"))","v":2.6872422508979647E-2},{"$f":"IF(A433=\"\",\"\",RTD(\"cqg.rtd\", ,\"ContractData\", C433, \"T_CVol\",, \"T\"))","v":540978.86284399999},433,{"$f":"IFERROR(RANK($J433,INDIRECT((\"$J$\"&\"1\"&\":$J$\"&$A$449)))+COUNTIF($J$1:J433,J433)-1,\"\")","v":27},"S.US.YUM","S.US.BKR"]
[{"$f":"IF(Symbols!A435=\"\",\"\",Symbols!A435)","v":"S.US.ZBH"},{"$f":"IF(A434=\"\",\"\",IF(J435>0,1,0))","v":1},"S.US.ZBH",{"$f":"IF(A434=\"\",\"\",RTD(\"cqg.rtd\", ,\"ContractData\",C434, \"LongDescription\",, \"T\"))","v":"Zimmer Biomet Holdings, Inc"},null,null,null,{"$f":"IF(A434=\"\",\"\",RTD(\"cqg.rtd\", ,\"ContractData\",C434, \"LastTradeToday\",, \"T\"))","v":99.73},{"$f":"IF(A434=\"\",\"\",RTD(\"cqg.rtd\", ,\"ContractData\",C434, \"NetLastTradeToday\",, \"T\"))","v":1.84},{"$f":"IF(A434=\"\",\"\",IFERROR(RTD(\"cqg.rtd\", ,\"ContractData\",C434, \"PerCentNetLastTrade\",, \"T\")/100,\"\"))","v":1.8796608438042702E-2},{"$f":"IF(A434=\"\",\"\",RTD(\"cqg.rtd\", ,\"ContractData\", C434, \"T_CVol\",, \"T\"))","v":338780.738694},434,{"$f":"IFERROR(RANK($J434,INDIRECT((\"$J$\"&\"1\"&\":$J$\"&$A$449)))+COUNTIF($J$1:J434,J434)-1,\"\")","v":66},"S.US.ZBH","S.US.EXE"]
[{"$f":"IF(Symbols!A436=\"\",\"\",Symbols!A436)","v":"S.US.ZBRA"},{"$f":"IF(A435=\"\",\"\",IF(J436>0,1,0))","v":1},"S.US.ZBRA",{"$f":"IF(A435=\"\",\"\",RTD(\"cqg.rtd\", ,\"ContractData\",C435, \"LongDescription\",, \"T\"))","v":"ZEBRA TECHNOLOGIES"},null,null,null,{"$f":"IF(A435=\"\",\"\",RTD(\"cqg.rtd\", ,\"ContractData\",C435, \"LastTradeToday\",, \"T\"))","v":380.83},{"$f":"IF(A435=\"\",\"\",RTD(\"cqg.rtd\", ,\"ContractData\",C435, \"NetLastTradeToday\",, \"T\"))","v":2.46},{"$f":"IF(A435=\"\",\"\",IFERROR(RTD(\"cqg.rtd\", ,\"ContractData\",C435, \"PerCentNetLastTrade\",, \"T\")/100,\"\"))","v":6.5015725348204134E-3},{"$f":"IF(A435=\"\",\"\",RTD(\"cqg.rtd\", ,\"ContractData\", C435, \"T_CVol\",, \"T\"))","v":50481.835740000002},435,{"$f":"IFERROR(RANK($J435,INDIRECT((\"$J$\"&\"1\"&\":$J$\"&$A$449)))+COUNTIF($J$1:J435,J435)-1,\"\")","v":238},"S.US.ZBRA","S.US.DVN"]
[{"$f":"IF(Symbols!A437=\"\",\"\",Symbols!A437)","v":"S.US.ZTS"},{"$f":"IF(A436=\"\",\"\",IF(J437>0,1,0))","v":1},"S.US.ZTS",{"$f":"IF(A436=\"\",\"\",RTD(\"cqg.rtd\", ,\"ContractData\",C436, \"LongDescription\",, \"T\"))","v":"Zoetis Inc"},null,null,null,{"$f":"IF(A436=\"\",\"\",RTD(\"cqg.rtd\", ,\"ContractData\",C436, \"LastTradeToday\",, \"T\"))","v":74.13},{"$f":"IF(A436=\"\",\"\",RTD(\"cqg.rtd\", ,\"ContractData\",C436, \"NetLastTradeToday\",, \"T\"))","v":0.59},{"$f":"IF(A436=\"\",\"\",IFERROR(RTD(\"cqg.rtd\", ,\"ContractData\",C436, \"PerCentNetLastTrade\",, \"T\")/100,\"\"))","v":8.0228447103617082E-3},{"$f":"IF(A436=\"\",\"\",RTD(\"cqg.rtd\", ,\"ContractData\", C436, \"T_CVol\",, \"T\"))","v":995430.386038},436,{"$f":"IFERROR(RANK($J436,INDIRECT((\"$J$\"&\"1\"&\":$J$\"&$A$449)))+COUNTIF($J$1:J436,J436)-1,\"\")","v":206},"S.US.ZTS","S.US.CSCO"]
[{"$f":"IF(Symbols!A438=\"\",\"\",Symbols!A438)","v":""},{"$f":"IF(A437=\"\",\"\",IF(J438>0,1,0))","v":""},"",{"$f":"IF(A437=\"\",\"\",RTD(\"cqg.rtd\", ,\"ContractData\",C437, \"LongDescription\",, \"T\"))","v":""},null,null,null,{"$f":"IF(A437=\"\",\"\",RTD(\"cqg.rtd\", ,\"ContractData\",C437, \"LastTradeToday\",, \"T\"))","v":""},{"$f":"IF(A437=\"\",\"\",RTD(\"cqg.rtd\", ,\"ContractData\",C437, \"NetLastTradeToday\",, \"T\"))","v":""},{"$f":"IF(A437=\"\",\"\",IFERROR(RTD(\"cqg.rtd\", ,\"ContractData\",C437, \"PerCentNetLastTrade\",, \"T\")/100,\"\"))","v":""},{"$f":"IF(A437=\"\",\"\",RTD(\"cqg.rtd\", ,\"ContractData\", C437, \"T_CVol\",, \"T\"))","v":""},null,{"$f":"IFERROR(RANK($J437,INDIRECT((\"$J$\"&\"1\"&\":$J$\"&$A$449)))+COUNTIF($J$1:J437,J437)-1,\"\")","v":""},"",""]
[{"$f":"IF(Symbols!A439=\"\",\"\",Symbols!A439)","v":""},{"$f":"IF(A438=\"\",\"\",IF(J439>0,1,0))","v":""},"",{"$f":"IF(A438=\"\",\"\",RTD(\"cqg.rtd\", ,\"ContractData\",C438, \"LongDescription\",, \"T\"))","v":""},null,null,null,{"$f":"IF(A438=\"\",\"\",RTD(\"cqg.rtd\", ,\"ContractData\",C438, \"LastTradeToday\",, \"T\"))","v":""},{"$f":"IF(A438=\"\",\"\",RTD(\"cqg.rtd\", ,\"ContractData\",C438, \"NetLastTradeToday\",, \"T\"))","v":""},{"$f":"IF(A438=\"\",\"\",IFERROR(RTD(\"cqg.rtd\", ,\"ContractData\",C438, \"PerCentNetLastTrade\",, \"T\")/100,\"\"))","v":""},{"$f":"IF(A438=\"\",\"\",RTD(\"cqg.rtd\", ,\"ContractData\", C438, \"T_CVol\",, \"T\"))","v":""},null,{"$f":"IFERROR(RANK($J438,INDIRECT((\"$J$\"&\"1\"&\":$J$\"&$A$449)))+COUNTIF($J$1:J438,J438)-1,\"\")","v":""},"",""]
[null,null,null,null,null,null,null,{"$f":"IF(A438=\"\",\"\",RTD(\"cqg.rtd\", ,\"ContractData\",C438, \"LastTradeToday\",, \"T\"))","v":""},{"$f":"IF(A438=\"\",\"\",RTD(\"cqg.rtd\", ,\"ContractData\",C438, \"NetLastTradeToday\",, \"T\"))","v":""},{"$f":"IF(A438=\"\",\"\",IFERROR(RTD(\"cqg.rtd\", ,\"ContractData\",C438, \"PerCentNetLastTrade\",, \"T\")/100,\"\"))","v":""},{"$f":"IF(A438=\"\",\"\",RTD(\"cqg.rtd\", ,\"ContractData\", C438, \"T_CVol\",, \"T\"))","v":""}]
[]
[]
[]
[]
[]
[]
[]
[]
[]
[{"$f":"437-COUNTIF(A1:A437,\"\")","v":436},{"$f":"SUM(B1:B438)/A449","v":0.77293577981651373}]
[{"$f":"\"$J$1:$J$\"&A449","v":"$J$1:$J$436"}]

{"sheet":"Symbols","index":2,"n_rows":438,"n_cols":7,"rows_kept":438,"cut":false,"hidden":false,"merged":[[11,3,11,10],[9,7,9,10],[4,3,4,6],[5,3,5,6],[6,3,6,6],[7,3,7,6],[8,3,8,6],[9,3,9,6],[4,7,4,10],[5,7,5,10],[6,7,6,10],[7,7,7,10],[8,7,8,10]]}
["S.US.A",{"$f":"IF(A1=\"\",\"\",RTD(\"cqg.rtd\", ,\"ContractData\",A1, \"LongDescription\",, \"T\"))","v":"Agilent Technologies"}]
["S.US.AAPL",{"$f":"IF(A2=\"\",\"\",RTD(\"cqg.rtd\", ,\"ContractData\",A2, \"LongDescription\",, \"T\"))","v":"APPLE INC."}]
["S.US.ABBV",{"$f":"IF(A3=\"\",\"\",RTD(\"cqg.rtd\", ,\"ContractData\",A3, \"LongDescription\",, \"T\"))","v":"AbbVie Inc."}]
["S.US.ABNB",{"$f":"IF(A4=\"\",\"\",RTD(\"cqg.rtd\", ,\"ContractData\",A4, \"LongDescription\",, \"T\"))","v":"Airbnb, Inc. Class A"}]
["S.US.ABT",{"$f":"IF(A5=\"\",\"\",RTD(\"cqg.rtd\", ,\"ContractData\",A5, \"LongDescription\",, \"T\"))","v":"Abbott Laboratories"}]
["S.US.ACGL",{"$f":"IF(A6=\"\",\"\",RTD(\"cqg.rtd\", ,\"ContractData\",A6, \"LongDescription\",, \"T\"))","v":"Arch Capital Grp Ltd"}]
["S.US.ACN",{"$f":"IF(A7=\"\",\"\",RTD(\"cqg.rtd\", ,\"ContractData\",A7, \"LongDescription\",, \"T\"))","v":"Accenture PLC Ireland"}]
["S.US.ADBE",{"$f":"IF(A8=\"\",\"\",RTD(\"cqg.rtd\", ,\"ContractData\",A8, \"LongDescription\",, \"T\"))","v":"Adobe Inc."}]
["S.US.ADI",{"$f":"IF(A9=\"\",\"\",RTD(\"cqg.rtd\", ,\"ContractData\",A9, \"LongDescription\",, \"T\"))","v":"Analog Devices Inc"}]
["S.US.ADM",{"$f":"IF(A10=\"\",\"\",RTD(\"cqg.rtd\", ,\"ContractData\",A10, \"LongDescription\",, \"T\"))","v":"Archer-Daniels-Midland"}]
["S.US.ADP",{"$f":"IF(A11=\"\",\"\",RTD(\"cqg.rtd\", ,\"ContractData\",A11, \"LongDescription\",, \"T\"))","v":"AUTOMATIC DATA PROCS"},null,"Web site link:"]
["S.US.ADSK",{"$f":"IF(A12=\"\",\"\",RTD(\"cqg.rtd\", ,\"ContractData\",A12, \"LongDescription\",, \"T\"))","v":"Autodesk Inc"},null,"https://www.ishares.com/us/products/239728/ishares-sp-500-value-etf"]
["S.US.AEE",{"$f":"IF(A13=\"\",\"\",RTD(\"cqg.rtd\", ,\"ContractData\",A13, \"LongDescription\",, \"T\"))","v":"Ameren Corp"}]
["S.US.AEP",{"$f":"IF(A14=\"\",\"\",RTD(\"cqg.rtd\", ,\"ContractData\",A14, \"LongDescription\",, \"T\"))","v":"AMER ELC PWR CO CMN"}]
["S.US.AES",{"$f":"IF(A15=\"\",\"\",RTD(\"cqg.rtd\", ,\"ContractData\",A15, \"LongDescription\",, \"T\"))","v":"AES Corp"}]
["S.US.AFL",{"$f":"IF(A16=\"\",\"\",RTD(\"cqg.rtd\", ,\"ContractData\",A16, \"LongDescription\",, \"T\"))","v":"AFLAC Inc"}]
["S.US.AIG",{"$f":"IF(A17=\"\",\"\",RTD(\"cqg.rtd\", ,\"ContractData\",A17, \"LongDescription\",, \"T\"))","v":"American Intl Group Inc"}]
["S.US.AIZ",{"$f":"IF(A18=\"\",\"\",RTD(\"cqg.rtd\", ,\"ContractData\",A18, \"LongDescription\",, \"T\"))","v":"Assurant Inc"},"To update the Ticker List:"]
["S.US.AJG",{"$f":"IF(A19=\"\",\"\",RTD(\"cqg.rtd\", ,\"ContractData\",A19, \"LongDescription\",, \"T\"))","v":"Arthur J Gallagher Co"}]
["S.US.AKAM",{"$f":"IF(A20=\"\",\"\",RTD(\"cqg.rtd\", ,\"ContractData\",A20, \"LongDescription\",, \"T\"))","v":"AKAMAI TECHNOLOGIES"}]
["S.US.ALB",{"$f":"IF(A21=\"\",\"\",RTD(\"cqg.rtd\", ,\"ContractData\",A21, \"LongDescription\",, \"T\"))","v":"Albemarle Corporation"},"1) From their Web site download the CSV File."]
["S.US.ALGN",{"$f":"IF(A22=\"\",\"\",RTD(\"cqg.rtd\", ,\"ContractData\",A22, \"LongDescription\",, \"T\"))","v":"Align Technology Inc"}]
["S.US.ALL",{"$f":"IF(A23=\"\",\"\",RTD(\"cqg.rtd\", ,\"ContractData\",A23, \"LongDescription\",, \"T\"))","v":"Allstate Corporation"}]
["S.US.ALLE",{"$f":"IF(A24=\"\",\"\",RTD(\"cqg.rtd\", ,\"ContractData\",A24, \"LongDescription\",, \"T\"))","v":"Allegion plc"},"2) Copy the Tickers from the file.",null,null,null,"Merge \"S.US.\" to the Tickers. =\"S.US.\"&H1"]
["S.US.AMCR",{"$f":"IF(A25=\"\",\"\",RTD(\"cqg.rtd\", ,\"ContractData\",A25, \"LongDescription\",, \"T\"))","v":"Amcor PLC"}]
["S.US.AME",{"$f":"IF(A26=\"\",\"\",RTD(\"cqg.rtd\", ,\"ContractData\",A26, \"LongDescription\",, \"T\"))","v":"Ametek Inc New"}]
["S.US.AMGN",{"$f":"IF(A27=\"\",\"\",RTD(\"cqg.rtd\", ,\"ContractData\",A27, \"LongDescription\",, \"T\"))","v":"AMGEN"},"3) Remove money market fund tickers."]
["S.US.AMP",{"$f":"IF(A28=\"\",\"\",RTD(\"cqg.rtd\", ,\"ContractData\",A28, \"LongDescription\",, \"T\"))","v":"Ameriprise Financial Inc"}]
["S.US.AMT",{"$f":"IF(A29=\"\",\"\",RTD(\"cqg.rtd\", ,\"ContractData\",A29, \"LongDescription\",, \"T\"))","v":"American Tower Corp ClA"}]
["S.US.AMZN",{"$f":"IF(A30=\"\",\"\",RTD(\"cqg.rtd\", ,\"ContractData\",A30, \"LongDescription\",, \"T\"))","v":"Amazon.com Inc"},"4) Copy and Paste \"As Values\" the updated Ticker List to column A."]
["S.US.AON",{"$f":"IF(A31=\"\",\"\",RTD(\"cqg.rtd\", ,\"ContractData\",A31, \"LongDescription\",, \"T\"))","v":"AON Corporation"}]
["S.US.AOS",{"$f":"IF(A32=\"\",\"\",RTD(\"cqg.rtd\", ,\"ContractData\",A32, \"LongDescription\",, \"T\"))","v":"AO Smith Corp"}]
["S.US.APA",{"$f":"IF(A33=\"\",\"\",RTD(\"cqg.rtd\", ,\"ContractData\",A33, \"LongDescription\",, \"T\"))","v":"APA CORPORATION CMN"}]
["S.US.APD",{"$f":"IF(A34=\"\",\"\",RTD(\"cqg.rtd\", ,\"ContractData\",A34, \"LongDescription\",, \"T\"))","v":"Air Products & Chems Inc"}]
["S.US.APO",{"$f":"IF(A35=\"\",\"\",RTD(\"cqg.rtd\", ,\"ContractData\",A35, \"LongDescription\",, \"T\"))","v":"Apollo Global Management, LLC"}]
["S.US.APTV",{"$f":"IF(A36=\"\",\"\",RTD(\"cqg.rtd\", ,\"ContractData\",A36, \"LongDescription\",, \"T\"))","v":"Aptiv PLC"}]
["S.US.ARE",{"$f":"IF(A37=\"\",\"\",RTD(\"cqg.rtd\", ,\"ContractData\",A37, \"LongDescription\",, \"T\"))","v":"Alexandria Real Estate Equities Inc"}]
["S.US.ARES",{"$f":"IF(A38=\"\",\"\",RTD(\"cqg.rtd\", ,\"ContractData\",A38, \"LongDescription\",, \"T\"))","v":"Ares Management, L.P."}]
["S.US.ATO",{"$f":"IF(A39=\"\",\"\",RTD(\"cqg.rtd\", ,\"ContractData\",A39, \"LongDescription\",, \"T\"))","v":"Atmos Energy Corp"}]
["S.US.AVB",{"$f":"IF(A40=\"\",\"\",RTD(\"cqg.rtd\", ,\"ContractData\",A40, \"LongDescription\",, \"T\"))","v":"AvalonBay Communities, Inc."}]
["S.US.AVY",{"$f":"IF(A41=\"\",\"\",RTD(\"cqg.rtd\", ,\"ContractData\",A41, \"LongDescription\",, \"T\"))","v":"Avery Dennison Corp"}]
["S.US.AWK",{"$f":"IF(A42=\"\",\"\",RTD(\"cqg.rtd\", ,\"ContractData\",A42, \"LongDescription\",, \"T\"))","v":"American Water Works"}]
["S.US.AXON",{"$f":"IF(A43=\"\",\"\",RTD(\"cqg.rtd\", ,\"ContractData\",A43, \"LongDescription\",, \"T\"))","v":"AXON ENTERPRISE, INC"}]
["S.US.AXP",{"$f":"IF(A44=\"\",\"\",RTD(\"cqg.rtd\", ,\"ContractData\",A44, \"LongDescription\",, \"T\"))","v":"American Express Co"}]
["S.US.AZO",{"$f":"IF(A45=\"\",\"\",RTD(\"cqg.rtd\", ,\"ContractData\",A45, \"LongDescription\",, \"T\"))","v":"Autozone Inc"}]
["S.US.BA",{"$f":"IF(A46=\"\",\"\",RTD(\"cqg.rtd\", ,\"ContractData\",A46, \"LongDescription\",, \"T\"))","v":"Boeing Company"}]
["S.US.BAC",{"$f":"IF(A47=\"\",\"\",RTD(\"cqg.rtd\", ,\"ContractData\",A47, \"LongDescription\",, \"T\"))","v":"Bank of America Corp"}]
["S.US.BALL",{"$f":"IF(A48=\"\",\"\",RTD(\"cqg.rtd\", ,\"ContractData\",A48, \"LongDescription\",, \"T\"))","v":"Ball Corp"}]
["S.US.BAX",{"$f":"IF(A49=\"\",\"\",RTD(\"cqg.rtd\", ,\"ContractData\",A49, \"LongDescription\",, \"T\"))","v":"Baxter International Inc"}]
["S.US.BBY",{"$f":"IF(A50=\"\",\"\",RTD(\"cqg.rtd\", ,\"ContractData\",A50, \"LongDescription\",, \"T\"))","v":"Best Buy Co Inc"}]
["S.US.BDX",{"$f":"IF(A51=\"\",\"\",RTD(\"cqg.rtd\", ,\"ContractData\",A51, \"LongDescription\",, \"T\"))","v":"Becton Dickinson & Co"}]
["S.US.BEN",{"$f":"IF(A52=\"\",\"\",RTD(\"cqg.rtd\", ,\"ContractData\",A52, \"LongDescription\",, \"T\"))","v":"Franklin Resources Inc"}]
["S.US.BFB",{"$f":"IF(A53=\"\",\"\",RTD(\"cqg.rtd\", ,\"ContractData\",A53, \"LongDescription\",, \"T\"))","v":"Brown-Forman Corporation ClsB"}]
["S.US.BG",{"$f":"IF(A54=\"\",\"\",RTD(\"cqg.rtd\", ,\"ContractData\",A54, \"LongDescription\",, \"T\"))","v":"Bunge Limited"}]
["S.US.BIIB",{"$f":"IF(A55=\"\",\"\",RTD(\"cqg.rtd\", ,\"ContractData\",A55, \"LongDescription\",, \"T\"))","v":"BIOGEN INC CMN"}]
["S.US.BKR",{"$f":"IF(A56=\"\",\"\",RTD(\"cqg.rtd\", ,\"ContractData\",A56, \"LongDescription\",, \"T\"))","v":"BAKER HUGHES CO"}]
["S.US.BLDR",{"$f":"IF(A57=\"\",\"\",RTD(\"cqg.rtd\", ,\"ContractData\",A57, \"LongDescription\",, \"T\"))","v":"Builders FirstSource Inc"}]
["S.US.BLK",{"$f":"IF(A58=\"\",\"\",RTD(\"cqg.rtd\", ,\"ContractData\",A58, \"LongDescription\",, \"T\"))","v":"BlackRock, Inc."}]
["S.US.BMY",{"$f":"IF(A59=\"\",\"\",RTD(\"cqg.rtd\", ,\"ContractData\",A59, \"LongDescription\",, \"T\"))","v":"Bristol-Myers Squibb Co"}]
["S.US.BNY",{"$f":"IF(A60=\"\",\"\",RTD(\"cqg.rtd\", ,\"ContractData\",A60, \"LongDescription\",, \"T\"))","v":"Bank of New York Co Inc"}]
["S.US.BR",{"$f":"IF(A61=\"\",\"\",RTD(\"cqg.rtd\", ,\"ContractData\",A61, \"LongDescription\",, \"T\"))","v":"Broadridge Financial Solutions"}]
["S.US.BRO",{"$f":"IF(A62=\"\",\"\",RTD(\"cqg.rtd\", ,\"ContractData\",A62, \"LongDescription\",, \"T\"))","v":"BROWN AND BROWN INC"}]
["S.US.BSX",{"$f":"IF(A63=\"\",\"\",RTD(\"cqg.rtd\", ,\"ContractData\",A63, \"LongDescription\",, \"T\"))","v":"Boston Scientific Corp"}]
["S.US.BX",{"$f":"IF(A64=\"\",\"\",RTD(\"cqg.rtd\", ,\"ContractData\",A64, \"LongDescription\",, \"T\"))","v":"Blackstone Inc."}]
["S.US.BXP",{"$f":"IF(A65=\"\",\"\",RTD(\"cqg.rtd\", ,\"ContractData\",A65, \"LongDescription\",, \"T\"))","v":"BXP, Inc."}]
["S.US.C",{"$f":"IF(A66=\"\",\"\",RTD(\"cqg.rtd\", ,\"ContractData\",A66, \"LongDescription\",, \"T\"))","v":"Citigroup Inc"}]
["S.US.CAH",{"$f":"IF(A67=\"\",\"\",RTD(\"cqg.rtd\", ,\"ContractData\",A67, \"LongDescription\",, \"T\"))","v":"Cardinal Health Inc"}]
["S.US.CARR",{"$f":"IF(A68=\"\",\"\",RTD(\"cqg.rtd\", ,\"ContractData\",A68, \"LongDescription\",, \"T\"))","v":"Carrier Global Corporation"}]
["S.US.CB",{"$f":"IF(A69=\"\",\"\",RTD(\"cqg.rtd\", ,\"ContractData\",A69, \"LongDescription\",, \"T\"))","v":"Chubb Limited"}]
["S.US.CBOE",{"$f":"IF(A70=\"\",\"\",RTD(\"cqg.rtd\", ,\"ContractData\",A70, \"LongDescription\",, \"T\"))","v":"Cboe Global Markets, Inc."}]
["S.US.CBRE",{"$f":"IF(A71=\"\",\"\",RTD(\"cqg.rtd\", ,\"ContractData\",A71, \"LongDescription\",, \"T\"))","v":"CBRE Group, Inc."}]
["S.US.CCI",{"$f":"IF(A72=\"\",\"\",RTD(\"cqg.rtd\", ,\"ContractData\",A72, \"LongDescription\",, \"T\"))","v":"Crown Castle Intl"}]
["S.US.CDNS",{"$f":"IF(A73=\"\",\"\",RTD(\"cqg.rtd\", ,\"ContractData\",A73, \"LongDescription\",, \"T\"))","v":"CADENCE DESIGN SYS"}]
["S.US.CDW",{"$f":"IF(A74=\"\",\"\",RTD(\"cqg.rtd\", ,\"ContractData\",A74, \"LongDescription\",, \"T\"))","v":"CDW Corporation"}]
["S.US.CEG",{"$f":"IF(A75=\"\",\"\",RTD(\"cqg.rtd\", ,\"ContractData\",A75, \"LongDescription\",, \"T\"))","v":"CONSTELLATION EN CM"}]
["S.US.CF",{"$f":"IF(A76=\"\",\"\",RTD(\"cqg.rtd\", ,\"ContractData\",A76, \"LongDescription\",, \"T\"))","v":"CF Industries Holdings, Inc"}]
["S.US.CFG",{"$f":"IF(A77=\"\",\"\",RTD(\"cqg.rtd\", ,\"ContractData\",A77, \"LongDescription\",, \"T\"))","v":"Citizens Financial Group, Inc."}]
["S.US.CHD",{"$f":"IF(A78=\"\",\"\",RTD(\"cqg.rtd\", ,\"ContractData\",A78, \"LongDescription\",, \"T\"))","v":"Church/Dwight Co Inc"}]
["S.US.CHRW",{"$f":"IF(A79=\"\",\"\",RTD(\"cqg.rtd\", ,\"ContractData\",A79, \"LongDescription\",, \"T\"))","v":"C.H. ROBINSON WW"}]
["S.US.CHTR",{"$f":"IF(A80=\"\",\"\",RTD(\"cqg.rtd\", ,\"ContractData\",A80, \"LongDescription\",, \"T\"))","v":"CHARTER COMMUNICATIO"}]
["S.US.CI",{"$f":"IF(A81=\"\",\"\",RTD(\"cqg.rtd\", ,\"ContractData\",A81, \"LongDescription\",, \"T\"))","v":"The Cigna Group"}]
["S.US.CINF",{"$f":"IF(A82=\"\",\"\",RTD(\"cqg.rtd\", ,\"ContractData\",A82, \"LongDescription\",, \"T\"))","v":"CINCINNATI FINANCIAL"}]
["S.US.CL",{"$f":"IF(A83=\"\",\"\",RTD(\"cqg.rtd\", ,\"ContractData\",A83, \"LongDescription\",, \"T\"))","v":"Colgate-Palmolive Co"}]
["S.US.CLX",{"$f":"IF(A84=\"\",\"\",RTD(\"cqg.rtd\", ,\"ContractData\",A84, \"LongDescription\",, \"T\"))","v":"Clorox Company"}]
["S.US.CMCSA",{"$f":"IF(A85=\"\",\"\",RTD(\"cqg.rtd\", ,\"ContractData\",A85, \"LongDescription\",, \"T\"))","v":"COMCAST CORP A"}]
["S.US.CME",{"$f":"IF(A86=\"\",\"\",RTD(\"cqg.rtd\", ,\"ContractData\",A86, \"LongDescription\",, \"T\"))","v":"CME GROUP INC"}]
["S.US.CMG",{"$f":"IF(A87=\"\",\"\",RTD(\"cqg.rtd\", ,\"ContractData\",A87, \"LongDescription\",, \"T\"))","v":"Chipotle Mexican Grill"}]
["S.US.CMI",{"$f":"IF(A88=\"\",\"\",RTD(\"cqg.rtd\", ,\"ContractData\",A88, \"LongDescription\",, \"T\"))","v":"Cummins Inc"}]
["S.US.CMS",{"$f":"IF(A89=\"\",\"\",RTD(\"cqg.rtd\", ,\"ContractData\",A89, \"LongDescription\",, \"T\"))","v":"CMS Energy Corporation"}]
["S.US.CNC",{"$f":"IF(A90=\"\",\"\",RTD(\"cqg.rtd\", ,\"ContractData\",A90, \"LongDescription\",, \"T\"))","v":"Cenetene Corporation"}]
["S.US.CNP",{"$f":"IF(A91=\"\",\"\",RTD(\"cqg.rtd\", ,\"ContractData\",A91, \"LongDescription\",, \"T\"))","v":"Centerpoint Energy Holding Co."}]
["S.US.COF",{"$f":"IF(A92=\"\",\"\",RTD(\"cqg.rtd\", ,\"ContractData\",A92, \"LongDescription\",, \"T\"))","v":"Capital One Financl Corp"}]
["S.US.COIN",{"$f":"IF(A93=\"\",\"\",RTD(\"cqg.rtd\", ,\"ContractData\",A93, \"LongDescription\",, \"T\"))","v":"COINBASE GLB CL A CM"}]
["S.US.COO",{"$f":"IF(A94=\"\",\"\",RTD(\"cqg.rtd\", ,\"ContractData\",A94, \"LongDescription\",, \"T\"))","v":"THE COOPER CO INC CM"}]
["S.US.COP",{"$f":"IF(A95=\"\",\"\",RTD(\"cqg.rtd\", ,\"ContractData\",A95, \"LongDescription\",, \"T\"))","v":"ConocoPhillips"}]
["S.US.COR",{"$f":"IF(A96=\"\",\"\",RTD(\"cqg.rtd\", ,\"ContractData\",A96, \"LongDescription\",, \"T\"))","v":"Cencora Inc."}]
["S.US.COST",{"$f":"IF(A97=\"\",\"\",RTD(\"cqg.rtd\", ,\"ContractData\",A97, \"LongDescription\",, \"T\"))","v":"COSTCO WHOLESALE"}]
["S.US.CPAY",{"$f":"IF(A98=\"\",\"\",RTD(\"cqg.rtd\", ,\"ContractData\",A98, \"LongDescription\",, \"T\"))","v":"Corpay, Inc."}]
["S.US.CPRT",{"$f":"IF(A99=\"\",\"\",RTD(\"cqg.rtd\", ,\"ContractData\",A99, \"LongDescription\",, \"T\"))","v":"COPART, INC."}]
["S.US.CPT",{"$f":"IF(A100=\"\",\"\",RTD(\"cqg.rtd\", ,\"ContractData\",A100, \"LongDescription\",, \"T\"))","v":"Camden Property Trust"}]
["S.US.CRH",{"$f":"IF(A101=\"\",\"\",RTD(\"cqg.rtd\", ,\"ContractData\",A101, \"LongDescription\",, \"T\"))","v":"CRH Public Limited Company"}]
["S.US.CRL",{"$f":"IF(A102=\"\",\"\",RTD(\"cqg.rtd\", ,\"ContractData\",A102, \"LongDescription\",, \"T\"))","v":"Charles River Labs Hldgs Inc"}]
["S.US.CRM",{"$f":"IF(A103=\"\",\"\",RTD(\"cqg.rtd\", ,\"ContractData\",A103, \"LongDescription\",, \"T\"))","v":"Salesforce, Inc."}]
["S.US.CSCO",{"$f":"IF(A104=\"\",\"\",RTD(\"cqg.rtd\", ,\"ContractData\",A104, \"LongDescription\",, \"T\"))","v":"CISCO SYSTEMS INC."}]
["S.US.CSGP",{"$f":"IF(A105=\"\",\"\",RTD(\"cqg.rtd\", ,\"ContractData\",A105, \"LongDescription\",, \"T\"))","v":"COSTAR GROUP INC ##"}]
["S.US.CSX",{"$f":"IF(A106=\"\",\"\",RTD(\"cqg.rtd\", ,\"ContractData\",A106, \"LongDescription\",, \"T\"))","v":"CSX Corporation"}]
["S.US.CTAS",{"$f":"IF(A107=\"\",\"\",RTD(\"cqg.rtd\", ,\"ContractData\",A107, \"LongDescription\",, \"T\"))","v":"Cintas Corp"}]
["S.US.CTSH",{"$f":"IF(A108=\"\",\"\",RTD(\"cqg.rtd\", ,\"ContractData\",A108, \"LongDescription\",, \"T\"))","v":"COGNIZANT TECH SOL"}]
["S.US.CTVA",{"$f":"IF(A109=\"\",\"\",RTD(\"cqg.rtd\", ,\"ContractData\",A109, \"LongDescription\",, \"T\"))","v":"Corteva Inc"}]
["S.US.CVNA",{"$f":"IF(A110=\"\",\"\",RTD(\"cqg.rtd\", ,\"ContractData\",A110, \"LongDescription\",, \"T\"))","v":"Carvana Co."}]
["S.US.CVS",{"$f":"IF(A111=\"\",\"\",RTD(\"cqg.rtd\", ,\"ContractData\",A111, \"LongDescription\",, \"T\"))","v":"CVS Health Corporation"}]
["S.US.CVX",{"$f":"IF(A112=\"\",\"\",RTD(\"cqg.rtd\", ,\"ContractData\",A112, \"LongDescription\",, \"T\"))","v":"Chevron Corp"}]
["S.US.D",{"$f":"IF(A113=\"\",\"\",RTD(\"cqg.rtd\", ,\"ContractData\",A113, \"LongDescription\",, \"T\"))","v":"Dominion Energy, Inc."}]
["S.US.DAL",{"$f":"IF(A114=\"\",\"\",RTD(\"cqg.rtd\", ,\"ContractData\",A114, \"LongDescription\",, \"T\"))","v":"Delta Airlines, Inc."}]
["S.US.DD",{"$f":"IF(A115=\"\",\"\",RTD(\"cqg.rtd\", ,\"ContractData\",A115, \"LongDescription\",, \"T\"))","v":"E.I. du Pont de Nemours and Co. (DuPont)"}]
["S.US.DE",{"$f":"IF(A116=\"\",\"\",RTD(\"cqg.rtd\", ,\"ContractData\",A116, \"LongDescription\",, \"T\"))","v":"Deere & Company"}]
["S.US.DECK",{"$f":"IF(A117=\"\",\"\",RTD(\"cqg.rtd\", ,\"ContractData\",A117, \"LongDescription\",, \"T\"))","v":"Deckers Outdoor Corp"}]
["S.US.DELL",{"$f":"IF(A118=\"\",\"\",RTD(\"cqg.rtd\", ,\"ContractData\",A118, \"LongDescription\",, \"T\"))","v":"Dell Technologies Inc."}]
["S.US.DG",{"$f":"IF(A119=\"\",\"\",RTD(\"cqg.rtd\", ,\"ContractData\",A119, \"LongDescription\",, \"T\"))","v":"Dollar General Corporation"}]
["S.US.DGX",{"$f":"IF(A120=\"\",\"\",RTD(\"cqg.rtd\", ,\"ContractData\",A120, \"LongDescription\",, \"T\"))","v":"Quest Diagnostics Inc"}]
["S.US.DHI",{"$f":"IF(A121=\"\",\"\",RTD(\"cqg.rtd\", ,\"ContractData\",A121, \"LongDescription\",, \"T\"))","v":"DR Horton Inc"}]
["S.US.DHR",{"$f":"IF(A122=\"\",\"\",RTD(\"cqg.rtd\", ,\"ContractData\",A122, \"LongDescription\",, \"T\"))","v":"Danaher Corporation"}]
["S.US.DIS",{"$f":"IF(A123=\"\",\"\",RTD(\"cqg.rtd\", ,\"ContractData\",A123, \"LongDescription\",, \"T\"))","v":"The Walt Disney Company"}]
["S.US.DLR",{"$f":"IF(A124=\"\",\"\",RTD(\"cqg.rtd\", ,\"ContractData\",A124, \"LongDescription\",, \"T\"))","v":"Digital Realty"}]
["S.US.DLTR",{"$f":"IF(A125=\"\",\"\",RTD(\"cqg.rtd\", ,\"ContractData\",A125, \"LongDescription\",, \"T\"))","v":"DOLLAR TREE INC"}]
["S.US.DOC",{"$f":"IF(A126=\"\",\"\",RTD(\"cqg.rtd\", ,\"ContractData\",A126, \"LongDescription\",, \"T\"))","v":"Healthpeak Properties, Inc."}]
["S.US.DOV",{"$f":"IF(A127=\"\",\"\",RTD(\"cqg.rtd\", ,\"ContractData\",A127, \"LongDescription\",, \"T\"))","v":"Dover Corporation"}]
["S.US.DOW",{"$f":"IF(A128=\"\",\"\",RTD(\"cqg.rtd\", ,\"ContractData\",A128, \"LongDescription\",, \"T\"))","v":"Dow Inc."}]
["S.US.DPZ",{"$f":"IF(A129=\"\",\"\",RTD(\"cqg.rtd\", ,\"ContractData\",A129, \"LongDescription\",, \"T\"))","v":"DOMINOS PIZZA INC CM"}]
["S.US.DRI",{"$f":"IF(A130=\"\",\"\",RTD(\"cqg.rtd\", ,\"ContractData\",A130, \"LongDescription\",, \"T\"))","v":"Darden Restaurants Inc"}]
["S.US.DTE",{"$f":"IF(A131=\"\",\"\",RTD(\"cqg.rtd\", ,\"ContractData\",A131, \"LongDescription\",, \"T\"))","v":"DTE Energy Corp"}]
["S.US.DUK",{"$f":"IF(A132=\"\",\"\",RTD(\"cqg.rtd\", ,\"ContractData\",A132, \"LongDescription\",, \"T\"))","v":"Duke Energy Corp"}]
["S.US.DVA",{"$f":"IF(A133=\"\",\"\",RTD(\"cqg.rtd\", ,\"ContractData\",A133, \"LongDescription\",, \"T\"))","v":"DaVita Inc."}]
["S.US.DVN",{"$f":"IF(A134=\"\",\"\",RTD(\"cqg.rtd\", ,\"ContractData\",A134, \"LongDescription\",, \"T\"))","v":"Devon Energy Corp"}]
["S.US.DXCM",{"$f":"IF(A135=\"\",\"\",RTD(\"cqg.rtd\", ,\"ContractData\",A135, \"LongDescription\",, \"T\"))","v":"DEXCOM"}]
["S.US.EBAY",{"$f":"IF(A136=\"\",\"\",RTD(\"cqg.rtd\", ,\"ContractData\",A136, \"LongDescription\",, \"T\"))","v":"EBAY INC."}]
["S.US.ECL",{"$f":"IF(A137=\"\",\"\",RTD(\"cqg.rtd\", ,\"ContractData\",A137, \"LongDescription\",, \"T\"))","v":"Ecolab Inc"}]
["S.US.ED",{"$f":"IF(A138=\"\",\"\",RTD(\"cqg.rtd\", ,\"ContractData\",A138, \"LongDescription\",, \"T\"))","v":"Consol Edison Hldg Co"}]
["S.US.EFX",{"$f":"IF(A139=\"\",\"\",RTD(\"cqg.rtd\", ,\"ContractData\",A139, \"LongDescription\",, \"T\"))","v":"Equifax Inc"}]
["S.US.EG",{"$f":"IF(A140=\"\",\"\",RTD(\"cqg.rtd\", ,\"ContractData\",A140, \"LongDescription\",, \"T\"))","v":"Everest Group, Ltd."}]
["S.US.EIX",{"$f":"IF(A141=\"\",\"\",RTD(\"cqg.rtd\", ,\"ContractData\",A141, \"LongDescription\",, \"T\"))","v":"Edison International"}]
["S.US.EL",{"$f":"IF(A142=\"\",\"\",RTD(\"cqg.rtd\", ,\"ContractData\",A142, \"LongDescription\",, \"T\"))","v":"Estee Lauder Companies"}]
["S.US.ELV",{"$f":"IF(A143=\"\",\"\",RTD(\"cqg.rtd\", ,\"ContractData\",A143, \"LongDescription\",, \"T\"))","v":"Elevance Health, Inc."}]
["S.US.EMR",{"$f":"IF(A144=\"\",\"\",RTD(\"cqg.rtd\", ,\"ContractData\",A144, \"LongDescription\",, \"T\"))","v":"Emerson Electric Co"}]
["S.US.EOG",{"$f":"IF(A145=\"\",\"\",RTD(\"cqg.rtd\", ,\"ContractData\",A145, \"LongDescription\",, \"T\"))","v":"EOG Resources"}]
["S.US.EQIX",{"$f":"IF(A146=\"\",\"\",RTD(\"cqg.rtd\", ,\"ContractData\",A146, \"LongDescription\",, \"T\"))","v":"EQUINIX, INC."}]
["S.US.EQR",{"$f":"IF(A147=\"\",\"\",RTD(\"cqg.rtd\", ,\"ContractData\",A147, \"LongDescription\",, \"T\"))","v":"Equity Residential Properties Trust"}]
["S.US.EQT",{"$f":"IF(A148=\"\",\"\",RTD(\"cqg.rtd\", ,\"ContractData\",A148, \"LongDescription\",, \"T\"))","v":"EQT Corp"}]
["S.US.ERIE",{"$f":"IF(A149=\"\",\"\",RTD(\"cqg.rtd\", ,\"ContractData\",A149, \"LongDescription\",, \"T\"))","v":"Erie Indemnity Co"}]
["S.US.ES",{"$f":"IF(A150=\"\",\"\",RTD(\"cqg.rtd\", ,\"ContractData\",A150, \"LongDescription\",, \"T\"))","v":"Eversource Energy"}]
["S.US.ESS",{"$f":"IF(A151=\"\",\"\",RTD(\"cqg.rtd\", ,\"ContractData\",A151, \"LongDescription\",, \"T\"))","v":"Essex Property Trust Inc"}]
["S.US.ETN",{"$f":"IF(A152=\"\",\"\",RTD(\"cqg.rtd\", ,\"ContractData\",A152, \"LongDescription\",, \"T\"))","v":"Eaton Corporation"}]
["S.US.ETR",{"$f":"IF(A153=\"\",\"\",RTD(\"cqg.rtd\", ,\"ContractData\",A153, \"LongDescription\",, \"T\"))","v":"Entergy Corporation"}]
["S.US.EVRG",{"$f":"IF(A154=\"\",\"\",RTD(\"cqg.rtd\", ,\"ContractData\",A154, \"LongDescription\",, \"T\"))","v":"Evergy, Inc."}]
["S.US.EW",{"$f":"IF(A155=\"\",\"\",RTD(\"cqg.rtd\", ,\"ContractData\",A155, \"LongDescription\",, \"T\"))","v":"Edwards LifeSciences"}]
["S.US.EXC",{"$f":"IF(A156=\"\",\"\",RTD(\"cqg.rtd\", ,\"ContractData\",A156, \"LongDescription\",, \"T\"))","v":"EXELON CORP CMN STK"}]
["S.US.EXE",{"$f":"IF(A157=\"\",\"\",RTD(\"cqg.rtd\", ,\"ContractData\",A157, \"LongDescription\",, \"T\"))","v":"EXPAND ENERGY COR CS"}]
["S.US.EXPD",{"$f":"IF(A158=\"\",\"\",RTD(\"cqg.rtd\", ,\"ContractData\",A158, \"LongDescription\",, \"T\"))","v":"Expeditors Intl of WA Inc"}]
["S.US.EXR",{"$f":"IF(A159=\"\",\"\",RTD(\"cqg.rtd\", ,\"ContractData\",A159, \"LongDescription\",, \"T\"))","v":"Extra Space Storage Inc"}]
["S.US.F",{"$f":"IF(A160=\"\",\"\",RTD(\"cqg.rtd\", ,\"ContractData\",A160, \"LongDescription\",, \"T\"))","v":"Ford Motor Company"}]
["S.US.FANG",{"$f":"IF(A161=\"\",\"\",RTD(\"cqg.rtd\", ,\"ContractData\",A161, \"LongDescription\",, \"T\"))","v":"DIAMONDBACK ENERGY"}]
["S.US.FAST",{"$f":"IF(A162=\"\",\"\",RTD(\"cqg.rtd\", ,\"ContractData\",A162, \"LongDescription\",, \"T\"))","v":"Fastenal Co"}]
["S.US.FCX",{"$f":"IF(A163=\"\",\"\",RTD(\"cqg.rtd\", ,\"ContractData\",A163, \"LongDescription\",, \"T\"))","v":"Freeport-McMoRan Inc."}]
["S.US.FDS",{"$f":"IF(A164=\"\",\"\",RTD(\"cqg.rtd\", ,\"ContractData\",A164, \"LongDescription\",, \"T\"))","v":"Factet Research"}]
["S.US.FDX",{"$f":"IF(A165=\"\",\"\",RTD(\"cqg.rtd\", ,\"ContractData\",A165, \"LongDescription\",, \"T\"))","v":"FedEx Corp"}]
["S.US.FDXF",{"$f":"IF(A166=\"\",\"\",RTD(\"cqg.rtd\", ,\"ContractData\",A166, \"LongDescription\",, \"T\"))","v":"FedEx Freight Holding Company, Inc."}]
["S.US.FE",{"$f":"IF(A167=\"\",\"\",RTD(\"cqg.rtd\", ,\"ContractData\",A167, \"LongDescription\",, \"T\"))","v":"FirstEnergy Corp"}]
["S.US.FERG",{"$f":"IF(A168=\"\",\"\",RTD(\"cqg.rtd\", ,\"ContractData\",A168, \"LongDescription\",, \"T\"))","v":"Ferguson plc"}]
["S.US.FFIV",{"$f":"IF(A169=\"\",\"\",RTD(\"cqg.rtd\", ,\"ContractData\",A169, \"LongDescription\",, \"T\"))","v":"F5, INC. COMMON STK"}]
["S.US.FICO",{"$f":"IF(A170=\"\",\"\",RTD(\"cqg.rtd\", ,\"ContractData\",A170, \"LongDescription\",, \"T\"))","v":"Fair Isaac Inc"}]
["S.US.FIS",{"$f":"IF(A171=\"\",\"\",RTD(\"cqg.rtd\", ,\"ContractData\",A171, \"LongDescription\",, \"T\"))","v":"Fidelity National Info Services"}]
["S.US.FISV",{"$f":"IF(A172=\"\",\"\",RTD(\"cqg.rtd\", ,\"ContractData\",A172, \"LongDescription\",, \"T\"))","v":"FISERV, INC. CMN STK"}]
["S.US.FITB",{"$f":"IF(A173=\"\",\"\",RTD(\"cqg.rtd\", ,\"ContractData\",A173, \"LongDescription\",, \"T\"))","v":"FIFTH THIRD BNCP"}]
["S.US.FOX",{"$f":"IF(A174=\"\",\"\",RTD(\"cqg.rtd\", ,\"ContractData\",A174, \"LongDescription\",, \"T\"))","v":"FOX CORP CM B"}]
["S.US.FOXA",{"$f":"IF(A175=\"\",\"\",RTD(\"cqg.rtd\", ,\"ContractData\",A175, \"LongDescription\",, \"T\"))","v":"FOX CORP CM A"}]
["S.US.FRT",{"$f":"IF(A176=\"\",\"\",RTD(\"cqg.rtd\", ,\"ContractData\",A176, \"LongDescription\",, \"T\"))","v":"Federal Realty Invstmt Trst"}]
["S.US.FTNT",{"$f":"IF(A177=\"\",\"\",RTD(\"cqg.rtd\", ,\"ContractData\",A177, \"LongDescription\",, \"T\"))","v":"Fortinet, Inc."}]
["S.US.FTV",{"$f":"IF(A178=\"\",\"\",RTD(\"cqg.rtd\", ,\"ContractData\",A178, \"LongDescription\",, \"T\"))","v":"Fortive Corporation"}]
["S.US.GD",{"$f":"IF(A179=\"\",\"\",RTD(\"cqg.rtd\", ,\"ContractData\",A179, \"LongDescription\",, \"T\"))","v":"General Dynamics Corp"}]
["S.US.GDDY",{"$f":"IF(A180=\"\",\"\",RTD(\"cqg.rtd\", ,\"ContractData\",A180, \"LongDescription\",, \"T\"))","v":"GoDaddy Inc."}]
["S.US.GE",{"$f":"IF(A181=\"\",\"\",RTD(\"cqg.rtd\", ,\"ContractData\",A181, \"LongDescription\",, \"T\"))","v":"General Electric Co"}]
["S.US.GEHC",{"$f":"IF(A182=\"\",\"\",RTD(\"cqg.rtd\", ,\"ContractData\",A182, \"LongDescription\",, \"T\"))","v":"GE HEALTHCARE CM"}]
["S.US.GEN",{"$f":"IF(A183=\"\",\"\",RTD(\"cqg.rtd\", ,\"ContractData\",A183, \"LongDescription\",, \"T\"))","v":"GEN DIGITAL INC. CMN"}]
["S.US.GILD",{"$f":"IF(A184=\"\",\"\",RTD(\"cqg.rtd\", ,\"ContractData\",A184, \"LongDescription\",, \"T\"))","v":"GILEAD SCIENCES, INC"}]
["S.US.GIS",{"$f":"IF(A185=\"\",\"\",RTD(\"cqg.rtd\", ,\"ContractData\",A185, \"LongDescription\",, \"T\"))","v":"General Mills Inc"}]
["S.US.GL",{"$f":"IF(A186=\"\",\"\",RTD(\"cqg.rtd\", ,\"ContractData\",A186, \"LongDescription\",, \"T\"))","v":"Globe Life Inc."}]
["S.US.GLW",{"$f":"IF(A187=\"\",\"\",RTD(\"cqg.rtd\", ,\"ContractData\",A187, \"LongDescription\",, \"T\"))","v":"Corning Incorporated"}]
["S.US.GM",{"$f":"IF(A188=\"\",\"\",RTD(\"cqg.rtd\", ,\"ContractData\",A188, \"LongDescription\",, \"T\"))","v":"General Motors Company"}]
["S.US.GNRC",{"$f":"IF(A189=\"\",\"\",RTD(\"cqg.rtd\", ,\"ContractData\",A189, \"LongDescription\",, \"T\"))","v":"Generac Holdings Inc."}]
["S.US.GPC",{"$f":"IF(A190=\"\",\"\",RTD(\"cqg.rtd\", ,\"ContractData\",A190, \"LongDescription\",, \"T\"))","v":"Genuine Parts Company"}]
["S.US.GPN",{"$f":"IF(A191=\"\",\"\",RTD(\"cqg.rtd\", ,\"ContractData\",A191, \"LongDescription\",, \"T\"))","v":"Global Payments"}]
["S.US.GRMN",{"$f":"IF(A192=\"\",\"\",RTD(\"cqg.rtd\", ,\"ContractData\",A192, \"LongDescription\",, \"T\"))","v":"Garmin Ltd"}]
["S.US.GS",{"$f":"IF(A193=\"\",\"\",RTD(\"cqg.rtd\", ,\"ContractData\",A193, \"LongDescription\",, \"T\"))","v":"Goldman Sachs Group"}]
["S.US.GWW",{"$f":"IF(A194=\"\",\"\",RTD(\"cqg.rtd\", ,\"ContractData\",A194, \"LongDescription\",, \"T\"))","v":"Grainger (WW) Inc"}]
["S.US.HAL",{"$f":"IF(A195=\"\",\"\",RTD(\"cqg.rtd\", ,\"ContractData\",A195, \"LongDescription\",, \"T\"))","v":"Halliburton Company"}]
["S.US.HAS",{"$f":"IF(A196=\"\",\"\",RTD(\"cqg.rtd\", ,\"ContractData\",A196, \"LongDescription\",, \"T\"))","v":"Hasbro Inc"}]
["S.US.HBAN",{"$f":"IF(A197=\"\",\"\",RTD(\"cqg.rtd\", ,\"ContractData\",A197, \"LongDescription\",, \"T\"))","v":"HUNTINGTON BCSHS"}]
["S.US.HD",{"$f":"IF(A198=\"\",\"\",RTD(\"cqg.rtd\", ,\"ContractData\",A198, \"LongDescription\",, \"T\"))","v":"Home Depot, Inc."}]
["S.US.HIG",{"$f":"IF(A199=\"\",\"\",RTD(\"cqg.rtd\", ,\"ContractData\",A199, \"LongDescription\",, \"T\"))","v":"The Hartford Insurance Group, Inc."}]
["S.US.HII",{"$f":"IF(A200=\"\",\"\",RTD(\"cqg.rtd\", ,\"ContractData\",A200, \"LongDescription\",, \"T\"))","v":"Huntington Ingalls Industries"}]
["S.US.HON",{"$f":"IF(A201=\"\",\"\",RTD(\"cqg.rtd\", ,\"ContractData\",A201, \"LongDescription\",, \"T\"))","v":"HONEYWELL INTL INC"}]
["S.US.HONA",{"$f":"IF(A202=\"\",\"\",RTD(\"cqg.rtd\", ,\"ContractData\",A202, \"LongDescription\",, \"T\"))","v":"Honeywell Aerospace Inc"}]
["S.US.HPE",{"$f":"IF(A203=\"\",\"\",RTD(\"cqg.rtd\", ,\"ContractData\",A203, \"LongDescription\",, \"T\"))","v":"Hewlett Packard Enterprise Company"}]
["S.US.HPQ",{"$f":"IF(A204=\"\",\"\",RTD(\"cqg.rtd\", ,\"ContractData\",A204, \"LongDescription\",, \"T\"))","v":"Hewlett-Packard Company"}]
["S.US.HRL",{"$f":"IF(A205=\"\",\"\",RTD(\"cqg.rtd\", ,\"ContractData\",A205, \"LongDescription\",, \"T\"))","v":"Hormel Foods Corp"}]
["S.US.HSIC",{"$f":"IF(A206=\"\",\"\",RTD(\"cqg.rtd\", ,\"ContractData\",A206, \"LongDescription\",, \"T\"))","v":"Henry Schein Inc"}]
["S.US.HST",{"$f":"IF(A207=\"\",\"\",RTD(\"cqg.rtd\", ,\"ContractData\",A207, \"LongDescription\",, \"T\"))","v":"HOST HTLS & RSRT CM"}]
["S.US.HSY",{"$f":"IF(A208=\"\",\"\",RTD(\"cqg.rtd\", ,\"ContractData\",A208, \"LongDescription\",, \"T\"))","v":"Hershey Foods Corp"}]
["S.US.HUBB",{"$f":"IF(A209=\"\",\"\",RTD(\"cqg.rtd\", ,\"ContractData\",A209, \"LongDescription\",, \"T\"))","v":"Hubbell Inc Cls B"}]
["S.US.HUM",{"$f":"IF(A210=\"\",\"\",RTD(\"cqg.rtd\", ,\"ContractData\",A210, \"LongDescription\",, \"T\"))","v":"Humana Inc"}]
["S.US.IBM",{"$f":"IF(A211=\"\",\"\",RTD(\"cqg.rtd\", ,\"ContractData\",A211, \"LongDescription\",, \"T\"))","v":"International Business Machines"}]
["S.US.ICE",{"$f":"IF(A212=\"\",\"\",RTD(\"cqg.rtd\", ,\"ContractData\",A212, \"LongDescription\",, \"T\"))","v":"Intercontinental, Inc."}]
["S.US.IEX",{"$f":"IF(A213=\"\",\"\",RTD(\"cqg.rtd\", ,\"ContractData\",A213, \"LongDescription\",, \"T\"))","v":"Idex Corp"}]
["S.US.IFF",{"$f":"IF(A214=\"\",\"\",RTD(\"cqg.rtd\", ,\"ContractData\",A214, \"LongDescription\",, \"T\"))","v":"Intl Flvrs & Fragrances"}]
["S.US.INTC",{"$f":"IF(A215=\"\",\"\",RTD(\"cqg.rtd\", ,\"ContractData\",A215, \"LongDescription\",, \"T\"))","v":"INTEL CORP"}]
["S.US.INTU",{"$f":"IF(A216=\"\",\"\",RTD(\"cqg.rtd\", ,\"ContractData\",A216, \"LongDescription\",, \"T\"))","v":"INTUIT INC"}]
["S.US.INVH",{"$f":"IF(A217=\"\",\"\",RTD(\"cqg.rtd\", ,\"ContractData\",A217, \"LongDescription\",, \"T\"))","v":"Invitation Homes Inc."}]
["S.US.IP",{"$f":"IF(A218=\"\",\"\",RTD(\"cqg.rtd\", ,\"ContractData\",A218, \"LongDescription\",, \"T\"))","v":"International Paper Co"}]
["S.US.IQV",{"$f":"IF(A219=\"\",\"\",RTD(\"cqg.rtd\", ,\"ContractData\",A219, \"LongDescription\",, \"T\"))","v":"IQVIA Holdings, Inc."}]
["S.US.IR",{"$f":"IF(A220=\"\",\"\",RTD(\"cqg.rtd\", ,\"ContractData\",A220, \"LongDescription\",, \"T\"))","v":"Ingersoll Rand Inc."}]
["S.US.IRM",{"$f":"IF(A221=\"\",\"\",RTD(\"cqg.rtd\", ,\"ContractData\",A221, \"LongDescription\",, \"T\"))","v":"Iron Mountain Inc"}]
["S.US.IT",{"$f":"IF(A222=\"\",\"\",RTD(\"cqg.rtd\", ,\"ContractData\",A222, \"LongDescription\",, \"T\"))","v":"Gartner Group"}]
["S.US.ITW",{"$f":"IF(A223=\"\",\"\",RTD(\"cqg.rtd\", ,\"ContractData\",A223, \"LongDescription\",, \"T\"))","v":"Illinois Tools Works Inc"}]
["S.US.IVZ",{"$f":"IF(A224=\"\",\"\",RTD(\"cqg.rtd\", ,\"ContractData\",A224, \"LongDescription\",, \"T\"))","v":"Invesco Ltd."}]
["S.US.J",{"$f":"IF(A225=\"\",\"\",RTD(\"cqg.rtd\", ,\"ContractData\",A225, \"LongDescription\",, \"T\"))","v":"Jacobs Solutions Inc."}]
["S.US.JBHT",{"$f":"IF(A226=\"\",\"\",RTD(\"cqg.rtd\", ,\"ContractData\",A226, \"LongDescription\",, \"T\"))","v":"J B HUNT TRANSPORT C"}]
["S.US.JBL",{"$f":"IF(A227=\"\",\"\",RTD(\"cqg.rtd\", ,\"ContractData\",A227, \"LongDescription\",, \"T\"))","v":"Jabil Inc."}]
["S.US.JCI",{"$f":"IF(A228=\"\",\"\",RTD(\"cqg.rtd\", ,\"ContractData\",A228, \"LongDescription\",, \"T\"))","v":"Johnson Controls International plc"}]
["S.US.JKHY",{"$f":"IF(A229=\"\",\"\",RTD(\"cqg.rtd\", ,\"ContractData\",A229, \"LongDescription\",, \"T\"))","v":"JACK HENRY & ASSOC"}]
["S.US.JNJ",{"$f":"IF(A230=\"\",\"\",RTD(\"cqg.rtd\", ,\"ContractData\",A230, \"LongDescription\",, \"T\"))","v":"Johnson & Johnson"}]
["S.US.JPM",{"$f":"IF(A231=\"\",\"\",RTD(\"cqg.rtd\", ,\"ContractData\",A231, \"LongDescription\",, \"T\"))","v":"JPMorgan Chase & Co."}]
["S.US.KDP",{"$f":"IF(A232=\"\",\"\",RTD(\"cqg.rtd\", ,\"ContractData\",A232, \"LongDescription\",, \"T\"))","v":"KEURIG DR PEPPER INC"}]
["S.US.KEY",{"$f":"IF(A233=\"\",\"\",RTD(\"cqg.rtd\", ,\"ContractData\",A233, \"LongDescription\",, \"T\"))","v":"KeyCorp"}]
["S.US.KEYS",{"$f":"IF(A234=\"\",\"\",RTD(\"cqg.rtd\", ,\"ContractData\",A234, \"LongDescription\",, \"T\"))","v":"Keysight Technologies Inc."}]
["S.US.KHC",{"$f":"IF(A235=\"\",\"\",RTD(\"cqg.rtd\", ,\"ContractData\",A235, \"LongDescription\",, \"T\"))","v":"KRAFT HEINZ CO CMN"}]
["S.US.KIM",{"$f":"IF(A236=\"\",\"\",RTD(\"cqg.rtd\", ,\"ContractData\",A236, \"LongDescription\",, \"T\"))","v":"Kimco Realty Corp"}]
["S.US.KKR",{"$f":"IF(A237=\"\",\"\",RTD(\"cqg.rtd\", ,\"ContractData\",A237, \"LongDescription\",, \"T\"))","v":"KKR & Co. Inc."}]
["S.US.KMB",{"$f":"IF(A238=\"\",\"\",RTD(\"cqg.rtd\", ,\"ContractData\",A238, \"LongDescription\",, \"T\"))","v":"KIMBERLY CLARK CP"}]
["S.US.KMI",{"$f":"IF(A239=\"\",\"\",RTD(\"cqg.rtd\", ,\"ContractData\",A239, \"LongDescription\",, \"T\"))","v":"Kinder Morgan, Inc."}]
["S.US.KO",{"$f":"IF(A240=\"\",\"\",RTD(\"cqg.rtd\", ,\"ContractData\",A240, \"LongDescription\",, \"T\"))","v":"Coca-Cola Company"}]
["S.US.KR",{"$f":"IF(A241=\"\",\"\",RTD(\"cqg.rtd\", ,\"ContractData\",A241, \"LongDescription\",, \"T\"))","v":"Kroger Co (The)"}]
["S.US.KVUE",{"$f":"IF(A242=\"\",\"\",RTD(\"cqg.rtd\", ,\"ContractData\",A242, \"LongDescription\",, \"T\"))","v":"Kenvue Inc."}]
["S.US.L",{"$f":"IF(A243=\"\",\"\",RTD(\"cqg.rtd\", ,\"ContractData\",A243, \"LongDescription\",, \"T\"))","v":"Loews Corporation"}]
["S.US.LDOS",{"$f":"IF(A244=\"\",\"\",RTD(\"cqg.rtd\", ,\"ContractData\",A244, \"LongDescription\",, \"T\"))","v":"Leidos Holdings, Inc."}]
["S.US.LEN",{"$f":"IF(A245=\"\",\"\",RTD(\"cqg.rtd\", ,\"ContractData\",A245, \"LongDescription\",, \"T\"))","v":"Lennar Corp"}]
["S.US.LH",{"$f":"IF(A246=\"\",\"\",RTD(\"cqg.rtd\", ,\"ContractData\",A246, \"LongDescription\",, \"T\"))","v":"Laboratory Corp of Amer"}]
["S.US.LHX",{"$f":"IF(A247=\"\",\"\",RTD(\"cqg.rtd\", ,\"ContractData\",A247, \"LongDescription\",, \"T\"))","v":"L3Harris Technologies, Inc."}]
["S.US.LII",{"$f":"IF(A248=\"\",\"\",RTD(\"cqg.rtd\", ,\"ContractData\",A248, \"LongDescription\",, \"T\"))","v":"Lennox Internatl"}]
["S.US.LIN",{"$f":"IF(A249=\"\",\"\",RTD(\"cqg.rtd\", ,\"ContractData\",A249, \"LongDescription\",, \"T\"))","v":"Linde PLC"}]
["S.US.LMT",{"$f":"IF(A250=\"\",\"\",RTD(\"cqg.rtd\", ,\"ContractData\",A250, \"LongDescription\",, \"T\"))","v":"Lockheed Martin Corp"}]
["S.US.LNT",{"$f":"IF(A251=\"\",\"\",RTD(\"cqg.rtd\", ,\"ContractData\",A251, \"LongDescription\",, \"T\"))","v":"ALLIANT ENERGY CMN"}]
["S.US.LOW",{"$f":"IF(A252=\"\",\"\",RTD(\"cqg.rtd\", ,\"ContractData\",A252, \"LongDescription\",, \"T\"))","v":"Lowes Companies Inc"}]
["S.US.LULU",{"$f":"IF(A253=\"\",\"\",RTD(\"cqg.rtd\", ,\"ContractData\",A253, \"LongDescription\",, \"T\"))","v":"LULULEMON ATHLETICA"}]
["S.US.LUV",{"$f":"IF(A254=\"\",\"\",RTD(\"cqg.rtd\", ,\"ContractData\",A254, \"LongDescription\",, \"T\"))","v":"Southwest Airlines Co"}]
["S.US.LYB",{"$f":"IF(A255=\"\",\"\",RTD(\"cqg.rtd\", ,\"ContractData\",A255, \"LongDescription\",, \"T\"))","v":"LyondellBasell Industries NV Class A"}]
["S.US.LYV",{"$f":"IF(A256=\"\",\"\",RTD(\"cqg.rtd\", ,\"ContractData\",A256, \"LongDescription\",, \"T\"))","v":"Live Nation Entertainment Inc"}]
["S.US.MA",{"$f":"IF(A257=\"\",\"\",RTD(\"cqg.rtd\", ,\"ContractData\",A257, \"LongDescription\",, \"T\"))","v":"Mastercard Inc."}]
["S.US.MAA",{"$f":"IF(A258=\"\",\"\",RTD(\"cqg.rtd\", ,\"ContractData\",A258, \"LongDescription\",, \"T\"))","v":"Mid-America Apt Communities Inc"}]
["S.US.MAS",{"$f":"IF(A259=\"\",\"\",RTD(\"cqg.rtd\", ,\"ContractData\",A259, \"LongDescription\",, \"T\"))","v":"Masco Corporation"}]
["S.US.MCD",{"$f":"IF(A260=\"\",\"\",RTD(\"cqg.rtd\", ,\"ContractData\",A260, \"LongDescription\",, \"T\"))","v":"McDonald's Corporation"}]
["S.US.MCHP",{"$f":"IF(A261=\"\",\"\",RTD(\"cqg.rtd\", ,\"ContractData\",A261, \"LongDescription\",, \"T\"))","v":"MICROCHIP TECHNOLOGY"}]
["S.US.MCK",{"$f":"IF(A262=\"\",\"\",RTD(\"cqg.rtd\", ,\"ContractData\",A262, \"LongDescription\",, \"T\"))","v":"McKesson Corporation"}]
["S.US.MCO",{"$f":"IF(A263=\"\",\"\",RTD(\"cqg.rtd\", ,\"ContractData\",A263, \"LongDescription\",, \"T\"))","v":"Moodys Corp"}]
["S.US.MDLZ",{"$f":"IF(A264=\"\",\"\",RTD(\"cqg.rtd\", ,\"ContractData\",A264, \"LongDescription\",, \"T\"))","v":"MONDELEZ INTL CMN A"}]
["S.US.MDT",{"$f":"IF(A265=\"\",\"\",RTD(\"cqg.rtd\", ,\"ContractData\",A265, \"LongDescription\",, \"T\"))","v":"Medtronic Inc"}]
["S.US.MET",{"$f":"IF(A266=\"\",\"\",RTD(\"cqg.rtd\", ,\"ContractData\",A266, \"LongDescription\",, \"T\"))","v":"MetLife Inc"}]
["S.US.MGM",{"$f":"IF(A267=\"\",\"\",RTD(\"cqg.rtd\", ,\"ContractData\",A267, \"LongDescription\",, \"T\"))","v":"MGM Resorts International"}]
["S.US.MKC",{"$f":"IF(A268=\"\",\"\",RTD(\"cqg.rtd\", ,\"ContractData\",A268, \"LongDescription\",, \"T\"))","v":"McCormick & Company Inc"}]
["S.US.MLM",{"$f":"IF(A269=\"\",\"\",RTD(\"cqg.rtd\", ,\"ContractData\",A269, \"LongDescription\",, \"T\"))","v":"Martin Marietta Materials Inc"}]
["S.US.MMM",{"$f":"IF(A270=\"\",\"\",RTD(\"cqg.rtd\", ,\"ContractData\",A270, \"LongDescription\",, \"T\"))","v":"3M Company"}]
["S.US.MO",{"$f":"IF(A271=\"\",\"\",RTD(\"cqg.rtd\", ,\"ContractData\",A271, \"LongDescription\",, \"T\"))","v":"Altria Group Inc"}]
["S.US.MOS",{"$f":"IF(A272=\"\",\"\",RTD(\"cqg.rtd\", ,\"ContractData\",A272, \"LongDescription\",, \"T\"))","v":"Mosaic Company"}]
["S.US.MPC",{"$f":"IF(A273=\"\",\"\",RTD(\"cqg.rtd\", ,\"ContractData\",A273, \"LongDescription\",, \"T\"))","v":"Marathon Petroleum Corporation"}]
["S.US.MRK",{"$f":"IF(A274=\"\",\"\",RTD(\"cqg.rtd\", ,\"ContractData\",A274, \"LongDescription\",, \"T\"))","v":"Merck & Co Inc"}]
["S.US.MRNA",{"$f":"IF(A275=\"\",\"\",RTD(\"cqg.rtd\", ,\"ContractData\",A275, \"LongDescription\",, \"T\"))","v":"MODERNA INC CS"}]
["S.US.MRSH",{"$f":"IF(A276=\"\",\"\",RTD(\"cqg.rtd\", ,\"ContractData\",A276, \"LongDescription\",, \"T\"))","v":"Marsh"}]
["S.US.MRVL",{"$f":"IF(A277=\"\",\"\",RTD(\"cqg.rtd\", ,\"ContractData\",A277, \"LongDescription\",, \"T\"))","v":"MARVELL TECH INC CMN"}]
["S.US.MS",{"$f":"IF(A278=\"\",\"\",RTD(\"cqg.rtd\", ,\"ContractData\",A278, \"LongDescription\",, \"T\"))","v":"Morgan Stanley"}]
["S.US.MSCI",{"$f":"IF(A279=\"\",\"\",RTD(\"cqg.rtd\", ,\"ContractData\",A279, \"LongDescription\",, \"T\"))","v":"MSCI, Inc."}]
["S.US.MSI",{"$f":"IF(A280=\"\",\"\",RTD(\"cqg.rtd\", ,\"ContractData\",A280, \"LongDescription\",, \"T\"))","v":"Motorola Solutions, Inc."}]
["S.US.MTB",{"$f":"IF(A281=\"\",\"\",RTD(\"cqg.rtd\", ,\"ContractData\",A281, \"LongDescription\",, \"T\"))","v":"M&T Bank Corp"}]
["S.US.MTD",{"$f":"IF(A282=\"\",\"\",RTD(\"cqg.rtd\", ,\"ContractData\",A282, \"LongDescription\",, \"T\"))","v":"Mettler-Toledo Internatl Inc"}]
["S.US.NCLH",{"$f":"IF(A283=\"\",\"\",RTD(\"cqg.rtd\", ,\"ContractData\",A283, \"LongDescription\",, \"T\"))","v":"Norwegian Cruise Line"}]
["S.US.NDAQ",{"$f":"IF(A284=\"\",\"\",RTD(\"cqg.rtd\", ,\"ContractData\",A284, \"LongDescription\",, \"T\"))","v":"NASDAQ, INC. CMN STK"}]
["S.US.NDSN",{"$f":"IF(A285=\"\",\"\",RTD(\"cqg.rtd\", ,\"ContractData\",A285, \"LongDescription\",, \"T\"))","v":"Nordson Corporation"}]
["S.US.NEE",{"$f":"IF(A286=\"\",\"\",RTD(\"cqg.rtd\", ,\"ContractData\",A286, \"LongDescription\",, \"T\"))","v":"Nextera Energy, Inc."}]
["S.US.NI",{"$f":"IF(A287=\"\",\"\",RTD(\"cqg.rtd\", ,\"ContractData\",A287, \"LongDescription\",, \"T\"))","v":"NiSource Inc"}]
["S.US.NKE",{"$f":"IF(A288=\"\",\"\",RTD(\"cqg.rtd\", ,\"ContractData\",A288, \"LongDescription\",, \"T\"))","v":"NIKE Inc ClsB"}]
["S.US.NOC",{"$f":"IF(A289=\"\",\"\",RTD(\"cqg.rtd\", ,\"ContractData\",A289, \"LongDescription\",, \"T\"))","v":"Northrop Grumman Corporation"}]
["S.US.NOW",{"$f":"IF(A290=\"\",\"\",RTD(\"cqg.rtd\", ,\"ContractData\",A290, \"LongDescription\",, \"T\"))","v":"ServiceNow, Inc."}]
["S.US.NRG",{"$f":"IF(A291=\"\",\"\",RTD(\"cqg.rtd\", ,\"ContractData\",A291, \"LongDescription\",, \"T\"))","v":"NRG Energy Inc"}]
["S.US.NSC",{"$f":"IF(A292=\"\",\"\",RTD(\"cqg.rtd\", ,\"ContractData\",A292, \"LongDescription\",, \"T\"))","v":"Norfolk Southern Corp"}]
["S.US.NTAP",{"$f":"IF(A293=\"\",\"\",RTD(\"cqg.rtd\", ,\"ContractData\",A293, \"LongDescription\",, \"T\"))","v":"NETAPP, INC."}]
["S.US.NTRS",{"$f":"IF(A294=\"\",\"\",RTD(\"cqg.rtd\", ,\"ContractData\",A294, \"LongDescription\",, \"T\"))","v":"Northern Trust Corp"}]
["S.US.NUE",{"$f":"IF(A295=\"\",\"\",RTD(\"cqg.rtd\", ,\"ContractData\",A295, \"LongDescription\",, \"T\"))","v":"Nucor Corp"}]
["S.US.NVR",{"$f":"IF(A296=\"\",\"\",RTD(\"cqg.rtd\", ,\"ContractData\",A296, \"LongDescription\",, \"T\"))","v":"NVR Inc"}]
["S.US.NWS",{"$f":"IF(A297=\"\",\"\",RTD(\"cqg.rtd\", ,\"ContractData\",A297, \"LongDescription\",, \"T\"))","v":"NEWS CP CL B CMN ST"}]
["S.US.NWSA",{"$f":"IF(A298=\"\",\"\",RTD(\"cqg.rtd\", ,\"ContractData\",A298, \"LongDescription\",, \"T\"))","v":"NEWS CP CL A CMN ST"}]
["S.US.NXPI",{"$f":"IF(A299=\"\",\"\",RTD(\"cqg.rtd\", ,\"ContractData\",A299, \"LongDescription\",, \"T\"))","v":"NXP SEMICONDUCTORS"}]
["S.US.O",{"$f":"IF(A300=\"\",\"\",RTD(\"cqg.rtd\", ,\"ContractData\",A300, \"LongDescription\",, \"T\"))","v":"Realty Income Corp"}]
["S.US.ODFL",{"$f":"IF(A301=\"\",\"\",RTD(\"cqg.rtd\", ,\"ContractData\",A301, \"LongDescription\",, \"T\"))","v":"OLD DOMINION FREIG##"}]
["S.US.OKE",{"$f":"IF(A302=\"\",\"\",RTD(\"cqg.rtd\", ,\"ContractData\",A302, \"LongDescription\",, \"T\"))","v":"ONEOK Inc New"}]
["S.US.OMC",{"$f":"IF(A303=\"\",\"\",RTD(\"cqg.rtd\", ,\"ContractData\",A303, \"LongDescription\",, \"T\"))","v":"Omnicom Group Inc"}]
["S.US.ON",{"$f":"IF(A304=\"\",\"\",RTD(\"cqg.rtd\", ,\"ContractData\",A304, \"LongDescription\",, \"T\"))","v":"ON SEMICONDUCTOR"}]
["S.US.ORCL",{"$f":"IF(A305=\"\",\"\",RTD(\"cqg.rtd\", ,\"ContractData\",A305, \"LongDescription\",, \"T\"))","v":"Oracle Corporation"}]
["S.US.OTIS",{"$f":"IF(A306=\"\",\"\",RTD(\"cqg.rtd\", ,\"ContractData\",A306, \"LongDescription\",, \"T\"))","v":"Otis Worldwide Corporation"}]
["S.US.OXY",{"$f":"IF(A307=\"\",\"\",RTD(\"cqg.rtd\", ,\"ContractData\",A307, \"LongDescription\",, \"T\"))","v":"Occidental Petroleum"}]
["S.US.PANW",{"$f":"IF(A308=\"\",\"\",RTD(\"cqg.rtd\", ,\"ContractData\",A308, \"LongDescription\",, \"T\"))","v":"PALO ALTO NTWKS CM"}]
["S.US.PAYX",{"$f":"IF(A309=\"\",\"\",RTD(\"cqg.rtd\", ,\"ContractData\",A309, \"LongDescription\",, \"T\"))","v":"PAYCHEX, INC."}]
["S.US.PCAR",{"$f":"IF(A310=\"\",\"\",RTD(\"cqg.rtd\", ,\"ContractData\",A310, \"LongDescription\",, \"T\"))","v":"PACCAR INC."}]
["S.US.PCG",{"$f":"IF(A311=\"\",\"\",RTD(\"cqg.rtd\", ,\"ContractData\",A311, \"LongDescription\",, \"T\"))","v":"PG&E Corp Hldg Co"}]
["S.US.PEG",{"$f":"IF(A312=\"\",\"\",RTD(\"cqg.rtd\", ,\"ContractData\",A312, \"LongDescription\",, \"T\"))","v":"Pub Svc Entrpr Grp Inc"}]
["S.US.PEP",{"$f":"IF(A313=\"\",\"\",RTD(\"cqg.rtd\", ,\"ContractData\",A313, \"LongDescription\",, \"T\"))","v":"PepsiCo Inc"}]
["S.US.PFE",{"$f":"IF(A314=\"\",\"\",RTD(\"cqg.rtd\", ,\"ContractData\",A314, \"LongDescription\",, \"T\"))","v":"Pfizer Inc"}]
["S.US.PFG",{"$f":"IF(A315=\"\",\"\",RTD(\"cqg.rtd\", ,\"ContractData\",A315, \"LongDescription\",, \"T\"))","v":"PRINCIPAL FINL GROUP"}]
["S.US.PG",{"$f":"IF(A316=\"\",\"\",RTD(\"cqg.rtd\", ,\"ContractData\",A316, \"LongDescription\",, \"T\"))","v":"Procter & Gamble Co"}]
["S.US.PGR",{"$f":"IF(A317=\"\",\"\",RTD(\"cqg.rtd\", ,\"ContractData\",A317, \"LongDescription\",, \"T\"))","v":"Progressive Corp"}]
["S.US.PH",{"$f":"IF(A318=\"\",\"\",RTD(\"cqg.rtd\", ,\"ContractData\",A318, \"LongDescription\",, \"T\"))","v":"Parker-Hannifin Corp"}]
["S.US.PHM",{"$f":"IF(A319=\"\",\"\",RTD(\"cqg.rtd\", ,\"ContractData\",A319, \"LongDescription\",, \"T\"))","v":"PulteGroup Inc"}]
["S.US.PKG",{"$f":"IF(A320=\"\",\"\",RTD(\"cqg.rtd\", ,\"ContractData\",A320, \"LongDescription\",, \"T\"))","v":"Packaging Corp of America"}]
["S.US.PLD",{"$f":"IF(A321=\"\",\"\",RTD(\"cqg.rtd\", ,\"ContractData\",A321, \"LongDescription\",, \"T\"))","v":"Prologis, Inc"}]
["S.US.PM",{"$f":"IF(A322=\"\",\"\",RTD(\"cqg.rtd\", ,\"ContractData\",A322, \"LongDescription\",, \"T\"))","v":"Philip Morris International"}]
["S.US.PNC",{"$f":"IF(A323=\"\",\"\",RTD(\"cqg.rtd\", ,\"ContractData\",A323, \"LongDescription\",, \"T\"))","v":"PNC Fincl Svcs Grp Inc"}]
["S.US.PNR",{"$f":"IF(A324=\"\",\"\",RTD(\"cqg.rtd\", ,\"ContractData\",A324, \"LongDescription\",, \"T\"))","v":"Pentair Ltd."}]
["S.US.PNW",{"$f":"IF(A325=\"\",\"\",RTD(\"cqg.rtd\", ,\"ContractData\",A325, \"LongDescription\",, \"T\"))","v":"Pinnacle West Captl Corp"}]
["S.US.PPG",{"$f":"IF(A326=\"\",\"\",RTD(\"cqg.rtd\", ,\"ContractData\",A326, \"LongDescription\",, \"T\"))","v":"PPG Industries Inc"}]
["S.US.PPL",{"$f":"IF(A327=\"\",\"\",RTD(\"cqg.rtd\", ,\"ContractData\",A327, \"LongDescription\",, \"T\"))","v":"PPL Corp"}]
["S.US.PRU",{"$f":"IF(A328=\"\",\"\",RTD(\"cqg.rtd\", ,\"ContractData\",A328, \"LongDescription\",, \"T\"))","v":"Prudential Financial Inc"}]
["S.US.PSA",{"$f":"IF(A329=\"\",\"\",RTD(\"cqg.rtd\", ,\"ContractData\",A329, \"LongDescription\",, \"T\"))","v":"Public Storage Inc"}]
["S.US.PSKY",{"$f":"IF(A330=\"\",\"\",RTD(\"cqg.rtd\", ,\"ContractData\",A330, \"LongDescription\",, \"T\"))","v":"PARAMOUNT SKYDN B"}]
["S.US.PSX",{"$f":"IF(A331=\"\",\"\",RTD(\"cqg.rtd\", ,\"ContractData\",A331, \"LongDescription\",, \"T\"))","v":"Phillips 66 Common Stock"}]
["S.US.PTC",{"$f":"IF(A332=\"\",\"\",RTD(\"cqg.rtd\", ,\"ContractData\",A332, \"LongDescription\",, \"T\"))","v":"PTC INC."}]
["S.US.PYPL",{"$f":"IF(A333=\"\",\"\",RTD(\"cqg.rtd\", ,\"ContractData\",A333, \"LongDescription\",, \"T\"))","v":"PAYPAL HOLDINGS"}]
["S.US.Q",{"$f":"IF(A334=\"\",\"\",RTD(\"cqg.rtd\", ,\"ContractData\",A334, \"LongDescription\",, \"T\"))","v":"Qnity Electronics Inc."}]
["S.US.QCOM",{"$f":"IF(A335=\"\",\"\",RTD(\"cqg.rtd\", ,\"ContractData\",A335, \"LongDescription\",, \"T\"))","v":"QUALCOMM Inc"}]
["S.US.REG",{"$f":"IF(A336=\"\",\"\",RTD(\"cqg.rtd\", ,\"ContractData\",A336, \"LongDescription\",, \"T\"))","v":"REGENCY CENTERS CMN"}]
["S.US.REGN",{"$f":"IF(A337=\"\",\"\",RTD(\"cqg.rtd\", ,\"ContractData\",A337, \"LongDescription\",, \"T\"))","v":"REGENERON PHARMACEUT"}]
["S.US.RF",{"$f":"IF(A338=\"\",\"\",RTD(\"cqg.rtd\", ,\"ContractData\",A338, \"LongDescription\",, \"T\"))","v":"Regions Financial Corp"}]
["S.US.RJF",{"$f":"IF(A339=\"\",\"\",RTD(\"cqg.rtd\", ,\"ContractData\",A339, \"LongDescription\",, \"T\"))","v":"Raymond James Fincl Inc"}]
["S.US.RMD",{"$f":"IF(A340=\"\",\"\",RTD(\"cqg.rtd\", ,\"ContractData\",A340, \"LongDescription\",, \"T\"))","v":"Resmed Inc"}]
["S.US.ROK",{"$f":"IF(A341=\"\",\"\",RTD(\"cqg.rtd\", ,\"ContractData\",A341, \"LongDescription\",, \"T\"))","v":"Rockwell Automation Inc"}]
["S.US.ROP",{"$f":"IF(A342=\"\",\"\",RTD(\"cqg.rtd\", ,\"ContractData\",A342, \"LongDescription\",, \"T\"))","v":"ROPER TECH CMN"}]
["S.US.ROST",{"$f":"IF(A343=\"\",\"\",RTD(\"cqg.rtd\", ,\"ContractData\",A343, \"LongDescription\",, \"T\"))","v":"ROSS STORES, INC."}]
["S.US.RSG",{"$f":"IF(A344=\"\",\"\",RTD(\"cqg.rtd\", ,\"ContractData\",A344, \"LongDescription\",, \"T\"))","v":"Republic Services Inc ClA"}]
["S.US.RVTY",{"$f":"IF(A345=\"\",\"\",RTD(\"cqg.rtd\", ,\"ContractData\",A345, \"LongDescription\",, \"T\"))","v":"Revvity Inc."}]
["S.US.SBAC",{"$f":"IF(A346=\"\",\"\",RTD(\"cqg.rtd\", ,\"ContractData\",A346, \"LongDescription\",, \"T\"))","v":"SBA COMMUNICATIONS"}]
["S.US.SBUX",{"$f":"IF(A347=\"\",\"\",RTD(\"cqg.rtd\", ,\"ContractData\",A347, \"LongDescription\",, \"T\"))","v":"Starbucks Corp"}]
["S.US.SCHW",{"$f":"IF(A348=\"\",\"\",RTD(\"cqg.rtd\", ,\"ContractData\",A348, \"LongDescription\",, \"T\"))","v":"Charles Schwab Corp"}]
["S.US.SHW",{"$f":"IF(A349=\"\",\"\",RTD(\"cqg.rtd\", ,\"ContractData\",A349, \"LongDescription\",, \"T\"))","v":"Sherwin-Williams Co"}]
["S.US.SJM",{"$f":"IF(A350=\"\",\"\",RTD(\"cqg.rtd\", ,\"ContractData\",A350, \"LongDescription\",, \"T\"))","v":"SMUCKER JM CO"}]
["S.US.SLB",{"$f":"IF(A351=\"\",\"\",RTD(\"cqg.rtd\", ,\"ContractData\",A351, \"LongDescription\",, \"T\"))","v":"SLB"}]
["S.US.SMCI",{"$f":"IF(A352=\"\",\"\",RTD(\"cqg.rtd\", ,\"ContractData\",A352, \"LongDescription\",, \"T\"))","v":"Super Micro Computer"}]
["S.US.SNA",{"$f":"IF(A353=\"\",\"\",RTD(\"cqg.rtd\", ,\"ContractData\",A353, \"LongDescription\",, \"T\"))","v":"Snap-On Tools Corp"}]
["S.US.SNPS",{"$f":"IF(A354=\"\",\"\",RTD(\"cqg.rtd\", ,\"ContractData\",A354, \"LongDescription\",, \"T\"))","v":"SYNOPSYS, INC."}]
["S.US.SO",{"$f":"IF(A355=\"\",\"\",RTD(\"cqg.rtd\", ,\"ContractData\",A355, \"LongDescription\",, \"T\"))","v":"Southern Company"}]
["S.US.SOLV",{"$f":"IF(A356=\"\",\"\",RTD(\"cqg.rtd\", ,\"ContractData\",A356, \"LongDescription\",, \"T\"))","v":"Solventum Corporation"}]
["S.US.SPG",{"$f":"IF(A357=\"\",\"\",RTD(\"cqg.rtd\", ,\"ContractData\",A357, \"LongDescription\",, \"T\"))","v":"Simon Property Grp"}]
["S.US.SPGI",{"$f":"IF(A358=\"\",\"\",RTD(\"cqg.rtd\", ,\"ContractData\",A358, \"LongDescription\",, \"T\"))","v":"S&P Global Inc."}]
["S.US.SRE",{"$f":"IF(A359=\"\",\"\",RTD(\"cqg.rtd\", ,\"ContractData\",A359, \"LongDescription\",, \"T\"))","v":"Sempra"}]
["S.US.STE",{"$f":"IF(A360=\"\",\"\",RTD(\"cqg.rtd\", ,\"ContractData\",A360, \"LongDescription\",, \"T\"))","v":"STERIS plc"}]
["S.US.STLD",{"$f":"IF(A361=\"\",\"\",RTD(\"cqg.rtd\", ,\"ContractData\",A361, \"LongDescription\",, \"T\"))","v":"Steel Dynamics Inc"}]
["S.US.STT",{"$f":"IF(A362=\"\",\"\",RTD(\"cqg.rtd\", ,\"ContractData\",A362, \"LongDescription\",, \"T\"))","v":"State Street Corp"}]
["S.US.STX",{"$f":"IF(A363=\"\",\"\",RTD(\"cqg.rtd\", ,\"ContractData\",A363, \"LongDescription\",, \"T\"))","v":"SEAGATE TCH HLDGS OR"}]
["S.US.STZ",{"$f":"IF(A364=\"\",\"\",RTD(\"cqg.rtd\", ,\"ContractData\",A364, \"LongDescription\",, \"T\"))","v":"Constellation Brands Inc"}]
["S.US.SW",{"$f":"IF(A365=\"\",\"\",RTD(\"cqg.rtd\", ,\"ContractData\",A365, \"LongDescription\",, \"T\"))","v":"Smurfit Westrock Plc"}]
["S.US.SWK",{"$f":"IF(A366=\"\",\"\",RTD(\"cqg.rtd\", ,\"ContractData\",A366, \"LongDescription\",, \"T\"))","v":"Stanley Black and Decker Inc"}]
["S.US.SWKS",{"$f":"IF(A367=\"\",\"\",RTD(\"cqg.rtd\", ,\"ContractData\",A367, \"LongDescription\",, \"T\"))","v":"SKYWORKS SOLUTIONS##"}]
["S.US.SYF",{"$f":"IF(A368=\"\",\"\",RTD(\"cqg.rtd\", ,\"ContractData\",A368, \"LongDescription\",, \"T\"))","v":"Synchrony Financial"}]
["S.US.SYK",{"$f":"IF(A369=\"\",\"\",RTD(\"cqg.rtd\", ,\"ContractData\",A369, \"LongDescription\",, \"T\"))","v":"Stryker Corp"}]
["S.US.SYY",{"$f":"IF(A370=\"\",\"\",RTD(\"cqg.rtd\", ,\"ContractData\",A370, \"LongDescription\",, \"T\"))","v":"Sysco Corp"}]
["S.US.T",{"$f":"IF(A371=\"\",\"\",RTD(\"cqg.rtd\", ,\"ContractData\",A371, \"LongDescription\",, \"T\"))","v":"AT&T Inc"}]
["S.US.TAP",{"$f":"IF(A372=\"\",\"\",RTD(\"cqg.rtd\", ,\"ContractData\",A372, \"LongDescription\",, \"T\"))","v":"Molson Coors Beverage Company"}]
["S.US.TDY",{"$f":"IF(A373=\"\",\"\",RTD(\"cqg.rtd\", ,\"ContractData\",A373, \"LongDescription\",, \"T\"))","v":"Teledyne Technologies Inc"}]
["S.US.TECH",{"$f":"IF(A374=\"\",\"\",RTD(\"cqg.rtd\", ,\"ContractData\",A374, \"LongDescription\",, \"T\"))","v":"BIO-TECHNE CP CMN"}]
["S.US.TEL",{"$f":"IF(A375=\"\",\"\",RTD(\"cqg.rtd\", ,\"ContractData\",A375, \"LongDescription\",, \"T\"))","v":"TE Connectivity Ltd."}]
["S.US.TER",{"$f":"IF(A376=\"\",\"\",RTD(\"cqg.rtd\", ,\"ContractData\",A376, \"LongDescription\",, \"T\"))","v":"TERADYNE INC CMN"}]
["S.US.TFC",{"$f":"IF(A377=\"\",\"\",RTD(\"cqg.rtd\", ,\"ContractData\",A377, \"LongDescription\",, \"T\"))","v":"Truist Financial Corporation"}]
["S.US.TGT",{"$f":"IF(A378=\"\",\"\",RTD(\"cqg.rtd\", ,\"ContractData\",A378, \"LongDescription\",, \"T\"))","v":"Target Corp"}]
["S.US.TJX",{"$f":"IF(A379=\"\",\"\",RTD(\"cqg.rtd\", ,\"ContractData\",A379, \"LongDescription\",, \"T\"))","v":"TJX Companies Inc"}]
["S.US.TMO",{"$f":"IF(A380=\"\",\"\",RTD(\"cqg.rtd\", ,\"ContractData\",A380, \"LongDescription\",, \"T\"))","v":"Thermo Electron Corp"}]
["S.US.TMUS",{"$f":"IF(A381=\"\",\"\",RTD(\"cqg.rtd\", ,\"ContractData\",A381, \"LongDescription\",, \"T\"))","v":"T-MOBILE US CMN"}]
["S.US.TPL",{"$f":"IF(A382=\"\",\"\",RTD(\"cqg.rtd\", ,\"ContractData\",A382, \"LongDescription\",, \"T\"))","v":"TEXAS PACIFIC LAND TR"}]
["S.US.TRGP",{"$f":"IF(A383=\"\",\"\",RTD(\"cqg.rtd\", ,\"ContractData\",A383, \"LongDescription\",, \"T\"))","v":"Targa Resources Corp"}]
["S.US.TRMB",{"$f":"IF(A384=\"\",\"\",RTD(\"cqg.rtd\", ,\"ContractData\",A384, \"LongDescription\",, \"T\"))","v":"Trimble Inc."}]
["S.US.TROW",{"$f":"IF(A385=\"\",\"\",RTD(\"cqg.rtd\", ,\"ContractData\",A385, \"LongDescription\",, \"T\"))","v":"T ROWE PRICE GROUP"}]
["S.US.TRV",{"$f":"IF(A386=\"\",\"\",RTD(\"cqg.rtd\", ,\"ContractData\",A386, \"LongDescription\",, \"T\"))","v":"Travelers Companies, Inc"}]
["S.US.TSCO",{"$f":"IF(A387=\"\",\"\",RTD(\"cqg.rtd\", ,\"ContractData\",A387, \"LongDescription\",, \"T\"))","v":"TRACTOR SUPPLY CO ##"}]
["S.US.TSLA",{"$f":"IF(A388=\"\",\"\",RTD(\"cqg.rtd\", ,\"ContractData\",A388, \"LongDescription\",, \"T\"))","v":"TESLA, INC."}]
["S.US.TSN",{"$f":"IF(A389=\"\",\"\",RTD(\"cqg.rtd\", ,\"ContractData\",A389, \"LongDescription\",, \"T\"))","v":"Tyson Foods Inc ClsA"}]
["S.US.TT",{"$f":"IF(A390=\"\",\"\",RTD(\"cqg.rtd\", ,\"ContractData\",A390, \"LongDescription\",, \"T\"))","v":"Trane Technologies plc"}]
["S.US.TTD",{"$f":"IF(A391=\"\",\"\",RTD(\"cqg.rtd\", ,\"ContractData\",A391, \"LongDescription\",, \"T\"))","v":"THE TRADE DESK CL A"}]
["S.US.TTWO",{"$f":"IF(A392=\"\",\"\",RTD(\"cqg.rtd\", ,\"ContractData\",A392, \"LongDescription\",, \"T\"))","v":"TAKE-TWO INTERACTI##"}]
["S.US.TXN",{"$f":"IF(A393=\"\",\"\",RTD(\"cqg.rtd\", ,\"ContractData\",A393, \"LongDescription\",, \"T\"))","v":"TEXAS INSTRUMENTS"}]
["S.US.TXT",{"$f":"IF(A394=\"\",\"\",RTD(\"cqg.rtd\", ,\"ContractData\",A394, \"LongDescription\",, \"T\"))","v":"Textron Inc"}]
["S.US.TYL",{"$f":"IF(A395=\"\",\"\",RTD(\"cqg.rtd\", ,\"ContractData\",A395, \"LongDescription\",, \"T\"))","v":"TYLER TECHNOLOGIES INC"}]
["S.US.UAL",{"$f":"IF(A396=\"\",\"\",RTD(\"cqg.rtd\", ,\"ContractData\",A396, \"LongDescription\",, \"T\"))","v":"UNITED AIRLNS HLD CM"}]
["S.US.UDR",{"$f":"IF(A397=\"\",\"\",RTD(\"cqg.rtd\", ,\"ContractData\",A397, \"LongDescription\",, \"T\"))","v":"United Dominion Realty Trust"}]
["S.US.UHS",{"$f":"IF(A398=\"\",\"\",RTD(\"cqg.rtd\", ,\"ContractData\",A398, \"LongDescription\",, \"T\"))","v":"Universal Health Svcs ClsB"}]
["S.US.UNH",{"$f":"IF(A399=\"\",\"\",RTD(\"cqg.rtd\", ,\"ContractData\",A399, \"LongDescription\",, \"T\"))","v":"United Health Group Inc"}]
["S.US.UNP",{"$f":"IF(A400=\"\",\"\",RTD(\"cqg.rtd\", ,\"ContractData\",A400, \"LongDescription\",, \"T\"))","v":"Union Pacific Corp"}]
["S.US.UPS",{"$f":"IF(A401=\"\",\"\",RTD(\"cqg.rtd\", ,\"ContractData\",A401, \"LongDescription\",, \"T\"))","v":"United Parcel Svc"}]
["S.US.URI",{"$f":"IF(A402=\"\",\"\",RTD(\"cqg.rtd\", ,\"ContractData\",A402, \"LongDescription\",, \"T\"))","v":"United Rentals Inc"}]
["S.US.USB",{"$f":"IF(A403=\"\",\"\",RTD(\"cqg.rtd\", ,\"ContractData\",A403, \"LongDescription\",, \"T\"))","v":"U S Bancorp"}]
["S.US.V",{"$f":"IF(A404=\"\",\"\",RTD(\"cqg.rtd\", ,\"ContractData\",A404, \"LongDescription\",, \"T\"))","v":"Visa Inc."}]
["S.US.VEEV",{"$f":"IF(A405=\"\",\"\",RTD(\"cqg.rtd\", ,\"ContractData\",A405, \"LongDescription\",, \"T\"))","v":"VEEVA Systems, Inc."}]
["S.US.VICI",{"$f":"IF(A406=\"\",\"\",RTD(\"cqg.rtd\", ,\"ContractData\",A406, \"LongDescription\",, \"T\"))","v":"VICI Properties Inc."}]
["S.US.VLO",{"$f":"IF(A407=\"\",\"\",RTD(\"cqg.rtd\", ,\"ContractData\",A407, \"LongDescription\",, \"T\"))","v":"Valero Energy Corp New"}]
["S.US.VLTO",{"$f":"IF(A408=\"\",\"\",RTD(\"cqg.rtd\", ,\"ContractData\",A408, \"LongDescription\",, \"T\"))","v":"Veralto Corporation"}]
["S.US.VMC",{"$f":"IF(A409=\"\",\"\",RTD(\"cqg.rtd\", ,\"ContractData\",A409, \"LongDescription\",, \"T\"))","v":"Vulcan Material Co"}]
["S.US.VRSK",{"$f":"IF(A410=\"\",\"\",RTD(\"cqg.rtd\", ,\"ContractData\",A410, \"LongDescription\",, \"T\"))","v":"VERISK ANALYTICS INC"}]
["S.US.VRTX",{"$f":"IF(A411=\"\",\"\",RTD(\"cqg.rtd\", ,\"ContractData\",A411, \"LongDescription\",, \"T\"))","v":"VERTEX PHARMACEUTIC"}]
["S.US.VTR",{"$f":"IF(A412=\"\",\"\",RTD(\"cqg.rtd\", ,\"ContractData\",A412, \"LongDescription\",, \"T\"))","v":"Ventas Inc"}]
["S.US.VTRS",{"$f":"IF(A413=\"\",\"\",RTD(\"cqg.rtd\", ,\"ContractData\",A413, \"LongDescription\",, \"T\"))","v":"VIATRIS INC. CMN STK"}]
["S.US.VZ",{"$f":"IF(A414=\"\",\"\",RTD(\"cqg.rtd\", ,\"ContractData\",A414, \"LongDescription\",, \"T\"))","v":"Verizon Communications"}]
["S.US.WAB",{"$f":"IF(A415=\"\",\"\",RTD(\"cqg.rtd\", ,\"ContractData\",A415, \"LongDescription\",, \"T\"))","v":"Westinghouse Air Brake Co"}]
["S.US.WAT",{"$f":"IF(A416=\"\",\"\",RTD(\"cqg.rtd\", ,\"ContractData\",A416, \"LongDescription\",, \"T\"))","v":"Waters Corporation"}]
["S.US.WBD",{"$f":"IF(A417=\"\",\"\",RTD(\"cqg.rtd\", ,\"ContractData\",A417, \"LongDescription\",, \"T\"))","v":"WRNR BRS DS CM WI"}]
["S.US.WDAY",{"$f":"IF(A418=\"\",\"\",RTD(\"cqg.rtd\", ,\"ContractData\",A418, \"LongDescription\",, \"T\"))","v":"WORKDAY INC CL A"}]
["S.US.WDC",{"$f":"IF(A419=\"\",\"\",RTD(\"cqg.rtd\", ,\"ContractData\",A419, \"LongDescription\",, \"T\"))","v":"WESTERN DIGITAL CP"}]
["S.US.WEC",{"$f":"IF(A420=\"\",\"\",RTD(\"cqg.rtd\", ,\"ContractData\",A420, \"LongDescription\",, \"T\"))","v":"Wisconsin Energy Corp"}]
["S.US.WFC",{"$f":"IF(A421=\"\",\"\",RTD(\"cqg.rtd\", ,\"ContractData\",A421, \"LongDescription\",, \"T\"))","v":"Wells Fargo & Co New"}]
["S.US.WM",{"$f":"IF(A422=\"\",\"\",RTD(\"cqg.rtd\", ,\"ContractData\",A422, \"LongDescription\",, \"T\"))","v":"Waste Mgmt Inc New"}]
["S.US.WMB",{"$f":"IF(A423=\"\",\"\",RTD(\"cqg.rtd\", ,\"ContractData\",A423, \"LongDescription\",, \"T\"))","v":"Williams Companies Inc"}]
["S.US.WMT",{"$f":"IF(A424=\"\",\"\",RTD(\"cqg.rtd\", ,\"ContractData\",A424, \"LongDescription\",, \"T\"))","v":"WALMART INC CMN"}]
["S.US.WRB",{"$f":"IF(A425=\"\",\"\",RTD(\"cqg.rtd\", ,\"ContractData\",A425, \"LongDescription\",, \"T\"))","v":"WR Berkley Corp"}]
["S.US.WSM",{"$f":"IF(A426=\"\",\"\",RTD(\"cqg.rtd\", ,\"ContractData\",A426, \"LongDescription\",, \"T\"))","v":"Williams-Sonoma Inc"}]
["S.US.WST",{"$f":"IF(A427=\"\",\"\",RTD(\"cqg.rtd\", ,\"ContractData\",A427, \"LongDescription\",, \"T\"))","v":"West Pharmaceuticals Svcs Inc"}]
["S.US.WTW",{"$f":"IF(A428=\"\",\"\",RTD(\"cqg.rtd\", ,\"ContractData\",A428, \"LongDescription\",, \"T\"))","v":"Willis Towers Watson"}]
["S.US.WY",{"$f":"IF(A429=\"\",\"\",RTD(\"cqg.rtd\", ,\"ContractData\",A429, \"LongDescription\",, \"T\"))","v":"Weyerhaeuser Company"}]
["S.US.XEL",{"$f":"IF(A430=\"\",\"\",RTD(\"cqg.rtd\", ,\"ContractData\",A430, \"LongDescription\",, \"T\"))","v":"Xcel Energy Inc"}]
["S.US.XOM",{"$f":"IF(A431=\"\",\"\",RTD(\"cqg.rtd\", ,\"ContractData\",A431, \"LongDescription\",, \"T\"))","v":"ExxonMobil Holdings Corporation"}]
["S.US.XYL",{"$f":"IF(A432=\"\",\"\",RTD(\"cqg.rtd\", ,\"ContractData\",A432, \"LongDescription\",, \"T\"))","v":"Xylem, Inc."}]
["S.US.XYZ",{"$f":"IF(A433=\"\",\"\",RTD(\"cqg.rtd\", ,\"ContractData\",A433, \"LongDescription\",, \"T\"))","v":"Square, Inc"}]
["S.US.YUM",{"$f":"IF(A434=\"\",\"\",RTD(\"cqg.rtd\", ,\"ContractData\",A434, \"LongDescription\",, \"T\"))","v":"Yum Brands Inc"}]
["S.US.ZBH",{"$f":"IF(A435=\"\",\"\",RTD(\"cqg.rtd\", ,\"ContractData\",A435, \"LongDescription\",, \"T\"))","v":"Zimmer Biomet Holdings, Inc"}]
["S.US.ZBRA",{"$f":"IF(A436=\"\",\"\",RTD(\"cqg.rtd\", ,\"ContractData\",A436, \"LongDescription\",, \"T\"))","v":"ZEBRA TECHNOLOGIES"}]
["S.US.ZTS",{"$f":"IF(A437=\"\",\"\",RTD(\"cqg.rtd\", ,\"ContractData\",A437, \"LongDescription\",, \"T\"))","v":"Zoetis Inc"}]
["",{"$f":"IF(A438=\"\",\"\",RTD(\"cqg.rtd\", ,\"ContractData\",A438, \"LongDescription\",, \"T\"))","v":""}]