{"text_format":"1","workbook":"xlsx","n_sheets":13,"sheets":["Disaggregated","TradersFinancialFutures","DisaggregatedNoNum","TradersFinancialFuturesNoNum","Sheet1","Sheet2","Sheet1 (2)","Sheet2 (2)","Sheet1 (3)","Sheet2 (3)","Sheet1 (4)","Sheet2 (4)","Symbols"],"not_rendered":{"charts":24,"images":2,"macros":1,"external_links":0,"defined_names":0,"comments":0,"pivot_tables":0},"unopened":[],"bounds":{"document_bytes":16777216,"sheet_cells":100000,"rows_first":2000,"rows_last":500,"rows_between":2000,"halvings":0,"cell_chars":16384,"cell_head_chars":4096},"cells_cut":0,"cells_raw":0,"read":"whole","date_system":"1900"}

{"sheet":"Disaggregated","index":0,"n_rows":45,"n_cols":21,"rows_kept":45,"cut":false,"hidden":false,"merged":[[1,21,2,23],[3,1,3,16],[3,17,3,23],[23,17,23,23],[43,5,43,6],[43,7,43,10],[43,13,43,14],[1,5,2,19],[1,1,2,3],[41,4,41,14]]}
[]
[null,null,null,null,null,"CQG CFTC Disaggreated COT Data",null,null,null,null,null,null,null,null,null,null,null,null,null,null,"Ribbon"]
[]
[null,{"$f":"Sheet1!$P$20","v":"Disaggregated COT as a Percentage of Total Open Interest, Weeks: 10/20/20 vs. 08/18/20"},null,null,null,null,null,null,null,null,null,null,null,null,null,null,null,"Nominal Difference Between Longs and Shorts"]
[]
[]
{"$rows_left_out":40}
{"sheet":"TradersFinancialFutures","index":1,"n_rows":45,"n_cols":21,"rows_kept":45,"cut":false,"hidden":false,"merged":[[1,21,2,23],[3,1,3,16],[3,17,3,23],[23,17,23,23],[41,4,41,14],[43,5,43,6],[43,7,43,10],[43,13,43,14],[1,1,2,3],[1,5,2,19]]}
[]
[null,null,null,null,null,"CQG CFTC Traders in Financial Futures",null,null,null,null,null,null,null,null,null,null,null,null,null,null,"Ribbon"]
[]
[null,{"$f":"'Sheet1 (2)'!P20","v":"Traders in Financial Futures COT as a Percentage of Total Open Interest, Weeks: 10/20/20 vs. 09/01/20"},null,null,null,null,null,null,null,null,null,null,null,null,null,null,null,"Nominal Difference Between Longs and Shorts"]
[]
[]
{"$rows_left_out":40}
{"sheet":"DisaggregatedNoNum","index":2,"n_rows":45,"n_cols":21,"rows_kept":45,"cut":false,"hidden":false,"merged":[[43,5,43,6],[43,7,43,10],[43,13,43,14],[1,1,2,3],[1,5,2,19],[1,21,2,23],[3,1,3,16],[3,17,3,23],[23,17,23,23],[41,4,41,14]]}
[]
[null,null,null,null,null,"CQG CFTC Disaggreated Notional COT Data",null,null,null,null,null,null,null,null,null,null,null,null,null,null,"Ribbon"]
[]
[null,{"$f":"'Sheet1 (3)'!P20","v":"Disaggregated Notional COT, Weeks: 10/20/20 vs. 08/18/20"},null,null,null,null,null,null,null,null,null,null,null,null,null,null,null,"Notional Nominal Difference Between Longs and Shorts"]
[]
[]
{"$rows_left_out":40}
{"sheet":"TradersFinancialFuturesNoNum","index":3,"n_rows":45,"n_cols":21,"rows_kept":45,"cut":false,"hidden":false,"merged":[[1,21,2,23],[3,1,3,16],[3,17,3,23],[23,17,23,23],[41,4,41,14],[43,5,43,6],[43,7,43,10],[43,13,43,14],[1,1,2,3],[1,5,2,19]]}
[]
[null,null,null,null,null," CQG CFTC Traders in Financial Futures Notional COT Data",null,null,null,null,null,null,null,null,null,null,null,null,null,null,"Ribbon"]
[]
[null,{"$f":"'Sheet1 (4)'!P20","v":"Traders in Financial Futures COT as a Percentage of Total Open Interest, Weeks: 10/20/20 vs. 08/18/20"},null,null,null,null,null,null,null,null,null,null,null,null,null,null,null,"Notional Nominal Difference Between Longs and Shorts"]
[]
[]
{"$rows_left_out":40}
{"sheet":"Sheet1","index":4,"n_rows":61,"n_cols":32,"rows_kept":61,"cut":false,"hidden":true,"merged":[]}
[null,"Symbol",{"$f":"Disaggregated!D44","v":"ZSE"},{"$f":"RTD(\"cqg.rtd\", ,\"ContractData\",C1, \"LongDescription\",, \"T\")","v":"Soybeans (Globex), Jan 21"},null,null,null,"Week",{"$f":"IF(I2=\"\",-1,0)","v":-1},{"$f":" IF(LEFT(RTD(\"cqg.rtd\",,\"StudyData\",K6, \"Bar\", \"\", \"Time\",\"W\",I1,,,,,\"T\"),3)=\"777\",\"\",RTD(\"cqg.rtd\",,\"StudyData\",K6, \"Bar\", \"\", \"Time\",\"W\",I1,,,,,\"T\")+1)","v":"2020-10-20"},"Week",{"$f":"Disaggregated!L44","v":-10},null,{"$f":" IF(LEFT( RTD(\"cqg.rtd\",,\"StudyData\",K6, \"Bar\", \"\", \"Time\",\"W\",L1,,,,,\"T\"),3)=\"777\",\"\",RTD(\"cqg.rtd\",,\"StudyData\",K6, \"Bar\", \"\", \"Time\",\"W\",L1,,,,,\"T\")+1)","v":"2020-08-18"}]
[null,null,null,null,null,null,null,null,{"$f":" RTD(\"cqg.rtd\",,\"StudyData\",K6, \"Bar\", \"\", \"Close\",\"W\",0,,,,,\"T\")","v":""},{"$f":"J1+1","v":"2020-10-21"},{"$f":" RTD(\"cqg.rtd\",,\"StudyData\", \"OI(\"&C1&\",OIType:=CommodityOi) when (LocalMonth(\"&$C$1&\")=\"&MONTH(J2)&\" and LocalDay(\"&$C$1&\")=\"&DAY(J2)&\" and LocalYear(\"&$C$1&\")=\"&YEAR(J2)&\")\", \"Bar\", \"\", \"Close\", \"D\", \"0\", \"all\", \"\", \"\",\"FALSE\",\"T\")","v":1049850},null,null,{"$f":"N1+1","v":"2020-08-19"},{"$f":"IF(P2=\"\",RTD(\"cqg.rtd\",,\"StudyData\",\"OI(\"&C1&\",OIType:=CommodityOi) when (LocalMonth(\"&$C$1&\")=\"&MONTH(N2)&\" and LocalDay(\"&$C$1&\")=\"&DAY(N2)+1&\" and LocalYear(\"&$C$1&\")=\"&YEAR(N2)&\")\",\"Bar\",\"\",\"Close\",\"ADC\",\"0\",\"all\",\"\",\"\",\"FALSE\",\"T\"),RTD(\"cqg.rtd\",,\"StudyData\",\"OI(\"&C1&\",OIType:=CommodityOi) when (LocalMonth(\"&$C$1&\")=\"&MONTH(N2)&\" and LocalDay(\"&$C$1&\")=\"&DAY(N2)&\" and LocalYear(\"&$C$1&\")=\"&YEAR(N2)&\")\",\"Bar\",\"\",\"Close\",\"ADC\",\"0\",\"all\",\"\",\"\",\"FALSE\",\"T\"))","v":844099},{"$f":" RTD(\"cqg.rtd\",,\"StudyData\", \"OI(\"&C1&\",OIType:=CommodityOi) when (LocalMonth(\"&$C$1&\")=\"&MONTH(N2)&\" and LocalDay(\"&$C$1&\")=\"&DAY(N1)+1&\" and LocalYear(\"&$C$1&\")=\"&YEAR(N2)&\")\", \"Bar\", \"\", \"Close\", \"ADC\", \"0\", \"all\", \"\", \"\",\"FALSE\",\"T\")","v":844099}]
[null,{"$f":"IF(LEFT(I2,3)=\"777\",1,0)","v":0},null,null,null,null,null,null,null,{"$f":"J1","v":"2020-10-20"},{"$f":" RTD(\"cqg.rtd\",,\"StudyData\", \"PriceToDollar(\"&C1&\",InputChoice=Close) when (LocalMonth(\"&$C$1&\")=\"&MONTH(J3)&\" and LocalDay(\"&$C$1&\")=\"&DAY(J3)&\" and LocalYear(\"&$C$1&\")=\"&YEAR(J3)&\")\", \"Bar\", \"\", \"Close\", \"D\", \"0\", \"all\", \"\", \"\",\"FALSE\",\"T\")","v":53187.5},null,null,{"$f":"N1","v":"2020-08-18"},{"$f":" RTD(\"cqg.rtd\",,\"StudyData\", \"PriceToDollar(\"&C1&\",InputChoice=Close) when (LocalMonth(\"&$C$1&\")=\"&MONTH(N3)&\" and LocalDay(\"&$C$1&\")=\"&DAY(N3)&\" and LocalYear(\"&$C$1&\")=\"&YEAR(N3)&\")\", \"Bar\", \"\", \"Close\", \"ADC\", \"0\", \"all\", \"\", \"\",\"FALSE\",\"T\")","v":45687.5},null,null,null,", &TEXT(AC6,\".0%\")"]
[]
[null,"Agriculture, Petroleum and Products, Natural Gas and Products, Electricity or Metals"]
[null,null,null,null,null,null,null,{"$f":"K3*N6","v":3237044437.5},null,null,{"$f":"\"X.US.\"&$C$1&L6","v":"X.US.ZSEOFSDSPR"},"OFSDSPR",null,{"$f":" RTD(\"cqg.rtd\",,\"StudyData\",K6, \"Bar\", \"\", \"Close\",\"W\",$I$1,,,,,\"T\")","v":60861},{"$f":"N6/$K$2","v":5.7971138734104873E-2},{"$f":"VLOOKUP(K6,Symbols!$A$1:$B$3103,2,FALSE)","v":"Soybeans Options and Futures Combined Swap Dealers Spreading"},{"$f":"P6&\", \"&TEXT(O6,\".0%\")","v":"Soybeans Options and Futures Combined Swap Dealers Spreading, 5.8%"},null,null,null,null,null,null,null,{"$f":"\"X.US.\"&$C$1&Z6","v":"X.US.ZSEOFSDSPR"},"OFSDSPR",null,{"$f":" RTD(\"cqg.rtd\",,\"StudyData\",Y6, \"Bar\", \"\", \"Close\",\"W\",$L$1,,,,,\"T\")","v":27698},{"$f":"AB6/$O$2","v":3.2813686546246355E-2},{"$f":"P6&\", \"&TEXT(AC6,\".0%\")","v":"Soybeans Options and Futures Combined Swap Dealers Spreading, 3.3%"}]
{"$rows_left_out":56}
{"sheet":"Sheet2","index":5,"n_rows":27,"n_cols":19,"rows_kept":27,"cut":false,"hidden":true,"merged":[]}
[null,null,null,null,null,null,null,null,null,null,null,null,null,"Vlookup","Symbol","Volume","rank1","rank2"]
[null,null,null,null,null,null,null,null,null,null,null,null,null,{"$f":"R2","v":6},"A",100,{"$f":"RANK($P2,$P$2:P$7)","v":6},{"$f":"RANK($P2,$P$2:P$7)+COUNTIF($P$2:P2,P2)-1","v":6},{"$f":"RANK($P2,$P$2:P$7)+COUNTIF($P$2:P2,P2)-1","v":6}]
[null,null,null,null,null,null,null,null,null,null,null,null,null,{"$f":"R3","v":3},"B",103,{"$f":"RANK($P3,$P$2:P$7)","v":3},{"$f":"RANK($P3,$P$2:P$7)+COUNTIF($P$2:P3,P3)-1","v":3},{"$f":"RANK($P3,$P$2:P$7)+COUNTIF($P$2:P3,P3)-1","v":3}]
[null,null,null,null,null,null,null,null,null,null,null,null,null,5,"C",102,{"$f":"RANK($P4,$P$2:P$7)","v":5},{"$f":"RANK($P4,$P$2:P$7)+COUNTIF($P$2:P4,P4)-1","v":5},{"$f":"RANK($P4,$P$2:P$7)+COUNTIF($P$2:P4,P4)-1","v":5}]
[null,null,null,null,null,null,null,null,null,null,null,null,null,4,"D",103,{"$f":"RANK($P5,$P$2:P$7)","v":3},{"$f":"RANK($P5,$P$2:P$7)+COUNTIF($P$2:P5,P5)-1","v":4},{"$f":"RANK($P5,$P$2:P$7)+COUNTIF($P$2:P5,P5)-1","v":4}]
[null,null,null,null,null,null,null,null,null,null,null,null,null,{"$f":"R6","v":2},"E",104,{"$f":"RANK($P6,$P$2:P$7)","v":2},{"$f":"RANK($P6,$P$2:P$7)+COUNTIF($P$2:P6,P6)-1","v":2},{"$f":"RANK($P6,$P$2:P$7)+COUNTIF($P$2:P6,P6)-1","v":2}]
{"$rows_left_out":22}
{"sheet":"Sheet1 (2)","index":6,"n_rows":61,"n_cols":32,"rows_kept":61,"cut":false,"hidden":true,"merged":[]}
[null,"Symbol",{"$f":"TradersFinancialFutures!D44","v":"TYA"},{"$f":"RTD(\"cqg.rtd\", ,\"ContractData\",C1, \"LongDescription\",, \"T\")","v":"10yr US Treasury Notes (Globex), Dec 20"},null,null,null,"Week",{"$f":"IF(I2=\"\",-1,0)","v":-1},{"$f":" IF(LEFT(RTD(\"cqg.rtd\",,\"StudyData\",K6, \"Bar\", \"\", \"Time\",\"W\",I1,,,,,\"T\"),3)=\"777\",\"\",RTD(\"cqg.rtd\",,\"StudyData\",K6, \"Bar\", \"\", \"Time\",\"W\",I1,,,,,\"T\")+1)","v":"2020-10-20"},"Week",{"$f":"TradersFinancialFutures!L44","v":-8},null,{"$f":" IF(LEFT( RTD(\"cqg.rtd\",,\"StudyData\",K6, \"Bar\", \"\", \"Time\",\"W\",L1,,,,,\"T\"),3)=\"777\",\"\",RTD(\"cqg.rtd\",,\"StudyData\",K6, \"Bar\", \"\", \"Time\",\"W\",L1,,,,,\"T\")+1)","v":"2020-09-01"}]
[null,null,null,null,null,null,null,null,{"$f":" RTD(\"cqg.rtd\",,\"StudyData\",K6, \"Bar\", \"\", \"Close\",\"W\",0,,,,,\"T\")","v":""},{"$f":"J1+1","v":"2020-10-21"},{"$f":" RTD(\"cqg.rtd\",,\"StudyData\", \"OI(\"&C1&\",OIType:=CommodityOi) when (LocalMonth(\"&$C$1&\")=\"&MONTH(J2)&\" and LocalDay(\"&$C$1&\")=\"&DAY(J2)&\" and LocalYear(\"&$C$1&\")=\"&YEAR(J2)&\")\", \"Bar\", \"\", \"Close\", \"D\", \"0\", \"all\", \"\", \"\",\"FALSE\",\"T\")","v":3183549},null,null,{"$f":"N1+1","v":"2020-09-02"},{"$f":"IF(P2=\"\",RTD(\"cqg.rtd\",,\"StudyData\",\"OI(\"&C1&\",OIType:=CommodityOi) when (LocalMonth(\"&$C$1&\")=\"&MONTH(N2)&\" and LocalDay(\"&$C$1&\")=\"&DAY(N2)+1&\" and LocalYear(\"&$C$1&\")=\"&YEAR(N2)&\")\",\"Bar\",\"\",\"Close\",\"D\",\"0\",\"all\",\"\",\"\",\"FALSE\",\"T\"),RTD(\"cqg.rtd\",,\"StudyData\",\"OI(\"&C1&\",OIType:=CommodityOi) when (LocalMonth(\"&$C$1&\")=\"&MONTH(N2)&\" and LocalDay(\"&$C$1&\")=\"&DAY(N2)&\" and LocalYear(\"&$C$1&\")=\"&YEAR(N2)&\")\",\"Bar\",\"\",\"Close\",\"D\",\"0\",\"all\",\"\",\"\",\"FALSE\",\"T\"))","v":3374018},{"$f":" RTD(\"cqg.rtd\",,\"StudyData\", \"OI(\"&C1&\",OIType:=CommodityOi) when (LocalMonth(\"&$C$1&\")=\"&MONTH(N2)&\" and LocalDay(\"&$C$1&\")=\"&DAY(N1)+1&\" and LocalYear(\"&$C$1&\")=\"&YEAR(N2)&\")\", \"Bar\", \"\", \"Close\", \"D\", \"0\", \"all\", \"\", \"\",\"FALSE\",\"T\")","v":3374018}]
[null,{"$f":"IF(LEFT(I2,3)=\"777\",1,0)","v":0},null,null,null,null,null,null,null,{"$f":"J1","v":"2020-10-20"},{"$f":" RTD(\"cqg.rtd\",,\"StudyData\", \"PriceToDollar(\"&C1&\",InputChoice:=Close) when (LocalMonth(\"&$C$1&\")=\"&MONTH(J3)&\" and LocalDay(\"&$C$1&\")=\"&DAY(J3)&\" and LocalYear(\"&$C$1&\")=\"&YEAR(J3)&\")\", \"Bar\", \"\", \"Close\", \"D\", \"0\", \"all\", \"\", \"\",\"FALSE\",\"T\")","v":138703.125},null,null,{"$f":"N1","v":"2020-09-01"},{"$f":"RTD(\"cqg.rtd\",,\"StudyData\",\"PriceToDollar(\"&C1&\",InputChoice:=Close) when (LocalMonth(\"&$C$1&\")=\"&N4&\" and LocalDay(\"&$C$1&\")=\"&O4&\" and LocalYear(\"&$C$1&\")=\"&P4&\")\",\"Bar\",\"\",\"Close\",\"ADC\",\"0\",\"all\",\"\",\"\",\"FALSE\",\"T\")","v":128421.875},null,null,null,", &TEXT(AC6,\".0%\")"]
[null,null,null,null,null,null,null,null,null,null,null,null,null,12,31,2019]
[null,"Agriculture, Petroleum and Products, Natural Gas and Products, Electricity or Metals"]
[null,null,null,null,null,null,null,null,null,null,{"$f":"\"X.US.\"&$C$1&L6","v":"X.US.TYAOFAMILONG"},"OFAMILONG",null,{"$f":" RTD(\"cqg.rtd\",,\"StudyData\",K6, \"Bar\", \"\", \"Close\",\"W\",$I$1,,,,,\"T\")","v":1379468},{"$f":"N6/$K$2","v":0.43331137670568287},{"$f":"VLOOKUP(K6,Symbols!$A$1:$B$3103,2,FALSE)","v":"US 10Y T-note Options and Futures Combined Asset Manager/Institutional Long"},{"$f":"P6&\", \"&TEXT(O6,\".0%\")","v":"US 10Y T-note Options and Futures Combined Asset Manager/Institutional Long, 43.3%"},null,null,null,null,null,null,null,{"$f":"\"X.US.\"&$C$1&Z6","v":"X.US.TYAOFAMILONG"},"OFAMILONG",null,{"$f":" RTD(\"cqg.rtd\",,\"StudyData\",Y6, \"Bar\", \"\", \"Close\",\"W\",$L$1,,,,,\"T\")","v":1337774},{"$f":"AB6/$O$2","v":0.39649284621480974},{"$f":"P6&\", \"&TEXT(AC6,\".0%\")","v":"US 10Y T-note Options and Futures Combined Asset Manager/Institutional Long, 39.6%"}]
{"$rows_left_out":56}
{"sheet":"Sheet2 (2)","index":7,"n_rows":27,"n_cols":19,"rows_kept":27,"cut":false,"hidden":true,"merged":[]}
[null,null,null,null,null,null,null,null,null,null,null,null,null,"Vlookup","Symbol","Volume","rank1","rank2"]
[null,null,null,null,null,null,null,null,null,null,null,null,null,{"$f":"R2","v":6},"A",100,{"$f":"RANK($P2,$P$2:P$7)","v":6},{"$f":"RANK($P2,$P$2:P$7)+COUNTIF($P$2:P2,P2)-1","v":6},{"$f":"RANK($P2,$P$2:P$7)+COUNTIF($P$2:P2,P2)-1","v":6}]
[null,null,null,null,null,null,null,null,null,null,null,null,null,{"$f":"R3","v":3},"B",103,{"$f":"RANK($P3,$P$2:P$7)","v":3},{"$f":"RANK($P3,$P$2:P$7)+COUNTIF($P$2:P3,P3)-1","v":3},{"$f":"RANK($P3,$P$2:P$7)+COUNTIF($P$2:P3,P3)-1","v":3}]
[null,null,null,null,null,null,null,null,null,null,null,null,null,5,"C",102,{"$f":"RANK($P4,$P$2:P$7)","v":5},{"$f":"RANK($P4,$P$2:P$7)+COUNTIF($P$2:P4,P4)-1","v":5},{"$f":"RANK($P4,$P$2:P$7)+COUNTIF($P$2:P4,P4)-1","v":5}]
[null,null,null,null,null,null,null,null,null,null,null,null,null,4,"D",103,{"$f":"RANK($P5,$P$2:P$7)","v":3},{"$f":"RANK($P5,$P$2:P$7)+COUNTIF($P$2:P5,P5)-1","v":4},{"$f":"RANK($P5,$P$2:P$7)+COUNTIF($P$2:P5,P5)-1","v":4}]
[null,null,null,null,null,null,null,null,null,null,null,null,null,{"$f":"R6","v":2},"E",104,{"$f":"RANK($P6,$P$2:P$7)","v":2},{"$f":"RANK($P6,$P$2:P$7)+COUNTIF($P$2:P6,P6)-1","v":2},{"$f":"RANK($P6,$P$2:P$7)+COUNTIF($P$2:P6,P6)-1","v":2}]
{"$rows_left_out":22}
{"sheet":"Sheet1 (3)","index":8,"n_rows":61,"n_cols":32,"rows_kept":61,"cut":false,"hidden":true,"merged":[]}
[null,"Symbol",{"$f":"DisaggregatedNoNum!D44","v":"ZSE"},{"$f":"RTD(\"cqg.rtd\", ,\"ContractData\",C1, \"LongDescription\",, \"T\")","v":"Soybeans (Globex), Jan 21"},null,null,null,"Week",{"$f":"IF(I2=\"\",-1,0)","v":-1},{"$f":" IF(LEFT(RTD(\"cqg.rtd\",,\"StudyData\",K6, \"Bar\", \"\", \"Time\",\"W\",I1,,,,,\"T\"),3)=\"777\",\"\",RTD(\"cqg.rtd\",,\"StudyData\",K6, \"Bar\", \"\", \"Time\",\"W\",I1,,,,,\"T\")+1)","v":"2020-10-20"},"Week",{"$f":"DisaggregatedNoNum!L44","v":-10},null,{"$f":" IF(LEFT( RTD(\"cqg.rtd\",,\"StudyData\",K6, \"Bar\", \"\", \"Time\",\"W\",L1,,,,,\"T\"),3)=\"777\",\"\",RTD(\"cqg.rtd\",,\"StudyData\",K6, \"Bar\", \"\", \"Time\",\"W\",L1,,,,,\"T\")+1)","v":"2020-08-18"}]
[null,null,null,null,null,null,null,null,{"$f":" RTD(\"cqg.rtd\",,\"StudyData\",K6, \"Bar\", \"\", \"Close\",\"W\",0,,,,,\"T\")","v":""},{"$f":"J1+1","v":"2020-10-21"},{"$f":" RTD(\"cqg.rtd\",,\"StudyData\", \"OI(\"&C1&\",OIType:=CommodityOi) when (LocalMonth(\"&$C$1&\")=\"&MONTH(J2)&\" and LocalDay(\"&$C$1&\")=\"&DAY(J2)&\" and LocalYear(\"&$C$1&\")=\"&YEAR(J2)&\")\", \"Bar\", \"\", \"Close\", \"D\", \"0\", \"all\", \"\", \"\",\"FALSE\",\"T\")","v":1049850},null,null,{"$f":"N1+1","v":"2020-08-19"},{"$f":"IF(P2=\"\",RTD(\"cqg.rtd\",,\"StudyData\",\"OI(\"&C1&\",OIType:=CommodityOi) when (LocalMonth(\"&$C$1&\")=\"&MONTH(N2)&\" and LocalDay(\"&$C$1&\")=\"&DAY(N2)+1&\" and LocalYear(\"&$C$1&\")=\"&YEAR(N2)&\")\",\"Bar\",\"\",\"Close\",\"ADC\",\"0\",\"all\",\"\",\"\",\"FALSE\",\"T\"),RTD(\"cqg.rtd\",,\"StudyData\",\"OI(\"&C1&\",OIType:=CommodityOi) when (LocalMonth(\"&$C$1&\")=\"&MONTH(N2)&\" and LocalDay(\"&$C$1&\")=\"&DAY(N2)&\" and LocalYear(\"&$C$1&\")=\"&YEAR(N2)&\")\",\"Bar\",\"\",\"Close\",\"ADC\",\"0\",\"all\",\"\",\"\",\"FALSE\",\"T\"))","v":844099},{"$f":" RTD(\"cqg.rtd\",,\"StudyData\", \"OI(\"&C1&\",OIType:=CommodityOi) when (LocalMonth(\"&$C$1&\")=\"&MONTH(N2)&\" and LocalDay(\"&$C$1&\")=\"&DAY(N1)+1&\" and LocalYear(\"&$C$1&\")=\"&YEAR(N2)&\")\", \"Bar\", \"\", \"Close\", \"ADC\", \"0\", \"all\", \"\", \"\",\"FALSE\",\"T\")","v":844099}]
[null,{"$f":"IF(LEFT(I2,3)=\"777\",1,0)","v":0},null,null,null,null,null,null,null,{"$f":"J1","v":"2020-10-20"},{"$f":" RTD(\"cqg.rtd\",,\"StudyData\", \"PriceToDollar(\"&C1&\",InputChoice=Close) when (LocalMonth(\"&$C$1&\")=\"&MONTH(J3)&\" and LocalDay(\"&$C$1&\")=\"&DAY(J3)&\" and LocalYear(\"&$C$1&\")=\"&YEAR(J3)&\")\", \"Bar\", \"\", \"Close\", \"D\", \"0\", \"all\", \"\", \"\",\"FALSE\",\"T\")","v":53187.5},null,null,{"$f":"N1","v":"2020-08-18"},{"$f":" RTD(\"cqg.rtd\",,\"StudyData\", \"PriceToDollar(\"&C1&\",InputChoice=Close) when (LocalMonth(\"&$C$1&\")=\"&MONTH(N3)&\" and LocalDay(\"&$C$1&\")=\"&DAY(N3)&\" and LocalYear(\"&$C$1&\")=\"&YEAR(N3)&\")\", \"Bar\", \"\", \"Close\", \"ADC\", \"0\", \"all\", \"\", \"\",\"FALSE\",\"T\")","v":45687.5},null,null,null,", &TEXT(AC6,\".0%\")"]
[]
[null,"Agriculture, Petroleum and Products, Natural Gas and Products, Electricity or Metals"]
[null,null,null,null,null,null,null,{"$f":"K3*N6","v":3237044437.5},null,null,{"$f":"\"X.US.\"&$C$1&L6","v":"X.US.ZSEOFSDSPR"},"OFSDSPR",null,{"$f":" RTD(\"cqg.rtd\",,\"StudyData\",K6, \"Bar\", \"\", \"Close\",\"W\",$I$1,,,,,\"T\")","v":60861},{"$f":"N6/$K$2","v":5.7971138734104873E-2},{"$f":"VLOOKUP(K6,Symbols!$A$1:$B$3103,2,FALSE)","v":"Soybeans Options and Futures Combined Swap Dealers Spreading"},{"$f":"P6&\", \"&TEXT(O6,\".0%\")","v":"Soybeans Options and Futures Combined Swap Dealers Spreading, 5.8%"},null,null,null,null,null,null,null,{"$f":"\"X.US.\"&$C$1&Z6","v":"X.US.ZSEOFSDSPR"},"OFSDSPR",null,{"$f":" RTD(\"cqg.rtd\",,\"StudyData\",Y6, \"Bar\", \"\", \"Close\",\"W\",$L$1,,,,,\"T\")","v":27698},{"$f":"AB6/$O$2","v":3.2813686546246355E-2},{"$f":"P6&\", \"&TEXT(AC6,\".0%\")","v":"Soybeans Options and Futures Combined Swap Dealers Spreading, 3.3%"}]
{"$rows_left_out":56}
{"sheet":"Sheet2 (3)","index":9,"n_rows":27,"n_cols":19,"rows_kept":27,"cut":false,"hidden":true,"merged":[]}
[null,null,null,null,null,null,null,null,null,null,null,null,null,"Vlookup","Symbol","Volume","rank1","rank2"]
[null,null,null,null,null,null,null,null,null,null,null,null,null,{"$f":"R2","v":6},"A",100,{"$f":"RANK($P2,$P$2:P$7)","v":6},{"$f":"RANK($P2,$P$2:P$7)+COUNTIF($P$2:P2,P2)-1","v":6},{"$f":"RANK($P2,$P$2:P$7)+COUNTIF($P$2:P2,P2)-1","v":6}]
[null,null,null,null,null,null,null,null,null,null,null,null,null,{"$f":"R3","v":3},"B",103,{"$f":"RANK($P3,$P$2:P$7)","v":3},{"$f":"RANK($P3,$P$2:P$7)+COUNTIF($P$2:P3,P3)-1","v":3},{"$f":"RANK($P3,$P$2:P$7)+COUNTIF($P$2:P3,P3)-1","v":3}]
[null,null,null,null,null,null,null,null,null,null,null,null,null,5,"C",102,{"$f":"RANK($P4,$P$2:P$7)","v":5},{"$f":"RANK($P4,$P$2:P$7)+COUNTIF($P$2:P4,P4)-1","v":5},{"$f":"RANK($P4,$P$2:P$7)+COUNTIF($P$2:P4,P4)-1","v":5}]
[null,null,null,null,null,null,null,null,null,null,null,null,null,4,"D",103,{"$f":"RANK($P5,$P$2:P$7)","v":3},{"$f":"RANK($P5,$P$2:P$7)+COUNTIF($P$2:P5,P5)-1","v":4},{"$f":"RANK($P5,$P$2:P$7)+COUNTIF($P$2:P5,P5)-1","v":4}]
[null,null,null,null,null,null,null,null,null,null,null,null,null,{"$f":"R6","v":2},"E",104,{"$f":"RANK($P6,$P$2:P$7)","v":2},{"$f":"RANK($P6,$P$2:P$7)+COUNTIF($P$2:P6,P6)-1","v":2},{"$f":"RANK($P6,$P$2:P$7)+COUNTIF($P$2:P6,P6)-1","v":2}]
{"$rows_left_out":22}
{"sheet":"Sheet1 (4)","index":10,"n_rows":61,"n_cols":32,"rows_kept":61,"cut":false,"hidden":true,"merged":[]}
[null,"Symbol",{"$f":"TradersFinancialFuturesNoNum!D44","v":"EP"},{"$f":"RTD(\"cqg.rtd\", ,\"ContractData\",C1, \"LongDescription\",, \"T\")","v":"E-Mini S&P 500, Dec 20"},null,null,null,"Week",{"$f":"IF(I2=\"\",-1,0)","v":-1},{"$f":" IF(LEFT(RTD(\"cqg.rtd\",,\"StudyData\",K6, \"Bar\", \"\", \"Time\",\"W\",I1,,,,,\"T\"),3)=\"777\",\"\",RTD(\"cqg.rtd\",,\"StudyData\",K6, \"Bar\", \"\", \"Time\",\"W\",I1,,,,,\"T\")+1)","v":"2020-10-20"},"Week",{"$f":"TradersFinancialFuturesNoNum!L44","v":-10},null,{"$f":" IF(LEFT( RTD(\"cqg.rtd\",,\"StudyData\",K6, \"Bar\", \"\", \"Time\",\"W\",L1,,,,,\"T\"),3)=\"777\",\"\",RTD(\"cqg.rtd\",,\"StudyData\",K6, \"Bar\", \"\", \"Time\",\"W\",L1,,,,,\"T\")+1)","v":"2020-08-18"}]
[null,null,null,null,null,null,null,null,{"$f":" RTD(\"cqg.rtd\",,\"StudyData\",K6, \"Bar\", \"\", \"Close\",\"W\",0,,,,,\"T\")","v":""},{"$f":"J1+1","v":"2020-10-21"},{"$f":" RTD(\"cqg.rtd\",,\"StudyData\", \"OI(\"&C1&\",OIType:=CommodityOi) when (LocalMonth(\"&$C$1&\")=\"&MONTH(J2)&\" and LocalDay(\"&$C$1&\")=\"&DAY(J2)&\" and LocalYear(\"&$C$1&\")=\"&YEAR(J2)&\")\", \"Bar\", \"\", \"Close\", \"D\", \"0\", \"all\", \"\", \"\",\"FALSE\",\"T\")","v":2438237},null,null,{"$f":"N1+1","v":"2020-08-19"},{"$f":"IF(P2=\"\",RTD(\"cqg.rtd\",,\"StudyData\",\"OI(\"&C1&\",OIType:=CommodityOi) when (LocalMonth(\"&$C$1&\")=\"&MONTH(N2)&\" and LocalDay(\"&$C$1&\")=\"&DAY(N2)+1&\" and LocalYear(\"&$C$1&\")=\"&YEAR(N2)&\")\",\"Bar\",\"\",\"Close\",\"ADC\",\"0\",\"all\",\"\",\"\",\"FALSE\",\"T\"),RTD(\"cqg.rtd\",,\"StudyData\",\"OI(\"&C1&\",OIType:=CommodityOi) when (LocalMonth(\"&$C$1&\")=\"&MONTH(N2)&\" and LocalDay(\"&$C$1&\")=\"&DAY(N2)&\" and LocalYear(\"&$C$1&\")=\"&YEAR(N2)&\")\",\"Bar\",\"\",\"Close\",\"ADC\",\"0\",\"all\",\"\",\"\",\"FALSE\",\"T\"))","v":2721218},{"$f":" RTD(\"cqg.rtd\",,\"StudyData\", \"OI(\"&C1&\",OIType:=CommodityOi) when (LocalMonth(\"&$C$1&\")=\"&MONTH(N2)&\" and LocalDay(\"&$C$1&\")=\"&DAY(N1)+1&\" and LocalYear(\"&$C$1&\")=\"&YEAR(N2)&\")\", \"Bar\", \"\", \"Close\", \"ADC\", \"0\", \"all\", \"\", \"\",\"FALSE\",\"T\")","v":2721218}]
[null,{"$f":"IF(LEFT(I2,3)=\"777\",1,0)","v":0},null,null,null,null,null,null,null,{"$f":"J1","v":"2020-10-20"},{"$f":" RTD(\"cqg.rtd\",,\"StudyData\", \"PriceToDollar(\"&C1&\",InputChoice=Close) when (LocalMonth(\"&$C$1&\")=\"&MONTH(J3)&\" and LocalDay(\"&$C$1&\")=\"&DAY(J3)&\" and LocalYear(\"&$C$1&\")=\"&YEAR(J3)&\")\", \"Bar\", \"\", \"Close\", \"D\", \"0\", \"all\", \"\", \"\",\"FALSE\",\"T\")","v":171612.5},null,null,{"$f":"N1","v":"2020-08-18"},{"$f":" RTD(\"cqg.rtd\",,\"StudyData\", \"PriceToDollar(\"&C1&\",InputChoice=Close) when (LocalMonth(\"&$C$1&\")=\"&MONTH(N3)&\" and LocalDay(\"&$C$1&\")=\"&DAY(N3)&\" and LocalYear(\"&$C$1&\")=\"&YEAR(N3)&\")\", \"Bar\", \"\", \"Close\", \"ADC\", \"0\", \"all\", \"\", \"\",\"FALSE\",\"T\")","v":169350},null,null,null,", &TEXT(AC6,\".0%\")"]
[]
[null,"Agriculture, Petroleum and Products, Natural Gas and Products, Electricity or Metals"]
[null,null,null,null,null,null,null,{"$f":"K3*N6","v":3.619515374373156E+16},null,null,{"$f":"\"X.US.\"&$C$1&L6","v":"X.US.EPOFAMILONG"},"OFAMILONG",null,{"$f":" RTD(\"cqg.rtd\",,\"StudyData\",K6, \"Bar\", \"\", \"Close\",\"W\",$I$1,,,,,\"T\")*$K$3","v":210912105725},{"$f":"N6/$K$2","v":86501.888751995808},{"$f":"VLOOKUP(K6,Symbols!$A$1:$B$3103,2,FALSE)","v":"E-mini SP500 Options and Futures Combined Asset Manager/Institutional Long"},{"$f":"P6&\", \"&TEXT(O6,\".0%\")","v":"E-mini SP500 Options and Futures Combined Asset Manager/Institutional Long, 8650188.9%"},null,null,null,null,null,null,null,{"$f":"\"X.US.\"&$C$1&Z6","v":"X.US.EPOFAMILONG"},"OFAMILONG",null,{"$f":" RTD(\"cqg.rtd\",,\"StudyData\",Y6, \"Bar\", \"\", \"Close\",\"W\",$L$1,,,,,\"T\")","v":1313841},{"$f":"AB6/$O$2","v":0.48281357833146776},{"$f":"P6&\", \"&TEXT(AC6,\".0%\")","v":"E-mini SP500 Options and Futures Combined Asset Manager/Institutional Long, 48.3%"}]
{"$rows_left_out":56}
{"sheet":"Sheet2 (4)","index":11,"n_rows":27,"n_cols":19,"rows_kept":27,"cut":false,"hidden":true,"merged":[]}
[null,null,null,null,null,null,null,null,null,null,null,null,null,"Vlookup","Symbol","Volume","rank1","rank2"]
[null,null,null,null,null,null,null,null,null,null,null,null,null,{"$f":"R2","v":6},"A",100,{"$f":"RANK($P2,$P$2:P$7)","v":6},{"$f":"RANK($P2,$P$2:P$7)+COUNTIF($P$2:P2,P2)-1","v":6},{"$f":"RANK($P2,$P$2:P$7)+COUNTIF($P$2:P2,P2)-1","v":6}]
[null,null,null,null,null,null,null,null,null,null,null,null,null,{"$f":"R3","v":3},"B",103,{"$f":"RANK($P3,$P$2:P$7)","v":3},{"$f":"RANK($P3,$P$2:P$7)+COUNTIF($P$2:P3,P3)-1","v":3},{"$f":"RANK($P3,$P$2:P$7)+COUNTIF($P$2:P3,P3)-1","v":3}]
[null,null,null,null,null,null,null,null,null,null,null,null,null,5,"C",102,{"$f":"RANK($P4,$P$2:P$7)","v":5},{"$f":"RANK($P4,$P$2:P$7)+COUNTIF($P$2:P4,P4)-1","v":5},{"$f":"RANK($P4,$P$2:P$7)+COUNTIF($P$2:P4,P4)-1","v":5}]
[null,null,null,null,null,null,null,null,null,null,null,null,null,4,"D",103,{"$f":"RANK($P5,$P$2:P$7)","v":3},{"$f":"RANK($P5,$P$2:P$7)+COUNTIF($P$2:P5,P5)-1","v":4},{"$f":"RANK($P5,$P$2:P$7)+COUNTIF($P$2:P5,P5)-1","v":4}]
[null,null,null,null,null,null,null,null,null,null,null,null,null,{"$f":"R6","v":2},"E",104,{"$f":"RANK($P6,$P$2:P$7)","v":2},{"$f":"RANK($P6,$P$2:P$7)+COUNTIF($P$2:P6,P6)-1","v":2},{"$f":"RANK($P6,$P$2:P$7)+COUNTIF($P$2:P6,P6)-1","v":2}]
{"$rows_left_out":22}
{"sheet":"Symbols","index":12,"n_rows":3103,"n_cols":2,"rows_kept":3103,"cut":false,"hidden":true,"merged":[]}
["X.US.ZQEAMILONG","30 day Fed Funds Asset Manager/Institutional Long"]
["X.US.ZQEAMIDIFF","30 day Fed Funds Asset Manager/Institutional Long/Short Diff"]
["X.US.ZQEAMISHT","30 day Fed Funds Asset Manager/Institutional Short"]
["X.US.ZQEAMISPR","30 day Fed Funds Asset Manager/Institutional Spreading"]
["X.US.ZQEDILONG","30 day Fed Funds Dealer Intermediary Long"]
["X.US.ZQEDIDIFF","30 day Fed Funds Dealer Intermediary Long/Short Diff"]
{"$rows_left_out":3097}