{"text_format":"1","workbook":"xlsx","n_sheets":11,"sheets":["Main Display","Symbols","15_Min","Daily","Weekly","Monthly","Symbols (2)","15_Min (2)","Daily (2)","Weekly (2)","Monthly (2)"],"not_rendered":{"charts":8,"images":2,"macros":1,"external_links":0,"defined_names":0,"comments":0,"pivot_tables":0},"unopened":[],"bounds":{"document_bytes":16777216,"sheet_cells":100000,"rows_first":2000,"rows_last":500,"rows_between":2000,"halvings":0,"cell_chars":16384,"cell_head_chars":4096},"cells_cut":0,"cells_raw":0,"read":"whole","date_system":"1900"}

{"sheet":"Main Display","index":0,"n_rows":46,"n_cols":25,"rows_kept":46,"cut":false,"hidden":false,"merged":[[24,19,24,23],[1,1,2,4],[1,21,2,24],[3,1,3,5],[3,7,3,11],[3,13,3,17],[3,19,3,23],[1,6,2,19],[45,1,45,4],[45,5,45,7],[24,1,24,5],[24,7,24,11],[24,13,24,17]]}
[]
[null,null,null,null,null,null,"CQG Percent Change Performance",null,null,null,null,null,null,null,null,null,null,null,null,null,"Ribbon",{"$f":"RTD(\"cqg.rtd\", ,\"SystemInfo\", \"Linetime\")","v":44096.404120370367}]
[]
[null,{"$f":"Symbols!D7","v":"Dow 30"},null,null,null,null,{"$f":"Symbols!D3","v":15},{"$f":"Symbols!D7","v":"Dow 30"},null,null,null,null,{"$f":"Symbols!E3","v":"Daily"},{"$f":"Symbols!D7","v":"Dow 30"},null,null,null,null,{"$f":"Symbols!F3","v":"Weekly"},{"$f":"Symbols!D7","v":"Dow 30"},null,null,null,null,{"$f":"Symbols!G3","v":"Monthly"}]
[]
[]
[]
[]
[]
[]
[]
[]
[]
[]
[]
[]
[]
[]
[]
[]
[]
[]
[]
[]
[null,{"$f":"'Symbols (2)'!D7","v":"Futures Markets"},null,null,null,null,{"$f":"'Symbols (2)'!D3","v":15},{"$f":"'Symbols (2)'!D7","v":"Futures Markets"},null,null,null,null,{"$f":"'Symbols (2)'!E3","v":"Daily"},{"$f":"'Symbols (2)'!D7","v":"Futures Markets"},null,null,null,null,{"$f":"'Symbols (2)'!F3","v":"Weekly"},{"$f":"'Symbols (2)'!D7","v":"Futures Markets"},null,null,null,null,{"$f":"'Symbols (2)'!G3","v":"Monthly"}]
[]
[]
[]
[]
[]
[]
[]
[]
[]
[]
[]
[]
[]
[]
[]
[]
[]
[]
[]
[]
[null,"  Copyright © 2020, CQG Inc.",null,null,null,"Designed by Thom Hartle"]

{"sheet":"Symbols","index":1,"n_rows":31,"n_cols":7,"rows_kept":31,"cut":false,"hidden":false,"merged":[[6,3,6,6],[5,3,5,6]]}
[null,"Symbols","Description","Chart 1","Chart 2","Chart 3","Chart 4"]
[null,"S.MMM",{"$f":"RTD(\"cqg.rtd\", ,\"ContractData\",B2, \"LongDescription\",, \"T\")","v":"3M Company"},15,"D","W","M"]
[null,"S.AXP",{"$f":"RTD(\"cqg.rtd\", ,\"ContractData\",B3, \"LongDescription\",, \"T\")","v":"American Express Co"},{"$f":"IF(ISNUMBER(D2),D2,IF(D2=\"D\",\"Daily\",IF(D2=\"W\",\"Weekly\",IF(D2=\"M\",\"Monthly\",IF(D2=\"Q\",\"Quarterly\",IF(D2=\"S\",\"Semi-Annual\",IF(D2=\"A\",\"Annual\")))))))","v":15},{"$f":"IF(ISNUMBER(E2),E2,IF(E2=\"D\",\"Daily\",IF(E2=\"W\",\"Weekly\",IF(E2=\"M\",\"Monthly\",IF(E2=\"Q\",\"Quarterly\",IF(E2=\"S\",\"Semi-Annual\",IF(E2=\"A\",\"Annual\")))))))","v":"Daily"},{"$f":"IF(ISNUMBER(F2),F2,IF(F2=\"D\",\"Daily\",IF(F2=\"W\",\"Weekly\",IF(F2=\"M\",\"Monthly\",IF(F2=\"Q\",\"Quarterly\",IF(F2=\"S\",\"Semi-Annual\",IF(F2=\"A\",\"Annual\")))))))","v":"Weekly"},{"$f":"IF(ISNUMBER(G2),G2,IF(G2=\"D\",\"Daily\",IF(G2=\"W\",\"Weekly\",IF(G2=\"M\",\"Monthly\",IF(G2=\"Q\",\"Quarterly\",IF(G2=\"S\",\"Semi-Annual\",IF(G2=\"A\",\"Annual\")))))))","v":"Monthly"}]
[null,"S.AMGN",{"$f":"RTD(\"cqg.rtd\", ,\"ContractData\",B4, \"LongDescription\",, \"T\")","v":"Amgen Inc"},"Use All Capitals for Symbols and Time Frame"]
[null,"S.AAPL",{"$f":"RTD(\"cqg.rtd\", ,\"ContractData\",B5, \"LongDescription\",, \"T\")","v":"Apple Inc"}]
[null,"S.BA",{"$f":"RTD(\"cqg.rtd\", ,\"ContractData\",B6, \"LongDescription\",, \"T\")","v":"Boeing Company"},"Title"]
[null,"S.CAT",{"$f":"RTD(\"cqg.rtd\", ,\"ContractData\",B7, \"LongDescription\",, \"T\")","v":"Caterpillar Inc"},"Dow 30"]
[null,"S.CVX",{"$f":"RTD(\"cqg.rtd\", ,\"ContractData\",B8, \"LongDescription\",, \"T\")","v":"Chevron Corp"}]
[null,"S.CSCO",{"$f":"RTD(\"cqg.rtd\", ,\"ContractData\",B9, \"LongDescription\",, \"T\")","v":"Cisco Systems Inc"}]
[null,"S.KO",{"$f":"RTD(\"cqg.rtd\", ,\"ContractData\",B10, \"LongDescription\",, \"T\")","v":"Coca-Cola Company"}]
[null,"S.DOW",{"$f":"RTD(\"cqg.rtd\", ,\"ContractData\",B11, \"LongDescription\",, \"T\")","v":"Dow Inc."}]
[null,"S.GS",{"$f":"RTD(\"cqg.rtd\", ,\"ContractData\",B12, \"LongDescription\",, \"T\")","v":"Goldman Sachs Group"}]
[null,"S.HD",{"$f":"RTD(\"cqg.rtd\", ,\"ContractData\",B13, \"LongDescription\",, \"T\")","v":"Home Depot, Inc."}]
[null,"S.HON",{"$f":"RTD(\"cqg.rtd\", ,\"ContractData\",B14, \"LongDescription\",, \"T\")","v":"Honeywell Intl"}]
[null,"S.INTC",{"$f":"RTD(\"cqg.rtd\", ,\"ContractData\",B15, \"LongDescription\",, \"T\")","v":"Intel Corporation"}]
[null,"S.IBM",{"$f":"RTD(\"cqg.rtd\", ,\"ContractData\",B16, \"LongDescription\",, \"T\")","v":"International Business Machines"}]
[null,"S.JNJ",{"$f":"RTD(\"cqg.rtd\", ,\"ContractData\",B17, \"LongDescription\",, \"T\")","v":"Johnson & Johnson"}]
[null,"S.JPM",{"$f":"RTD(\"cqg.rtd\", ,\"ContractData\",B18, \"LongDescription\",, \"T\")","v":"JPMorgan Chase & Co."}]
[null,"S.MCD",{"$f":"RTD(\"cqg.rtd\", ,\"ContractData\",B19, \"LongDescription\",, \"T\")","v":"McDonald's Corporation"}]
[null,"S.MRK",{"$f":"RTD(\"cqg.rtd\", ,\"ContractData\",B20, \"LongDescription\",, \"T\")","v":"Merck & Co Inc"}]
[null,"S.MSFT",{"$f":"RTD(\"cqg.rtd\", ,\"ContractData\",B21, \"LongDescription\",, \"T\")","v":"Microsoft Corporation"}]
[null,"S.NKE",{"$f":"RTD(\"cqg.rtd\", ,\"ContractData\",B22, \"LongDescription\",, \"T\")","v":"NIKE Inc ClsB"}]
[null,"S.PG",{"$f":"RTD(\"cqg.rtd\", ,\"ContractData\",B23, \"LongDescription\",, \"T\")","v":"Procter & Gamble Co"}]
[null,"S.CRM",{"$f":"RTD(\"cqg.rtd\", ,\"ContractData\",B24, \"LongDescription\",, \"T\")","v":"Salesforce.com Inc"}]
[null,"S.TRV",{"$f":"RTD(\"cqg.rtd\", ,\"ContractData\",B25, \"LongDescription\",, \"T\")","v":"Travelers Companies, Inc"}]
[null,"S.UNH",{"$f":"RTD(\"cqg.rtd\", ,\"ContractData\",B26, \"LongDescription\",, \"T\")","v":"United Health Group Inc"}]
[null,"S.VZ",{"$f":"RTD(\"cqg.rtd\", ,\"ContractData\",B27, \"LongDescription\",, \"T\")","v":"Verizon Communications"}]
[null,"S.V",{"$f":"RTD(\"cqg.rtd\", ,\"ContractData\",B28, \"LongDescription\",, \"T\")","v":"Visa Inc."}]
[null,"S.WBA",{"$f":"RTD(\"cqg.rtd\", ,\"ContractData\",B29, \"LongDescription\",, \"T\")","v":"Walgreens Boots Alliance, Inc."}]
[null,"S.WMT",{"$f":"RTD(\"cqg.rtd\", ,\"ContractData\",B30, \"LongDescription\",, \"T\")","v":"Walmart Inc."}]
[null,"S.DIS",{"$f":"RTD(\"cqg.rtd\", ,\"ContractData\",B31, \"LongDescription\",, \"T\")","v":"Disney (Walt) Company"}]

{"sheet":"15_Min","index":2,"n_rows":31,"n_cols":12,"rows_kept":31,"cut":false,"hidden":true,"merged":[]}
[null,null,{"$f":"Symbols!D2","v":15}]
[null,{"$f":"Symbols!B2","v":"S.MMM"},{"$f":"IFERROR(RTD(\"cqg.rtd\",,\"StudyData\",B2,\"PCB\",\"BaseType=Index,Price=1000,Index=1,Date=12/30/2016\",\"Close\",$C$1,,\"all\",,,,\"T\")/100,\"\")","v":-1.5999015445202812E-3},{"$f":"RANK($C2,$C$2:C$31)+COUNTIF($C$2:C2,C2)-1","v":17},{"$f":"B2","v":"S.MMM"},1,{"$f":"IFERROR(VLOOKUP($F2,$D$2:$E$31,2,FALSE),\"\")","v":"S.DOW"},{"$f":"IFERROR( RTD(\"cqg.rtd\",,\"StudyData\",G2, \"PCB\",\"BaseType=Index,Price=1000,Index=1,Date=12/30/2016\", \"Close\",$C$1,,\"all\",,,,\"T\")/100,\"\")","v":1.8828451882844416E-3},{"$f":"IF(H2<0,\"\",H2)","v":1.8828451882844416E-3},{"$f":"IF(H2>=0,\"\",-H2)","v":""},{"$f":"IF(J2=\"\",\"\",H2)","v":""},{"$f":"IF(G2=\"\",\"\",RTD(\"cqg.rtd\",,\"ContractData\",G2,\"LongDescription\",,\"T\"))","v":"Dow Inc."}]
[null,{"$f":"Symbols!B3","v":"S.AXP"},{"$f":"IFERROR(RTD(\"cqg.rtd\",,\"StudyData\",B3,\"PCB\",\"BaseType=Index,Price=1000,Index=1,Date=12/30/2016\",\"Close\",$C$1,,\"all\",,,,\"T\")/100,\"\")","v":-3.1600407747196966E-3},{"$f":"RANK($C3,$C$2:C$31)+COUNTIF($C$2:C3,C3)-1","v":26},{"$f":"B3","v":"S.AXP"},{"$f":"F2+1","v":2},{"$f":"IFERROR(VLOOKUP($F3,$D$2:$E$31,2,FALSE),\"\")","v":"S.MRK"},{"$f":"IFERROR( RTD(\"cqg.rtd\",,\"StudyData\",G3, \"PCB\",\"BaseType=Index,Price=1000,Index=1,Date=12/30/2016\", \"Close\",$C$1,,\"all\",,,,\"T\")/100,\"\")","v":4.830334500664926E-4},{"$f":"IF(H3<0,\"\",H3)","v":4.830334500664926E-4},{"$f":"IF(H3>=0,\"\",-H3)","v":""},{"$f":"IF(J3=\"\",\"\",H3)","v":""},{"$f":"IF(G3=\"\",\"\",RTD(\"cqg.rtd\",,\"ContractData\",G3,\"LongDescription\",,\"T\"))","v":"Merck & Co Inc"}]
[null,{"$f":"Symbols!B4","v":"S.AMGN"},{"$f":"IFERROR(RTD(\"cqg.rtd\",,\"StudyData\",B4,\"PCB\",\"BaseType=Index,Price=1000,Index=1,Date=12/30/2016\",\"Close\",$C$1,,\"all\",,,,\"T\")/100,\"\")","v":-8.2260519063870623E-4},{"$f":"RANK($C4,$C$2:C$31)+COUNTIF($C$2:C4,C4)-1","v":9},"S.AMGN",{"$f":"F3+1","v":3},"S.CSCO",{"$f":"IFERROR( RTD(\"cqg.rtd\",,\"StudyData\",G4, \"PCB\",\"BaseType=Index,Price=1000,Index=1,Date=12/30/2016\", \"Close\",$C$1,,\"all\",,,,\"T\")/100,\"\")","v":2.5425883549466352E-4},2.5425883549466352E-4,"","",{"$f":"IF(G4=\"\",\"\",RTD(\"cqg.rtd\",,\"ContractData\",G4,\"LongDescription\",,\"T\"))","v":"Cisco Systems Inc"}]
[null,{"$f":"Symbols!B5","v":"S.AAPL"},{"$f":"IFERROR(RTD(\"cqg.rtd\",,\"StudyData\",B5,\"PCB\",\"BaseType=Index,Price=1000,Index=1,Date=12/30/2016\",\"Close\",$C$1,,\"all\",,,,\"T\")/100,\"\")","v":-5.920875571902723E-3},{"$f":"RANK($C5,$C$2:C$31)+COUNTIF($C$2:C5,C5)-1","v":29},"S.AAPL",4,"S.V",{"$f":"IFERROR( RTD(\"cqg.rtd\",,\"StudyData\",G5, \"PCB\",\"BaseType=Index,Price=1000,Index=1,Date=12/30/2016\", \"Close\",$C$1,,\"all\",,,,\"T\")/100,\"\")","v":2.0145044319093495E-4},2.0145044319093495E-4,"","",{"$f":"IF(G5=\"\",\"\",RTD(\"cqg.rtd\",,\"ContractData\",G5,\"LongDescription\",,\"T\"))","v":"Visa Inc."}]
[null,{"$f":"Symbols!B6","v":"S.BA"},{"$f":"IFERROR(RTD(\"cqg.rtd\",,\"StudyData\",B6,\"PCB\",\"BaseType=Index,Price=1000,Index=1,Date=12/30/2016\",\"Close\",$C$1,,\"all\",,,,\"T\")/100,\"\")","v":-6.8031536113936485E-3},{"$f":"RANK($C6,$C$2:C$31)+COUNTIF($C$2:C6,C6)-1","v":30},"S.BA",5,"S.WMT",{"$f":"IFERROR( RTD(\"cqg.rtd\",,\"StudyData\",G6, \"PCB\",\"BaseType=Index,Price=1000,Index=1,Date=12/30/2016\", \"Close\",$C$1,,\"all\",,,,\"T\")/100,\"\")","v":-1.4551804423735312E-4},"",1.4551804423735312E-4,-1.4551804423735312E-4,{"$f":"IF(G6=\"\",\"\",RTD(\"cqg.rtd\",,\"ContractData\",G6,\"LongDescription\",,\"T\"))","v":"Walmart Inc."}]
[null,{"$f":"Symbols!B7","v":"S.CAT"},{"$f":"IFERROR(RTD(\"cqg.rtd\",,\"StudyData\",B7,\"PCB\",\"BaseType=Index,Price=1000,Index=1,Date=12/30/2016\",\"Close\",$C$1,,\"all\",,,,\"T\")/100,\"\")","v":-2.448979591836634E-3},{"$f":"RANK($C7,$C$2:C$31)+COUNTIF($C$2:C7,C7)-1","v":21},"S.CAT",6,"S.HD",{"$f":"IFERROR( RTD(\"cqg.rtd\",,\"StudyData\",G7, \"PCB\",\"BaseType=Index,Price=1000,Index=1,Date=12/30/2016\", \"Close\",$C$1,,\"all\",,,,\"T\")/100,\"\")","v":-5.1319648093836644E-4},"",5.1319648093836644E-4,-5.1319648093836644E-4,{"$f":"IF(G7=\"\",\"\",RTD(\"cqg.rtd\",,\"ContractData\",G7,\"LongDescription\",,\"T\"))","v":"Home Depot, Inc."}]
[null,{"$f":"Symbols!B8","v":"S.CVX"},{"$f":"IFERROR(RTD(\"cqg.rtd\",,\"StudyData\",B8,\"PCB\",\"BaseType=Index,Price=1000,Index=1,Date=12/30/2016\",\"Close\",$C$1,,\"all\",,,,\"T\")/100,\"\")","v":-2.0923237871060102E-3},{"$f":"RANK($C8,$C$2:C$31)+COUNTIF($C$2:C8,C8)-1","v":19},"S.CVX",7,"S.PG",{"$f":"IFERROR( RTD(\"cqg.rtd\",,\"StudyData\",G8, \"PCB\",\"BaseType=Index,Price=1000,Index=1,Date=12/30/2016\", \"Close\",$C$1,,\"all\",,,,\"T\")/100,\"\")","v":-6.4888248017305988E-4},"",6.4888248017305988E-4,-6.4888248017305988E-4,{"$f":"IF(G8=\"\",\"\",RTD(\"cqg.rtd\",,\"ContractData\",G8,\"LongDescription\",,\"T\"))","v":"Procter & Gamble Co"}]
[null,{"$f":"Symbols!B9","v":"S.CSCO"},{"$f":"IFERROR(RTD(\"cqg.rtd\",,\"StudyData\",B9,\"PCB\",\"BaseType=Index,Price=1000,Index=1,Date=12/30/2016\",\"Close\",$C$1,,\"all\",,,,\"T\")/100,\"\")","v":2.5425883549466352E-4},{"$f":"RANK($C9,$C$2:C$31)+COUNTIF($C$2:C9,C9)-1","v":3},"S.CSCO",8,"S.JNJ",{"$f":"IFERROR( RTD(\"cqg.rtd\",,\"StudyData\",G9, \"PCB\",\"BaseType=Index,Price=1000,Index=1,Date=12/30/2016\", \"Close\",$C$1,,\"all\",,,,\"T\")/100,\"\")","v":-6.9141948420102549E-4},"",6.9141948420102549E-4,-6.9141948420102549E-4,{"$f":"IF(G9=\"\",\"\",RTD(\"cqg.rtd\",,\"ContractData\",G9,\"LongDescription\",,\"T\"))","v":"Johnson & Johnson"}]
[null,{"$f":"Symbols!B10","v":"S.KO"},{"$f":"IFERROR(RTD(\"cqg.rtd\",,\"StudyData\",B10,\"PCB\",\"BaseType=Index,Price=1000,Index=1,Date=12/30/2016\",\"Close\",$C$1,,\"all\",,,,\"T\")/100,\"\")","v":-1.0016025641025072E-3},{"$f":"RANK($C10,$C$2:C$31)+COUNTIF($C$2:C10,C10)-1","v":12},"S.KO",9,"S.AMGN",{"$f":"IFERROR( RTD(\"cqg.rtd\",,\"StudyData\",G10, \"PCB\",\"BaseType=Index,Price=1000,Index=1,Date=12/30/2016\", \"Close\",$C$1,,\"all\",,,,\"T\")/100,\"\")","v":-8.2260519063870623E-4},"",8.2260519063870623E-4,-8.2260519063870623E-4,{"$f":"IF(G10=\"\",\"\",RTD(\"cqg.rtd\",,\"ContractData\",G10,\"LongDescription\",,\"T\"))","v":"Amgen Inc"}]
[null,{"$f":"Symbols!B11","v":"S.DOW"},{"$f":"IFERROR(RTD(\"cqg.rtd\",,\"StudyData\",B11,\"PCB\",\"BaseType=Index,Price=1000,Index=1,Date=12/30/2016\",\"Close\",$C$1,,\"all\",,,,\"T\")/100,\"\")","v":1.8828451882844416E-3},{"$f":"RANK($C11,$C$2:C$31)+COUNTIF($C$2:C11,C11)-1","v":1},"S.DOW",10,"S.NKE",{"$f":"IFERROR( RTD(\"cqg.rtd\",,\"StudyData\",G11, \"PCB\",\"BaseType=Index,Price=1000,Index=1,Date=12/30/2016\", \"Close\",$C$1,,\"all\",,,,\"T\")/100,\"\")","v":-8.7696220292900391E-4},"",8.7696220292900391E-4,-8.7696220292900391E-4,{"$f":"IF(G11=\"\",\"\",RTD(\"cqg.rtd\",,\"ContractData\",G11,\"LongDescription\",,\"T\"))","v":"NIKE Inc ClsB"}]
[null,{"$f":"Symbols!B12","v":"S.GS"},{"$f":"IFERROR(RTD(\"cqg.rtd\",,\"StudyData\",B12,\"PCB\",\"BaseType=Index,Price=1000,Index=1,Date=12/30/2016\",\"Close\",$C$1,,\"all\",,,,\"T\")/100,\"\")","v":-2.5482344375681561E-3},{"$f":"RANK($C12,$C$2:C$31)+COUNTIF($C$2:C12,C12)-1","v":24},"S.GS",11,"S.MSFT",{"$f":"IFERROR( RTD(\"cqg.rtd\",,\"StudyData\",G12, \"PCB\",\"BaseType=Index,Price=1000,Index=1,Date=12/30/2016\", \"Close\",$C$1,,\"all\",,,,\"T\")/100,\"\")","v":-9.3023255813952377E-4},"",9.3023255813952377E-4,-9.3023255813952377E-4,{"$f":"IF(G12=\"\",\"\",RTD(\"cqg.rtd\",,\"ContractData\",G12,\"LongDescription\",,\"T\"))","v":"Microsoft Corporation"}]
[null,{"$f":"Symbols!B13","v":"S.HD"},{"$f":"IFERROR(RTD(\"cqg.rtd\",,\"StudyData\",B13,\"PCB\",\"BaseType=Index,Price=1000,Index=1,Date=12/30/2016\",\"Close\",$C$1,,\"all\",,,,\"T\")/100,\"\")","v":-5.1319648093836644E-4},{"$f":"RANK($C13,$C$2:C$31)+COUNTIF($C$2:C13,C13)-1","v":6},"S.HD",12,"S.KO",{"$f":"IFERROR( RTD(\"cqg.rtd\",,\"StudyData\",G13, \"PCB\",\"BaseType=Index,Price=1000,Index=1,Date=12/30/2016\", \"Close\",$C$1,,\"all\",,,,\"T\")/100,\"\")","v":-1.0016025641025072E-3},"",1.0016025641025072E-3,-1.0016025641025072E-3,{"$f":"IF(G13=\"\",\"\",RTD(\"cqg.rtd\",,\"ContractData\",G13,\"LongDescription\",,\"T\"))","v":"Coca-Cola Company"}]
[null,{"$f":"Symbols!B14","v":"S.HON"},{"$f":"IFERROR(RTD(\"cqg.rtd\",,\"StudyData\",B14,\"PCB\",\"BaseType=Index,Price=1000,Index=1,Date=12/30/2016\",\"Close\",$C$1,,\"all\",,,,\"T\")/100,\"\")","v":-3.5764938027996085E-3},{"$f":"RANK($C14,$C$2:C$31)+COUNTIF($C$2:C14,C14)-1","v":28},"S.HON",13,"S.INTC",{"$f":"IFERROR( RTD(\"cqg.rtd\",,\"StudyData\",G14, \"PCB\",\"BaseType=Index,Price=1000,Index=1,Date=12/30/2016\", \"Close\",$C$1,,\"all\",,,,\"T\")/100,\"\")","v":-1.0036130068245112E-3},"",1.0036130068245112E-3,-1.0036130068245112E-3,{"$f":"IF(G14=\"\",\"\",RTD(\"cqg.rtd\",,\"ContractData\",G14,\"LongDescription\",,\"T\"))","v":"Intel Corporation"}]
[null,{"$f":"Symbols!B15","v":"S.INTC"},{"$f":"IFERROR(RTD(\"cqg.rtd\",,\"StudyData\",B15,\"PCB\",\"BaseType=Index,Price=1000,Index=1,Date=12/30/2016\",\"Close\",$C$1,,\"all\",,,,\"T\")/100,\"\")","v":-1.0036130068245112E-3},{"$f":"RANK($C15,$C$2:C$31)+COUNTIF($C$2:C15,C15)-1","v":13},"S.INTC",14,"S.UNH",{"$f":"IFERROR( RTD(\"cqg.rtd\",,\"StudyData\",G15, \"PCB\",\"BaseType=Index,Price=1000,Index=1,Date=12/30/2016\", \"Close\",$C$1,,\"all\",,,,\"T\")/100,\"\")","v":-1.0120774576614646E-3},"",1.0120774576614646E-3,-1.0120774576614646E-3,{"$f":"IF(G15=\"\",\"\",RTD(\"cqg.rtd\",,\"ContractData\",G15,\"LongDescription\",,\"T\"))","v":"United Health Group Inc"}]
[null,{"$f":"Symbols!B16","v":"S.IBM"},{"$f":"IFERROR(RTD(\"cqg.rtd\",,\"StudyData\",B16,\"PCB\",\"BaseType=Index,Price=1000,Index=1,Date=12/30/2016\",\"Close\",$C$1,,\"all\",,,,\"T\")/100,\"\")","v":-1.5658480303279855E-3},{"$f":"RANK($C16,$C$2:C$31)+COUNTIF($C$2:C16,C16)-1","v":16},"S.IBM",15,"S.TRV",{"$f":"IFERROR( RTD(\"cqg.rtd\",,\"StudyData\",G16, \"PCB\",\"BaseType=Index,Price=1000,Index=1,Date=12/30/2016\", \"Close\",$C$1,,\"all\",,,,\"T\")/100,\"\")","v":-1.5383223237716195E-3},"",1.5383223237716195E-3,-1.5383223237716195E-3,{"$f":"IF(G16=\"\",\"\",RTD(\"cqg.rtd\",,\"ContractData\",G16,\"LongDescription\",,\"T\"))","v":"Travelers Companies, Inc"}]
[null,{"$f":"Symbols!B17","v":"S.JNJ"},{"$f":"IFERROR(RTD(\"cqg.rtd\",,\"StudyData\",B17,\"PCB\",\"BaseType=Index,Price=1000,Index=1,Date=12/30/2016\",\"Close\",$C$1,,\"all\",,,,\"T\")/100,\"\")","v":-6.9141948420102549E-4},{"$f":"RANK($C17,$C$2:C$31)+COUNTIF($C$2:C17,C17)-1","v":8},"S.JNJ",16,"S.IBM",{"$f":"IFERROR( RTD(\"cqg.rtd\",,\"StudyData\",G17, \"PCB\",\"BaseType=Index,Price=1000,Index=1,Date=12/30/2016\", \"Close\",$C$1,,\"all\",,,,\"T\")/100,\"\")","v":-1.5658480303279855E-3},"",1.5658480303279855E-3,-1.5658480303279855E-3,{"$f":"IF(G17=\"\",\"\",RTD(\"cqg.rtd\",,\"ContractData\",G17,\"LongDescription\",,\"T\"))","v":"International Business Machines"}]
[null,{"$f":"Symbols!B18","v":"S.JPM"},{"$f":"IFERROR(RTD(\"cqg.rtd\",,\"StudyData\",B18,\"PCB\",\"BaseType=Index,Price=1000,Index=1,Date=12/30/2016\",\"Close\",$C$1,,\"all\",,,,\"T\")/100,\"\")","v":-2.325335588204195E-3},{"$f":"RANK($C18,$C$2:C$31)+COUNTIF($C$2:C18,C18)-1","v":20},"S.JPM",17,"S.MMM",{"$f":"IFERROR( RTD(\"cqg.rtd\",,\"StudyData\",G18, \"PCB\",\"BaseType=Index,Price=1000,Index=1,Date=12/30/2016\", \"Close\",$C$1,,\"all\",,,,\"T\")/100,\"\")","v":-1.5999015445202812E-3},"",1.5999015445202812E-3,-1.5999015445202812E-3,{"$f":"IF(G18=\"\",\"\",RTD(\"cqg.rtd\",,\"ContractData\",G18,\"LongDescription\",,\"T\"))","v":"3M Company"}]
[null,{"$f":"Symbols!B19","v":"S.MCD"},{"$f":"IFERROR(RTD(\"cqg.rtd\",,\"StudyData\",B19,\"PCB\",\"BaseType=Index,Price=1000,Index=1,Date=12/30/2016\",\"Close\",$C$1,,\"all\",,,,\"T\")/100,\"\")","v":-2.5405330500254575E-3},{"$f":"RANK($C19,$C$2:C$31)+COUNTIF($C$2:C19,C19)-1","v":23},"S.MCD",18,"S.CRM",{"$f":"IFERROR( RTD(\"cqg.rtd\",,\"StudyData\",G19, \"PCB\",\"BaseType=Index,Price=1000,Index=1,Date=12/30/2016\", \"Close\",$C$1,,\"all\",,,,\"T\")/100,\"\")","v":-2.0021247037673006E-3},"",2.0021247037673006E-3,-2.0021247037673006E-3,{"$f":"IF(G19=\"\",\"\",RTD(\"cqg.rtd\",,\"ContractData\",G19,\"LongDescription\",,\"T\"))","v":"Salesforce.com Inc"}]
[null,{"$f":"Symbols!B20","v":"S.MRK"},{"$f":"IFERROR(RTD(\"cqg.rtd\",,\"StudyData\",B20,\"PCB\",\"BaseType=Index,Price=1000,Index=1,Date=12/30/2016\",\"Close\",$C$1,,\"all\",,,,\"T\")/100,\"\")","v":4.830334500664926E-4},{"$f":"RANK($C20,$C$2:C$31)+COUNTIF($C$2:C20,C20)-1","v":2},"S.MRK",19,"S.CVX",{"$f":"IFERROR( RTD(\"cqg.rtd\",,\"StudyData\",G20, \"PCB\",\"BaseType=Index,Price=1000,Index=1,Date=12/30/2016\", \"Close\",$C$1,,\"all\",,,,\"T\")/100,\"\")","v":-2.0923237871060102E-3},"",2.0923237871060102E-3,-2.0923237871060102E-3,{"$f":"IF(G20=\"\",\"\",RTD(\"cqg.rtd\",,\"ContractData\",G20,\"LongDescription\",,\"T\"))","v":"Chevron Corp"}]
[null,{"$f":"Symbols!B21","v":"S.MSFT"},{"$f":"IFERROR(RTD(\"cqg.rtd\",,\"StudyData\",B21,\"PCB\",\"BaseType=Index,Price=1000,Index=1,Date=12/30/2016\",\"Close\",$C$1,,\"all\",,,,\"T\")/100,\"\")","v":-9.3023255813952377E-4},{"$f":"RANK($C21,$C$2:C$31)+COUNTIF($C$2:C21,C21)-1","v":11},"S.MSFT",20,"S.JPM",{"$f":"IFERROR( RTD(\"cqg.rtd\",,\"StudyData\",G21, \"PCB\",\"BaseType=Index,Price=1000,Index=1,Date=12/30/2016\", \"Close\",$C$1,,\"all\",,,,\"T\")/100,\"\")","v":-2.325335588204195E-3},"",2.325335588204195E-3,-2.325335588204195E-3,{"$f":"IF(G21=\"\",\"\",RTD(\"cqg.rtd\",,\"ContractData\",G21,\"LongDescription\",,\"T\"))","v":"JPMorgan Chase & Co."}]
[null,{"$f":"Symbols!B22","v":"S.NKE"},{"$f":"IFERROR(RTD(\"cqg.rtd\",,\"StudyData\",B22,\"PCB\",\"BaseType=Index,Price=1000,Index=1,Date=12/30/2016\",\"Close\",$C$1,,\"all\",,,,\"T\")/100,\"\")","v":-8.7696220292900391E-4},{"$f":"RANK($C22,$C$2:C$31)+COUNTIF($C$2:C22,C22)-1","v":10},"S.NKE",21,"S.CAT",{"$f":"IFERROR( RTD(\"cqg.rtd\",,\"StudyData\",G22, \"PCB\",\"BaseType=Index,Price=1000,Index=1,Date=12/30/2016\", \"Close\",$C$1,,\"all\",,,,\"T\")/100,\"\")","v":-2.448979591836634E-3},"",2.448979591836634E-3,-2.448979591836634E-3,{"$f":"IF(G22=\"\",\"\",RTD(\"cqg.rtd\",,\"ContractData\",G22,\"LongDescription\",,\"T\"))","v":"Caterpillar Inc"}]
[null,{"$f":"Symbols!B23","v":"S.PG"},{"$f":"IFERROR(RTD(\"cqg.rtd\",,\"StudyData\",B23,\"PCB\",\"BaseType=Index,Price=1000,Index=1,Date=12/30/2016\",\"Close\",$C$1,,\"all\",,,,\"T\")/100,\"\")","v":-6.4888248017305988E-4},{"$f":"RANK($C23,$C$2:C$31)+COUNTIF($C$2:C23,C23)-1","v":7},"S.PG",22,"S.VZ",{"$f":"IFERROR( RTD(\"cqg.rtd\",,\"StudyData\",G23, \"PCB\",\"BaseType=Index,Price=1000,Index=1,Date=12/30/2016\", \"Close\",$C$1,,\"all\",,,,\"T\")/100,\"\")","v":-2.4995834027661821E-3},"",2.4995834027661821E-3,-2.4995834027661821E-3,{"$f":"IF(G23=\"\",\"\",RTD(\"cqg.rtd\",,\"ContractData\",G23,\"LongDescription\",,\"T\"))","v":"Verizon Communications"}]
[null,{"$f":"Symbols!B24","v":"S.CRM"},{"$f":"IFERROR(RTD(\"cqg.rtd\",,\"StudyData\",B24,\"PCB\",\"BaseType=Index,Price=1000,Index=1,Date=12/30/2016\",\"Close\",$C$1,,\"all\",,,,\"T\")/100,\"\")","v":-2.0021247037673006E-3},{"$f":"RANK($C24,$C$2:C$31)+COUNTIF($C$2:C24,C24)-1","v":18},"S.CRM",23,"S.MCD",{"$f":"IFERROR( RTD(\"cqg.rtd\",,\"StudyData\",G24, \"PCB\",\"BaseType=Index,Price=1000,Index=1,Date=12/30/2016\", \"Close\",$C$1,,\"all\",,,,\"T\")/100,\"\")","v":-2.5405330500254575E-3},"",2.5405330500254575E-3,-2.5405330500254575E-3,{"$f":"IF(G24=\"\",\"\",RTD(\"cqg.rtd\",,\"ContractData\",G24,\"LongDescription\",,\"T\"))","v":"McDonald's Corporation"}]
[null,{"$f":"Symbols!B25","v":"S.TRV"},{"$f":"IFERROR(RTD(\"cqg.rtd\",,\"StudyData\",B25,\"PCB\",\"BaseType=Index,Price=1000,Index=1,Date=12/30/2016\",\"Close\",$C$1,,\"all\",,,,\"T\")/100,\"\")","v":-1.5383223237716195E-3},{"$f":"RANK($C25,$C$2:C$31)+COUNTIF($C$2:C25,C25)-1","v":15},"S.TRV",24,"S.GS",{"$f":"IFERROR( RTD(\"cqg.rtd\",,\"StudyData\",G25, \"PCB\",\"BaseType=Index,Price=1000,Index=1,Date=12/30/2016\", \"Close\",$C$1,,\"all\",,,,\"T\")/100,\"\")","v":-2.5482344375681561E-3},"",2.5482344375681561E-3,-2.5482344375681561E-3,{"$f":"IF(G25=\"\",\"\",RTD(\"cqg.rtd\",,\"ContractData\",G25,\"LongDescription\",,\"T\"))","v":"Goldman Sachs Group"}]
[null,{"$f":"Symbols!B26","v":"S.UNH"},{"$f":"IFERROR(RTD(\"cqg.rtd\",,\"StudyData\",B26,\"PCB\",\"BaseType=Index,Price=1000,Index=1,Date=12/30/2016\",\"Close\",$C$1,,\"all\",,,,\"T\")/100,\"\")","v":-1.0120774576614646E-3},{"$f":"RANK($C26,$C$2:C$31)+COUNTIF($C$2:C26,C26)-1","v":14},"S.UNH",25,"S.WBA",{"$f":"IFERROR( RTD(\"cqg.rtd\",,\"StudyData\",G26, \"PCB\",\"BaseType=Index,Price=1000,Index=1,Date=12/30/2016\", \"Close\",$C$1,,\"all\",,,,\"T\")/100,\"\")","v":-3.0640668523676724E-3},"",3.0640668523676724E-3,-3.0640668523676724E-3,{"$f":"IF(G26=\"\",\"\",RTD(\"cqg.rtd\",,\"ContractData\",G26,\"LongDescription\",,\"T\"))","v":"Walgreens Boots Alliance, Inc."}]
[null,{"$f":"Symbols!B27","v":"S.VZ"},{"$f":"IFERROR(RTD(\"cqg.rtd\",,\"StudyData\",B27,\"PCB\",\"BaseType=Index,Price=1000,Index=1,Date=12/30/2016\",\"Close\",$C$1,,\"all\",,,,\"T\")/100,\"\")","v":-2.4995834027661821E-3},{"$f":"RANK($C27,$C$2:C$31)+COUNTIF($C$2:C27,C27)-1","v":22},"S.VZ",26,"S.AXP",{"$f":"IFERROR( RTD(\"cqg.rtd\",,\"StudyData\",G27, \"PCB\",\"BaseType=Index,Price=1000,Index=1,Date=12/30/2016\", \"Close\",$C$1,,\"all\",,,,\"T\")/100,\"\")","v":-3.1600407747196966E-3},"",3.1600407747196966E-3,-3.1600407747196966E-3,{"$f":"IF(G27=\"\",\"\",RTD(\"cqg.rtd\",,\"ContractData\",G27,\"LongDescription\",,\"T\"))","v":"American Express Co"}]
[null,{"$f":"Symbols!B28","v":"S.V"},{"$f":"IFERROR(RTD(\"cqg.rtd\",,\"StudyData\",B28,\"PCB\",\"BaseType=Index,Price=1000,Index=1,Date=12/30/2016\",\"Close\",$C$1,,\"all\",,,,\"T\")/100,\"\")","v":2.0145044319093495E-4},{"$f":"RANK($C28,$C$2:C$31)+COUNTIF($C$2:C28,C28)-1","v":4},"S.V",27,"S.DIS",{"$f":"IFERROR( RTD(\"cqg.rtd\",,\"StudyData\",G28, \"PCB\",\"BaseType=Index,Price=1000,Index=1,Date=12/30/2016\", \"Close\",$C$1,,\"all\",,,,\"T\")/100,\"\")","v":-3.1673133264708657E-3},"",3.1673133264708657E-3,-3.1673133264708657E-3,{"$f":"IF(G28=\"\",\"\",RTD(\"cqg.rtd\",,\"ContractData\",G28,\"LongDescription\",,\"T\"))","v":"Disney (Walt) Company"}]
[null,{"$f":"Symbols!B29","v":"S.WBA"},{"$f":"IFERROR(RTD(\"cqg.rtd\",,\"StudyData\",B29,\"PCB\",\"BaseType=Index,Price=1000,Index=1,Date=12/30/2016\",\"Close\",$C$1,,\"all\",,,,\"T\")/100,\"\")","v":-3.0640668523676724E-3},{"$f":"RANK($C29,$C$2:C$31)+COUNTIF($C$2:C29,C29)-1","v":25},"S.WBA",28,"S.HON",{"$f":"IFERROR( RTD(\"cqg.rtd\",,\"StudyData\",G29, \"PCB\",\"BaseType=Index,Price=1000,Index=1,Date=12/30/2016\", \"Close\",$C$1,,\"all\",,,,\"T\")/100,\"\")","v":-3.5764938027996085E-3},"",3.5764938027996085E-3,-3.5764938027996085E-3,{"$f":"IF(G29=\"\",\"\",RTD(\"cqg.rtd\",,\"ContractData\",G29,\"LongDescription\",,\"T\"))","v":"Honeywell Intl"}]
[null,{"$f":"Symbols!B30","v":"S.WMT"},{"$f":"IFERROR(RTD(\"cqg.rtd\",,\"StudyData\",B30,\"PCB\",\"BaseType=Index,Price=1000,Index=1,Date=12/30/2016\",\"Close\",$C$1,,\"all\",,,,\"T\")/100,\"\")","v":-1.4551804423735312E-4},{"$f":"RANK($C30,$C$2:C$31)+COUNTIF($C$2:C30,C30)-1","v":5},"S.WMT",29,"S.AAPL",{"$f":"IFERROR( RTD(\"cqg.rtd\",,\"StudyData\",G30, \"PCB\",\"BaseType=Index,Price=1000,Index=1,Date=12/30/2016\", \"Close\",$C$1,,\"all\",,,,\"T\")/100,\"\")","v":-5.920875571902723E-3},"",5.920875571902723E-3,-5.920875571902723E-3,{"$f":"IF(G30=\"\",\"\",RTD(\"cqg.rtd\",,\"ContractData\",G30,\"LongDescription\",,\"T\"))","v":"Apple Inc"}]
[null,{"$f":"Symbols!B31","v":"S.DIS"},{"$f":"IFERROR(RTD(\"cqg.rtd\",,\"StudyData\",B31,\"PCB\",\"BaseType=Index,Price=1000,Index=1,Date=12/30/2016\",\"Close\",$C$1,,\"all\",,,,\"T\")/100,\"\")","v":-3.1673133264708657E-3},{"$f":"RANK($C31,$C$2:C$31)+COUNTIF($C$2:C31,C31)-1","v":27},"S.DIS",30,"S.BA",{"$f":"IFERROR( RTD(\"cqg.rtd\",,\"StudyData\",G31, \"PCB\",\"BaseType=Index,Price=1000,Index=1,Date=12/30/2016\", \"Close\",$C$1,,\"all\",,,,\"T\")/100,\"\")","v":-6.8031536113936485E-3},"",6.8031536113936485E-3,-6.8031536113936485E-3,{"$f":"IF(G31=\"\",\"\",RTD(\"cqg.rtd\",,\"ContractData\",G31,\"LongDescription\",,\"T\"))","v":"Boeing Company"}]

{"sheet":"Daily","index":3,"n_rows":31,"n_cols":12,"rows_kept":31,"cut":false,"hidden":true,"merged":[]}
[null,null,{"$f":"\"A\"&Symbols!E2","v":"AD"}]
[null,{"$f":"Symbols!B2","v":"S.MMM"},{"$f":"IFERROR(RTD(\"cqg.rtd\",,\"StudyData\",B2,\"PCB\",\"BaseType=Index,Price=1000,Index=1,Date=12/30/2016\",\"Close\",$C$1,,\"all\",,,,\"T\")/100,\"\")","v":5.5156172533464684E-3},{"$f":"RANK($C2,$C$2:C$31)+COUNTIF($C$2:C2,C2)-1","v":10},{"$f":"B2","v":"S.MMM"},1,{"$f":"IFERROR(VLOOKUP($F2,$D$2:$E$31,2,FALSE),\"\")","v":"S.KO"},{"$f":"IFERROR( RTD(\"cqg.rtd\",,\"StudyData\",G2, \"PCB\",\"BaseType=Index,Price=1000,Index=1,Date=12/30/2016\", \"Close\",$C$1,,\"all\",,,,\"T\")/100,\"\")","v":1.5889183133021005E-2},{"$f":"IF(H2<0,\"\",H2)","v":1.5889183133021005E-2},{"$f":"IF(H2>=0,\"\",-H2)","v":""},{"$f":"IF(J2=\"\",\"\",H2)","v":""},{"$f":"IF(G2=\"\",\"\",RTD(\"cqg.rtd\",,\"ContractData\",G2,\"LongDescription\",,\"T\"))","v":"Coca-Cola Company"}]
[null,{"$f":"Symbols!B3","v":"S.AXP"},{"$f":"IFERROR(RTD(\"cqg.rtd\",,\"StudyData\",B3,\"PCB\",\"BaseType=Index,Price=1000,Index=1,Date=12/30/2016\",\"Close\",$C$1,,\"all\",,,,\"T\")/100,\"\")","v":-3.8708363043699241E-3},{"$f":"RANK($C3,$C$2:C$31)+COUNTIF($C$2:C3,C3)-1","v":26},{"$f":"B3","v":"S.AXP"},{"$f":"F2+1","v":2},{"$f":"IFERROR(VLOOKUP($F3,$D$2:$E$31,2,FALSE),\"\")","v":"S.PG"},{"$f":"IFERROR( RTD(\"cqg.rtd\",,\"StudyData\",G3, \"PCB\",\"BaseType=Index,Price=1000,Index=1,Date=12/30/2016\", \"Close\",$C$1,,\"all\",,,,\"T\")/100,\"\")","v":1.3898032331212095E-2},{"$f":"IF(H3<0,\"\",H3)","v":1.3898032331212095E-2},{"$f":"IF(H3>=0,\"\",-H3)","v":""},{"$f":"IF(J3=\"\",\"\",H3)","v":""},{"$f":"IF(G3=\"\",\"\",RTD(\"cqg.rtd\",,\"ContractData\",G3,\"LongDescription\",,\"T\"))","v":"Procter & Gamble Co"}]
[null,{"$f":"Symbols!B4","v":"S.AMGN"},{"$f":"IFERROR(RTD(\"cqg.rtd\",,\"StudyData\",B4,\"PCB\",\"BaseType=Index,Price=1000,Index=1,Date=12/30/2016\",\"Close\",$C$1,,\"all\",,,,\"T\")/100,\"\")","v":-1.0691229080142723E-3},{"$f":"RANK($C4,$C$2:C$31)+COUNTIF($C$2:C4,C4)-1","v":22},"S.AMGN",{"$f":"F3+1","v":3},"S.CAT",{"$f":"IFERROR( RTD(\"cqg.rtd\",,\"StudyData\",G4, \"PCB\",\"BaseType=Index,Price=1000,Index=1,Date=12/30/2016\", \"Close\",$C$1,,\"all\",,,,\"T\")/100,\"\")","v":9.0139682102800683E-3},9.0139682102800683E-3,"","",{"$f":"IF(G4=\"\",\"\",RTD(\"cqg.rtd\",,\"ContractData\",G4,\"LongDescription\",,\"T\"))","v":"Caterpillar Inc"}]
[null,{"$f":"Symbols!B5","v":"S.AAPL"},{"$f":"IFERROR(RTD(\"cqg.rtd\",,\"StudyData\",B5,\"PCB\",\"BaseType=Index,Price=1000,Index=1,Date=12/30/2016\",\"Close\",$C$1,,\"all\",,,,\"T\")/100,\"\")","v":6.6315406976744547E-3},{"$f":"RANK($C5,$C$2:C$31)+COUNTIF($C$2:C5,C5)-1","v":8},"S.AAPL",4,"S.TRV",{"$f":"IFERROR( RTD(\"cqg.rtd\",,\"StudyData\",G5, \"PCB\",\"BaseType=Index,Price=1000,Index=1,Date=12/30/2016\", \"Close\",$C$1,,\"all\",,,,\"T\")/100,\"\")","v":8.1315669255367807E-3},8.1315669255367807E-3,"","",{"$f":"IF(G5=\"\",\"\",RTD(\"cqg.rtd\",,\"ContractData\",G5,\"LongDescription\",,\"T\"))","v":"Travelers Companies, Inc"}]
[null,{"$f":"Symbols!B6","v":"S.BA"},{"$f":"IFERROR(RTD(\"cqg.rtd\",,\"StudyData\",B6,\"PCB\",\"BaseType=Index,Price=1000,Index=1,Date=12/30/2016\",\"Close\",$C$1,,\"all\",,,,\"T\")/100,\"\")","v":-8.9542692676678208E-4},{"$f":"RANK($C6,$C$2:C$31)+COUNTIF($C$2:C6,C6)-1","v":21},"S.BA",5,"S.CSCO",{"$f":"IFERROR( RTD(\"cqg.rtd\",,\"StudyData\",G6, \"PCB\",\"BaseType=Index,Price=1000,Index=1,Date=12/30/2016\", \"Close\",$C$1,,\"all\",,,,\"T\")/100,\"\")","v":7.6844262295083067E-3},7.6844262295083067E-3,"","",{"$f":"IF(G6=\"\",\"\",RTD(\"cqg.rtd\",,\"ContractData\",G6,\"LongDescription\",,\"T\"))","v":"Cisco Systems Inc"}]
[null,{"$f":"Symbols!B7","v":"S.CAT"},{"$f":"IFERROR(RTD(\"cqg.rtd\",,\"StudyData\",B7,\"PCB\",\"BaseType=Index,Price=1000,Index=1,Date=12/30/2016\",\"Close\",$C$1,,\"all\",,,,\"T\")/100,\"\")","v":9.0139682102800683E-3},{"$f":"RANK($C7,$C$2:C$31)+COUNTIF($C$2:C7,C7)-1","v":3},"S.CAT",6,"S.MSFT",{"$f":"IFERROR( RTD(\"cqg.rtd\",,\"StudyData\",G7, \"PCB\",\"BaseType=Index,Price=1000,Index=1,Date=12/30/2016\", \"Close\",$C$1,,\"all\",,,,\"T\")/100,\"\")","v":7.5046904315197501E-3},7.5046904315197501E-3,"","",{"$f":"IF(G7=\"\",\"\",RTD(\"cqg.rtd\",,\"ContractData\",G7,\"LongDescription\",,\"T\"))","v":"Microsoft Corporation"}]
[null,{"$f":"Symbols!B8","v":"S.CVX"},{"$f":"IFERROR(RTD(\"cqg.rtd\",,\"StudyData\",B8,\"PCB\",\"BaseType=Index,Price=1000,Index=1,Date=12/30/2016\",\"Close\",$C$1,,\"all\",,,,\"T\")/100,\"\")","v":1.3106159895157426E-4},{"$f":"RANK($C8,$C$2:C$31)+COUNTIF($C$2:C8,C8)-1","v":18},"S.CVX",7,"S.IBM",{"$f":"IFERROR( RTD(\"cqg.rtd\",,\"StudyData\",G8, \"PCB\",\"BaseType=Index,Price=1000,Index=1,Date=12/30/2016\", \"Close\",$C$1,,\"all\",,,,\"T\")/100,\"\")","v":7.4844074844075325E-3},7.4844074844075325E-3,"","",{"$f":"IF(G8=\"\",\"\",RTD(\"cqg.rtd\",,\"ContractData\",G8,\"LongDescription\",,\"T\"))","v":"International Business Machines"}]
[null,{"$f":"Symbols!B9","v":"S.CSCO"},{"$f":"IFERROR(RTD(\"cqg.rtd\",,\"StudyData\",B9,\"PCB\",\"BaseType=Index,Price=1000,Index=1,Date=12/30/2016\",\"Close\",$C$1,,\"all\",,,,\"T\")/100,\"\")","v":7.6844262295083067E-3},{"$f":"RANK($C9,$C$2:C$31)+COUNTIF($C$2:C9,C9)-1","v":5},"S.CSCO",8,"S.AAPL",{"$f":"IFERROR( RTD(\"cqg.rtd\",,\"StudyData\",G9, \"PCB\",\"BaseType=Index,Price=1000,Index=1,Date=12/30/2016\", \"Close\",$C$1,,\"all\",,,,\"T\")/100,\"\")","v":6.6315406976744547E-3},6.6315406976744547E-3,"","",{"$f":"IF(G9=\"\",\"\",RTD(\"cqg.rtd\",,\"ContractData\",G9,\"LongDescription\",,\"T\"))","v":"Apple Inc"}]
[null,{"$f":"Symbols!B10","v":"S.KO"},{"$f":"IFERROR(RTD(\"cqg.rtd\",,\"StudyData\",B10,\"PCB\",\"BaseType=Index,Price=1000,Index=1,Date=12/30/2016\",\"Close\",$C$1,,\"all\",,,,\"T\")/100,\"\")","v":1.5889183133021005E-2},{"$f":"RANK($C10,$C$2:C$31)+COUNTIF($C$2:C10,C10)-1","v":1},"S.KO",9,"S.V",{"$f":"IFERROR( RTD(\"cqg.rtd\",,\"StudyData\",G10, \"PCB\",\"BaseType=Index,Price=1000,Index=1,Date=12/30/2016\", \"Close\",$C$1,,\"all\",,,,\"T\")/100,\"\")","v":5.8242593061533406E-3},5.8242593061533406E-3,"","",{"$f":"IF(G10=\"\",\"\",RTD(\"cqg.rtd\",,\"ContractData\",G10,\"LongDescription\",,\"T\"))","v":"Visa Inc."}]
[null,{"$f":"Symbols!B11","v":"S.DOW"},{"$f":"IFERROR(RTD(\"cqg.rtd\",,\"StudyData\",B11,\"PCB\",\"BaseType=Index,Price=1000,Index=1,Date=12/30/2016\",\"Close\",$C$1,,\"all\",,,,\"T\")/100,\"\")","v":-4.1744938426222335E-4},{"$f":"RANK($C11,$C$2:C$31)+COUNTIF($C$2:C11,C11)-1","v":20},"S.DOW",10,"S.MMM",{"$f":"IFERROR( RTD(\"cqg.rtd\",,\"StudyData\",G11, \"PCB\",\"BaseType=Index,Price=1000,Index=1,Date=12/30/2016\", \"Close\",$C$1,,\"all\",,,,\"T\")/100,\"\")","v":5.5156172533464684E-3},5.5156172533464684E-3,"","",{"$f":"IF(G11=\"\",\"\",RTD(\"cqg.rtd\",,\"ContractData\",G11,\"LongDescription\",,\"T\"))","v":"3M Company"}]
[null,{"$f":"Symbols!B12","v":"S.GS"},{"$f":"IFERROR(RTD(\"cqg.rtd\",,\"StudyData\",B12,\"PCB\",\"BaseType=Index,Price=1000,Index=1,Date=12/30/2016\",\"Close\",$C$1,,\"all\",,,,\"T\")/100,\"\")","v":-1.1340206185566949E-2},{"$f":"RANK($C12,$C$2:C$31)+COUNTIF($C$2:C12,C12)-1","v":30},"S.GS",11,"S.NKE",{"$f":"IFERROR( RTD(\"cqg.rtd\",,\"StudyData\",G12, \"PCB\",\"BaseType=Index,Price=1000,Index=1,Date=12/30/2016\", \"Close\",$C$1,,\"all\",,,,\"T\")/100,\"\")","v":4.9395783717032923E-3},4.9395783717032923E-3,"","",{"$f":"IF(G12=\"\",\"\",RTD(\"cqg.rtd\",,\"ContractData\",G12,\"LongDescription\",,\"T\"))","v":"NIKE Inc ClsB"}]
[null,{"$f":"Symbols!B13","v":"S.HD"},{"$f":"IFERROR(RTD(\"cqg.rtd\",,\"StudyData\",B13,\"PCB\",\"BaseType=Index,Price=1000,Index=1,Date=12/30/2016\",\"Close\",$C$1,,\"all\",,,,\"T\")/100,\"\")","v":1.1382412337066358E-3},{"$f":"RANK($C13,$C$2:C$31)+COUNTIF($C$2:C13,C13)-1","v":16},"S.HD",12,"S.VZ",{"$f":"IFERROR( RTD(\"cqg.rtd\",,\"StudyData\",G13, \"PCB\",\"BaseType=Index,Price=1000,Index=1,Date=12/30/2016\", \"Close\",$C$1,,\"all\",,,,\"T\")/100,\"\")","v":4.1939271934239219E-3},4.1939271934239219E-3,"","",{"$f":"IF(G13=\"\",\"\",RTD(\"cqg.rtd\",,\"ContractData\",G13,\"LongDescription\",,\"T\"))","v":"Verizon Communications"}]
[null,{"$f":"Symbols!B14","v":"S.HON"},{"$f":"IFERROR(RTD(\"cqg.rtd\",,\"StudyData\",B14,\"PCB\",\"BaseType=Index,Price=1000,Index=1,Date=12/30/2016\",\"Close\",$C$1,,\"all\",,,,\"T\")/100,\"\")","v":1.3633265167007427E-3},{"$f":"RANK($C14,$C$2:C$31)+COUNTIF($C$2:C14,C14)-1","v":15},"S.HON",13,"S.DIS",{"$f":"IFERROR( RTD(\"cqg.rtd\",,\"StudyData\",G14, \"PCB\",\"BaseType=Index,Price=1000,Index=1,Date=12/30/2016\", \"Close\",$C$1,,\"all\",,,,\"T\")/100,\"\")","v":3.8274459771948325E-3},3.8274459771948325E-3,"","",{"$f":"IF(G14=\"\",\"\",RTD(\"cqg.rtd\",,\"ContractData\",G14,\"LongDescription\",,\"T\"))","v":"Disney (Walt) Company"}]
[null,{"$f":"Symbols!B15","v":"S.INTC"},{"$f":"IFERROR(RTD(\"cqg.rtd\",,\"StudyData\",B15,\"PCB\",\"BaseType=Index,Price=1000,Index=1,Date=12/30/2016\",\"Close\",$C$1,,\"all\",,,,\"T\")/100,\"\")","v":1.0056315366050736E-3},{"$f":"RANK($C15,$C$2:C$31)+COUNTIF($C$2:C15,C15)-1","v":17},"S.INTC",14,"S.WMT",{"$f":"IFERROR( RTD(\"cqg.rtd\",,\"StudyData\",G15, \"PCB\",\"BaseType=Index,Price=1000,Index=1,Date=12/30/2016\", \"Close\",$C$1,,\"all\",,,,\"T\")/100,\"\")","v":2.5534398482528835E-3},2.5534398482528835E-3,"","",{"$f":"IF(G15=\"\",\"\",RTD(\"cqg.rtd\",,\"ContractData\",G15,\"LongDescription\",,\"T\"))","v":"Walmart Inc."}]
[null,{"$f":"Symbols!B16","v":"S.IBM"},{"$f":"IFERROR(RTD(\"cqg.rtd\",,\"StudyData\",B16,\"PCB\",\"BaseType=Index,Price=1000,Index=1,Date=12/30/2016\",\"Close\",$C$1,,\"all\",,,,\"T\")/100,\"\")","v":7.4844074844075325E-3},{"$f":"RANK($C16,$C$2:C$31)+COUNTIF($C$2:C16,C16)-1","v":7},"S.IBM",15,"S.HON",{"$f":"IFERROR( RTD(\"cqg.rtd\",,\"StudyData\",G16, \"PCB\",\"BaseType=Index,Price=1000,Index=1,Date=12/30/2016\", \"Close\",$C$1,,\"all\",,,,\"T\")/100,\"\")","v":1.3633265167007427E-3},1.3633265167007427E-3,"","",{"$f":"IF(G16=\"\",\"\",RTD(\"cqg.rtd\",,\"ContractData\",G16,\"LongDescription\",,\"T\"))","v":"Honeywell Intl"}]
[null,{"$f":"Symbols!B17","v":"S.JNJ"},{"$f":"IFERROR(RTD(\"cqg.rtd\",,\"StudyData\",B17,\"PCB\",\"BaseType=Index,Price=1000,Index=1,Date=12/30/2016\",\"Close\",$C$1,,\"all\",,,,\"T\")/100,\"\")","v":-3.9283252929014001E-3},{"$f":"RANK($C17,$C$2:C$31)+COUNTIF($C$2:C17,C17)-1","v":27},"S.JNJ",16,"S.HD",{"$f":"IFERROR( RTD(\"cqg.rtd\",,\"StudyData\",G17, \"PCB\",\"BaseType=Index,Price=1000,Index=1,Date=12/30/2016\", \"Close\",$C$1,,\"all\",,,,\"T\")/100,\"\")","v":1.1382412337066358E-3},1.1382412337066358E-3,"","",{"$f":"IF(G17=\"\",\"\",RTD(\"cqg.rtd\",,\"ContractData\",G17,\"LongDescription\",,\"T\"))","v":"Home Depot, Inc."}]
[null,{"$f":"Symbols!B18","v":"S.JPM"},{"$f":"IFERROR(RTD(\"cqg.rtd\",,\"StudyData\",B18,\"PCB\",\"BaseType=Index,Price=1000,Index=1,Date=12/30/2016\",\"Close\",$C$1,,\"all\",,,,\"T\")/100,\"\")","v":-9.6527122022872919E-3},{"$f":"RANK($C18,$C$2:C$31)+COUNTIF($C$2:C18,C18)-1","v":28},"S.JPM",17,"S.INTC",{"$f":"IFERROR( RTD(\"cqg.rtd\",,\"StudyData\",G18, \"PCB\",\"BaseType=Index,Price=1000,Index=1,Date=12/30/2016\", \"Close\",$C$1,,\"all\",,,,\"T\")/100,\"\")","v":1.0056315366050736E-3},1.0056315366050736E-3,"","",{"$f":"IF(G18=\"\",\"\",RTD(\"cqg.rtd\",,\"ContractData\",G18,\"LongDescription\",,\"T\"))","v":"Intel Corporation"}]
[null,{"$f":"Symbols!B19","v":"S.MCD"},{"$f":"IFERROR(RTD(\"cqg.rtd\",,\"StudyData\",B19,\"PCB\",\"BaseType=Index,Price=1000,Index=1,Date=12/30/2016\",\"Close\",$C$1,,\"all\",,,,\"T\")/100,\"\")","v":-2.1718035210942141E-3},{"$f":"RANK($C19,$C$2:C$31)+COUNTIF($C$2:C19,C19)-1","v":23},"S.MCD",18,"S.CVX",{"$f":"IFERROR( RTD(\"cqg.rtd\",,\"StudyData\",G19, \"PCB\",\"BaseType=Index,Price=1000,Index=1,Date=12/30/2016\", \"Close\",$C$1,,\"all\",,,,\"T\")/100,\"\")","v":1.3106159895157426E-4},1.3106159895157426E-4,"","",{"$f":"IF(G19=\"\",\"\",RTD(\"cqg.rtd\",,\"ContractData\",G19,\"LongDescription\",,\"T\"))","v":"Chevron Corp"}]
[null,{"$f":"Symbols!B20","v":"S.MRK"},{"$f":"IFERROR(RTD(\"cqg.rtd\",,\"StudyData\",B20,\"PCB\",\"BaseType=Index,Price=1000,Index=1,Date=12/30/2016\",\"Close\",$C$1,,\"all\",,,,\"T\")/100,\"\")","v":-3.3682184530252246E-3},{"$f":"RANK($C20,$C$2:C$31)+COUNTIF($C$2:C20,C20)-1","v":25},"S.MRK",19,"S.WBA",{"$f":"IFERROR( RTD(\"cqg.rtd\",,\"StudyData\",G20, \"PCB\",\"BaseType=Index,Price=1000,Index=1,Date=12/30/2016\", \"Close\",$C$1,,\"all\",,,,\"T\")/100,\"\")","v":0},0,"","",{"$f":"IF(G20=\"\",\"\",RTD(\"cqg.rtd\",,\"ContractData\",G20,\"LongDescription\",,\"T\"))","v":"Walgreens Boots Alliance, Inc."}]
[null,{"$f":"Symbols!B21","v":"S.MSFT"},{"$f":"IFERROR(RTD(\"cqg.rtd\",,\"StudyData\",B21,\"PCB\",\"BaseType=Index,Price=1000,Index=1,Date=12/30/2016\",\"Close\",$C$1,,\"all\",,,,\"T\")/100,\"\")","v":7.5046904315197501E-3},{"$f":"RANK($C21,$C$2:C$31)+COUNTIF($C$2:C21,C21)-1","v":6},"S.MSFT",20,"S.DOW",{"$f":"IFERROR( RTD(\"cqg.rtd\",,\"StudyData\",G21, \"PCB\",\"BaseType=Index,Price=1000,Index=1,Date=12/30/2016\", \"Close\",$C$1,,\"all\",,,,\"T\")/100,\"\")","v":-4.1744938426222335E-4},"",4.1744938426222335E-4,-4.1744938426222335E-4,{"$f":"IF(G21=\"\",\"\",RTD(\"cqg.rtd\",,\"ContractData\",G21,\"LongDescription\",,\"T\"))","v":"Dow Inc."}]
[null,{"$f":"Symbols!B22","v":"S.NKE"},{"$f":"IFERROR(RTD(\"cqg.rtd\",,\"StudyData\",B22,\"PCB\",\"BaseType=Index,Price=1000,Index=1,Date=12/30/2016\",\"Close\",$C$1,,\"all\",,,,\"T\")/100,\"\")","v":4.9395783717032923E-3},{"$f":"RANK($C22,$C$2:C$31)+COUNTIF($C$2:C22,C22)-1","v":11},"S.NKE",21,"S.BA",{"$f":"IFERROR( RTD(\"cqg.rtd\",,\"StudyData\",G22, \"PCB\",\"BaseType=Index,Price=1000,Index=1,Date=12/30/2016\", \"Close\",$C$1,,\"all\",,,,\"T\")/100,\"\")","v":-8.9542692676678208E-4},"",8.9542692676678208E-4,-8.9542692676678208E-4,{"$f":"IF(G22=\"\",\"\",RTD(\"cqg.rtd\",,\"ContractData\",G22,\"LongDescription\",,\"T\"))","v":"Boeing Company"}]
[null,{"$f":"Symbols!B23","v":"S.PG"},{"$f":"IFERROR(RTD(\"cqg.rtd\",,\"StudyData\",B23,\"PCB\",\"BaseType=Index,Price=1000,Index=1,Date=12/30/2016\",\"Close\",$C$1,,\"all\",,,,\"T\")/100,\"\")","v":1.3898032331212095E-2},{"$f":"RANK($C23,$C$2:C$31)+COUNTIF($C$2:C23,C23)-1","v":2},"S.PG",22,"S.AMGN",{"$f":"IFERROR( RTD(\"cqg.rtd\",,\"StudyData\",G23, \"PCB\",\"BaseType=Index,Price=1000,Index=1,Date=12/30/2016\", \"Close\",$C$1,,\"all\",,,,\"T\")/100,\"\")","v":-1.0691229080142723E-3},"",1.0691229080142723E-3,-1.0691229080142723E-3,{"$f":"IF(G23=\"\",\"\",RTD(\"cqg.rtd\",,\"ContractData\",G23,\"LongDescription\",,\"T\"))","v":"Amgen Inc"}]
[null,{"$f":"Symbols!B24","v":"S.CRM"},{"$f":"IFERROR(RTD(\"cqg.rtd\",,\"StudyData\",B24,\"PCB\",\"BaseType=Index,Price=1000,Index=1,Date=12/30/2016\",\"Close\",$C$1,,\"all\",,,,\"T\")/100,\"\")","v":-3.2646398694144516E-3},{"$f":"RANK($C24,$C$2:C$31)+COUNTIF($C$2:C24,C24)-1","v":24},"S.CRM",23,"S.MCD",{"$f":"IFERROR( RTD(\"cqg.rtd\",,\"StudyData\",G24, \"PCB\",\"BaseType=Index,Price=1000,Index=1,Date=12/30/2016\", \"Close\",$C$1,,\"all\",,,,\"T\")/100,\"\")","v":-2.1718035210942141E-3},"",2.1718035210942141E-3,-2.1718035210942141E-3,{"$f":"IF(G24=\"\",\"\",RTD(\"cqg.rtd\",,\"ContractData\",G24,\"LongDescription\",,\"T\"))","v":"McDonald's Corporation"}]
[null,{"$f":"Symbols!B25","v":"S.TRV"},{"$f":"IFERROR(RTD(\"cqg.rtd\",,\"StudyData\",B25,\"PCB\",\"BaseType=Index,Price=1000,Index=1,Date=12/30/2016\",\"Close\",$C$1,,\"all\",,,,\"T\")/100,\"\")","v":8.1315669255367807E-3},{"$f":"RANK($C25,$C$2:C$31)+COUNTIF($C$2:C25,C25)-1","v":4},"S.TRV",24,"S.CRM",{"$f":"IFERROR( RTD(\"cqg.rtd\",,\"StudyData\",G25, \"PCB\",\"BaseType=Index,Price=1000,Index=1,Date=12/30/2016\", \"Close\",$C$1,,\"all\",,,,\"T\")/100,\"\")","v":-3.2646398694144516E-3},"",3.2646398694144516E-3,-3.2646398694144516E-3,{"$f":"IF(G25=\"\",\"\",RTD(\"cqg.rtd\",,\"ContractData\",G25,\"LongDescription\",,\"T\"))","v":"Salesforce.com Inc"}]
[null,{"$f":"Symbols!B26","v":"S.UNH"},{"$f":"IFERROR(RTD(\"cqg.rtd\",,\"StudyData\",B26,\"PCB\",\"BaseType=Index,Price=1000,Index=1,Date=12/30/2016\",\"Close\",$C$1,,\"all\",,,,\"T\")/100,\"\")","v":-1.0261038136301324E-2},{"$f":"RANK($C26,$C$2:C$31)+COUNTIF($C$2:C26,C26)-1","v":29},"S.UNH",25,"S.MRK",{"$f":"IFERROR( RTD(\"cqg.rtd\",,\"StudyData\",G26, \"PCB\",\"BaseType=Index,Price=1000,Index=1,Date=12/30/2016\", \"Close\",$C$1,,\"all\",,,,\"T\")/100,\"\")","v":-3.3682184530252246E-3},"",3.3682184530252246E-3,-3.3682184530252246E-3,{"$f":"IF(G26=\"\",\"\",RTD(\"cqg.rtd\",,\"ContractData\",G26,\"LongDescription\",,\"T\"))","v":"Merck & Co Inc"}]
[null,{"$f":"Symbols!B27","v":"S.VZ"},{"$f":"IFERROR(RTD(\"cqg.rtd\",,\"StudyData\",B27,\"PCB\",\"BaseType=Index,Price=1000,Index=1,Date=12/30/2016\",\"Close\",$C$1,,\"all\",,,,\"T\")/100,\"\")","v":4.1939271934239219E-3},{"$f":"RANK($C27,$C$2:C$31)+COUNTIF($C$2:C27,C27)-1","v":12},"S.VZ",26,"S.AXP",{"$f":"IFERROR( RTD(\"cqg.rtd\",,\"StudyData\",G27, \"PCB\",\"BaseType=Index,Price=1000,Index=1,Date=12/30/2016\", \"Close\",$C$1,,\"all\",,,,\"T\")/100,\"\")","v":-3.8708363043699241E-3},"",3.8708363043699241E-3,-3.8708363043699241E-3,{"$f":"IF(G27=\"\",\"\",RTD(\"cqg.rtd\",,\"ContractData\",G27,\"LongDescription\",,\"T\"))","v":"American Express Co"}]
[null,{"$f":"Symbols!B28","v":"S.V"},{"$f":"IFERROR(RTD(\"cqg.rtd\",,\"StudyData\",B28,\"PCB\",\"BaseType=Index,Price=1000,Index=1,Date=12/30/2016\",\"Close\",$C$1,,\"all\",,,,\"T\")/100,\"\")","v":5.8242593061533406E-3},{"$f":"RANK($C28,$C$2:C$31)+COUNTIF($C$2:C28,C28)-1","v":9},"S.V",27,"S.JNJ",{"$f":"IFERROR( RTD(\"cqg.rtd\",,\"StudyData\",G28, \"PCB\",\"BaseType=Index,Price=1000,Index=1,Date=12/30/2016\", \"Close\",$C$1,,\"all\",,,,\"T\")/100,\"\")","v":-3.9283252929014001E-3},"",3.9283252929014001E-3,-3.9283252929014001E-3,{"$f":"IF(G28=\"\",\"\",RTD(\"cqg.rtd\",,\"ContractData\",G28,\"LongDescription\",,\"T\"))","v":"Johnson & Johnson"}]
[null,{"$f":"Symbols!B29","v":"S.WBA"},{"$f":"IFERROR(RTD(\"cqg.rtd\",,\"StudyData\",B29,\"PCB\",\"BaseType=Index,Price=1000,Index=1,Date=12/30/2016\",\"Close\",$C$1,,\"all\",,,,\"T\")/100,\"\")","v":0},{"$f":"RANK($C29,$C$2:C$31)+COUNTIF($C$2:C29,C29)-1","v":19},"S.WBA",28,"S.JPM",{"$f":"IFERROR( RTD(\"cqg.rtd\",,\"StudyData\",G29, \"PCB\",\"BaseType=Index,Price=1000,Index=1,Date=12/30/2016\", \"Close\",$C$1,,\"all\",,,,\"T\")/100,\"\")","v":-9.6527122022872919E-3},"",9.6527122022872919E-3,-9.6527122022872919E-3,{"$f":"IF(G29=\"\",\"\",RTD(\"cqg.rtd\",,\"ContractData\",G29,\"LongDescription\",,\"T\"))","v":"JPMorgan Chase & Co."}]
[null,{"$f":"Symbols!B30","v":"S.WMT"},{"$f":"IFERROR(RTD(\"cqg.rtd\",,\"StudyData\",B30,\"PCB\",\"BaseType=Index,Price=1000,Index=1,Date=12/30/2016\",\"Close\",$C$1,,\"all\",,,,\"T\")/100,\"\")","v":2.5534398482528835E-3},{"$f":"RANK($C30,$C$2:C$31)+COUNTIF($C$2:C30,C30)-1","v":14},"S.WMT",29,"S.UNH",{"$f":"IFERROR( RTD(\"cqg.rtd\",,\"StudyData\",G30, \"PCB\",\"BaseType=Index,Price=1000,Index=1,Date=12/30/2016\", \"Close\",$C$1,,\"all\",,,,\"T\")/100,\"\")","v":-1.0261038136301324E-2},"",1.0261038136301324E-2,-1.0261038136301324E-2,{"$f":"IF(G30=\"\",\"\",RTD(\"cqg.rtd\",,\"ContractData\",G30,\"LongDescription\",,\"T\"))","v":"United Health Group Inc"}]
[null,{"$f":"Symbols!B31","v":"S.DIS"},{"$f":"IFERROR(RTD(\"cqg.rtd\",,\"StudyData\",B31,\"PCB\",\"BaseType=Index,Price=1000,Index=1,Date=12/30/2016\",\"Close\",$C$1,,\"all\",,,,\"T\")/100,\"\")","v":3.8274459771948325E-3},{"$f":"RANK($C31,$C$2:C$31)+COUNTIF($C$2:C31,C31)-1","v":13},"S.DIS",30,"S.GS",{"$f":"IFERROR( RTD(\"cqg.rtd\",,\"StudyData\",G31, \"PCB\",\"BaseType=Index,Price=1000,Index=1,Date=12/30/2016\", \"Close\",$C$1,,\"all\",,,,\"T\")/100,\"\")","v":-1.1340206185566949E-2},"",1.1340206185566949E-2,-1.1340206185566949E-2,{"$f":"IF(G31=\"\",\"\",RTD(\"cqg.rtd\",,\"ContractData\",G31,\"LongDescription\",,\"T\"))","v":"Goldman Sachs Group"}]

{"sheet":"Weekly","index":4,"n_rows":31,"n_cols":12,"rows_kept":31,"cut":false,"hidden":true,"merged":[]}
[null,null,{"$f":"\"A\"&Symbols!F2","v":"AW"}]
[null,{"$f":"Symbols!B2","v":"S.MMM"},{"$f":" IFERROR(RTD(\"cqg.rtd\",,\"StudyData\",B2, \"PCB\",\"BaseType=Index,Price=1000,Index=1,Date=12/30/2016\", \"Close\",$C$1,,\"all\",,,,\"T\")/100,\"\")","v":-4.3055145974638817E-2},{"$f":"RANK($C2,$C$2:C$31)+COUNTIF($C$2:C2,C2)-1","v":28},{"$f":"B2","v":"S.MMM"},1,{"$f":"IFERROR(VLOOKUP($F2,$D$2:$E$31,2,FALSE),\"\")","v":"S.AAPL"},{"$f":"IFERROR( RTD(\"cqg.rtd\",,\"StudyData\",G2, \"PCB\",\"BaseType=Index,Price=1000,Index=1,Date=12/30/2016\", \"Close\",$C$1,,\"all\",,,,\"T\")/100,\"\")","v":3.715836765256457E-2},{"$f":"IF(H2<0,\"\",H2)","v":3.715836765256457E-2},{"$f":"IF(H2>=0,\"\",-H2)","v":""},{"$f":"IF(J2=\"\",\"\",H2)","v":""},{"$f":"IF(G2=\"\",\"\",RTD(\"cqg.rtd\",,\"ContractData\",G2,\"LongDescription\",,\"T\"))","v":"Apple Inc"}]
[null,{"$f":"Symbols!B3","v":"S.AXP"},{"$f":" IFERROR(RTD(\"cqg.rtd\",,\"StudyData\",B3, \"PCB\",\"BaseType=Index,Price=1000,Index=1,Date=12/30/2016\", \"Close\",$C$1,,\"all\",,,,\"T\")/100,\"\")","v":-5.4621036349574548E-2},{"$f":"RANK($C3,$C$2:C$31)+COUNTIF($C$2:C3,C3)-1","v":30},{"$f":"B3","v":"S.AXP"},{"$f":"F2+1","v":2},{"$f":"IFERROR(VLOOKUP($F3,$D$2:$E$31,2,FALSE),\"\")","v":"S.MSFT"},{"$f":"IFERROR( RTD(\"cqg.rtd\",,\"StudyData\",G3, \"PCB\",\"BaseType=Index,Price=1000,Index=1,Date=12/30/2016\", \"Close\",$C$1,,\"all\",,,,\"T\")/100,\"\")","v":1.8314287140076789E-2},{"$f":"IF(H3<0,\"\",H3)","v":1.8314287140076789E-2},{"$f":"IF(H3>=0,\"\",-H3)","v":""},{"$f":"IF(J3=\"\",\"\",H3)","v":""},{"$f":"IF(G3=\"\",\"\",RTD(\"cqg.rtd\",,\"ContractData\",G3,\"LongDescription\",,\"T\"))","v":"Microsoft Corporation"}]
[null,{"$f":"Symbols!B4","v":"S.AMGN"},{"$f":" IFERROR(RTD(\"cqg.rtd\",,\"StudyData\",B4, \"PCB\",\"BaseType=Index,Price=1000,Index=1,Date=12/30/2016\", \"Close\",$C$1,,\"all\",,,,\"T\")/100,\"\")","v":-1.9336347489100566E-2},{"$f":"RANK($C4,$C$2:C$31)+COUNTIF($C$2:C4,C4)-1","v":15},"S.AMGN",{"$f":"F3+1","v":3},"S.WMT",{"$f":"IFERROR( RTD(\"cqg.rtd\",,\"StudyData\",G4, \"PCB\",\"BaseType=Index,Price=1000,Index=1,Date=12/30/2016\", \"Close\",$C$1,,\"all\",,,,\"T\")/100,\"\")","v":1.5743957424791365E-2},1.5743957424791365E-2,"","",{"$f":"IF(G4=\"\",\"\",RTD(\"cqg.rtd\",,\"ContractData\",G4,\"LongDescription\",,\"T\"))","v":"Walmart Inc."}]
[null,{"$f":"Symbols!B5","v":"S.AAPL"},{"$f":" IFERROR(RTD(\"cqg.rtd\",,\"StudyData\",B5, \"PCB\",\"BaseType=Index,Price=1000,Index=1,Date=12/30/2016\", \"Close\",$C$1,,\"all\",,,,\"T\")/100,\"\")","v":3.715836765256457E-2},{"$f":"RANK($C5,$C$2:C$31)+COUNTIF($C$2:C5,C5)-1","v":1},"S.AAPL",4,"S.PG",{"$f":"IFERROR( RTD(\"cqg.rtd\",,\"StudyData\",G5, \"PCB\",\"BaseType=Index,Price=1000,Index=1,Date=12/30/2016\", \"Close\",$C$1,,\"all\",,,,\"T\")/100,\"\")","v":9.0267161680134596E-3},9.0267161680134596E-3,"","",{"$f":"IF(G5=\"\",\"\",RTD(\"cqg.rtd\",,\"ContractData\",G5,\"LongDescription\",,\"T\"))","v":"Procter & Gamble Co"}]
[null,{"$f":"Symbols!B6","v":"S.BA"},{"$f":" IFERROR(RTD(\"cqg.rtd\",,\"StudyData\",B6, \"PCB\",\"BaseType=Index,Price=1000,Index=1,Date=12/30/2016\", \"Close\",$C$1,,\"all\",,,,\"T\")/100,\"\")","v":-3.0594514087129241E-2},{"$f":"RANK($C6,$C$2:C$31)+COUNTIF($C$2:C6,C6)-1","v":20},"S.BA",5,"S.CRM",{"$f":"IFERROR( RTD(\"cqg.rtd\",,\"StudyData\",G6, \"PCB\",\"BaseType=Index,Price=1000,Index=1,Date=12/30/2016\", \"Close\",$C$1,,\"all\",,,,\"T\")/100,\"\")","v":6.0548644863662529E-3},6.0548644863662529E-3,"","",{"$f":"IF(G6=\"\",\"\",RTD(\"cqg.rtd\",,\"ContractData\",G6,\"LongDescription\",,\"T\"))","v":"Salesforce.com Inc"}]
[null,{"$f":"Symbols!B7","v":"S.CAT"},{"$f":" IFERROR(RTD(\"cqg.rtd\",,\"StudyData\",B7, \"PCB\",\"BaseType=Index,Price=1000,Index=1,Date=12/30/2016\", \"Close\",$C$1,,\"all\",,,,\"T\")/100,\"\")","v":-3.7732134654504888E-2},{"$f":"RANK($C7,$C$2:C$31)+COUNTIF($C$2:C7,C7)-1","v":24},"S.CAT",6,"S.INTC",{"$f":"IFERROR( RTD(\"cqg.rtd\",,\"StudyData\",G7, \"PCB\",\"BaseType=Index,Price=1000,Index=1,Date=12/30/2016\", \"Close\",$C$1,,\"all\",,,,\"T\")/100,\"\")","v":-2.4052916416114939E-3},"",2.4052916416114939E-3,-2.4052916416114939E-3,{"$f":"IF(G7=\"\",\"\",RTD(\"cqg.rtd\",,\"ContractData\",G7,\"LongDescription\",,\"T\"))","v":"Intel Corporation"}]
[null,{"$f":"Symbols!B8","v":"S.CVX"},{"$f":" IFERROR(RTD(\"cqg.rtd\",,\"StudyData\",B8, \"PCB\",\"BaseType=Index,Price=1000,Index=1,Date=12/30/2016\", \"Close\",$C$1,,\"all\",,,,\"T\")/100,\"\")","v":-2.4293568597366137E-2},{"$f":"RANK($C8,$C$2:C$31)+COUNTIF($C$2:C8,C8)-1","v":19},"S.CVX",7,"S.NKE",{"$f":"IFERROR( RTD(\"cqg.rtd\",,\"StudyData\",G8, \"PCB\",\"BaseType=Index,Price=1000,Index=1,Date=12/30/2016\", \"Close\",$C$1,,\"all\",,,,\"T\")/100,\"\")","v":-6.3666492237919913E-3},"",6.3666492237919913E-3,-6.3666492237919913E-3,{"$f":"IF(G8=\"\",\"\",RTD(\"cqg.rtd\",,\"ContractData\",G8,\"LongDescription\",,\"T\"))","v":"NIKE Inc ClsB"}]
[null,{"$f":"Symbols!B9","v":"S.CSCO"},{"$f":" IFERROR(RTD(\"cqg.rtd\",,\"StudyData\",B9, \"PCB\",\"BaseType=Index,Price=1000,Index=1,Date=12/30/2016\", \"Close\",$C$1,,\"all\",,,,\"T\")/100,\"\")","v":-1.1806078874654583E-2},{"$f":"RANK($C9,$C$2:C$31)+COUNTIF($C$2:C9,C9)-1","v":12},"S.CSCO",8,"S.VZ",{"$f":"IFERROR( RTD(\"cqg.rtd\",,\"StudyData\",G9, \"PCB\",\"BaseType=Index,Price=1000,Index=1,Date=12/30/2016\", \"Close\",$C$1,,\"all\",,,,\"T\")/100,\"\")","v":-8.1193040596520619E-3},"",8.1193040596520619E-3,-8.1193040596520619E-3,{"$f":"IF(G9=\"\",\"\",RTD(\"cqg.rtd\",,\"ContractData\",G9,\"LongDescription\",,\"T\"))","v":"Verizon Communications"}]
[null,{"$f":"Symbols!B10","v":"S.KO"},{"$f":" IFERROR(RTD(\"cqg.rtd\",,\"StudyData\",B10, \"PCB\",\"BaseType=Index,Price=1000,Index=1,Date=12/30/2016\", \"Close\",$C$1,,\"all\",,,,\"T\")/100,\"\")","v":-1.1496531219028707E-2},{"$f":"RANK($C10,$C$2:C$31)+COUNTIF($C$2:C10,C10)-1","v":11},"S.KO",9,"S.HD",{"$f":"IFERROR( RTD(\"cqg.rtd\",,\"StudyData\",G10, \"PCB\",\"BaseType=Index,Price=1000,Index=1,Date=12/30/2016\", \"Close\",$C$1,,\"all\",,,,\"T\")/100,\"\")","v":-9.1936480250008092E-3},"",9.1936480250008092E-3,-9.1936480250008092E-3,{"$f":"IF(G10=\"\",\"\",RTD(\"cqg.rtd\",,\"ContractData\",G10,\"LongDescription\",,\"T\"))","v":"Home Depot, Inc."}]
[null,{"$f":"Symbols!B11","v":"S.DOW"},{"$f":" IFERROR(RTD(\"cqg.rtd\",,\"StudyData\",B11, \"PCB\",\"BaseType=Index,Price=1000,Index=1,Date=12/30/2016\", \"Close\",$C$1,,\"all\",,,,\"T\")/100,\"\")","v":-4.9235656144530543E-2},{"$f":"RANK($C11,$C$2:C$31)+COUNTIF($C$2:C11,C11)-1","v":29},"S.DOW",10,"S.TRV",{"$f":"IFERROR( RTD(\"cqg.rtd\",,\"StudyData\",G11, \"PCB\",\"BaseType=Index,Price=1000,Index=1,Date=12/30/2016\", \"Close\",$C$1,,\"all\",,,,\"T\")/100,\"\")","v":-1.1378908699937245E-2},"",1.1378908699937245E-2,-1.1378908699937245E-2,{"$f":"IF(G11=\"\",\"\",RTD(\"cqg.rtd\",,\"ContractData\",G11,\"LongDescription\",,\"T\"))","v":"Travelers Companies, Inc"}]
[null,{"$f":"Symbols!B12","v":"S.GS"},{"$f":" IFERROR(RTD(\"cqg.rtd\",,\"StudyData\",B12, \"PCB\",\"BaseType=Index,Price=1000,Index=1,Date=12/30/2016\", \"Close\",$C$1,,\"all\",,,,\"T\")/100,\"\")","v":-1.5703582058914103E-2},{"$f":"RANK($C12,$C$2:C$31)+COUNTIF($C$2:C12,C12)-1","v":14},"S.GS",11,"S.KO",{"$f":"IFERROR( RTD(\"cqg.rtd\",,\"StudyData\",G12, \"PCB\",\"BaseType=Index,Price=1000,Index=1,Date=12/30/2016\", \"Close\",$C$1,,\"all\",,,,\"T\")/100,\"\")","v":-1.1496531219028707E-2},"",1.1496531219028707E-2,-1.1496531219028707E-2,{"$f":"IF(G12=\"\",\"\",RTD(\"cqg.rtd\",,\"ContractData\",G12,\"LongDescription\",,\"T\"))","v":"Coca-Cola Company"}]
[null,{"$f":"Symbols!B13","v":"S.HD"},{"$f":" IFERROR(RTD(\"cqg.rtd\",,\"StudyData\",B13, \"PCB\",\"BaseType=Index,Price=1000,Index=1,Date=12/30/2016\", \"Close\",$C$1,,\"all\",,,,\"T\")/100,\"\")","v":-9.1936480250008092E-3},{"$f":"RANK($C13,$C$2:C$31)+COUNTIF($C$2:C13,C13)-1","v":9},"S.HD",12,"S.CSCO",{"$f":"IFERROR( RTD(\"cqg.rtd\",,\"StudyData\",G13, \"PCB\",\"BaseType=Index,Price=1000,Index=1,Date=12/30/2016\", \"Close\",$C$1,,\"all\",,,,\"T\")/100,\"\")","v":-1.1806078874654583E-2},"",1.1806078874654583E-2,-1.1806078874654583E-2,{"$f":"IF(G13=\"\",\"\",RTD(\"cqg.rtd\",,\"ContractData\",G13,\"LongDescription\",,\"T\"))","v":"Cisco Systems Inc"}]
[null,{"$f":"Symbols!B14","v":"S.HON"},{"$f":" IFERROR(RTD(\"cqg.rtd\",,\"StudyData\",B14, \"PCB\",\"BaseType=Index,Price=1000,Index=1,Date=12/30/2016\", \"Close\",$C$1,,\"all\",,,,\"T\")/100,\"\")","v":-4.214582098399533E-2},{"$f":"RANK($C14,$C$2:C$31)+COUNTIF($C$2:C14,C14)-1","v":27},"S.HON",13,"S.IBM",{"$f":"IFERROR( RTD(\"cqg.rtd\",,\"StudyData\",G14, \"PCB\",\"BaseType=Index,Price=1000,Index=1,Date=12/30/2016\", \"Close\",$C$1,,\"all\",,,,\"T\")/100,\"\")","v":-1.3115021179537304E-2},"",1.3115021179537304E-2,-1.3115021179537304E-2,{"$f":"IF(G14=\"\",\"\",RTD(\"cqg.rtd\",,\"ContractData\",G14,\"LongDescription\",,\"T\"))","v":"International Business Machines"}]
[null,{"$f":"Symbols!B15","v":"S.INTC"},{"$f":" IFERROR(RTD(\"cqg.rtd\",,\"StudyData\",B15, \"PCB\",\"BaseType=Index,Price=1000,Index=1,Date=12/30/2016\", \"Close\",$C$1,,\"all\",,,,\"T\")/100,\"\")","v":-2.4052916416114939E-3},{"$f":"RANK($C15,$C$2:C$31)+COUNTIF($C$2:C15,C15)-1","v":6},"S.INTC",14,"S.GS",{"$f":"IFERROR( RTD(\"cqg.rtd\",,\"StudyData\",G15, \"PCB\",\"BaseType=Index,Price=1000,Index=1,Date=12/30/2016\", \"Close\",$C$1,,\"all\",,,,\"T\")/100,\"\")","v":-1.5703582058914103E-2},"",1.5703582058914103E-2,-1.5703582058914103E-2,{"$f":"IF(G15=\"\",\"\",RTD(\"cqg.rtd\",,\"ContractData\",G15,\"LongDescription\",,\"T\"))","v":"Goldman Sachs Group"}]
[null,{"$f":"Symbols!B16","v":"S.IBM"},{"$f":" IFERROR(RTD(\"cqg.rtd\",,\"StudyData\",B16, \"PCB\",\"BaseType=Index,Price=1000,Index=1,Date=12/30/2016\", \"Close\",$C$1,,\"all\",,,,\"T\")/100,\"\")","v":-1.3115021179537304E-2},{"$f":"RANK($C16,$C$2:C$31)+COUNTIF($C$2:C16,C16)-1","v":13},"S.IBM",15,"S.AMGN",{"$f":"IFERROR( RTD(\"cqg.rtd\",,\"StudyData\",G16, \"PCB\",\"BaseType=Index,Price=1000,Index=1,Date=12/30/2016\", \"Close\",$C$1,,\"all\",,,,\"T\")/100,\"\")","v":-1.9336347489100566E-2},"",1.9336347489100566E-2,-1.9336347489100566E-2,{"$f":"IF(G16=\"\",\"\",RTD(\"cqg.rtd\",,\"ContractData\",G16,\"LongDescription\",,\"T\"))","v":"Amgen Inc"}]
[null,{"$f":"Symbols!B17","v":"S.JNJ"},{"$f":" IFERROR(RTD(\"cqg.rtd\",,\"StudyData\",B17, \"PCB\",\"BaseType=Index,Price=1000,Index=1,Date=12/30/2016\", \"Close\",$C$1,,\"all\",,,,\"T\")/100,\"\")","v":-3.1170398176699327E-2},{"$f":"RANK($C17,$C$2:C$31)+COUNTIF($C$2:C17,C17)-1","v":22},"S.JNJ",16,"S.MCD",{"$f":"IFERROR( RTD(\"cqg.rtd\",,\"StudyData\",G17, \"PCB\",\"BaseType=Index,Price=1000,Index=1,Date=12/30/2016\", \"Close\",$C$1,,\"all\",,,,\"T\")/100,\"\")","v":-1.9657692831525003E-2},"",1.9657692831525003E-2,-1.9657692831525003E-2,{"$f":"IF(G17=\"\",\"\",RTD(\"cqg.rtd\",,\"ContractData\",G17,\"LongDescription\",,\"T\"))","v":"McDonald's Corporation"}]
[null,{"$f":"Symbols!B18","v":"S.JPM"},{"$f":" IFERROR(RTD(\"cqg.rtd\",,\"StudyData\",B18, \"PCB\",\"BaseType=Index,Price=1000,Index=1,Date=12/30/2016\", \"Close\",$C$1,,\"all\",,,,\"T\")/100,\"\")","v":-4.0264361972547104E-2},{"$f":"RANK($C18,$C$2:C$31)+COUNTIF($C$2:C18,C18)-1","v":26},"S.JPM",17,"S.V",{"$f":"IFERROR( RTD(\"cqg.rtd\",,\"StudyData\",G18, \"PCB\",\"BaseType=Index,Price=1000,Index=1,Date=12/30/2016\", \"Close\",$C$1,,\"all\",,,,\"T\")/100,\"\")","v":-1.9791718079068255E-2},"",1.9791718079068255E-2,-1.9791718079068255E-2,{"$f":"IF(G18=\"\",\"\",RTD(\"cqg.rtd\",,\"ContractData\",G18,\"LongDescription\",,\"T\"))","v":"Visa Inc."}]
[null,{"$f":"Symbols!B19","v":"S.MCD"},{"$f":" IFERROR(RTD(\"cqg.rtd\",,\"StudyData\",B19, \"PCB\",\"BaseType=Index,Price=1000,Index=1,Date=12/30/2016\", \"Close\",$C$1,,\"all\",,,,\"T\")/100,\"\")","v":-1.9657692831525003E-2},{"$f":"RANK($C19,$C$2:C$31)+COUNTIF($C$2:C19,C19)-1","v":16},"S.MCD",18,"S.DIS",{"$f":"IFERROR( RTD(\"cqg.rtd\",,\"StudyData\",G19, \"PCB\",\"BaseType=Index,Price=1000,Index=1,Date=12/30/2016\", \"Close\",$C$1,,\"all\",,,,\"T\")/100,\"\")","v":-2.1301407136748773E-2},"",2.1301407136748773E-2,-2.1301407136748773E-2,{"$f":"IF(G19=\"\",\"\",RTD(\"cqg.rtd\",,\"ContractData\",G19,\"LongDescription\",,\"T\"))","v":"Disney (Walt) Company"}]
[null,{"$f":"Symbols!B20","v":"S.MRK"},{"$f":" IFERROR(RTD(\"cqg.rtd\",,\"StudyData\",B20, \"PCB\",\"BaseType=Index,Price=1000,Index=1,Date=12/30/2016\", \"Close\",$C$1,,\"all\",,,,\"T\")/100,\"\")","v":-3.449481412422787E-2},{"$f":"RANK($C20,$C$2:C$31)+COUNTIF($C$2:C20,C20)-1","v":23},"S.MRK",19,"S.CVX",{"$f":"IFERROR( RTD(\"cqg.rtd\",,\"StudyData\",G20, \"PCB\",\"BaseType=Index,Price=1000,Index=1,Date=12/30/2016\", \"Close\",$C$1,,\"all\",,,,\"T\")/100,\"\")","v":-2.4293568597366137E-2},"",2.4293568597366137E-2,-2.4293568597366137E-2,{"$f":"IF(G20=\"\",\"\",RTD(\"cqg.rtd\",,\"ContractData\",G20,\"LongDescription\",,\"T\"))","v":"Chevron Corp"}]
[null,{"$f":"Symbols!B21","v":"S.MSFT"},{"$f":" IFERROR(RTD(\"cqg.rtd\",,\"StudyData\",B21, \"PCB\",\"BaseType=Index,Price=1000,Index=1,Date=12/30/2016\", \"Close\",$C$1,,\"all\",,,,\"T\")/100,\"\")","v":1.8314287140076789E-2},{"$f":"RANK($C21,$C$2:C$31)+COUNTIF($C$2:C21,C21)-1","v":2},"S.MSFT",20,"S.BA",{"$f":"IFERROR( RTD(\"cqg.rtd\",,\"StudyData\",G21, \"PCB\",\"BaseType=Index,Price=1000,Index=1,Date=12/30/2016\", \"Close\",$C$1,,\"all\",,,,\"T\")/100,\"\")","v":-3.0594514087129241E-2},"",3.0594514087129241E-2,-3.0594514087129241E-2,{"$f":"IF(G21=\"\",\"\",RTD(\"cqg.rtd\",,\"ContractData\",G21,\"LongDescription\",,\"T\"))","v":"Boeing Company"}]
[null,{"$f":"Symbols!B22","v":"S.NKE"},{"$f":" IFERROR(RTD(\"cqg.rtd\",,\"StudyData\",B22, \"PCB\",\"BaseType=Index,Price=1000,Index=1,Date=12/30/2016\", \"Close\",$C$1,,\"all\",,,,\"T\")/100,\"\")","v":-6.3666492237919913E-3},{"$f":"RANK($C22,$C$2:C$31)+COUNTIF($C$2:C22,C22)-1","v":7},"S.NKE",21,"S.WBA",{"$f":"IFERROR( RTD(\"cqg.rtd\",,\"StudyData\",G22, \"PCB\",\"BaseType=Index,Price=1000,Index=1,Date=12/30/2016\", \"Close\",$C$1,,\"all\",,,,\"T\")/100,\"\")","v":-3.086921202274575E-2},"",3.086921202274575E-2,-3.086921202274575E-2,{"$f":"IF(G22=\"\",\"\",RTD(\"cqg.rtd\",,\"ContractData\",G22,\"LongDescription\",,\"T\"))","v":"Walgreens Boots Alliance, Inc."}]
[null,{"$f":"Symbols!B23","v":"S.PG"},{"$f":" IFERROR(RTD(\"cqg.rtd\",,\"StudyData\",B23, \"PCB\",\"BaseType=Index,Price=1000,Index=1,Date=12/30/2016\", \"Close\",$C$1,,\"all\",,,,\"T\")/100,\"\")","v":9.0267161680134596E-3},{"$f":"RANK($C23,$C$2:C$31)+COUNTIF($C$2:C23,C23)-1","v":4},"S.PG",22,"S.JNJ",{"$f":"IFERROR( RTD(\"cqg.rtd\",,\"StudyData\",G23, \"PCB\",\"BaseType=Index,Price=1000,Index=1,Date=12/30/2016\", \"Close\",$C$1,,\"all\",,,,\"T\")/100,\"\")","v":-3.1170398176699327E-2},"",3.1170398176699327E-2,-3.1170398176699327E-2,{"$f":"IF(G23=\"\",\"\",RTD(\"cqg.rtd\",,\"ContractData\",G23,\"LongDescription\",,\"T\"))","v":"Johnson & Johnson"}]
[null,{"$f":"Symbols!B24","v":"S.CRM"},{"$f":" IFERROR(RTD(\"cqg.rtd\",,\"StudyData\",B24, \"PCB\",\"BaseType=Index,Price=1000,Index=1,Date=12/30/2016\", \"Close\",$C$1,,\"all\",,,,\"T\")/100,\"\")","v":6.0548644863662529E-3},{"$f":"RANK($C24,$C$2:C$31)+COUNTIF($C$2:C24,C24)-1","v":5},"S.CRM",23,"S.MRK",{"$f":"IFERROR( RTD(\"cqg.rtd\",,\"StudyData\",G24, \"PCB\",\"BaseType=Index,Price=1000,Index=1,Date=12/30/2016\", \"Close\",$C$1,,\"all\",,,,\"T\")/100,\"\")","v":-3.449481412422787E-2},"",3.449481412422787E-2,-3.449481412422787E-2,{"$f":"IF(G24=\"\",\"\",RTD(\"cqg.rtd\",,\"ContractData\",G24,\"LongDescription\",,\"T\"))","v":"Merck & Co Inc"}]
[null,{"$f":"Symbols!B25","v":"S.TRV"},{"$f":" IFERROR(RTD(\"cqg.rtd\",,\"StudyData\",B25, \"PCB\",\"BaseType=Index,Price=1000,Index=1,Date=12/30/2016\", \"Close\",$C$1,,\"all\",,,,\"T\")/100,\"\")","v":-1.1378908699937245E-2},{"$f":"RANK($C25,$C$2:C$31)+COUNTIF($C$2:C25,C25)-1","v":10},"S.TRV",24,"S.CAT",{"$f":"IFERROR( RTD(\"cqg.rtd\",,\"StudyData\",G25, \"PCB\",\"BaseType=Index,Price=1000,Index=1,Date=12/30/2016\", \"Close\",$C$1,,\"all\",,,,\"T\")/100,\"\")","v":-3.7732134654504888E-2},"",3.7732134654504888E-2,-3.7732134654504888E-2,{"$f":"IF(G25=\"\",\"\",RTD(\"cqg.rtd\",,\"ContractData\",G25,\"LongDescription\",,\"T\"))","v":"Caterpillar Inc"}]
[null,{"$f":"Symbols!B26","v":"S.UNH"},{"$f":" IFERROR(RTD(\"cqg.rtd\",,\"StudyData\",B26, \"PCB\",\"BaseType=Index,Price=1000,Index=1,Date=12/30/2016\", \"Close\",$C$1,,\"all\",,,,\"T\")/100,\"\")","v":-3.8633854944484056E-2},{"$f":"RANK($C26,$C$2:C$31)+COUNTIF($C$2:C26,C26)-1","v":25},"S.UNH",25,"S.UNH",{"$f":"IFERROR( RTD(\"cqg.rtd\",,\"StudyData\",G26, \"PCB\",\"BaseType=Index,Price=1000,Index=1,Date=12/30/2016\", \"Close\",$C$1,,\"all\",,,,\"T\")/100,\"\")","v":-3.8633854944484056E-2},"",3.8633854944484056E-2,-3.8633854944484056E-2,{"$f":"IF(G26=\"\",\"\",RTD(\"cqg.rtd\",,\"ContractData\",G26,\"LongDescription\",,\"T\"))","v":"United Health Group Inc"}]
[null,{"$f":"Symbols!B27","v":"S.VZ"},{"$f":" IFERROR(RTD(\"cqg.rtd\",,\"StudyData\",B27, \"PCB\",\"BaseType=Index,Price=1000,Index=1,Date=12/30/2016\", \"Close\",$C$1,,\"all\",,,,\"T\")/100,\"\")","v":-8.1193040596520619E-3},{"$f":"RANK($C27,$C$2:C$31)+COUNTIF($C$2:C27,C27)-1","v":8},"S.VZ",26,"S.JPM",{"$f":"IFERROR( RTD(\"cqg.rtd\",,\"StudyData\",G27, \"PCB\",\"BaseType=Index,Price=1000,Index=1,Date=12/30/2016\", \"Close\",$C$1,,\"all\",,,,\"T\")/100,\"\")","v":-4.0264361972547104E-2},"",4.0264361972547104E-2,-4.0264361972547104E-2,{"$f":"IF(G27=\"\",\"\",RTD(\"cqg.rtd\",,\"ContractData\",G27,\"LongDescription\",,\"T\"))","v":"JPMorgan Chase & Co."}]
[null,{"$f":"Symbols!B28","v":"S.V"},{"$f":" IFERROR(RTD(\"cqg.rtd\",,\"StudyData\",B28, \"PCB\",\"BaseType=Index,Price=1000,Index=1,Date=12/30/2016\", \"Close\",$C$1,,\"all\",,,,\"T\")/100,\"\")","v":-1.9791718079068255E-2},{"$f":"RANK($C28,$C$2:C$31)+COUNTIF($C$2:C28,C28)-1","v":17},"S.V",27,"S.HON",{"$f":"IFERROR( RTD(\"cqg.rtd\",,\"StudyData\",G28, \"PCB\",\"BaseType=Index,Price=1000,Index=1,Date=12/30/2016\", \"Close\",$C$1,,\"all\",,,,\"T\")/100,\"\")","v":-4.214582098399533E-2},"",4.214582098399533E-2,-4.214582098399533E-2,{"$f":"IF(G28=\"\",\"\",RTD(\"cqg.rtd\",,\"ContractData\",G28,\"LongDescription\",,\"T\"))","v":"Honeywell Intl"}]
[null,{"$f":"Symbols!B29","v":"S.WBA"},{"$f":" IFERROR(RTD(\"cqg.rtd\",,\"StudyData\",B29, \"PCB\",\"BaseType=Index,Price=1000,Index=1,Date=12/30/2016\", \"Close\",$C$1,,\"all\",,,,\"T\")/100,\"\")","v":-3.086921202274575E-2},{"$f":"RANK($C29,$C$2:C$31)+COUNTIF($C$2:C29,C29)-1","v":21},"S.WBA",28,"S.MMM",{"$f":"IFERROR( RTD(\"cqg.rtd\",,\"StudyData\",G29, \"PCB\",\"BaseType=Index,Price=1000,Index=1,Date=12/30/2016\", \"Close\",$C$1,,\"all\",,,,\"T\")/100,\"\")","v":-4.3055145974638817E-2},"",4.3055145974638817E-2,-4.3055145974638817E-2,{"$f":"IF(G29=\"\",\"\",RTD(\"cqg.rtd\",,\"ContractData\",G29,\"LongDescription\",,\"T\"))","v":"3M Company"}]
[null,{"$f":"Symbols!B30","v":"S.WMT"},{"$f":" IFERROR(RTD(\"cqg.rtd\",,\"StudyData\",B30, \"PCB\",\"BaseType=Index,Price=1000,Index=1,Date=12/30/2016\", \"Close\",$C$1,,\"all\",,,,\"T\")/100,\"\")","v":1.5743957424791365E-2},{"$f":"RANK($C30,$C$2:C$31)+COUNTIF($C$2:C30,C30)-1","v":3},"S.WMT",29,"S.DOW",{"$f":"IFERROR( RTD(\"cqg.rtd\",,\"StudyData\",G30, \"PCB\",\"BaseType=Index,Price=1000,Index=1,Date=12/30/2016\", \"Close\",$C$1,,\"all\",,,,\"T\")/100,\"\")","v":-4.9235656144530543E-2},"",4.9235656144530543E-2,-4.9235656144530543E-2,{"$f":"IF(G30=\"\",\"\",RTD(\"cqg.rtd\",,\"ContractData\",G30,\"LongDescription\",,\"T\"))","v":"Dow Inc."}]
[null,{"$f":"Symbols!B31","v":"S.DIS"},{"$f":" IFERROR(RTD(\"cqg.rtd\",,\"StudyData\",B31, \"PCB\",\"BaseType=Index,Price=1000,Index=1,Date=12/30/2016\", \"Close\",$C$1,,\"all\",,,,\"T\")/100,\"\")","v":-2.1301407136748773E-2},{"$f":"RANK($C31,$C$2:C$31)+COUNTIF($C$2:C31,C31)-1","v":18},"S.DIS",30,"S.AXP",{"$f":"IFERROR( RTD(\"cqg.rtd\",,\"StudyData\",G31, \"PCB\",\"BaseType=Index,Price=1000,Index=1,Date=12/30/2016\", \"Close\",$C$1,,\"all\",,,,\"T\")/100,\"\")","v":-5.4621036349574548E-2},"",5.4621036349574548E-2,-5.4621036349574548E-2,{"$f":"IF(G31=\"\",\"\",RTD(\"cqg.rtd\",,\"ContractData\",G31,\"LongDescription\",,\"T\"))","v":"American Express Co"}]

{"sheet":"Monthly","index":5,"n_rows":31,"n_cols":12,"rows_kept":31,"cut":false,"hidden":true,"merged":[]}
[null,null,{"$f":"\"A\"&Symbols!G2","v":"AM"}]
[null,{"$f":"Symbols!B2","v":"S.MMM"},{"$f":" IFERROR(RTD(\"cqg.rtd\",,\"StudyData\",B2, \"PCB\",\"BaseType=Index,Price=1000,Index=1,Date=12/30/2016\", \"Close\",$C$1,,\"all\",,,,\"T\")/100,\"\")","v":-4.7233468286100493E-3},{"$f":"RANK($C2,$C$2:C$31)+COUNTIF($C$2:C2,C2)-1","v":8},{"$f":"B2","v":"S.MMM"},1,{"$f":"IFERROR(VLOOKUP($F2,$D$2:$E$31,2,FALSE),\"\")","v":"S.DOW"},{"$f":"IFERROR( RTD(\"cqg.rtd\",,\"StudyData\",G2, \"PCB\",\"BaseType=Index,Price=1000,Index=1,Date=12/30/2016\", \"Close\",$C$1,,\"all\",,,,\"T\")/100,\"\")","v":6.1391843971631277E-2},{"$f":"IF(H2<0,\"\",H2)","v":6.1391843971631277E-2},{"$f":"IF(H2>=0,\"\",-H2)","v":""},{"$f":"IF(J2=\"\",\"\",H2)","v":""},{"$f":"IF(G2=\"\",\"\",RTD(\"cqg.rtd\",,\"ContractData\",G2,\"LongDescription\",,\"T\"))","v":"Dow Inc."}]
[null,{"$f":"Symbols!B3","v":"S.AXP"},{"$f":" IFERROR(RTD(\"cqg.rtd\",,\"StudyData\",B3, \"PCB\",\"BaseType=Index,Price=1000,Index=1,Date=12/30/2016\", \"Close\",$C$1,,\"all\",,,,\"T\")/100,\"\")","v":-3.7405256422876232E-2},{"$f":"RANK($C3,$C$2:C$31)+COUNTIF($C$2:C3,C3)-1","v":14},{"$f":"B3","v":"S.AXP"},{"$f":"F2+1","v":2},{"$f":"IFERROR(VLOOKUP($F3,$D$2:$E$31,2,FALSE),\"\")","v":"S.CAT"},{"$f":"IFERROR( RTD(\"cqg.rtd\",,\"StudyData\",G3, \"PCB\",\"BaseType=Index,Price=1000,Index=1,Date=12/30/2016\", \"Close\",$C$1,,\"all\",,,,\"T\")/100,\"\")","v":3.0426533623779162E-2},{"$f":"IF(H3<0,\"\",H3)","v":3.0426533623779162E-2},{"$f":"IF(H3>=0,\"\",-H3)","v":""},{"$f":"IF(J3=\"\",\"\",H3)","v":""},{"$f":"IF(G3=\"\",\"\",RTD(\"cqg.rtd\",,\"ContractData\",G3,\"LongDescription\",,\"T\"))","v":"Caterpillar Inc"}]
[null,{"$f":"Symbols!B4","v":"S.AMGN"},{"$f":" IFERROR(RTD(\"cqg.rtd\",,\"StudyData\",B4, \"PCB\",\"BaseType=Index,Price=1000,Index=1,Date=12/30/2016\", \"Close\",$C$1,,\"all\",,,,\"T\")/100,\"\")","v":-4.1015316595610238E-2},{"$f":"RANK($C4,$C$2:C$31)+COUNTIF($C$2:C4,C4)-1","v":15},"S.AMGN",{"$f":"F3+1","v":3},"S.NKE",{"$f":"IFERROR( RTD(\"cqg.rtd\",,\"StudyData\",G4, \"PCB\",\"BaseType=Index,Price=1000,Index=1,Date=12/30/2016\", \"Close\",$C$1,,\"all\",,,,\"T\")/100,\"\")","v":1.8232192331754458E-2},1.8232192331754458E-2,"","",{"$f":"IF(G4=\"\",\"\",RTD(\"cqg.rtd\",,\"ContractData\",G4,\"LongDescription\",,\"T\"))","v":"NIKE Inc ClsB"}]
[null,{"$f":"Symbols!B5","v":"S.AAPL"},{"$f":" IFERROR(RTD(\"cqg.rtd\",,\"StudyData\",B5, \"PCB\",\"BaseType=Index,Price=1000,Index=1,Date=12/30/2016\", \"Close\",$C$1,,\"all\",,,,\"T\")/100,\"\")","v":-0.14127402355858643},{"$f":"RANK($C5,$C$2:C$31)+COUNTIF($C$2:C5,C5)-1","v":30},"S.AAPL",4,"S.MCD",{"$f":"IFERROR( RTD(\"cqg.rtd\",,\"StudyData\",G5, \"PCB\",\"BaseType=Index,Price=1000,Index=1,Date=12/30/2016\", \"Close\",$C$1,,\"all\",,,,\"T\")/100,\"\")","v":1.1333832896215751E-2},1.1333832896215751E-2,"","",{"$f":"IF(G5=\"\",\"\",RTD(\"cqg.rtd\",,\"ContractData\",G5,\"LongDescription\",,\"T\"))","v":"McDonald's Corporation"}]
[null,{"$f":"Symbols!B6","v":"S.BA"},{"$f":" IFERROR(RTD(\"cqg.rtd\",,\"StudyData\",B6, \"PCB\",\"BaseType=Index,Price=1000,Index=1,Date=12/30/2016\", \"Close\",$C$1,,\"all\",,,,\"T\")/100,\"\")","v":-9.0850890466767462E-2},{"$f":"RANK($C6,$C$2:C$31)+COUNTIF($C$2:C6,C6)-1","v":27},"S.BA",5,"S.VZ",{"$f":"IFERROR( RTD(\"cqg.rtd\",,\"StudyData\",G6, \"PCB\",\"BaseType=Index,Price=1000,Index=1,Date=12/30/2016\", \"Close\",$C$1,,\"all\",,,,\"T\")/100,\"\")","v":9.9544457567065335E-3},9.9544457567065335E-3,"","",{"$f":"IF(G6=\"\",\"\",RTD(\"cqg.rtd\",,\"ContractData\",G6,\"LongDescription\",,\"T\"))","v":"Verizon Communications"}]
[null,{"$f":"Symbols!B7","v":"S.CAT"},{"$f":" IFERROR(RTD(\"cqg.rtd\",,\"StudyData\",B7, \"PCB\",\"BaseType=Index,Price=1000,Index=1,Date=12/30/2016\", \"Close\",$C$1,,\"all\",,,,\"T\")/100,\"\")","v":3.0426533623779162E-2},{"$f":"RANK($C7,$C$2:C$31)+COUNTIF($C$2:C7,C7)-1","v":2},"S.CAT",6,"S.KO",{"$f":"IFERROR( RTD(\"cqg.rtd\",,\"StudyData\",G7, \"PCB\",\"BaseType=Index,Price=1000,Index=1,Date=12/30/2016\", \"Close\",$C$1,,\"all\",,,,\"T\")/100,\"\")","v":6.8645265495659892E-3},6.8645265495659892E-3,"","",{"$f":"IF(G7=\"\",\"\",RTD(\"cqg.rtd\",,\"ContractData\",G7,\"LongDescription\",,\"T\"))","v":"Coca-Cola Company"}]
[null,{"$f":"Symbols!B8","v":"S.CVX"},{"$f":" IFERROR(RTD(\"cqg.rtd\",,\"StudyData\",B8, \"PCB\",\"BaseType=Index,Price=1000,Index=1,Date=12/30/2016\", \"Close\",$C$1,,\"all\",,,,\"T\")/100,\"\")","v":-9.0789944000953221E-2},{"$f":"RANK($C8,$C$2:C$31)+COUNTIF($C$2:C8,C8)-1","v":26},"S.CVX",7,"S.PG",{"$f":"IFERROR( RTD(\"cqg.rtd\",,\"StudyData\",G8, \"PCB\",\"BaseType=Index,Price=1000,Index=1,Date=12/30/2016\", \"Close\",$C$1,,\"all\",,,,\"T\")/100,\"\")","v":2.024145160124348E-3},2.024145160124348E-3,"","",{"$f":"IF(G8=\"\",\"\",RTD(\"cqg.rtd\",,\"ContractData\",G8,\"LongDescription\",,\"T\"))","v":"Procter & Gamble Co"}]
[null,{"$f":"Symbols!B9","v":"S.CSCO"},{"$f":" IFERROR(RTD(\"cqg.rtd\",,\"StudyData\",B9, \"PCB\",\"BaseType=Index,Price=1000,Index=1,Date=12/30/2016\", \"Close\",$C$1,,\"all\",,,,\"T\")/100,\"\")","v":-6.8214116532448965E-2},{"$f":"RANK($C9,$C$2:C$31)+COUNTIF($C$2:C9,C9)-1","v":25},"S.CSCO",8,"S.MMM",{"$f":"IFERROR( RTD(\"cqg.rtd\",,\"StudyData\",G9, \"PCB\",\"BaseType=Index,Price=1000,Index=1,Date=12/30/2016\", \"Close\",$C$1,,\"all\",,,,\"T\")/100,\"\")","v":-4.7233468286100493E-3},"",4.7233468286100493E-3,-4.7233468286100493E-3,{"$f":"IF(G9=\"\",\"\",RTD(\"cqg.rtd\",,\"ContractData\",G9,\"LongDescription\",,\"T\"))","v":"3M Company"}]
[null,{"$f":"Symbols!B10","v":"S.KO"},{"$f":" IFERROR(RTD(\"cqg.rtd\",,\"StudyData\",B10, \"PCB\",\"BaseType=Index,Price=1000,Index=1,Date=12/30/2016\", \"Close\",$C$1,,\"all\",,,,\"T\")/100,\"\")","v":6.8645265495659892E-3},{"$f":"RANK($C10,$C$2:C$31)+COUNTIF($C$2:C10,C10)-1","v":6},"S.KO",9,"S.WMT",{"$f":"IFERROR( RTD(\"cqg.rtd\",,\"StudyData\",G10, \"PCB\",\"BaseType=Index,Price=1000,Index=1,Date=12/30/2016\", \"Close\",$C$1,,\"all\",,,,\"T\")/100,\"\")","v":-1.0298883687432325E-2},"",1.0298883687432325E-2,-1.0298883687432325E-2,{"$f":"IF(G10=\"\",\"\",RTD(\"cqg.rtd\",,\"ContractData\",G10,\"LongDescription\",,\"T\"))","v":"Walmart Inc."}]
[null,{"$f":"Symbols!B11","v":"S.DOW"},{"$f":" IFERROR(RTD(\"cqg.rtd\",,\"StudyData\",B11, \"PCB\",\"BaseType=Index,Price=1000,Index=1,Date=12/30/2016\", \"Close\",$C$1,,\"all\",,,,\"T\")/100,\"\")","v":6.1391843971631277E-2},{"$f":"RANK($C11,$C$2:C$31)+COUNTIF($C$2:C11,C11)-1","v":1},"S.DOW",10,"S.IBM",{"$f":"IFERROR( RTD(\"cqg.rtd\",,\"StudyData\",G11, \"PCB\",\"BaseType=Index,Price=1000,Index=1,Date=12/30/2016\", \"Close\",$C$1,,\"all\",,,,\"T\")/100,\"\")","v":-1.7516827507906875E-2},"",1.7516827507906875E-2,-1.7516827507906875E-2,{"$f":"IF(G11=\"\",\"\",RTD(\"cqg.rtd\",,\"ContractData\",G11,\"LongDescription\",,\"T\"))","v":"International Business Machines"}]
[null,{"$f":"Symbols!B12","v":"S.GS"},{"$f":" IFERROR(RTD(\"cqg.rtd\",,\"StudyData\",B12, \"PCB\",\"BaseType=Index,Price=1000,Index=1,Date=12/30/2016\", \"Close\",$C$1,,\"all\",,,,\"T\")/100,\"\")","v":-6.3796553912236986E-2},{"$f":"RANK($C12,$C$2:C$31)+COUNTIF($C$2:C12,C12)-1","v":24},"S.GS",11,"S.INTC",{"$f":"IFERROR( RTD(\"cqg.rtd\",,\"StudyData\",G12, \"PCB\",\"BaseType=Index,Price=1000,Index=1,Date=12/30/2016\", \"Close\",$C$1,,\"all\",,,,\"T\")/100,\"\")","v":-2.3159960745829235E-2},"",2.3159960745829235E-2,-2.3159960745829235E-2,{"$f":"IF(G12=\"\",\"\",RTD(\"cqg.rtd\",,\"ContractData\",G12,\"LongDescription\",,\"T\"))","v":"Intel Corporation"}]
[null,{"$f":"Symbols!B13","v":"S.HD"},{"$f":" IFERROR(RTD(\"cqg.rtd\",,\"StudyData\",B13, \"PCB\",\"BaseType=Index,Price=1000,Index=1,Date=12/30/2016\", \"Close\",$C$1,,\"all\",,,,\"T\")/100,\"\")","v":-4.3432500701655885E-2},{"$f":"RANK($C13,$C$2:C$31)+COUNTIF($C$2:C13,C13)-1","v":16},"S.HD",12,"S.HON",{"$f":"IFERROR( RTD(\"cqg.rtd\",,\"StudyData\",G13, \"PCB\",\"BaseType=Index,Price=1000,Index=1,Date=12/30/2016\", \"Close\",$C$1,,\"all\",,,,\"T\")/100,\"\")","v":-2.3920265780730941E-2},"",2.3920265780730941E-2,-2.3920265780730941E-2,{"$f":"IF(G13=\"\",\"\",RTD(\"cqg.rtd\",,\"ContractData\",G13,\"LongDescription\",,\"T\"))","v":"Honeywell Intl"}]
[null,{"$f":"Symbols!B14","v":"S.HON"},{"$f":" IFERROR(RTD(\"cqg.rtd\",,\"StudyData\",B14, \"PCB\",\"BaseType=Index,Price=1000,Index=1,Date=12/30/2016\", \"Close\",$C$1,,\"all\",,,,\"T\")/100,\"\")","v":-2.3920265780730941E-2},{"$f":"RANK($C14,$C$2:C$31)+COUNTIF($C$2:C14,C14)-1","v":12},"S.HON",13,"S.MRK",{"$f":"IFERROR( RTD(\"cqg.rtd\",,\"StudyData\",G14, \"PCB\",\"BaseType=Index,Price=1000,Index=1,Date=12/30/2016\", \"Close\",$C$1,,\"all\",,,,\"T\")/100,\"\")","v":-2.8380438606778323E-2},"",2.8380438606778323E-2,-2.8380438606778323E-2,{"$f":"IF(G14=\"\",\"\",RTD(\"cqg.rtd\",,\"ContractData\",G14,\"LongDescription\",,\"T\"))","v":"Merck & Co Inc"}]
[null,{"$f":"Symbols!B15","v":"S.INTC"},{"$f":" IFERROR(RTD(\"cqg.rtd\",,\"StudyData\",B15, \"PCB\",\"BaseType=Index,Price=1000,Index=1,Date=12/30/2016\", \"Close\",$C$1,,\"all\",,,,\"T\")/100,\"\")","v":-2.3159960745829235E-2},{"$f":"RANK($C15,$C$2:C$31)+COUNTIF($C$2:C15,C15)-1","v":11},"S.INTC",14,"S.AXP",{"$f":"IFERROR( RTD(\"cqg.rtd\",,\"StudyData\",G15, \"PCB\",\"BaseType=Index,Price=1000,Index=1,Date=12/30/2016\", \"Close\",$C$1,,\"all\",,,,\"T\")/100,\"\")","v":-3.7405256422876232E-2},"",3.7405256422876232E-2,-3.7405256422876232E-2,{"$f":"IF(G15=\"\",\"\",RTD(\"cqg.rtd\",,\"ContractData\",G15,\"LongDescription\",,\"T\"))","v":"American Express Co"}]
[null,{"$f":"Symbols!B16","v":"S.IBM"},{"$f":" IFERROR(RTD(\"cqg.rtd\",,\"StudyData\",B16, \"PCB\",\"BaseType=Index,Price=1000,Index=1,Date=12/30/2016\", \"Close\",$C$1,,\"all\",,,,\"T\")/100,\"\")","v":-1.7516827507906875E-2},{"$f":"RANK($C16,$C$2:C$31)+COUNTIF($C$2:C16,C16)-1","v":10},"S.IBM",15,"S.AMGN",{"$f":"IFERROR( RTD(\"cqg.rtd\",,\"StudyData\",G16, \"PCB\",\"BaseType=Index,Price=1000,Index=1,Date=12/30/2016\", \"Close\",$C$1,,\"all\",,,,\"T\")/100,\"\")","v":-4.1015316595610238E-2},"",4.1015316595610238E-2,-4.1015316595610238E-2,{"$f":"IF(G16=\"\",\"\",RTD(\"cqg.rtd\",,\"ContractData\",G16,\"LongDescription\",,\"T\"))","v":"Amgen Inc"}]
[null,{"$f":"Symbols!B17","v":"S.JNJ"},{"$f":" IFERROR(RTD(\"cqg.rtd\",,\"StudyData\",B17, \"PCB\",\"BaseType=Index,Price=1000,Index=1,Date=12/30/2016\", \"Close\",$C$1,,\"all\",,,,\"T\")/100,\"\")","v":-5.7884101427547067E-2},{"$f":"RANK($C17,$C$2:C$31)+COUNTIF($C$2:C17,C17)-1","v":20},"S.JNJ",16,"S.HD",{"$f":"IFERROR( RTD(\"cqg.rtd\",,\"StudyData\",G17, \"PCB\",\"BaseType=Index,Price=1000,Index=1,Date=12/30/2016\", \"Close\",$C$1,,\"all\",,,,\"T\")/100,\"\")","v":-4.3432500701655885E-2},"",4.3432500701655885E-2,-4.3432500701655885E-2,{"$f":"IF(G17=\"\",\"\",RTD(\"cqg.rtd\",,\"ContractData\",G17,\"LongDescription\",,\"T\"))","v":"Home Depot, Inc."}]
[null,{"$f":"Symbols!B18","v":"S.JPM"},{"$f":" IFERROR(RTD(\"cqg.rtd\",,\"StudyData\",B18, \"PCB\",\"BaseType=Index,Price=1000,Index=1,Date=12/30/2016\", \"Close\",$C$1,,\"all\",,,,\"T\")/100,\"\")","v":-5.7890008982932395E-2},{"$f":"RANK($C18,$C$2:C$31)+COUNTIF($C$2:C18,C18)-1","v":21},"S.JPM",17,"S.DIS",{"$f":"IFERROR( RTD(\"cqg.rtd\",,\"StudyData\",G18, \"PCB\",\"BaseType=Index,Price=1000,Index=1,Date=12/30/2016\", \"Close\",$C$1,,\"all\",,,,\"T\")/100,\"\")","v":-4.5347690907712172E-2},"",4.5347690907712172E-2,-4.5347690907712172E-2,{"$f":"IF(G18=\"\",\"\",RTD(\"cqg.rtd\",,\"ContractData\",G18,\"LongDescription\",,\"T\"))","v":"Disney (Walt) Company"}]
[null,{"$f":"Symbols!B19","v":"S.MCD"},{"$f":" IFERROR(RTD(\"cqg.rtd\",,\"StudyData\",B19, \"PCB\",\"BaseType=Index,Price=1000,Index=1,Date=12/30/2016\", \"Close\",$C$1,,\"all\",,,,\"T\")/100,\"\")","v":1.1333832896215751E-2},{"$f":"RANK($C19,$C$2:C$31)+COUNTIF($C$2:C19,C19)-1","v":4},"S.MCD",18,"S.TRV",{"$f":"IFERROR( RTD(\"cqg.rtd\",,\"StudyData\",G19, \"PCB\",\"BaseType=Index,Price=1000,Index=1,Date=12/30/2016\", \"Close\",$C$1,,\"all\",,,,\"T\")/100,\"\")","v":-4.912099276111688E-2},"",4.912099276111688E-2,-4.912099276111688E-2,{"$f":"IF(G19=\"\",\"\",RTD(\"cqg.rtd\",,\"ContractData\",G19,\"LongDescription\",,\"T\"))","v":"Travelers Companies, Inc"}]
[null,{"$f":"Symbols!B20","v":"S.MRK"},{"$f":" IFERROR(RTD(\"cqg.rtd\",,\"StudyData\",B20, \"PCB\",\"BaseType=Index,Price=1000,Index=1,Date=12/30/2016\", \"Close\",$C$1,,\"all\",,,,\"T\")/100,\"\")","v":-2.8380438606778323E-2},{"$f":"RANK($C20,$C$2:C$31)+COUNTIF($C$2:C20,C20)-1","v":13},"S.MRK",19,"S.UNH",{"$f":"IFERROR( RTD(\"cqg.rtd\",,\"StudyData\",G20, \"PCB\",\"BaseType=Index,Price=1000,Index=1,Date=12/30/2016\", \"Close\",$C$1,,\"all\",,,,\"T\")/100,\"\")","v":-5.2567589185730304E-2},"",5.2567589185730304E-2,-5.2567589185730304E-2,{"$f":"IF(G20=\"\",\"\",RTD(\"cqg.rtd\",,\"ContractData\",G20,\"LongDescription\",,\"T\"))","v":"United Health Group Inc"}]
[null,{"$f":"Symbols!B21","v":"S.MSFT"},{"$f":" IFERROR(RTD(\"cqg.rtd\",,\"StudyData\",B21, \"PCB\",\"BaseType=Index,Price=1000,Index=1,Date=12/30/2016\", \"Close\",$C$1,,\"all\",,,,\"T\")/100,\"\")","v":-9.5197978096040428E-2},{"$f":"RANK($C21,$C$2:C$31)+COUNTIF($C$2:C21,C21)-1","v":28},"S.MSFT",20,"S.JNJ",{"$f":"IFERROR( RTD(\"cqg.rtd\",,\"StudyData\",G21, \"PCB\",\"BaseType=Index,Price=1000,Index=1,Date=12/30/2016\", \"Close\",$C$1,,\"all\",,,,\"T\")/100,\"\")","v":-5.7884101427547067E-2},"",5.7884101427547067E-2,-5.7884101427547067E-2,{"$f":"IF(G21=\"\",\"\",RTD(\"cqg.rtd\",,\"ContractData\",G21,\"LongDescription\",,\"T\"))","v":"Johnson & Johnson"}]
[null,{"$f":"Symbols!B22","v":"S.NKE"},{"$f":" IFERROR(RTD(\"cqg.rtd\",,\"StudyData\",B22, \"PCB\",\"BaseType=Index,Price=1000,Index=1,Date=12/30/2016\", \"Close\",$C$1,,\"all\",,,,\"T\")/100,\"\")","v":1.8232192331754458E-2},{"$f":"RANK($C22,$C$2:C$31)+COUNTIF($C$2:C22,C22)-1","v":3},"S.NKE",21,"S.JPM",{"$f":"IFERROR( RTD(\"cqg.rtd\",,\"StudyData\",G22, \"PCB\",\"BaseType=Index,Price=1000,Index=1,Date=12/30/2016\", \"Close\",$C$1,,\"all\",,,,\"T\")/100,\"\")","v":-5.7890008982932395E-2},"",5.7890008982932395E-2,-5.7890008982932395E-2,{"$f":"IF(G22=\"\",\"\",RTD(\"cqg.rtd\",,\"ContractData\",G22,\"LongDescription\",,\"T\"))","v":"JPMorgan Chase & Co."}]
[null,{"$f":"Symbols!B23","v":"S.PG"},{"$f":" IFERROR(RTD(\"cqg.rtd\",,\"StudyData\",B23, \"PCB\",\"BaseType=Index,Price=1000,Index=1,Date=12/30/2016\", \"Close\",$C$1,,\"all\",,,,\"T\")/100,\"\")","v":2.024145160124348E-3},{"$f":"RANK($C23,$C$2:C$31)+COUNTIF($C$2:C23,C23)-1","v":7},"S.PG",22,"S.WBA",{"$f":"IFERROR( RTD(\"cqg.rtd\",,\"StudyData\",G23, \"PCB\",\"BaseType=Index,Price=1000,Index=1,Date=12/30/2016\", \"Close\",$C$1,,\"all\",,,,\"T\")/100,\"\")","v":-5.8653340347185792E-2},"",5.8653340347185792E-2,-5.8653340347185792E-2,{"$f":"IF(G23=\"\",\"\",RTD(\"cqg.rtd\",,\"ContractData\",G23,\"LongDescription\",,\"T\"))","v":"Walgreens Boots Alliance, Inc."}]
[null,{"$f":"Symbols!B24","v":"S.CRM"},{"$f":" IFERROR(RTD(\"cqg.rtd\",,\"StudyData\",B24, \"PCB\",\"BaseType=Index,Price=1000,Index=1,Date=12/30/2016\", \"Close\",$C$1,,\"all\",,,,\"T\")/100,\"\")","v":-0.10416284613973952},{"$f":"RANK($C24,$C$2:C$31)+COUNTIF($C$2:C24,C24)-1","v":29},"S.CRM",23,"S.V",{"$f":"IFERROR( RTD(\"cqg.rtd\",,\"StudyData\",G24, \"PCB\",\"BaseType=Index,Price=1000,Index=1,Date=12/30/2016\", \"Close\",$C$1,,\"all\",,,,\"T\")/100,\"\")","v":-6.3163356762111489E-2},"",6.3163356762111489E-2,-6.3163356762111489E-2,{"$f":"IF(G24=\"\",\"\",RTD(\"cqg.rtd\",,\"ContractData\",G24,\"LongDescription\",,\"T\"))","v":"Visa Inc."}]
[null,{"$f":"Symbols!B25","v":"S.TRV"},{"$f":" IFERROR(RTD(\"cqg.rtd\",,\"StudyData\",B25, \"PCB\",\"BaseType=Index,Price=1000,Index=1,Date=12/30/2016\", \"Close\",$C$1,,\"all\",,,,\"T\")/100,\"\")","v":-4.912099276111688E-2},{"$f":"RANK($C25,$C$2:C$31)+COUNTIF($C$2:C25,C25)-1","v":18},"S.TRV",24,"S.GS",{"$f":"IFERROR( RTD(\"cqg.rtd\",,\"StudyData\",G25, \"PCB\",\"BaseType=Index,Price=1000,Index=1,Date=12/30/2016\", \"Close\",$C$1,,\"all\",,,,\"T\")/100,\"\")","v":-6.3796553912236986E-2},"",6.3796553912236986E-2,-6.3796553912236986E-2,{"$f":"IF(G25=\"\",\"\",RTD(\"cqg.rtd\",,\"ContractData\",G25,\"LongDescription\",,\"T\"))","v":"Goldman Sachs Group"}]
[null,{"$f":"Symbols!B26","v":"S.UNH"},{"$f":" IFERROR(RTD(\"cqg.rtd\",,\"StudyData\",B26, \"PCB\",\"BaseType=Index,Price=1000,Index=1,Date=12/30/2016\", \"Close\",$C$1,,\"all\",,,,\"T\")/100,\"\")","v":-5.2567589185730304E-2},{"$f":"RANK($C26,$C$2:C$31)+COUNTIF($C$2:C26,C26)-1","v":19},"S.UNH",25,"S.CSCO",{"$f":"IFERROR( RTD(\"cqg.rtd\",,\"StudyData\",G26, \"PCB\",\"BaseType=Index,Price=1000,Index=1,Date=12/30/2016\", \"Close\",$C$1,,\"all\",,,,\"T\")/100,\"\")","v":-6.8214116532448965E-2},"",6.8214116532448965E-2,-6.8214116532448965E-2,{"$f":"IF(G26=\"\",\"\",RTD(\"cqg.rtd\",,\"ContractData\",G26,\"LongDescription\",,\"T\"))","v":"Cisco Systems Inc"}]
[null,{"$f":"Symbols!B27","v":"S.VZ"},{"$f":" IFERROR(RTD(\"cqg.rtd\",,\"StudyData\",B27, \"PCB\",\"BaseType=Index,Price=1000,Index=1,Date=12/30/2016\", \"Close\",$C$1,,\"all\",,,,\"T\")/100,\"\")","v":9.9544457567065335E-3},{"$f":"RANK($C27,$C$2:C$31)+COUNTIF($C$2:C27,C27)-1","v":5},"S.VZ",26,"S.CVX",{"$f":"IFERROR( RTD(\"cqg.rtd\",,\"StudyData\",G27, \"PCB\",\"BaseType=Index,Price=1000,Index=1,Date=12/30/2016\", \"Close\",$C$1,,\"all\",,,,\"T\")/100,\"\")","v":-9.0789944000953221E-2},"",9.0789944000953221E-2,-9.0789944000953221E-2,{"$f":"IF(G27=\"\",\"\",RTD(\"cqg.rtd\",,\"ContractData\",G27,\"LongDescription\",,\"T\"))","v":"Chevron Corp"}]
[null,{"$f":"Symbols!B28","v":"S.V"},{"$f":" IFERROR(RTD(\"cqg.rtd\",,\"StudyData\",B28, \"PCB\",\"BaseType=Index,Price=1000,Index=1,Date=12/30/2016\", \"Close\",$C$1,,\"all\",,,,\"T\")/100,\"\")","v":-6.3163356762111489E-2},{"$f":"RANK($C28,$C$2:C$31)+COUNTIF($C$2:C28,C28)-1","v":23},"S.V",27,"S.BA",{"$f":"IFERROR( RTD(\"cqg.rtd\",,\"StudyData\",G28, \"PCB\",\"BaseType=Index,Price=1000,Index=1,Date=12/30/2016\", \"Close\",$C$1,,\"all\",,,,\"T\")/100,\"\")","v":-9.0850890466767462E-2},"",9.0850890466767462E-2,-9.0850890466767462E-2,{"$f":"IF(G28=\"\",\"\",RTD(\"cqg.rtd\",,\"ContractData\",G28,\"LongDescription\",,\"T\"))","v":"Boeing Company"}]
[null,{"$f":"Symbols!B29","v":"S.WBA"},{"$f":" IFERROR(RTD(\"cqg.rtd\",,\"StudyData\",B29, \"PCB\",\"BaseType=Index,Price=1000,Index=1,Date=12/30/2016\", \"Close\",$C$1,,\"all\",,,,\"T\")/100,\"\")","v":-5.8653340347185792E-2},{"$f":"RANK($C29,$C$2:C$31)+COUNTIF($C$2:C29,C29)-1","v":22},"S.WBA",28,"S.MSFT",{"$f":"IFERROR( RTD(\"cqg.rtd\",,\"StudyData\",G29, \"PCB\",\"BaseType=Index,Price=1000,Index=1,Date=12/30/2016\", \"Close\",$C$1,,\"all\",,,,\"T\")/100,\"\")","v":-9.5197978096040428E-2},"",9.5197978096040428E-2,-9.5197978096040428E-2,{"$f":"IF(G29=\"\",\"\",RTD(\"cqg.rtd\",,\"ContractData\",G29,\"LongDescription\",,\"T\"))","v":"Microsoft Corporation"}]
[null,{"$f":"Symbols!B30","v":"S.WMT"},{"$f":" IFERROR(RTD(\"cqg.rtd\",,\"StudyData\",B30, \"PCB\",\"BaseType=Index,Price=1000,Index=1,Date=12/30/2016\", \"Close\",$C$1,,\"all\",,,,\"T\")/100,\"\")","v":-1.0298883687432325E-2},{"$f":"RANK($C30,$C$2:C$31)+COUNTIF($C$2:C30,C30)-1","v":9},"S.WMT",29,"S.CRM",{"$f":"IFERROR( RTD(\"cqg.rtd\",,\"StudyData\",G30, \"PCB\",\"BaseType=Index,Price=1000,Index=1,Date=12/30/2016\", \"Close\",$C$1,,\"all\",,,,\"T\")/100,\"\")","v":-0.10416284613973952},"",0.10416284613973952,-0.10416284613973952,{"$f":"IF(G30=\"\",\"\",RTD(\"cqg.rtd\",,\"ContractData\",G30,\"LongDescription\",,\"T\"))","v":"Salesforce.com Inc"}]
[null,{"$f":"Symbols!B31","v":"S.DIS"},{"$f":" IFERROR(RTD(\"cqg.rtd\",,\"StudyData\",B31, \"PCB\",\"BaseType=Index,Price=1000,Index=1,Date=12/30/2016\", \"Close\",$C$1,,\"all\",,,,\"T\")/100,\"\")","v":-4.5347690907712172E-2},{"$f":"RANK($C31,$C$2:C$31)+COUNTIF($C$2:C31,C31)-1","v":17},"S.DIS",30,"S.AAPL",{"$f":"IFERROR( RTD(\"cqg.rtd\",,\"StudyData\",G31, \"PCB\",\"BaseType=Index,Price=1000,Index=1,Date=12/30/2016\", \"Close\",$C$1,,\"all\",,,,\"T\")/100,\"\")","v":-0.14127402355858643},"",0.14127402355858643,-0.14127402355858643,{"$f":"IF(G31=\"\",\"\",RTD(\"cqg.rtd\",,\"ContractData\",G31,\"LongDescription\",,\"T\"))","v":"Apple Inc"}]

{"sheet":"Symbols (2)","index":6,"n_rows":31,"n_cols":7,"rows_kept":31,"cut":false,"hidden":false,"merged":[[5,3,5,6],[6,3,6,6],[3,3,3,7]]}
[null,"Symbols","Description","Chart 1","Chart 2","Chart 3","Chart 4"]
[null,"F.DXE?",{"$f":"RTD(\"cqg.rtd\", ,\"ContractData\",B2, \"LongDescription\",, \"T\")","v":"Dollar Index (ICE), Dec 20"},15,"D","W","M"]
[null,"F.EU6?",{"$f":"RTD(\"cqg.rtd\", ,\"ContractData\",B3, \"LongDescription\",, \"T\")","v":"Euro FX (Globex), Dec 20"},{"$f":"IF(ISNUMBER(D2),D2,IF(D2=\"D\",\"Daily\",IF(D2=\"W\",\"Weekly\",IF(D2=\"M\",\"Monthly\",IF(D2=\"Q\",\"Quarterly\",IF(D2=\"S\",\"Semi-Annual\",IF(D2=\"A\",\"Annual\")))))))","v":15},{"$f":"IF(ISNUMBER(E2),E2,IF(E2=\"D\",\"Daily\",IF(E2=\"W\",\"Weekly\",IF(E2=\"M\",\"Monthly\",IF(E2=\"Q\",\"Quarterly\",IF(E2=\"S\",\"Semi-Annual\",IF(E2=\"A\",\"Annual\")))))))","v":"Daily"},{"$f":"IF(ISNUMBER(F2),F2,IF(F2=\"D\",\"Daily\",IF(F2=\"W\",\"Weekly\",IF(F2=\"M\",\"Monthly\",IF(F2=\"Q\",\"Quarterly\",IF(F2=\"S\",\"Semi-Annual\",IF(F2=\"A\",\"Annual\")))))))","v":"Weekly"},{"$f":"IF(ISNUMBER(G2),G2,IF(G2=\"D\",\"Daily\",IF(G2=\"W\",\"Weekly\",IF(G2=\"M\",\"Monthly\",IF(G2=\"Q\",\"Quarterly\",IF(G2=\"S\",\"Semi-Annual\",IF(G2=\"A\",\"Annual\")))))))","v":"Monthly"}]
[null,"F.JY6?",{"$f":"RTD(\"cqg.rtd\", ,\"ContractData\",B4, \"LongDescription\",, \"T\")","v":"Japanese Yen (Globex), Dec 20"},"Use All Capitals for Symbols and Time Frame"]
[null,"F.BP6?",{"$f":"RTD(\"cqg.rtd\", ,\"ContractData\",B5, \"LongDescription\",, \"T\")","v":"British Pound (Globex), Dec 20"}]
[null,"F.CA6?",{"$f":"RTD(\"cqg.rtd\", ,\"ContractData\",B6, \"LongDescription\",, \"T\")","v":"Canadian Dollar (Globex), Dec 20"},"Title"]
[null,"F.SF6?",{"$f":"RTD(\"cqg.rtd\", ,\"ContractData\",B7, \"LongDescription\",, \"T\")","v":"Swiss Franc (Globex), Dec 20"},"Futures Markets"]
[null,"F.DA6?",{"$f":"RTD(\"cqg.rtd\", ,\"ContractData\",B8, \"LongDescription\",, \"T\")","v":"Australian Dollar (Globex), Dec 20"}]
[null,"F.NE6?",{"$f":"RTD(\"cqg.rtd\", ,\"ContractData\",B9, \"LongDescription\",, \"T\")","v":"New Zealand Dollar (Globex), Dec 20"}]
[null,"F.MX6?",{"$f":"RTD(\"cqg.rtd\", ,\"ContractData\",B10, \"LongDescription\",, \"T\")","v":"Mexican Peso (Globex), Dec 20"}]
[null,"F.GCE?",{"$f":"RTD(\"cqg.rtd\", ,\"ContractData\",B11, \"LongDescription\",, \"T\")","v":"Gold (Globex), Dec 20"}]
[null,"F.SIE?",{"$f":"RTD(\"cqg.rtd\", ,\"ContractData\",B12, \"LongDescription\",, \"T\")","v":"Silver (Globex), Dec 20"}]
[null,"F.PLE?",{"$f":"RTD(\"cqg.rtd\", ,\"ContractData\",B13, \"LongDescription\",, \"T\")","v":"Platinum (Globex), Oct 20"}]
[null,"F.TYA?",{"$f":"RTD(\"cqg.rtd\", ,\"ContractData\",B14, \"LongDescription\",, \"T\")","v":"10yr US Treasury Notes (Globex), Dec 20"}]
[null,"F.CLE?",{"$f":"RTD(\"cqg.rtd\", ,\"ContractData\",B15, \"LongDescription\",, \"T\")","v":"Crude Light (Globex), Nov 20"}]
[null,"F.HOE?",{"$f":"RTD(\"cqg.rtd\", ,\"ContractData\",B16, \"LongDescription\",, \"T\")","v":"NY Harbor ULSD, Nov 20"}]
[null,"F.RBE?",{"$f":"RTD(\"cqg.rtd\", ,\"ContractData\",B17, \"LongDescription\",, \"T\")","v":"RBOB Gasoline (Globex), Nov 20"}]
[null,"F.ZSE",{"$f":"RTD(\"cqg.rtd\", ,\"ContractData\",B18, \"LongDescription\",, \"T\")","v":"Soybeans (Globex), Nov 20"}]
[null,"F.ZWA",{"$f":"RTD(\"cqg.rtd\", ,\"ContractData\",B19, \"LongDescription\",, \"T\")","v":"Wheat (Globex), Dec 20"}]
[null,"F.ZCE",{"$f":"RTD(\"cqg.rtd\", ,\"ContractData\",B20, \"LongDescription\",, \"T\")","v":"Corn (Globex), Dec 20"}]
[null,"F.GLE",{"$f":"RTD(\"cqg.rtd\", ,\"ContractData\",B21, \"LongDescription\",, \"T\")","v":"Live Cattle (Globex), Dec 20"}]
[null,"F.HE",{"$f":"RTD(\"cqg.rtd\", ,\"ContractData\",B22, \"LongDescription\",, \"T\")","v":"Lean Hogs (Globex), Dec 20"}]
[null,"F.YM?",{"$f":"RTD(\"cqg.rtd\", ,\"ContractData\",B23, \"LongDescription\",, \"T\")","v":"E-mini Dow ($5), Dec 20"}]
[null,"F.EP?",{"$f":"RTD(\"cqg.rtd\", ,\"ContractData\",B24, \"LongDescription\",, \"T\")","v":"E-Mini S&P 500, Dec 20"}]
[null,"F.ENQ?",{"$f":"RTD(\"cqg.rtd\", ,\"ContractData\",B25, \"LongDescription\",, \"T\")","v":"E-mini NASDAQ-100, Dec 20"}]
[null,"F.RTY?",{"$f":"RTD(\"cqg.rtd\", ,\"ContractData\",B26, \"LongDescription\",, \"T\")","v":"E-mini Russell 2000, Dec 20"}]
[null,"F.DD?",{"$f":"RTD(\"cqg.rtd\", ,\"ContractData\",B27, \"LongDescription\",, \"T\")","v":"DAX Index, Dec 20"}]
[null,"F.DSX?",{"$f":"RTD(\"cqg.rtd\", ,\"ContractData\",B28, \"LongDescription\",, \"T\")","v":"Euro STOXX 50, Dec 20"}]
[null,"F.QFA?",{"$f":"RTD(\"cqg.rtd\", ,\"ContractData\",B29, \"LongDescription\",, \"T\")","v":"FTSE 100 - Stnd Index, Dec 20"}]
[null,"F.PIL?",{"$f":"RTD(\"cqg.rtd\", ,\"ContractData\",B30, \"LongDescription\",, \"T\")","v":"CAC40, Oct 20"}]
[null,"F.NKD?",{"$f":"RTD(\"cqg.rtd\", ,\"ContractData\",B31, \"LongDescription\",, \"T\")","v":"Nikkei 225 (Globex), Dec 20"}]

{"sheet":"15_Min (2)","index":7,"n_rows":31,"n_cols":12,"rows_kept":31,"cut":false,"hidden":true,"merged":[]}
[null,null,{"$f":"'Symbols (2)'!D2","v":15}]
[null,{"$f":"'Symbols (2)'!B2","v":"F.DXE?"},{"$f":"IFERROR( RTD(\"cqg.rtd\",,\"StudyData\",B2, \"PCB\",\"BaseType=Index,Price=1000,Index=1,Date=12/30/2016\", \"Close\",$C$1,,\"all\",,,,\"T\")/100,\"\")","v":1.0660412557965387E-3},{"$f":"IFERROR(RANK($C2,$C$2:C$31)+COUNTIF($C$2:C2,C2)-1,\"\")","v":4},{"$f":"B2","v":"F.DXE?"},1,{"$f":"IFERROR(VLOOKUP($F2,$D$2:$E$31,2,FALSE),\"\")","v":"F.RBE?"},{"$f":"IFERROR( RTD(\"cqg.rtd\",,\"StudyData\",G2, \"PCB\",\"BaseType=Index,Price=1000,Index=1,Date=12/30/2016\", \"Close\",$C$1,,\"all\",,,,\"T\")/100,\"\")","v":3.7388053212763844E-3},{"$f":"IF(H2<0,\"\",H2)","v":3.7388053212763844E-3},{"$f":"IF(H2>=0,\"\",-H2)","v":""},{"$f":"IF(J2=\"\",\"\",H2)","v":""},{"$f":"IF(G2=\"\",\"\",RTD(\"cqg.rtd\",,\"ContractData\",G2,\"LongDescription\",,\"T\"))","v":"RBOB Gasoline (Globex), Nov 20"}]
[null,{"$f":"'Symbols (2)'!B3","v":"F.EU6?"},{"$f":"IFERROR( RTD(\"cqg.rtd\",,\"StudyData\",B3, \"PCB\",\"BaseType=Index,Price=1000,Index=1,Date=12/30/2016\", \"Close\",$C$1,,\"all\",,,,\"T\")/100,\"\")","v":-1.0633772862611429E-3},{"$f":"IFERROR(RANK($C3,$C$2:C$31)+COUNTIF($C$2:C3,C3)-1,\"\")","v":18},{"$f":"B3","v":"F.EU6?"},{"$f":"F2+1","v":2},{"$f":"IFERROR(VLOOKUP($F3,$D$2:$E$31,2,FALSE),\"\")","v":"F.HE"},{"$f":"IFERROR( RTD(\"cqg.rtd\",,\"StudyData\",G3, \"PCB\",\"BaseType=Index,Price=1000,Index=1,Date=12/30/2016\", \"Close\",$C$1,,\"all\",,,,\"T\")/100,\"\")","v":2.7269185820022928E-3},{"$f":"IF(H3<0,\"\",H3)","v":2.7269185820022928E-3},{"$f":"IF(H3>=0,\"\",-H3)","v":""},{"$f":"IF(J3=\"\",\"\",H3)","v":""},{"$f":"IF(G3=\"\",\"\",RTD(\"cqg.rtd\",,\"ContractData\",G3,\"LongDescription\",,\"T\"))","v":"Lean Hogs (Globex), Dec 20"}]
[null,{"$f":"'Symbols (2)'!B4","v":"F.JY6?"},{"$f":"IFERROR( RTD(\"cqg.rtd\",,\"StudyData\",B4, \"PCB\",\"BaseType=Index,Price=1000,Index=1,Date=12/30/2016\", \"Close\",$C$1,,\"all\",,,,\"T\")/100,\"\")","v":-1.5179272441769823E-3},{"$f":"IFERROR(RANK($C4,$C$2:C$31)+COUNTIF($C$2:C4,C4)-1,\"\")","v":23},"F.JY6?",{"$f":"F3+1","v":3},"F.CLE?",{"$f":"IFERROR( RTD(\"cqg.rtd\",,\"StudyData\",G4, \"PCB\",\"BaseType=Index,Price=1000,Index=1,Date=12/30/2016\", \"Close\",$C$1,,\"all\",,,,\"T\")/100,\"\")","v":1.2534469791927088E-3},1.2534469791927088E-3,"","",{"$f":"IF(G4=\"\",\"\",RTD(\"cqg.rtd\",,\"ContractData\",G4,\"LongDescription\",,\"T\"))","v":"Crude Light (Globex), Nov 20"}]
[null,{"$f":"'Symbols (2)'!B5","v":"F.BP6?"},{"$f":"IFERROR( RTD(\"cqg.rtd\",,\"StudyData\",B5, \"PCB\",\"BaseType=Index,Price=1000,Index=1,Date=12/30/2016\", \"Close\",$C$1,,\"all\",,,,\"T\")/100,\"\")","v":-1.6440930086901984E-3},{"$f":"IFERROR(RANK($C5,$C$2:C$31)+COUNTIF($C$2:C5,C5)-1,\"\")","v":25},"F.BP6?",4,"F.DXE?",{"$f":"IFERROR( RTD(\"cqg.rtd\",,\"StudyData\",G5, \"PCB\",\"BaseType=Index,Price=1000,Index=1,Date=12/30/2016\", \"Close\",$C$1,,\"all\",,,,\"T\")/100,\"\")","v":1.0660412557965387E-3},1.0660412557965387E-3,"","",{"$f":"IF(G5=\"\",\"\",RTD(\"cqg.rtd\",,\"ContractData\",G5,\"LongDescription\",,\"T\"))","v":"Dollar Index (ICE), Dec 20"}]
[null,{"$f":"'Symbols (2)'!B6","v":"F.CA6?"},{"$f":"IFERROR( RTD(\"cqg.rtd\",,\"StudyData\",B6, \"PCB\",\"BaseType=Index,Price=1000,Index=1,Date=12/30/2016\", \"Close\",$C$1,,\"all\",,,,\"T\")/100,\"\")","v":-9.9700897308079538E-4},{"$f":"IFERROR(RANK($C6,$C$2:C$31)+COUNTIF($C$2:C6,C6)-1,\"\")","v":16},"F.CA6?",5,"F.GLE",{"$f":"IFERROR( RTD(\"cqg.rtd\",,\"StudyData\",G6, \"PCB\",\"BaseType=Index,Price=1000,Index=1,Date=12/30/2016\", \"Close\",$C$1,,\"all\",,,,\"T\")/100,\"\")","v":6.7965564114171842E-4},6.7965564114171842E-4,"","",{"$f":"IF(G6=\"\",\"\",RTD(\"cqg.rtd\",,\"ContractData\",G6,\"LongDescription\",,\"T\"))","v":"Live Cattle (Globex), Dec 20"}]
[null,{"$f":"'Symbols (2)'!B7","v":"F.SF6?"},{"$f":"IFERROR( RTD(\"cqg.rtd\",,\"StudyData\",B7, \"PCB\",\"BaseType=Index,Price=1000,Index=1,Date=12/30/2016\", \"Close\",$C$1,,\"all\",,,,\"T\")/100,\"\")","v":-8.2387403881353056E-4},{"$f":"IFERROR(RANK($C7,$C$2:C$31)+COUNTIF($C$2:C7,C7)-1,\"\")","v":14},"F.SF6?",6,"F.QFA?",{"$f":"IFERROR( RTD(\"cqg.rtd\",,\"StudyData\",G7, \"PCB\",\"BaseType=Index,Price=1000,Index=1,Date=12/30/2016\", \"Close\",$C$1,,\"all\",,,,\"T\")/100,\"\")","v":2.5735609505018445E-4},2.5735609505018445E-4,"","",{"$f":"IF(G7=\"\",\"\",RTD(\"cqg.rtd\",,\"ContractData\",G7,\"LongDescription\",,\"T\"))","v":"FTSE 100 - Stnd Index, Dec 20"}]
[null,{"$f":"'Symbols (2)'!B8","v":"F.DA6?"},{"$f":"IFERROR( RTD(\"cqg.rtd\",,\"StudyData\",B8, \"PCB\",\"BaseType=Index,Price=1000,Index=1,Date=12/30/2016\", \"Close\",$C$1,,\"all\",,,,\"T\")/100,\"\")","v":-1.8033014287695489E-3},{"$f":"IFERROR(RANK($C8,$C$2:C$31)+COUNTIF($C$2:C8,C8)-1,\"\")","v":27},"F.DA6?",7,"F.PLE?",{"$f":"IFERROR( RTD(\"cqg.rtd\",,\"StudyData\",G8, \"PCB\",\"BaseType=Index,Price=1000,Index=1,Date=12/30/2016\", \"Close\",$C$1,,\"all\",,,,\"T\")/100,\"\")","v":1.1516756881264854E-4},1.1516756881264854E-4,"","",{"$f":"IF(G8=\"\",\"\",RTD(\"cqg.rtd\",,\"ContractData\",G8,\"LongDescription\",,\"T\"))","v":"Platinum (Globex), Oct 20"}]
[null,{"$f":"'Symbols (2)'!B9","v":"F.NE6?"},{"$f":"IFERROR( RTD(\"cqg.rtd\",,\"StudyData\",B9, \"PCB\",\"BaseType=Index,Price=1000,Index=1,Date=12/30/2016\", \"Close\",$C$1,,\"all\",,,,\"T\")/100,\"\")","v":-1.5026296018031569E-3},{"$f":"IFERROR(RANK($C9,$C$2:C$31)+COUNTIF($C$2:C9,C9)-1,\"\")","v":22},"F.NE6?",8,"F.HOE?",{"$f":"IFERROR( RTD(\"cqg.rtd\",,\"StudyData\",G9, \"PCB\",\"BaseType=Index,Price=1000,Index=1,Date=12/30/2016\", \"Close\",$C$1,,\"all\",,,,\"T\")/100,\"\")","v":0},0,"","",{"$f":"IF(G9=\"\",\"\",RTD(\"cqg.rtd\",,\"ContractData\",G9,\"LongDescription\",,\"T\"))","v":"NY Harbor ULSD, Nov 20"}]
[null,{"$f":"'Symbols (2)'!B10","v":"F.MX6?"},{"$f":"IFERROR( RTD(\"cqg.rtd\",,\"StudyData\",B10, \"PCB\",\"BaseType=Index,Price=1000,Index=1,Date=12/30/2016\", \"Close\",$C$1,,\"all\",,,,\"T\")/100,\"\")","v":-1.9459459459459415E-3},{"$f":"IFERROR(RANK($C10,$C$2:C$31)+COUNTIF($C$2:C10,C10)-1,\"\")","v":28},"F.MX6?",9,"F.TYA?",{"$f":"IFERROR( RTD(\"cqg.rtd\",,\"StudyData\",G10, \"PCB\",\"BaseType=Index,Price=1000,Index=1,Date=12/30/2016\", \"Close\",$C$1,,\"all\",,,,\"T\")/100,\"\")","v":-1.1195700850873266E-4},"",1.1195700850873266E-4,-1.1195700850873266E-4,{"$f":"IF(G10=\"\",\"\",RTD(\"cqg.rtd\",,\"ContractData\",G10,\"LongDescription\",,\"T\"))","v":"10yr US Treasury Notes (Globex), Dec 20"}]
[null,{"$f":"'Symbols (2)'!B11","v":"F.GCE?"},{"$f":"IFERROR( RTD(\"cqg.rtd\",,\"StudyData\",B11, \"PCB\",\"BaseType=Index,Price=1000,Index=1,Date=12/30/2016\", \"Close\",$C$1,,\"all\",,,,\"T\")/100,\"\")","v":-1.462064644143885E-3},{"$f":"IFERROR(RANK($C11,$C$2:C$31)+COUNTIF($C$2:C11,C11)-1,\"\")","v":21},"F.GCE?",10,"F.PIL?",{"$f":"IFERROR( RTD(\"cqg.rtd\",,\"StudyData\",G11, \"PCB\",\"BaseType=Index,Price=1000,Index=1,Date=12/30/2016\", \"Close\",$C$1,,\"all\",,,,\"T\")/100,\"\")","v":-3.1207739519400812E-4},"",3.1207739519400812E-4,-3.1207739519400812E-4,{"$f":"IF(G11=\"\",\"\",RTD(\"cqg.rtd\",,\"ContractData\",G11,\"LongDescription\",,\"T\"))","v":"CAC40, Oct 20"}]
[null,{"$f":"'Symbols (2)'!B12","v":"F.SIE?"},{"$f":"IFERROR( RTD(\"cqg.rtd\",,\"StudyData\",B12, \"PCB\",\"BaseType=Index,Price=1000,Index=1,Date=12/30/2016\", \"Close\",$C$1,,\"all\",,,,\"T\")/100,\"\")","v":-1.628332994097258E-3},{"$f":"IFERROR(RANK($C12,$C$2:C$31)+COUNTIF($C$2:C12,C12)-1,\"\")","v":24},"F.SIE?",11,"F.NKD?",{"$f":"IFERROR( RTD(\"cqg.rtd\",,\"StudyData\",G12, \"PCB\",\"BaseType=Index,Price=1000,Index=1,Date=12/30/2016\", \"Close\",$C$1,,\"all\",,,,\"T\")/100,\"\")","v":-4.3840420868040335E-4},"",4.3840420868040335E-4,-4.3840420868040335E-4,{"$f":"IF(G12=\"\",\"\",RTD(\"cqg.rtd\",,\"ContractData\",G12,\"LongDescription\",,\"T\"))","v":"Nikkei 225 (Globex), Dec 20"}]
[null,{"$f":"'Symbols (2)'!B13","v":"F.PLE?"},{"$f":"IFERROR( RTD(\"cqg.rtd\",,\"StudyData\",B13, \"PCB\",\"BaseType=Index,Price=1000,Index=1,Date=12/30/2016\", \"Close\",$C$1,,\"all\",,,,\"T\")/100,\"\")","v":1.1516756881264854E-4},{"$f":"IFERROR(RANK($C13,$C$2:C$31)+COUNTIF($C$2:C13,C13)-1,\"\")","v":7},"F.PLE?",12,"F.DD?",{"$f":"IFERROR( RTD(\"cqg.rtd\",,\"StudyData\",G13, \"PCB\",\"BaseType=Index,Price=1000,Index=1,Date=12/30/2016\", \"Close\",$C$1,,\"all\",,,,\"T\")/100,\"\")","v":-5.5285708644315452E-4},"",5.5285708644315452E-4,-5.5285708644315452E-4,{"$f":"IF(G13=\"\",\"\",RTD(\"cqg.rtd\",,\"ContractData\",G13,\"LongDescription\",,\"T\"))","v":"DAX Index, Dec 20"}]
[null,{"$f":"'Symbols (2)'!B14","v":"F.TYA?"},{"$f":"IFERROR( RTD(\"cqg.rtd\",,\"StudyData\",B14, \"PCB\",\"BaseType=Index,Price=1000,Index=1,Date=12/30/2016\", \"Close\",$C$1,,\"all\",,,,\"T\")/100,\"\")","v":-1.1195700850873266E-4},{"$f":"IFERROR(RANK($C14,$C$2:C$31)+COUNTIF($C$2:C14,C14)-1,\"\")","v":9},"F.TYA?",13,"F.DSX?",{"$f":"IFERROR( RTD(\"cqg.rtd\",,\"StudyData\",G14, \"PCB\",\"BaseType=Index,Price=1000,Index=1,Date=12/30/2016\", \"Close\",$C$1,,\"all\",,,,\"T\")/100,\"\")","v":-6.2932662051604776E-4},"",6.2932662051604776E-4,-6.2932662051604776E-4,{"$f":"IF(G14=\"\",\"\",RTD(\"cqg.rtd\",,\"ContractData\",G14,\"LongDescription\",,\"T\"))","v":"Euro STOXX 50, Dec 20"}]
[null,{"$f":"'Symbols (2)'!B15","v":"F.CLE?"},{"$f":"IFERROR( RTD(\"cqg.rtd\",,\"StudyData\",B15, \"PCB\",\"BaseType=Index,Price=1000,Index=1,Date=12/30/2016\", \"Close\",$C$1,,\"all\",,,,\"T\")/100,\"\")","v":1.2534469791927088E-3},{"$f":"IFERROR(RANK($C15,$C$2:C$31)+COUNTIF($C$2:C15,C15)-1,\"\")","v":3},"F.CLE?",14,"F.SF6?",{"$f":"IFERROR( RTD(\"cqg.rtd\",,\"StudyData\",G15, \"PCB\",\"BaseType=Index,Price=1000,Index=1,Date=12/30/2016\", \"Close\",$C$1,,\"all\",,,,\"T\")/100,\"\")","v":-8.2387403881353056E-4},"",8.2387403881353056E-4,-8.2387403881353056E-4,{"$f":"IF(G15=\"\",\"\",RTD(\"cqg.rtd\",,\"ContractData\",G15,\"LongDescription\",,\"T\"))","v":"Swiss Franc (Globex), Dec 20"}]
[null,{"$f":"'Symbols (2)'!B16","v":"F.HOE?"},{"$f":"IFERROR( RTD(\"cqg.rtd\",,\"StudyData\",B16, \"PCB\",\"BaseType=Index,Price=1000,Index=1,Date=12/30/2016\", \"Close\",$C$1,,\"all\",,,,\"T\")/100,\"\")","v":0},{"$f":"IFERROR(RANK($C16,$C$2:C$31)+COUNTIF($C$2:C16,C16)-1,\"\")","v":8},"F.HOE?",15,"F.ZSE",{"$f":"IFERROR( RTD(\"cqg.rtd\",,\"StudyData\",G16, \"PCB\",\"BaseType=Index,Price=1000,Index=1,Date=12/30/2016\", \"Close\",$C$1,,\"all\",,,,\"T\")/100,\"\")","v":-9.7252613663992228E-4},"",9.7252613663992228E-4,-9.7252613663992228E-4,{"$f":"IF(G16=\"\",\"\",RTD(\"cqg.rtd\",,\"ContractData\",G16,\"LongDescription\",,\"T\"))","v":"Soybeans (Globex), Nov 20"}]
[null,{"$f":"'Symbols (2)'!B17","v":"F.RBE?"},{"$f":"IFERROR( RTD(\"cqg.rtd\",,\"StudyData\",B17, \"PCB\",\"BaseType=Index,Price=1000,Index=1,Date=12/30/2016\", \"Close\",$C$1,,\"all\",,,,\"T\")/100,\"\")","v":3.7388053212763844E-3},{"$f":"IFERROR(RANK($C17,$C$2:C$31)+COUNTIF($C$2:C17,C17)-1,\"\")","v":1},"F.RBE?",16,"F.CA6?",{"$f":"IFERROR( RTD(\"cqg.rtd\",,\"StudyData\",G17, \"PCB\",\"BaseType=Index,Price=1000,Index=1,Date=12/30/2016\", \"Close\",$C$1,,\"all\",,,,\"T\")/100,\"\")","v":-9.9700897308079538E-4},"",9.9700897308079538E-4,-9.9700897308079538E-4,{"$f":"IF(G17=\"\",\"\",RTD(\"cqg.rtd\",,\"ContractData\",G17,\"LongDescription\",,\"T\"))","v":"Canadian Dollar (Globex), Dec 20"}]
[null,{"$f":"'Symbols (2)'!B18","v":"F.ZSE"},{"$f":"IFERROR( RTD(\"cqg.rtd\",,\"StudyData\",B18, \"PCB\",\"BaseType=Index,Price=1000,Index=1,Date=12/30/2016\", \"Close\",$C$1,,\"all\",,,,\"T\")/100,\"\")","v":-9.7252613663992228E-4},{"$f":"IFERROR(RANK($C18,$C$2:C$31)+COUNTIF($C$2:C18,C18)-1,\"\")","v":15},"F.ZSE",17,"F.ENQ?",{"$f":"IFERROR( RTD(\"cqg.rtd\",,\"StudyData\",G18, \"PCB\",\"BaseType=Index,Price=1000,Index=1,Date=12/30/2016\", \"Close\",$C$1,,\"all\",,,,\"T\")/100,\"\")","v":-1.0191140501857052E-3},"",1.0191140501857052E-3,-1.0191140501857052E-3,{"$f":"IF(G18=\"\",\"\",RTD(\"cqg.rtd\",,\"ContractData\",G18,\"LongDescription\",,\"T\"))","v":"E-mini NASDAQ-100, Dec 20"}]
[null,{"$f":"'Symbols (2)'!B19","v":"F.ZWA"},{"$f":"IFERROR( RTD(\"cqg.rtd\",,\"StudyData\",B19, \"PCB\",\"BaseType=Index,Price=1000,Index=1,Date=12/30/2016\", \"Close\",$C$1,,\"all\",,,,\"T\")/100,\"\")","v":-3.5571365051133837E-3},{"$f":"IFERROR(RANK($C19,$C$2:C$31)+COUNTIF($C$2:C19,C19)-1,\"\")","v":30},"F.ZWA",18,"F.EU6?",{"$f":"IFERROR( RTD(\"cqg.rtd\",,\"StudyData\",G19, \"PCB\",\"BaseType=Index,Price=1000,Index=1,Date=12/30/2016\", \"Close\",$C$1,,\"all\",,,,\"T\")/100,\"\")","v":-1.0633772862611429E-3},"",1.0633772862611429E-3,-1.0633772862611429E-3,{"$f":"IF(G19=\"\",\"\",RTD(\"cqg.rtd\",,\"ContractData\",G19,\"LongDescription\",,\"T\"))","v":"Euro FX (Globex), Dec 20"}]
[null,{"$f":"'Symbols (2)'!B20","v":"F.ZCE"},{"$f":"IFERROR( RTD(\"cqg.rtd\",,\"StudyData\",B20, \"PCB\",\"BaseType=Index,Price=1000,Index=1,Date=12/30/2016\", \"Close\",$C$1,,\"all\",,,,\"T\")/100,\"\")","v":-2.0270270270270271E-3},{"$f":"IFERROR(RANK($C20,$C$2:C$31)+COUNTIF($C$2:C20,C20)-1,\"\")","v":29},"F.ZCE",19,"F.RTY?",{"$f":"IFERROR( RTD(\"cqg.rtd\",,\"StudyData\",G20, \"PCB\",\"BaseType=Index,Price=1000,Index=1,Date=12/30/2016\", \"Close\",$C$1,,\"all\",,,,\"T\")/100,\"\")","v":-1.3487995683841381E-3},"",1.3487995683841381E-3,-1.3487995683841381E-3,{"$f":"IF(G20=\"\",\"\",RTD(\"cqg.rtd\",,\"ContractData\",G20,\"LongDescription\",,\"T\"))","v":"E-mini Russell 2000, Dec 20"}]
[null,{"$f":"'Symbols (2)'!B21","v":"F.GLE"},{"$f":"IFERROR( RTD(\"cqg.rtd\",,\"StudyData\",B21, \"PCB\",\"BaseType=Index,Price=1000,Index=1,Date=12/30/2016\", \"Close\",$C$1,,\"all\",,,,\"T\")/100,\"\")","v":6.7965564114171842E-4},{"$f":"IFERROR(RANK($C21,$C$2:C$31)+COUNTIF($C$2:C21,C21)-1,\"\")","v":5},"F.GLE",20,"F.EP?",{"$f":"IFERROR( RTD(\"cqg.rtd\",,\"StudyData\",G21, \"PCB\",\"BaseType=Index,Price=1000,Index=1,Date=12/30/2016\", \"Close\",$C$1,,\"all\",,,,\"T\")/100,\"\")","v":-1.3685090853797614E-3},"",1.3685090853797614E-3,-1.3685090853797614E-3,{"$f":"IF(G21=\"\",\"\",RTD(\"cqg.rtd\",,\"ContractData\",G21,\"LongDescription\",,\"T\"))","v":"E-Mini S&P 500, Dec 20"}]
[null,{"$f":"'Symbols (2)'!B22","v":"F.HE"},{"$f":"IFERROR( RTD(\"cqg.rtd\",,\"StudyData\",B22, \"PCB\",\"BaseType=Index,Price=1000,Index=1,Date=12/30/2016\", \"Close\",$C$1,,\"all\",,,,\"T\")/100,\"\")","v":2.7269185820022928E-3},{"$f":"IFERROR(RANK($C22,$C$2:C$31)+COUNTIF($C$2:C22,C22)-1,\"\")","v":2},"F.HE",21,"F.GCE?",{"$f":"IFERROR( RTD(\"cqg.rtd\",,\"StudyData\",G22, \"PCB\",\"BaseType=Index,Price=1000,Index=1,Date=12/30/2016\", \"Close\",$C$1,,\"all\",,,,\"T\")/100,\"\")","v":-1.462064644143885E-3},"",1.462064644143885E-3,-1.462064644143885E-3,{"$f":"IF(G22=\"\",\"\",RTD(\"cqg.rtd\",,\"ContractData\",G22,\"LongDescription\",,\"T\"))","v":"Gold (Globex), Dec 20"}]
[null,{"$f":"'Symbols (2)'!B23","v":"F.YM?"},{"$f":"IFERROR( RTD(\"cqg.rtd\",,\"StudyData\",B23, \"PCB\",\"BaseType=Index,Price=1000,Index=1,Date=12/30/2016\", \"Close\",$C$1,,\"all\",,,,\"T\")/100,\"\")","v":-1.6981689308919079E-3},{"$f":"IFERROR(RANK($C23,$C$2:C$31)+COUNTIF($C$2:C23,C23)-1,\"\")","v":26},"F.YM?",22,"F.NE6?",{"$f":"IFERROR( RTD(\"cqg.rtd\",,\"StudyData\",G23, \"PCB\",\"BaseType=Index,Price=1000,Index=1,Date=12/30/2016\", \"Close\",$C$1,,\"all\",,,,\"T\")/100,\"\")","v":-1.5026296018031569E-3},"",1.5026296018031569E-3,-1.5026296018031569E-3,{"$f":"IF(G23=\"\",\"\",RTD(\"cqg.rtd\",,\"ContractData\",G23,\"LongDescription\",,\"T\"))","v":"New Zealand Dollar (Globex), Dec 20"}]
[null,{"$f":"'Symbols (2)'!B24","v":"F.EP?"},{"$f":"IFERROR( RTD(\"cqg.rtd\",,\"StudyData\",B24, \"PCB\",\"BaseType=Index,Price=1000,Index=1,Date=12/30/2016\", \"Close\",$C$1,,\"all\",,,,\"T\")/100,\"\")","v":-1.3685090853797614E-3},{"$f":"IFERROR(RANK($C24,$C$2:C$31)+COUNTIF($C$2:C24,C24)-1,\"\")","v":20},"F.EP?",23,"F.JY6?",{"$f":"IFERROR( RTD(\"cqg.rtd\",,\"StudyData\",G24, \"PCB\",\"BaseType=Index,Price=1000,Index=1,Date=12/30/2016\", \"Close\",$C$1,,\"all\",,,,\"T\")/100,\"\")","v":-1.5179272441769823E-3},"",1.5179272441769823E-3,-1.5179272441769823E-3,{"$f":"IF(G24=\"\",\"\",RTD(\"cqg.rtd\",,\"ContractData\",G24,\"LongDescription\",,\"T\"))","v":"Japanese Yen (Globex), Dec 20"}]
[null,{"$f":"'Symbols (2)'!B25","v":"F.ENQ?"},{"$f":"IFERROR( RTD(\"cqg.rtd\",,\"StudyData\",B25, \"PCB\",\"BaseType=Index,Price=1000,Index=1,Date=12/30/2016\", \"Close\",$C$1,,\"all\",,,,\"T\")/100,\"\")","v":-1.0191140501857052E-3},{"$f":"IFERROR(RANK($C25,$C$2:C$31)+COUNTIF($C$2:C25,C25)-1,\"\")","v":17},"F.ENQ?",24,"F.SIE?",{"$f":"IFERROR( RTD(\"cqg.rtd\",,\"StudyData\",G25, \"PCB\",\"BaseType=Index,Price=1000,Index=1,Date=12/30/2016\", \"Close\",$C$1,,\"all\",,,,\"T\")/100,\"\")","v":-1.628332994097258E-3},"",1.628332994097258E-3,-1.628332994097258E-3,{"$f":"IF(G25=\"\",\"\",RTD(\"cqg.rtd\",,\"ContractData\",G25,\"LongDescription\",,\"T\"))","v":"Silver (Globex), Dec 20"}]
[null,{"$f":"'Symbols (2)'!B26","v":"F.RTY?"},{"$f":"IFERROR( RTD(\"cqg.rtd\",,\"StudyData\",B26, \"PCB\",\"BaseType=Index,Price=1000,Index=1,Date=12/30/2016\", \"Close\",$C$1,,\"all\",,,,\"T\")/100,\"\")","v":-1.3487995683841381E-3},{"$f":"IFERROR(RANK($C26,$C$2:C$31)+COUNTIF($C$2:C26,C26)-1,\"\")","v":19},"F.RTY?",25,"F.BP6?",{"$f":"IFERROR( RTD(\"cqg.rtd\",,\"StudyData\",G26, \"PCB\",\"BaseType=Index,Price=1000,Index=1,Date=12/30/2016\", \"Close\",$C$1,,\"all\",,,,\"T\")/100,\"\")","v":-1.6440930086901984E-3},"",1.6440930086901984E-3,-1.6440930086901984E-3,{"$f":"IF(G26=\"\",\"\",RTD(\"cqg.rtd\",,\"ContractData\",G26,\"LongDescription\",,\"T\"))","v":"British Pound (Globex), Dec 20"}]
[null,{"$f":"'Symbols (2)'!B27","v":"F.DD?"},{"$f":"IFERROR( RTD(\"cqg.rtd\",,\"StudyData\",B27, \"PCB\",\"BaseType=Index,Price=1000,Index=1,Date=12/30/2016\", \"Close\",$C$1,,\"all\",,,,\"T\")/100,\"\")","v":-5.5285708644315452E-4},{"$f":"IFERROR(RANK($C27,$C$2:C$31)+COUNTIF($C$2:C27,C27)-1,\"\")","v":12},"F.DD?",26,"F.YM?",{"$f":"IFERROR( RTD(\"cqg.rtd\",,\"StudyData\",G27, \"PCB\",\"BaseType=Index,Price=1000,Index=1,Date=12/30/2016\", \"Close\",$C$1,,\"all\",,,,\"T\")/100,\"\")","v":-1.6981689308919079E-3},"",1.6981689308919079E-3,-1.6981689308919079E-3,{"$f":"IF(G27=\"\",\"\",RTD(\"cqg.rtd\",,\"ContractData\",G27,\"LongDescription\",,\"T\"))","v":"E-mini Dow ($5), Dec 20"}]
[null,{"$f":"'Symbols (2)'!B28","v":"F.DSX?"},{"$f":"IFERROR( RTD(\"cqg.rtd\",,\"StudyData\",B28, \"PCB\",\"BaseType=Index,Price=1000,Index=1,Date=12/30/2016\", \"Close\",$C$1,,\"all\",,,,\"T\")/100,\"\")","v":-6.2932662051604776E-4},{"$f":"IFERROR(RANK($C28,$C$2:C$31)+COUNTIF($C$2:C28,C28)-1,\"\")","v":13},"F.DSX?",27,"F.DA6?",{"$f":"IFERROR( RTD(\"cqg.rtd\",,\"StudyData\",G28, \"PCB\",\"BaseType=Index,Price=1000,Index=1,Date=12/30/2016\", \"Close\",$C$1,,\"all\",,,,\"T\")/100,\"\")","v":-1.8033014287695489E-3},"",1.8033014287695489E-3,-1.8033014287695489E-3,{"$f":"IF(G28=\"\",\"\",RTD(\"cqg.rtd\",,\"ContractData\",G28,\"LongDescription\",,\"T\"))","v":"Australian Dollar (Globex), Dec 20"}]
[null,{"$f":"'Symbols (2)'!B29","v":"F.QFA?"},{"$f":"IFERROR( RTD(\"cqg.rtd\",,\"StudyData\",B29, \"PCB\",\"BaseType=Index,Price=1000,Index=1,Date=12/30/2016\", \"Close\",$C$1,,\"all\",,,,\"T\")/100,\"\")","v":2.5735609505018445E-4},{"$f":"IFERROR(RANK($C29,$C$2:C$31)+COUNTIF($C$2:C29,C29)-1,\"\")","v":6},"F.QFA?",28,"F.MX6?",{"$f":"IFERROR( RTD(\"cqg.rtd\",,\"StudyData\",G29, \"PCB\",\"BaseType=Index,Price=1000,Index=1,Date=12/30/2016\", \"Close\",$C$1,,\"all\",,,,\"T\")/100,\"\")","v":-1.9459459459459415E-3},"",1.9459459459459415E-3,-1.9459459459459415E-3,{"$f":"IF(G29=\"\",\"\",RTD(\"cqg.rtd\",,\"ContractData\",G29,\"LongDescription\",,\"T\"))","v":"Mexican Peso (Globex), Dec 20"}]
[null,{"$f":"'Symbols (2)'!B30","v":"F.PIL?"},{"$f":"IFERROR( RTD(\"cqg.rtd\",,\"StudyData\",B30, \"PCB\",\"BaseType=Index,Price=1000,Index=1,Date=12/30/2016\", \"Close\",$C$1,,\"all\",,,,\"T\")/100,\"\")","v":-3.1207739519400812E-4},{"$f":"IFERROR(RANK($C30,$C$2:C$31)+COUNTIF($C$2:C30,C30)-1,\"\")","v":10},"F.PIL?",29,"F.ZCE",{"$f":"IFERROR( RTD(\"cqg.rtd\",,\"StudyData\",G30, \"PCB\",\"BaseType=Index,Price=1000,Index=1,Date=12/30/2016\", \"Close\",$C$1,,\"all\",,,,\"T\")/100,\"\")","v":-2.0270270270270271E-3},"",2.0270270270270271E-3,-2.0270270270270271E-3,{"$f":"IF(G30=\"\",\"\",RTD(\"cqg.rtd\",,\"ContractData\",G30,\"LongDescription\",,\"T\"))","v":"Corn (Globex), Dec 20"}]
[null,{"$f":"'Symbols (2)'!B31","v":"F.NKD?"},{"$f":"IFERROR( RTD(\"cqg.rtd\",,\"StudyData\",B31, \"PCB\",\"BaseType=Index,Price=1000,Index=1,Date=12/30/2016\", \"Close\",$C$1,,\"all\",,,,\"T\")/100,\"\")","v":-4.3840420868040335E-4},{"$f":"IFERROR(RANK($C31,$C$2:C$31)+COUNTIF($C$2:C31,C31)-1,\"\")","v":11},"F.NKD?",30,"F.ZWA",{"$f":"IFERROR( RTD(\"cqg.rtd\",,\"StudyData\",G31, \"PCB\",\"BaseType=Index,Price=1000,Index=1,Date=12/30/2016\", \"Close\",$C$1,,\"all\",,,,\"T\")/100,\"\")","v":-3.5571365051133837E-3},"",3.5571365051133837E-3,-3.5571365051133837E-3,{"$f":"IF(G31=\"\",\"\",RTD(\"cqg.rtd\",,\"ContractData\",G31,\"LongDescription\",,\"T\"))","v":"Wheat (Globex), Dec 20"}]

{"sheet":"Daily (2)","index":8,"n_rows":31,"n_cols":12,"rows_kept":31,"cut":false,"hidden":true,"merged":[]}
[null,null,{"$f":"\"A\"&'Symbols (2)'!E2","v":"AD"}]
[null,{"$f":"'Symbols (2)'!B2","v":"F.DXE?"},{"$f":" IFERROR(RTD(\"cqg.rtd\",,\"StudyData\",B2, \"PCB\",\"BaseType=Index,Price=1000,Index=1,Date=12/30/2016\", \"Close\",$C$1,,\"all\",,,,\"T\")/100,\"\")","v":2.3589940651552416E-3},{"$f":"RANK($C2,$C$2:C$31)+COUNTIF($C$2:C2,C2)-1","v":12},{"$f":"B2","v":"F.DXE?"},1,{"$f":"IFERROR(VLOOKUP($F2,$D$2:$E$31,2,FALSE),\"\")","v":"F.HE"},{"$f":"IFERROR( RTD(\"cqg.rtd\",,\"StudyData\",G2, \"PCB\",\"BaseType=Index,Price=1000,Index=1,Date=12/30/2016\", \"Close\",$C$1,,\"all\",,,,\"T\")/100,\"\")","v":4.5491470349309344E-2},{"$f":"IF(H2<0,\"\",H2)","v":4.5491470349309344E-2},{"$f":"IF(H2>=0,\"\",-H2)","v":""},{"$f":"IF(J2=\"\",\"\",H2)","v":""},{"$f":"IF(G2=\"\",\"\",RTD(\"cqg.rtd\",,\"ContractData\",G2,\"LongDescription\",,\"T\"))","v":"Lean Hogs (Globex), Dec 20"}]
[null,{"$f":"'Symbols (2)'!B3","v":"F.EU6?"},{"$f":" IFERROR(RTD(\"cqg.rtd\",,\"StudyData\",B3, \"PCB\",\"BaseType=Index,Price=1000,Index=1,Date=12/30/2016\", \"Close\",$C$1,,\"all\",,,,\"T\")/100,\"\")","v":-2.8024287716021229E-3},{"$f":"RANK($C3,$C$2:C$31)+COUNTIF($C$2:C3,C3)-1","v":27},{"$f":"B3","v":"F.EU6?"},{"$f":"F2+1","v":2},{"$f":"IFERROR(VLOOKUP($F3,$D$2:$E$31,2,FALSE),\"\")","v":"F.DD?"},{"$f":"IFERROR( RTD(\"cqg.rtd\",,\"StudyData\",G3, \"PCB\",\"BaseType=Index,Price=1000,Index=1,Date=12/30/2016\", \"Close\",$C$1,,\"all\",,,,\"T\")/100,\"\")","v":1.3129978783875744E-2},{"$f":"IF(H3<0,\"\",H3)","v":1.3129978783875744E-2},{"$f":"IF(H3>=0,\"\",-H3)","v":""},{"$f":"IF(J3=\"\",\"\",H3)","v":""},{"$f":"IF(G3=\"\",\"\",RTD(\"cqg.rtd\",,\"ContractData\",G3,\"LongDescription\",,\"T\"))","v":"DAX Index, Dec 20"}]
[null,{"$f":"'Symbols (2)'!B4","v":"F.JY6?"},{"$f":" IFERROR(RTD(\"cqg.rtd\",,\"StudyData\",B4, \"PCB\",\"BaseType=Index,Price=1000,Index=1,Date=12/30/2016\", \"Close\",$C$1,,\"all\",,,,\"T\")/100,\"\")","v":-1.5701873756934356E-3},{"$f":"RANK($C4,$C$2:C$31)+COUNTIF($C$2:C4,C4)-1","v":20},"F.JY6?",{"$f":"F3+1","v":3},"F.DSX?",{"$f":"IFERROR( RTD(\"cqg.rtd\",,\"StudyData\",G4, \"PCB\",\"BaseType=Index,Price=1000,Index=1,Date=12/30/2016\", \"Close\",$C$1,,\"all\",,,,\"T\")/100,\"\")","v":1.1142948105698823E-2},1.1142948105698823E-2,"","",{"$f":"IF(G4=\"\",\"\",RTD(\"cqg.rtd\",,\"ContractData\",G4,\"LongDescription\",,\"T\"))","v":"Euro STOXX 50, Dec 20"}]
[null,{"$f":"'Symbols (2)'!B5","v":"F.BP6?"},{"$f":" IFERROR(RTD(\"cqg.rtd\",,\"StudyData\",B5, \"PCB\",\"BaseType=Index,Price=1000,Index=1,Date=12/30/2016\", \"Close\",$C$1,,\"all\",,,,\"T\")/100,\"\")","v":-3.7499999999999339E-3},{"$f":"RANK($C5,$C$2:C$31)+COUNTIF($C$2:C5,C5)-1","v":29},"F.BP6?",4,"F.CLE?",{"$f":"IFERROR( RTD(\"cqg.rtd\",,\"StudyData\",G5, \"PCB\",\"BaseType=Index,Price=1000,Index=1,Date=12/30/2016\", \"Close\",$C$1,,\"all\",,,,\"T\")/100,\"\")","v":1.0116337885685348E-2},1.0116337885685348E-2,"","",{"$f":"IF(G5=\"\",\"\",RTD(\"cqg.rtd\",,\"ContractData\",G5,\"LongDescription\",,\"T\"))","v":"Crude Light (Globex), Nov 20"}]
[null,{"$f":"'Symbols (2)'!B6","v":"F.CA6?"},{"$f":" IFERROR(RTD(\"cqg.rtd\",,\"StudyData\",B6, \"PCB\",\"BaseType=Index,Price=1000,Index=1,Date=12/30/2016\", \"Close\",$C$1,,\"all\",,,,\"T\")/100,\"\")","v":6.6577896138474688E-4},{"$f":"RANK($C6,$C$2:C$31)+COUNTIF($C$2:C6,C6)-1","v":14},"F.CA6?",5,"F.ZWA",{"$f":"IFERROR( RTD(\"cqg.rtd\",,\"StudyData\",G6, \"PCB\",\"BaseType=Index,Price=1000,Index=1,Date=12/30/2016\", \"Close\",$C$1,,\"all\",,,,\"T\")/100,\"\")","v":9.9143758449752144E-3},9.9143758449752144E-3,"","",{"$f":"IF(G6=\"\",\"\",RTD(\"cqg.rtd\",,\"ContractData\",G6,\"LongDescription\",,\"T\"))","v":"Wheat (Globex), Dec 20"}]
[null,{"$f":"'Symbols (2)'!B7","v":"F.SF6?"},{"$f":" IFERROR(RTD(\"cqg.rtd\",,\"StudyData\",B7, \"PCB\",\"BaseType=Index,Price=1000,Index=1,Date=12/30/2016\", \"Close\",$C$1,,\"all\",,,,\"T\")/100,\"\")","v":-3.4693691226148314E-3},{"$f":"RANK($C7,$C$2:C$31)+COUNTIF($C$2:C7,C7)-1","v":28},"F.SF6?",6,"F.SIE?",{"$f":"IFERROR( RTD(\"cqg.rtd\",,\"StudyData\",G7, \"PCB\",\"BaseType=Index,Price=1000,Index=1,Date=12/30/2016\", \"Close\",$C$1,,\"all\",,,,\"T\")/100,\"\")","v":5.6587526140977427E-3},5.6587526140977427E-3,"","",{"$f":"IF(G7=\"\",\"\",RTD(\"cqg.rtd\",,\"ContractData\",G7,\"LongDescription\",,\"T\"))","v":"Silver (Globex), Dec 20"}]
[null,{"$f":"'Symbols (2)'!B8","v":"F.DA6?"},{"$f":" IFERROR(RTD(\"cqg.rtd\",,\"StudyData\",B8, \"PCB\",\"BaseType=Index,Price=1000,Index=1,Date=12/30/2016\", \"Close\",$C$1,,\"all\",,,,\"T\")/100,\"\")","v":-1.8033014287695489E-3},{"$f":"RANK($C8,$C$2:C$31)+COUNTIF($C$2:C8,C8)-1","v":22},"F.DA6?",7,"F.QFA?",{"$f":"IFERROR( RTD(\"cqg.rtd\",,\"StudyData\",G8, \"PCB\",\"BaseType=Index,Price=1000,Index=1,Date=12/30/2016\", \"Close\",$C$1,,\"all\",,,,\"T\")/100,\"\")","v":5.3457492671150197E-3},5.3457492671150197E-3,"","",{"$f":"IF(G8=\"\",\"\",RTD(\"cqg.rtd\",,\"ContractData\",G8,\"LongDescription\",,\"T\"))","v":"FTSE 100 - Stnd Index, Dec 20"}]
[null,{"$f":"'Symbols (2)'!B9","v":"F.NE6?"},{"$f":" IFERROR(RTD(\"cqg.rtd\",,\"StudyData\",B9, \"PCB\",\"BaseType=Index,Price=1000,Index=1,Date=12/30/2016\", \"Close\",$C$1,,\"all\",,,,\"T\")/100,\"\")","v":-2.1024177804476163E-3},{"$f":"RANK($C9,$C$2:C$31)+COUNTIF($C$2:C9,C9)-1","v":23},"F.NE6?",8,"F.ZSE",{"$f":"IFERROR( RTD(\"cqg.rtd\",,\"StudyData\",G9, \"PCB\",\"BaseType=Index,Price=1000,Index=1,Date=12/30/2016\", \"Close\",$C$1,,\"all\",,,,\"T\")/100,\"\")","v":4.6454767726161368E-3},4.6454767726161368E-3,"","",{"$f":"IF(G9=\"\",\"\",RTD(\"cqg.rtd\",,\"ContractData\",G9,\"LongDescription\",,\"T\"))","v":"Soybeans (Globex), Nov 20"}]
[null,{"$f":"'Symbols (2)'!B10","v":"F.MX6?"},{"$f":" IFERROR(RTD(\"cqg.rtd\",,\"StudyData\",B10, \"PCB\",\"BaseType=Index,Price=1000,Index=1,Date=12/30/2016\", \"Close\",$C$1,,\"all\",,,,\"T\")/100,\"\")","v":-2.5929127052721507E-3},{"$f":"RANK($C10,$C$2:C$31)+COUNTIF($C$2:C10,C10)-1","v":25},"F.MX6?",9,"F.HOE?",{"$f":"IFERROR( RTD(\"cqg.rtd\",,\"StudyData\",G10, \"PCB\",\"BaseType=Index,Price=1000,Index=1,Date=12/30/2016\", \"Close\",$C$1,,\"all\",,,,\"T\")/100,\"\")","v":3.664640686449761E-3},3.664640686449761E-3,"","",{"$f":"IF(G10=\"\",\"\",RTD(\"cqg.rtd\",,\"ContractData\",G10,\"LongDescription\",,\"T\"))","v":"NY Harbor ULSD, Nov 20"}]
[null,{"$f":"'Symbols (2)'!B11","v":"F.GCE?"},{"$f":" IFERROR(RTD(\"cqg.rtd\",,\"StudyData\",B11, \"PCB\",\"BaseType=Index,Price=1000,Index=1,Date=12/30/2016\", \"Close\",$C$1,,\"all\",,,,\"T\")/100,\"\")","v":8.8977284622634002E-4},{"$f":"RANK($C11,$C$2:C$31)+COUNTIF($C$2:C11,C11)-1","v":13},"F.GCE?",10,"F.ENQ?",{"$f":"IFERROR( RTD(\"cqg.rtd\",,\"StudyData\",G11, \"PCB\",\"BaseType=Index,Price=1000,Index=1,Date=12/30/2016\", \"Close\",$C$1,,\"all\",,,,\"T\")/100,\"\")","v":3.5262535262535265E-3},3.5262535262535265E-3,"","",{"$f":"IF(G11=\"\",\"\",RTD(\"cqg.rtd\",,\"ContractData\",G11,\"LongDescription\",,\"T\"))","v":"E-mini NASDAQ-100, Dec 20"}]
[null,{"$f":"'Symbols (2)'!B12","v":"F.SIE?"},{"$f":" IFERROR(RTD(\"cqg.rtd\",,\"StudyData\",B12, \"PCB\",\"BaseType=Index,Price=1000,Index=1,Date=12/30/2016\", \"Close\",$C$1,,\"all\",,,,\"T\")/100,\"\")","v":5.6587526140977427E-3},{"$f":"RANK($C12,$C$2:C$31)+COUNTIF($C$2:C12,C12)-1","v":6},"F.SIE?",11,"F.EP?",{"$f":"IFERROR( RTD(\"cqg.rtd\",,\"StudyData\",G12, \"PCB\",\"BaseType=Index,Price=1000,Index=1,Date=12/30/2016\", \"Close\",$C$1,,\"all\",,,,\"T\")/100,\"\")","v":2.6717557251908397E-3},2.6717557251908397E-3,"","",{"$f":"IF(G12=\"\",\"\",RTD(\"cqg.rtd\",,\"ContractData\",G12,\"LongDescription\",,\"T\"))","v":"E-Mini S&P 500, Dec 20"}]
[null,{"$f":"'Symbols (2)'!B13","v":"F.PLE?"},{"$f":" IFERROR(RTD(\"cqg.rtd\",,\"StudyData\",B13, \"PCB\",\"BaseType=Index,Price=1000,Index=1,Date=12/30/2016\", \"Close\",$C$1,,\"all\",,,,\"T\")/100,\"\")","v":-8.7889510329870243E-3},{"$f":"RANK($C13,$C$2:C$31)+COUNTIF($C$2:C13,C13)-1","v":30},"F.PLE?",12,"F.DXE?",{"$f":"IFERROR( RTD(\"cqg.rtd\",,\"StudyData\",G13, \"PCB\",\"BaseType=Index,Price=1000,Index=1,Date=12/30/2016\", \"Close\",$C$1,,\"all\",,,,\"T\")/100,\"\")","v":2.3589940651552416E-3},2.3589940651552416E-3,"","",{"$f":"IF(G13=\"\",\"\",RTD(\"cqg.rtd\",,\"ContractData\",G13,\"LongDescription\",,\"T\"))","v":"Dollar Index (ICE), Dec 20"}]
[null,{"$f":"'Symbols (2)'!B14","v":"F.TYA?"},{"$f":" IFERROR(RTD(\"cqg.rtd\",,\"StudyData\",B14, \"PCB\",\"BaseType=Index,Price=1000,Index=1,Date=12/30/2016\", \"Close\",$C$1,,\"all\",,,,\"T\")/100,\"\")","v":-1.1195700850873266E-4},{"$f":"RANK($C14,$C$2:C$31)+COUNTIF($C$2:C14,C14)-1","v":16},"F.TYA?",13,"F.GCE?",{"$f":"IFERROR( RTD(\"cqg.rtd\",,\"StudyData\",G14, \"PCB\",\"BaseType=Index,Price=1000,Index=1,Date=12/30/2016\", \"Close\",$C$1,,\"all\",,,,\"T\")/100,\"\")","v":8.8977284622634002E-4},8.8977284622634002E-4,"","",{"$f":"IF(G14=\"\",\"\",RTD(\"cqg.rtd\",,\"ContractData\",G14,\"LongDescription\",,\"T\"))","v":"Gold (Globex), Dec 20"}]
[null,{"$f":"'Symbols (2)'!B15","v":"F.CLE?"},{"$f":" IFERROR(RTD(\"cqg.rtd\",,\"StudyData\",B15, \"PCB\",\"BaseType=Index,Price=1000,Index=1,Date=12/30/2016\", \"Close\",$C$1,,\"all\",,,,\"T\")/100,\"\")","v":1.0116337885685348E-2},{"$f":"RANK($C15,$C$2:C$31)+COUNTIF($C$2:C15,C15)-1","v":4},"F.CLE?",14,"F.CA6?",{"$f":"IFERROR( RTD(\"cqg.rtd\",,\"StudyData\",G15, \"PCB\",\"BaseType=Index,Price=1000,Index=1,Date=12/30/2016\", \"Close\",$C$1,,\"all\",,,,\"T\")/100,\"\")","v":6.6577896138474688E-4},6.6577896138474688E-4,"","",{"$f":"IF(G15=\"\",\"\",RTD(\"cqg.rtd\",,\"ContractData\",G15,\"LongDescription\",,\"T\"))","v":"Canadian Dollar (Globex), Dec 20"}]
[null,{"$f":"'Symbols (2)'!B16","v":"F.HOE?"},{"$f":" IFERROR(RTD(\"cqg.rtd\",,\"StudyData\",B16, \"PCB\",\"BaseType=Index,Price=1000,Index=1,Date=12/30/2016\", \"Close\",$C$1,,\"all\",,,,\"T\")/100,\"\")","v":3.664640686449761E-3},{"$f":"RANK($C16,$C$2:C$31)+COUNTIF($C$2:C16,C16)-1","v":9},"F.HOE?",15,"F.RBE?",{"$f":"IFERROR( RTD(\"cqg.rtd\",,\"StudyData\",G16, \"PCB\",\"BaseType=Index,Price=1000,Index=1,Date=12/30/2016\", \"Close\",$C$1,,\"all\",,,,\"T\")/100,\"\")","v":0},0,"","",{"$f":"IF(G16=\"\",\"\",RTD(\"cqg.rtd\",,\"ContractData\",G16,\"LongDescription\",,\"T\"))","v":"RBOB Gasoline (Globex), Nov 20"}]
[null,{"$f":"'Symbols (2)'!B17","v":"F.RBE?"},{"$f":" IFERROR(RTD(\"cqg.rtd\",,\"StudyData\",B17, \"PCB\",\"BaseType=Index,Price=1000,Index=1,Date=12/30/2016\", \"Close\",$C$1,,\"all\",,,,\"T\")/100,\"\")","v":0},{"$f":"RANK($C17,$C$2:C$31)+COUNTIF($C$2:C17,C17)-1","v":15},"F.RBE?",16,"F.TYA?",{"$f":"IFERROR( RTD(\"cqg.rtd\",,\"StudyData\",G17, \"PCB\",\"BaseType=Index,Price=1000,Index=1,Date=12/30/2016\", \"Close\",$C$1,,\"all\",,,,\"T\")/100,\"\")","v":-1.1195700850873266E-4},"",1.1195700850873266E-4,-1.1195700850873266E-4,{"$f":"IF(G17=\"\",\"\",RTD(\"cqg.rtd\",,\"ContractData\",G17,\"LongDescription\",,\"T\"))","v":"10yr US Treasury Notes (Globex), Dec 20"}]
[null,{"$f":"'Symbols (2)'!B18","v":"F.ZSE"},{"$f":" IFERROR(RTD(\"cqg.rtd\",,\"StudyData\",B18, \"PCB\",\"BaseType=Index,Price=1000,Index=1,Date=12/30/2016\", \"Close\",$C$1,,\"all\",,,,\"T\")/100,\"\")","v":4.6454767726161368E-3},{"$f":"RANK($C18,$C$2:C$31)+COUNTIF($C$2:C18,C18)-1","v":8},"F.ZSE",17,"F.YM?",{"$f":"IFERROR( RTD(\"cqg.rtd\",,\"StudyData\",G18, \"PCB\",\"BaseType=Index,Price=1000,Index=1,Date=12/30/2016\", \"Close\",$C$1,,\"all\",,,,\"T\")/100,\"\")","v":-4.8050267972648311E-4},"",4.8050267972648311E-4,-4.8050267972648311E-4,{"$f":"IF(G18=\"\",\"\",RTD(\"cqg.rtd\",,\"ContractData\",G18,\"LongDescription\",,\"T\"))","v":"E-mini Dow ($5), Dec 20"}]
[null,{"$f":"'Symbols (2)'!B19","v":"F.ZWA"},{"$f":" IFERROR(RTD(\"cqg.rtd\",,\"StudyData\",B19, \"PCB\",\"BaseType=Index,Price=1000,Index=1,Date=12/30/2016\", \"Close\",$C$1,,\"all\",,,,\"T\")/100,\"\")","v":9.9143758449752144E-3},{"$f":"RANK($C19,$C$2:C$31)+COUNTIF($C$2:C19,C19)-1","v":5},"F.ZWA",18,"F.RTY?",{"$f":"IFERROR( RTD(\"cqg.rtd\",,\"StudyData\",G19, \"PCB\",\"BaseType=Index,Price=1000,Index=1,Date=12/30/2016\", \"Close\",$C$1,,\"all\",,,,\"T\")/100,\"\")","v":-1.3487995683841381E-3},"",1.3487995683841381E-3,-1.3487995683841381E-3,{"$f":"IF(G19=\"\",\"\",RTD(\"cqg.rtd\",,\"ContractData\",G19,\"LongDescription\",,\"T\"))","v":"E-mini Russell 2000, Dec 20"}]
[null,{"$f":"'Symbols (2)'!B20","v":"F.ZCE"},{"$f":" IFERROR(RTD(\"cqg.rtd\",,\"StudyData\",B20, \"PCB\",\"BaseType=Index,Price=1000,Index=1,Date=12/30/2016\", \"Close\",$C$1,,\"all\",,,,\"T\")/100,\"\")","v":-1.3522650439486139E-3},{"$f":"RANK($C20,$C$2:C$31)+COUNTIF($C$2:C20,C20)-1","v":19},"F.ZCE",19,"F.ZCE",{"$f":"IFERROR( RTD(\"cqg.rtd\",,\"StudyData\",G20, \"PCB\",\"BaseType=Index,Price=1000,Index=1,Date=12/30/2016\", \"Close\",$C$1,,\"all\",,,,\"T\")/100,\"\")","v":-1.3522650439486139E-3},"",1.3522650439486139E-3,-1.3522650439486139E-3,{"$f":"IF(G20=\"\",\"\",RTD(\"cqg.rtd\",,\"ContractData\",G20,\"LongDescription\",,\"T\"))","v":"Corn (Globex), Dec 20"}]
[null,{"$f":"'Symbols (2)'!B21","v":"F.GLE"},{"$f":" IFERROR(RTD(\"cqg.rtd\",,\"StudyData\",B21, \"PCB\",\"BaseType=Index,Price=1000,Index=1,Date=12/30/2016\", \"Close\",$C$1,,\"all\",,,,\"T\")/100,\"\")","v":-1.5822784810127608E-3},{"$f":"RANK($C21,$C$2:C$31)+COUNTIF($C$2:C21,C21)-1","v":21},"F.GLE",20,"F.JY6?",{"$f":"IFERROR( RTD(\"cqg.rtd\",,\"StudyData\",G21, \"PCB\",\"BaseType=Index,Price=1000,Index=1,Date=12/30/2016\", \"Close\",$C$1,,\"all\",,,,\"T\")/100,\"\")","v":-1.5701873756934356E-3},"",1.5701873756934356E-3,-1.5701873756934356E-3,{"$f":"IF(G21=\"\",\"\",RTD(\"cqg.rtd\",,\"ContractData\",G21,\"LongDescription\",,\"T\"))","v":"Japanese Yen (Globex), Dec 20"}]
[null,{"$f":"'Symbols (2)'!B22","v":"F.HE"},{"$f":" IFERROR(RTD(\"cqg.rtd\",,\"StudyData\",B22, \"PCB\",\"BaseType=Index,Price=1000,Index=1,Date=12/30/2016\", \"Close\",$C$1,,\"all\",,,,\"T\")/100,\"\")","v":4.5491470349309344E-2},{"$f":"RANK($C22,$C$2:C$31)+COUNTIF($C$2:C22,C22)-1","v":1},"F.HE",21,"F.GLE",{"$f":"IFERROR( RTD(\"cqg.rtd\",,\"StudyData\",G22, \"PCB\",\"BaseType=Index,Price=1000,Index=1,Date=12/30/2016\", \"Close\",$C$1,,\"all\",,,,\"T\")/100,\"\")","v":-1.5822784810127608E-3},"",1.5822784810127608E-3,-1.5822784810127608E-3,{"$f":"IF(G22=\"\",\"\",RTD(\"cqg.rtd\",,\"ContractData\",G22,\"LongDescription\",,\"T\"))","v":"Live Cattle (Globex), Dec 20"}]
[null,{"$f":"'Symbols (2)'!B23","v":"F.YM?"},{"$f":" IFERROR(RTD(\"cqg.rtd\",,\"StudyData\",B23, \"PCB\",\"BaseType=Index,Price=1000,Index=1,Date=12/30/2016\", \"Close\",$C$1,,\"all\",,,,\"T\")/100,\"\")","v":-4.8050267972648311E-4},{"$f":"RANK($C23,$C$2:C$31)+COUNTIF($C$2:C23,C23)-1","v":17},"F.YM?",22,"F.DA6?",{"$f":"IFERROR( RTD(\"cqg.rtd\",,\"StudyData\",G23, \"PCB\",\"BaseType=Index,Price=1000,Index=1,Date=12/30/2016\", \"Close\",$C$1,,\"all\",,,,\"T\")/100,\"\")","v":-1.8033014287695489E-3},"",1.8033014287695489E-3,-1.8033014287695489E-3,{"$f":"IF(G23=\"\",\"\",RTD(\"cqg.rtd\",,\"ContractData\",G23,\"LongDescription\",,\"T\"))","v":"Australian Dollar (Globex), Dec 20"}]
[null,{"$f":"'Symbols (2)'!B24","v":"F.EP?"},{"$f":" IFERROR(RTD(\"cqg.rtd\",,\"StudyData\",B24, \"PCB\",\"BaseType=Index,Price=1000,Index=1,Date=12/30/2016\", \"Close\",$C$1,,\"all\",,,,\"T\")/100,\"\")","v":2.6717557251908397E-3},{"$f":"RANK($C24,$C$2:C$31)+COUNTIF($C$2:C24,C24)-1","v":11},"F.EP?",23,"F.NE6?",{"$f":"IFERROR( RTD(\"cqg.rtd\",,\"StudyData\",G24, \"PCB\",\"BaseType=Index,Price=1000,Index=1,Date=12/30/2016\", \"Close\",$C$1,,\"all\",,,,\"T\")/100,\"\")","v":-2.1024177804476163E-3},"",2.1024177804476163E-3,-2.1024177804476163E-3,{"$f":"IF(G24=\"\",\"\",RTD(\"cqg.rtd\",,\"ContractData\",G24,\"LongDescription\",,\"T\"))","v":"New Zealand Dollar (Globex), Dec 20"}]
[null,{"$f":"'Symbols (2)'!B25","v":"F.ENQ?"},{"$f":" IFERROR(RTD(\"cqg.rtd\",,\"StudyData\",B25, \"PCB\",\"BaseType=Index,Price=1000,Index=1,Date=12/30/2016\", \"Close\",$C$1,,\"all\",,,,\"T\")/100,\"\")","v":3.5262535262535265E-3},{"$f":"RANK($C25,$C$2:C$31)+COUNTIF($C$2:C25,C25)-1","v":10},"F.ENQ?",24,"F.NKD?",{"$f":"IFERROR( RTD(\"cqg.rtd\",,\"StudyData\",G25, \"PCB\",\"BaseType=Index,Price=1000,Index=1,Date=12/30/2016\", \"Close\",$C$1,,\"all\",,,,\"T\")/100,\"\")","v":-2.4064756070881644E-3},"",2.4064756070881644E-3,-2.4064756070881644E-3,{"$f":"IF(G25=\"\",\"\",RTD(\"cqg.rtd\",,\"ContractData\",G25,\"LongDescription\",,\"T\"))","v":"Nikkei 225 (Globex), Dec 20"}]
[null,{"$f":"'Symbols (2)'!B26","v":"F.RTY?"},{"$f":" IFERROR(RTD(\"cqg.rtd\",,\"StudyData\",B26, \"PCB\",\"BaseType=Index,Price=1000,Index=1,Date=12/30/2016\", \"Close\",$C$1,,\"all\",,,,\"T\")/100,\"\")","v":-1.3487995683841381E-3},{"$f":"RANK($C26,$C$2:C$31)+COUNTIF($C$2:C26,C26)-1","v":18},"F.RTY?",25,"F.MX6?",{"$f":"IFERROR( RTD(\"cqg.rtd\",,\"StudyData\",G26, \"PCB\",\"BaseType=Index,Price=1000,Index=1,Date=12/30/2016\", \"Close\",$C$1,,\"all\",,,,\"T\")/100,\"\")","v":-2.5929127052721507E-3},"",2.5929127052721507E-3,-2.5929127052721507E-3,{"$f":"IF(G26=\"\",\"\",RTD(\"cqg.rtd\",,\"ContractData\",G26,\"LongDescription\",,\"T\"))","v":"Mexican Peso (Globex), Dec 20"}]
[null,{"$f":"'Symbols (2)'!B27","v":"F.DD?"},{"$f":" IFERROR(RTD(\"cqg.rtd\",,\"StudyData\",B27, \"PCB\",\"BaseType=Index,Price=1000,Index=1,Date=12/30/2016\", \"Close\",$C$1,,\"all\",,,,\"T\")/100,\"\")","v":1.3129978783875744E-2},{"$f":"RANK($C27,$C$2:C$31)+COUNTIF($C$2:C27,C27)-1","v":2},"F.DD?",26,"F.PIL?",{"$f":"IFERROR( RTD(\"cqg.rtd\",,\"StudyData\",G27, \"PCB\",\"BaseType=Index,Price=1000,Index=1,Date=12/30/2016\", \"Close\",$C$1,,\"all\",,,,\"T\")/100,\"\")","v":-2.6982150269821504E-3},"",2.6982150269821504E-3,-2.6982150269821504E-3,{"$f":"IF(G27=\"\",\"\",RTD(\"cqg.rtd\",,\"ContractData\",G27,\"LongDescription\",,\"T\"))","v":"CAC40, Oct 20"}]
[null,{"$f":"'Symbols (2)'!B28","v":"F.DSX?"},{"$f":" IFERROR(RTD(\"cqg.rtd\",,\"StudyData\",B28, \"PCB\",\"BaseType=Index,Price=1000,Index=1,Date=12/30/2016\", \"Close\",$C$1,,\"all\",,,,\"T\")/100,\"\")","v":1.1142948105698823E-2},{"$f":"RANK($C28,$C$2:C$31)+COUNTIF($C$2:C28,C28)-1","v":3},"F.DSX?",27,"F.EU6?",{"$f":"IFERROR( RTD(\"cqg.rtd\",,\"StudyData\",G28, \"PCB\",\"BaseType=Index,Price=1000,Index=1,Date=12/30/2016\", \"Close\",$C$1,,\"all\",,,,\"T\")/100,\"\")","v":-2.8024287716021229E-3},"",2.8024287716021229E-3,-2.8024287716021229E-3,{"$f":"IF(G28=\"\",\"\",RTD(\"cqg.rtd\",,\"ContractData\",G28,\"LongDescription\",,\"T\"))","v":"Euro FX (Globex), Dec 20"}]
[null,{"$f":"'Symbols (2)'!B29","v":"F.QFA?"},{"$f":" IFERROR(RTD(\"cqg.rtd\",,\"StudyData\",B29, \"PCB\",\"BaseType=Index,Price=1000,Index=1,Date=12/30/2016\", \"Close\",$C$1,,\"all\",,,,\"T\")/100,\"\")","v":5.3457492671150197E-3},{"$f":"RANK($C29,$C$2:C$31)+COUNTIF($C$2:C29,C29)-1","v":7},"F.QFA?",28,"F.SF6?",{"$f":"IFERROR( RTD(\"cqg.rtd\",,\"StudyData\",G29, \"PCB\",\"BaseType=Index,Price=1000,Index=1,Date=12/30/2016\", \"Close\",$C$1,,\"all\",,,,\"T\")/100,\"\")","v":-3.4693691226148314E-3},"",3.4693691226148314E-3,-3.4693691226148314E-3,{"$f":"IF(G29=\"\",\"\",RTD(\"cqg.rtd\",,\"ContractData\",G29,\"LongDescription\",,\"T\"))","v":"Swiss Franc (Globex), Dec 20"}]
[null,{"$f":"'Symbols (2)'!B30","v":"F.PIL?"},{"$f":" IFERROR(RTD(\"cqg.rtd\",,\"StudyData\",B30, \"PCB\",\"BaseType=Index,Price=1000,Index=1,Date=12/30/2016\", \"Close\",$C$1,,\"all\",,,,\"T\")/100,\"\")","v":-2.6982150269821504E-3},{"$f":"RANK($C30,$C$2:C$31)+COUNTIF($C$2:C30,C30)-1","v":26},"F.PIL?",29,"F.BP6?",{"$f":"IFERROR( RTD(\"cqg.rtd\",,\"StudyData\",G30, \"PCB\",\"BaseType=Index,Price=1000,Index=1,Date=12/30/2016\", \"Close\",$C$1,,\"all\",,,,\"T\")/100,\"\")","v":-3.7499999999999339E-3},"",3.7499999999999339E-3,-3.7499999999999339E-3,{"$f":"IF(G30=\"\",\"\",RTD(\"cqg.rtd\",,\"ContractData\",G30,\"LongDescription\",,\"T\"))","v":"British Pound (Globex), Dec 20"}]
[null,{"$f":"'Symbols (2)'!B31","v":"F.NKD?"},{"$f":" IFERROR(RTD(\"cqg.rtd\",,\"StudyData\",B31, \"PCB\",\"BaseType=Index,Price=1000,Index=1,Date=12/30/2016\", \"Close\",$C$1,,\"all\",,,,\"T\")/100,\"\")","v":-2.4064756070881644E-3},{"$f":"RANK($C31,$C$2:C$31)+COUNTIF($C$2:C31,C31)-1","v":24},"F.NKD?",30,"F.PLE?",{"$f":"IFERROR( RTD(\"cqg.rtd\",,\"StudyData\",G31, \"PCB\",\"BaseType=Index,Price=1000,Index=1,Date=12/30/2016\", \"Close\",$C$1,,\"all\",,,,\"T\")/100,\"\")","v":-8.7889510329870243E-3},"",8.7889510329870243E-3,-8.7889510329870243E-3,{"$f":"IF(G31=\"\",\"\",RTD(\"cqg.rtd\",,\"ContractData\",G31,\"LongDescription\",,\"T\"))","v":"Platinum (Globex), Oct 20"}]

{"sheet":"Weekly (2)","index":9,"n_rows":31,"n_cols":12,"rows_kept":31,"cut":false,"hidden":true,"merged":[]}
[null,null,{"$f":"\"A\"&'Symbols (2)'!F2","v":"AW"}]
[null,{"$f":"'Symbols (2)'!B2","v":"F.DXE?"},{"$f":" IFERROR(RTD(\"cqg.rtd\",,\"StudyData\",B2, \"PCB\",\"BaseType=Index,Price=1000,Index=1,Date=12/30/2016\", \"Close\",$C$1,,\"all\",,,,\"T\")/100,\"\")","v":1.0252603494276648E-2},{"$f":"RANK($C2,$C$2:C$31)+COUNTIF($C$2:C2,C2)-1","v":2},{"$f":"B2","v":"F.DXE?"},1,{"$f":"IFERROR(VLOOKUP($F2,$D$2:$E$31,2,FALSE),\"\")","v":"F.HE"},{"$f":"IFERROR( RTD(\"cqg.rtd\",,\"StudyData\",G2, \"PCB\",\"BaseType=Index,Price=1000,Index=1,Date=12/30/2016\", \"Close\",$C$1,,\"all\",,,,\"T\")/100,\"\")","v":1.298701298701292E-2},{"$f":"IF(H2<0,\"\",H2)","v":1.298701298701292E-2},{"$f":"IF(H2>=0,\"\",-H2)","v":""},{"$f":"IF(J2=\"\",\"\",H2)","v":""},{"$f":"IF(G2=\"\",\"\",RTD(\"cqg.rtd\",,\"ContractData\",G2,\"LongDescription\",,\"T\"))","v":"Lean Hogs (Globex), Dec 20"}]
[null,{"$f":"'Symbols (2)'!B3","v":"F.EU6?"},{"$f":" IFERROR(RTD(\"cqg.rtd\",,\"StudyData\",B3, \"PCB\",\"BaseType=Index,Price=1000,Index=1,Date=12/30/2016\", \"Close\",$C$1,,\"all\",,,,\"T\")/100,\"\")","v":-1.1074616809836613E-2},{"$f":"RANK($C3,$C$2:C$31)+COUNTIF($C$2:C3,C3)-1","v":9},{"$f":"B3","v":"F.EU6?"},{"$f":"F2+1","v":2},{"$f":"IFERROR(VLOOKUP($F3,$D$2:$E$31,2,FALSE),\"\")","v":"F.DXE?"},{"$f":"IFERROR( RTD(\"cqg.rtd\",,\"StudyData\",G3, \"PCB\",\"BaseType=Index,Price=1000,Index=1,Date=12/30/2016\", \"Close\",$C$1,,\"all\",,,,\"T\")/100,\"\")","v":1.0252603494276648E-2},{"$f":"IF(H3<0,\"\",H3)","v":1.0252603494276648E-2},{"$f":"IF(H3>=0,\"\",-H3)","v":""},{"$f":"IF(J3=\"\",\"\",H3)","v":""},{"$f":"IF(G3=\"\",\"\",RTD(\"cqg.rtd\",,\"ContractData\",G3,\"LongDescription\",,\"T\"))","v":"Dollar Index (ICE), Dec 20"}]
[null,{"$f":"'Symbols (2)'!B4","v":"F.JY6?"},{"$f":" IFERROR(RTD(\"cqg.rtd\",,\"StudyData\",B4, \"PCB\",\"BaseType=Index,Price=1000,Index=1,Date=12/30/2016\", \"Close\",$C$1,,\"all\",,,,\"T\")/100,\"\")","v":-3.9162445825282593E-3},{"$f":"RANK($C4,$C$2:C$31)+COUNTIF($C$2:C4,C4)-1","v":5},"F.JY6?",{"$f":"F3+1","v":3},"F.ENQ?",{"$f":"IFERROR( RTD(\"cqg.rtd\",,\"StudyData\",G4, \"PCB\",\"BaseType=Index,Price=1000,Index=1,Date=12/30/2016\", \"Close\",$C$1,,\"all\",,,,\"T\")/100,\"\")","v":9.2202800402672279E-3},9.2202800402672279E-3,"","",{"$f":"IF(G4=\"\",\"\",RTD(\"cqg.rtd\",,\"ContractData\",G4,\"LongDescription\",,\"T\"))","v":"E-mini NASDAQ-100, Dec 20"}]
[null,{"$f":"'Symbols (2)'!B5","v":"F.BP6?"},{"$f":" IFERROR(RTD(\"cqg.rtd\",,\"StudyData\",B5, \"PCB\",\"BaseType=Index,Price=1000,Index=1,Date=12/30/2016\", \"Close\",$C$1,,\"all\",,,,\"T\")/100,\"\")","v":-1.3995206062011911E-2},{"$f":"RANK($C5,$C$2:C$31)+COUNTIF($C$2:C5,C5)-1","v":11},"F.BP6?",4,"F.TYA?",{"$f":"IFERROR( RTD(\"cqg.rtd\",,\"StudyData\",G5, \"PCB\",\"BaseType=Index,Price=1000,Index=1,Date=12/30/2016\", \"Close\",$C$1,,\"all\",,,,\"T\")/100,\"\")","v":1.0087424344317419E-3},1.0087424344317419E-3,"","",{"$f":"IF(G5=\"\",\"\",RTD(\"cqg.rtd\",,\"ContractData\",G5,\"LongDescription\",,\"T\"))","v":"10yr US Treasury Notes (Globex), Dec 20"}]
[null,{"$f":"'Symbols (2)'!B6","v":"F.CA6?"},{"$f":" IFERROR(RTD(\"cqg.rtd\",,\"StudyData\",B6, \"PCB\",\"BaseType=Index,Price=1000,Index=1,Date=12/30/2016\", \"Close\",$C$1,,\"all\",,,,\"T\")/100,\"\")","v":-8.5751978891819933E-3},{"$f":"RANK($C6,$C$2:C$31)+COUNTIF($C$2:C6,C6)-1","v":6},"F.CA6?",5,"F.JY6?",{"$f":"IFERROR( RTD(\"cqg.rtd\",,\"StudyData\",G6, \"PCB\",\"BaseType=Index,Price=1000,Index=1,Date=12/30/2016\", \"Close\",$C$1,,\"all\",,,,\"T\")/100,\"\")","v":-3.9162445825282593E-3},"",3.9162445825282593E-3,-3.9162445825282593E-3,{"$f":"IF(G6=\"\",\"\",RTD(\"cqg.rtd\",,\"ContractData\",G6,\"LongDescription\",,\"T\"))","v":"Japanese Yen (Globex), Dec 20"}]
[null,{"$f":"'Symbols (2)'!B7","v":"F.SF6?"},{"$f":" IFERROR(RTD(\"cqg.rtd\",,\"StudyData\",B7, \"PCB\",\"BaseType=Index,Price=1000,Index=1,Date=12/30/2016\", \"Close\",$C$1,,\"all\",,,,\"T\")/100,\"\")","v":-9.0785292782569298E-3},{"$f":"RANK($C7,$C$2:C$31)+COUNTIF($C$2:C7,C7)-1","v":7},"F.SF6?",6,"F.CA6?",{"$f":"IFERROR( RTD(\"cqg.rtd\",,\"StudyData\",G7, \"PCB\",\"BaseType=Index,Price=1000,Index=1,Date=12/30/2016\", \"Close\",$C$1,,\"all\",,,,\"T\")/100,\"\")","v":-8.5751978891819933E-3},"",8.5751978891819933E-3,-8.5751978891819933E-3,{"$f":"IF(G7=\"\",\"\",RTD(\"cqg.rtd\",,\"ContractData\",G7,\"LongDescription\",,\"T\"))","v":"Canadian Dollar (Globex), Dec 20"}]
[null,{"$f":"'Symbols (2)'!B8","v":"F.DA6?"},{"$f":" IFERROR(RTD(\"cqg.rtd\",,\"StudyData\",B8, \"PCB\",\"BaseType=Index,Price=1000,Index=1,Date=12/30/2016\", \"Close\",$C$1,,\"all\",,,,\"T\")/100,\"\")","v":-1.4381591562799702E-2},{"$f":"RANK($C8,$C$2:C$31)+COUNTIF($C$2:C8,C8)-1","v":12},"F.DA6?",7,"F.SF6?",{"$f":"IFERROR( RTD(\"cqg.rtd\",,\"StudyData\",G8, \"PCB\",\"BaseType=Index,Price=1000,Index=1,Date=12/30/2016\", \"Close\",$C$1,,\"all\",,,,\"T\")/100,\"\")","v":-9.0785292782569298E-3},"",9.0785292782569298E-3,-9.0785292782569298E-3,{"$f":"IF(G8=\"\",\"\",RTD(\"cqg.rtd\",,\"ContractData\",G8,\"LongDescription\",,\"T\"))","v":"Swiss Franc (Globex), Dec 20"}]
[null,{"$f":"'Symbols (2)'!B9","v":"F.NE6?"},{"$f":" IFERROR(RTD(\"cqg.rtd\",,\"StudyData\",B9, \"PCB\",\"BaseType=Index,Price=1000,Index=1,Date=12/30/2016\", \"Close\",$C$1,,\"all\",,,,\"T\")/100,\"\")","v":-1.8028668538495787E-2},{"$f":"RANK($C9,$C$2:C$31)+COUNTIF($C$2:C9,C9)-1","v":16},"F.NE6?",8,"F.EP?",{"$f":"IFERROR( RTD(\"cqg.rtd\",,\"StudyData\",G9, \"PCB\",\"BaseType=Index,Price=1000,Index=1,Date=12/30/2016\", \"Close\",$C$1,,\"all\",,,,\"T\")/100,\"\")","v":-9.8002261590652093E-3},"",9.8002261590652093E-3,-9.8002261590652093E-3,{"$f":"IF(G9=\"\",\"\",RTD(\"cqg.rtd\",,\"ContractData\",G9,\"LongDescription\",,\"T\"))","v":"E-Mini S&P 500, Dec 20"}]
[null,{"$f":"'Symbols (2)'!B10","v":"F.MX6?"},{"$f":" IFERROR(RTD(\"cqg.rtd\",,\"StudyData\",B10, \"PCB\",\"BaseType=Index,Price=1000,Index=1,Date=12/30/2016\", \"Close\",$C$1,,\"all\",,,,\"T\")/100,\"\")","v":-1.6407415299382052E-2},{"$f":"RANK($C10,$C$2:C$31)+COUNTIF($C$2:C10,C10)-1","v":15},"F.MX6?",9,"F.EU6?",{"$f":"IFERROR( RTD(\"cqg.rtd\",,\"StudyData\",G10, \"PCB\",\"BaseType=Index,Price=1000,Index=1,Date=12/30/2016\", \"Close\",$C$1,,\"all\",,,,\"T\")/100,\"\")","v":-1.1074616809836613E-2},"",1.1074616809836613E-2,-1.1074616809836613E-2,{"$f":"IF(G10=\"\",\"\",RTD(\"cqg.rtd\",,\"ContractData\",G10,\"LongDescription\",,\"T\"))","v":"Euro FX (Globex), Dec 20"}]
[null,{"$f":"'Symbols (2)'!B11","v":"F.GCE?"},{"$f":" IFERROR(RTD(\"cqg.rtd\",,\"StudyData\",B11, \"PCB\",\"BaseType=Index,Price=1000,Index=1,Date=12/30/2016\", \"Close\",$C$1,,\"all\",,,,\"T\")/100,\"\")","v":-2.5380969369553003E-2},{"$f":"RANK($C11,$C$2:C$31)+COUNTIF($C$2:C11,C11)-1","v":20},"F.GCE?",10,"F.GLE",{"$f":"IFERROR( RTD(\"cqg.rtd\",,\"StudyData\",G11, \"PCB\",\"BaseType=Index,Price=1000,Index=1,Date=12/30/2016\", \"Close\",$C$1,,\"all\",,,,\"T\")/100,\"\")","v":-1.2740277156906671E-2},"",1.2740277156906671E-2,-1.2740277156906671E-2,{"$f":"IF(G11=\"\",\"\",RTD(\"cqg.rtd\",,\"ContractData\",G11,\"LongDescription\",,\"T\"))","v":"Live Cattle (Globex), Dec 20"}]
[null,{"$f":"'Symbols (2)'!B12","v":"F.SIE?"},{"$f":" IFERROR(RTD(\"cqg.rtd\",,\"StudyData\",B12, \"PCB\",\"BaseType=Index,Price=1000,Index=1,Date=12/30/2016\", \"Close\",$C$1,,\"all\",,,,\"T\")/100,\"\")","v":-9.5985845405285819E-2},{"$f":"RANK($C12,$C$2:C$31)+COUNTIF($C$2:C12,C12)-1","v":30},"F.SIE?",11,"F.BP6?",{"$f":"IFERROR( RTD(\"cqg.rtd\",,\"StudyData\",G12, \"PCB\",\"BaseType=Index,Price=1000,Index=1,Date=12/30/2016\", \"Close\",$C$1,,\"all\",,,,\"T\")/100,\"\")","v":-1.3995206062011911E-2},"",1.3995206062011911E-2,-1.3995206062011911E-2,{"$f":"IF(G12=\"\",\"\",RTD(\"cqg.rtd\",,\"ContractData\",G12,\"LongDescription\",,\"T\"))","v":"British Pound (Globex), Dec 20"}]
[null,{"$f":"'Symbols (2)'!B13","v":"F.PLE?"},{"$f":" IFERROR(RTD(\"cqg.rtd\",,\"StudyData\",B13, \"PCB\",\"BaseType=Index,Price=1000,Index=1,Date=12/30/2016\", \"Close\",$C$1,,\"all\",,,,\"T\")/100,\"\")","v":-7.4693660095897604E-2},{"$f":"RANK($C13,$C$2:C$31)+COUNTIF($C$2:C13,C13)-1","v":29},"F.PLE?",12,"F.DA6?",{"$f":"IFERROR( RTD(\"cqg.rtd\",,\"StudyData\",G13, \"PCB\",\"BaseType=Index,Price=1000,Index=1,Date=12/30/2016\", \"Close\",$C$1,,\"all\",,,,\"T\")/100,\"\")","v":-1.4381591562799702E-2},"",1.4381591562799702E-2,-1.4381591562799702E-2,{"$f":"IF(G13=\"\",\"\",RTD(\"cqg.rtd\",,\"ContractData\",G13,\"LongDescription\",,\"T\"))","v":"Australian Dollar (Globex), Dec 20"}]
[null,{"$f":"'Symbols (2)'!B14","v":"F.TYA?"},{"$f":" IFERROR(RTD(\"cqg.rtd\",,\"StudyData\",B14, \"PCB\",\"BaseType=Index,Price=1000,Index=1,Date=12/30/2016\", \"Close\",$C$1,,\"all\",,,,\"T\")/100,\"\")","v":1.0087424344317419E-3},{"$f":"RANK($C14,$C$2:C$31)+COUNTIF($C$2:C14,C14)-1","v":4},"F.TYA?",13,"F.NKD?",{"$f":"IFERROR( RTD(\"cqg.rtd\",,\"StudyData\",G14, \"PCB\",\"BaseType=Index,Price=1000,Index=1,Date=12/30/2016\", \"Close\",$C$1,,\"all\",,,,\"T\")/100,\"\")","v":-1.5331461887281366E-2},"",1.5331461887281366E-2,-1.5331461887281366E-2,{"$f":"IF(G14=\"\",\"\",RTD(\"cqg.rtd\",,\"ContractData\",G14,\"LongDescription\",,\"T\"))","v":"Nikkei 225 (Globex), Dec 20"}]
[null,{"$f":"'Symbols (2)'!B15","v":"F.CLE?"},{"$f":" IFERROR(RTD(\"cqg.rtd\",,\"StudyData\",B15, \"PCB\",\"BaseType=Index,Price=1000,Index=1,Date=12/30/2016\", \"Close\",$C$1,,\"all\",,,,\"T\")/100,\"\")","v":-3.3397870280735785E-2},{"$f":"RANK($C15,$C$2:C$31)+COUNTIF($C$2:C15,C15)-1","v":25},"F.CLE?",14,"F.ZSE",{"$f":"IFERROR( RTD(\"cqg.rtd\",,\"StudyData\",G15, \"PCB\",\"BaseType=Index,Price=1000,Index=1,Date=12/30/2016\", \"Close\",$C$1,,\"all\",,,,\"T\")/100,\"\")","v":-1.5572592237661715E-2},"",1.5572592237661715E-2,-1.5572592237661715E-2,{"$f":"IF(G15=\"\",\"\",RTD(\"cqg.rtd\",,\"ContractData\",G15,\"LongDescription\",,\"T\"))","v":"Soybeans (Globex), Nov 20"}]
[null,{"$f":"'Symbols (2)'!B16","v":"F.HOE?"},{"$f":" IFERROR(RTD(\"cqg.rtd\",,\"StudyData\",B16, \"PCB\",\"BaseType=Index,Price=1000,Index=1,Date=12/30/2016\", \"Close\",$C$1,,\"all\",,,,\"T\")/100,\"\")","v":-3.1147540983606573E-2},{"$f":"RANK($C16,$C$2:C$31)+COUNTIF($C$2:C16,C16)-1","v":22},"F.HOE?",15,"F.MX6?",{"$f":"IFERROR( RTD(\"cqg.rtd\",,\"StudyData\",G16, \"PCB\",\"BaseType=Index,Price=1000,Index=1,Date=12/30/2016\", \"Close\",$C$1,,\"all\",,,,\"T\")/100,\"\")","v":-1.6407415299382052E-2},"",1.6407415299382052E-2,-1.6407415299382052E-2,{"$f":"IF(G16=\"\",\"\",RTD(\"cqg.rtd\",,\"ContractData\",G16,\"LongDescription\",,\"T\"))","v":"Mexican Peso (Globex), Dec 20"}]
[null,{"$f":"'Symbols (2)'!B17","v":"F.RBE?"},{"$f":" IFERROR(RTD(\"cqg.rtd\",,\"StudyData\",B17, \"PCB\",\"BaseType=Index,Price=1000,Index=1,Date=12/30/2016\", \"Close\",$C$1,,\"all\",,,,\"T\")/100,\"\")","v":-6.6472586123241181E-2},{"$f":"RANK($C17,$C$2:C$31)+COUNTIF($C$2:C17,C17)-1","v":28},"F.RBE?",16,"F.NE6?",{"$f":"IFERROR( RTD(\"cqg.rtd\",,\"StudyData\",G17, \"PCB\",\"BaseType=Index,Price=1000,Index=1,Date=12/30/2016\", \"Close\",$C$1,,\"all\",,,,\"T\")/100,\"\")","v":-1.8028668538495787E-2},"",1.8028668538495787E-2,-1.8028668538495787E-2,{"$f":"IF(G17=\"\",\"\",RTD(\"cqg.rtd\",,\"ContractData\",G17,\"LongDescription\",,\"T\"))","v":"New Zealand Dollar (Globex), Dec 20"}]
[null,{"$f":"'Symbols (2)'!B18","v":"F.ZSE"},{"$f":" IFERROR(RTD(\"cqg.rtd\",,\"StudyData\",B18, \"PCB\",\"BaseType=Index,Price=1000,Index=1,Date=12/30/2016\", \"Close\",$C$1,,\"all\",,,,\"T\")/100,\"\")","v":-1.5572592237661715E-2},{"$f":"RANK($C18,$C$2:C$31)+COUNTIF($C$2:C18,C18)-1","v":14},"F.ZSE",17,"F.YM?",{"$f":"IFERROR( RTD(\"cqg.rtd\",,\"StudyData\",G18, \"PCB\",\"BaseType=Index,Price=1000,Index=1,Date=12/30/2016\", \"Close\",$C$1,,\"all\",,,,\"T\")/100,\"\")","v":-2.0288384899644952E-2},"",2.0288384899644952E-2,-2.0288384899644952E-2,{"$f":"IF(G18=\"\",\"\",RTD(\"cqg.rtd\",,\"ContractData\",G18,\"LongDescription\",,\"T\"))","v":"E-mini Dow ($5), Dec 20"}]
[null,{"$f":"'Symbols (2)'!B19","v":"F.ZWA"},{"$f":" IFERROR(RTD(\"cqg.rtd\",,\"StudyData\",B19, \"PCB\",\"BaseType=Index,Price=1000,Index=1,Date=12/30/2016\", \"Close\",$C$1,,\"all\",,,,\"T\")/100,\"\")","v":-2.5652173913043478E-2},{"$f":"RANK($C19,$C$2:C$31)+COUNTIF($C$2:C19,C19)-1","v":21},"F.ZWA",18,"F.QFA?",{"$f":"IFERROR( RTD(\"cqg.rtd\",,\"StudyData\",G19, \"PCB\",\"BaseType=Index,Price=1000,Index=1,Date=12/30/2016\", \"Close\",$C$1,,\"all\",,,,\"T\")/100,\"\")","v":-2.3286982744178255E-2},"",2.3286982744178255E-2,-2.3286982744178255E-2,{"$f":"IF(G19=\"\",\"\",RTD(\"cqg.rtd\",,\"ContractData\",G19,\"LongDescription\",,\"T\"))","v":"FTSE 100 - Stnd Index, Dec 20"}]
[null,{"$f":"'Symbols (2)'!B20","v":"F.ZCE"},{"$f":" IFERROR(RTD(\"cqg.rtd\",,\"StudyData\",B20, \"PCB\",\"BaseType=Index,Price=1000,Index=1,Date=12/30/2016\", \"Close\",$C$1,,\"all\",,,,\"T\")/100,\"\")","v":-2.4438573315719952E-2},{"$f":"RANK($C20,$C$2:C$31)+COUNTIF($C$2:C20,C20)-1","v":19},"F.ZCE",19,"F.ZCE",{"$f":"IFERROR( RTD(\"cqg.rtd\",,\"StudyData\",G20, \"PCB\",\"BaseType=Index,Price=1000,Index=1,Date=12/30/2016\", \"Close\",$C$1,,\"all\",,,,\"T\")/100,\"\")","v":-2.4438573315719952E-2},"",2.4438573315719952E-2,-2.4438573315719952E-2,{"$f":"IF(G20=\"\",\"\",RTD(\"cqg.rtd\",,\"ContractData\",G20,\"LongDescription\",,\"T\"))","v":"Corn (Globex), Dec 20"}]
[null,{"$f":"'Symbols (2)'!B21","v":"F.GLE"},{"$f":" IFERROR(RTD(\"cqg.rtd\",,\"StudyData\",B21, \"PCB\",\"BaseType=Index,Price=1000,Index=1,Date=12/30/2016\", \"Close\",$C$1,,\"all\",,,,\"T\")/100,\"\")","v":-1.2740277156906671E-2},{"$f":"RANK($C21,$C$2:C$31)+COUNTIF($C$2:C21,C21)-1","v":10},"F.GLE",20,"F.GCE?",{"$f":"IFERROR( RTD(\"cqg.rtd\",,\"StudyData\",G21, \"PCB\",\"BaseType=Index,Price=1000,Index=1,Date=12/30/2016\", \"Close\",$C$1,,\"all\",,,,\"T\")/100,\"\")","v":-2.5380969369553003E-2},"",2.5380969369553003E-2,-2.5380969369553003E-2,{"$f":"IF(G21=\"\",\"\",RTD(\"cqg.rtd\",,\"ContractData\",G21,\"LongDescription\",,\"T\"))","v":"Gold (Globex), Dec 20"}]
[null,{"$f":"'Symbols (2)'!B22","v":"F.HE"},{"$f":" IFERROR(RTD(\"cqg.rtd\",,\"StudyData\",B22, \"PCB\",\"BaseType=Index,Price=1000,Index=1,Date=12/30/2016\", \"Close\",$C$1,,\"all\",,,,\"T\")/100,\"\")","v":1.298701298701292E-2},{"$f":"RANK($C22,$C$2:C$31)+COUNTIF($C$2:C22,C22)-1","v":1},"F.HE",21,"F.ZWA",{"$f":"IFERROR( RTD(\"cqg.rtd\",,\"StudyData\",G22, \"PCB\",\"BaseType=Index,Price=1000,Index=1,Date=12/30/2016\", \"Close\",$C$1,,\"all\",,,,\"T\")/100,\"\")","v":-2.5652173913043478E-2},"",2.5652173913043478E-2,-2.5652173913043478E-2,{"$f":"IF(G22=\"\",\"\",RTD(\"cqg.rtd\",,\"ContractData\",G22,\"LongDescription\",,\"T\"))","v":"Wheat (Globex), Dec 20"}]
[null,{"$f":"'Symbols (2)'!B23","v":"F.YM?"},{"$f":" IFERROR(RTD(\"cqg.rtd\",,\"StudyData\",B23, \"PCB\",\"BaseType=Index,Price=1000,Index=1,Date=12/30/2016\", \"Close\",$C$1,,\"all\",,,,\"T\")/100,\"\")","v":-2.0288384899644952E-2},{"$f":"RANK($C23,$C$2:C$31)+COUNTIF($C$2:C23,C23)-1","v":17},"F.YM?",22,"F.HOE?",{"$f":"IFERROR( RTD(\"cqg.rtd\",,\"StudyData\",G23, \"PCB\",\"BaseType=Index,Price=1000,Index=1,Date=12/30/2016\", \"Close\",$C$1,,\"all\",,,,\"T\")/100,\"\")","v":-3.1147540983606573E-2},"",3.1147540983606573E-2,-3.1147540983606573E-2,{"$f":"IF(G23=\"\",\"\",RTD(\"cqg.rtd\",,\"ContractData\",G23,\"LongDescription\",,\"T\"))","v":"NY Harbor ULSD, Nov 20"}]
[null,{"$f":"'Symbols (2)'!B24","v":"F.EP?"},{"$f":" IFERROR(RTD(\"cqg.rtd\",,\"StudyData\",B24, \"PCB\",\"BaseType=Index,Price=1000,Index=1,Date=12/30/2016\", \"Close\",$C$1,,\"all\",,,,\"T\")/100,\"\")","v":-9.8002261590652093E-3},{"$f":"RANK($C24,$C$2:C$31)+COUNTIF($C$2:C24,C24)-1","v":8},"F.EP?",23,"F.PIL?",{"$f":"IFERROR( RTD(\"cqg.rtd\",,\"StudyData\",G24, \"PCB\",\"BaseType=Index,Price=1000,Index=1,Date=12/30/2016\", \"Close\",$C$1,,\"all\",,,,\"T\")/100,\"\")","v":-3.1445273130417256E-2},"",3.1445273130417256E-2,-3.1445273130417256E-2,{"$f":"IF(G24=\"\",\"\",RTD(\"cqg.rtd\",,\"ContractData\",G24,\"LongDescription\",,\"T\"))","v":"CAC40, Oct 20"}]
[null,{"$f":"'Symbols (2)'!B25","v":"F.ENQ?"},{"$f":" IFERROR(RTD(\"cqg.rtd\",,\"StudyData\",B25, \"PCB\",\"BaseType=Index,Price=1000,Index=1,Date=12/30/2016\", \"Close\",$C$1,,\"all\",,,,\"T\")/100,\"\")","v":9.2202800402672279E-3},{"$f":"RANK($C25,$C$2:C$31)+COUNTIF($C$2:C25,C25)-1","v":3},"F.ENQ?",24,"F.DSX?",{"$f":"IFERROR( RTD(\"cqg.rtd\",,\"StudyData\",G25, \"PCB\",\"BaseType=Index,Price=1000,Index=1,Date=12/30/2016\", \"Close\",$C$1,,\"all\",,,,\"T\")/100,\"\")","v":-3.1707317073170732E-2},"",3.1707317073170732E-2,-3.1707317073170732E-2,{"$f":"IF(G25=\"\",\"\",RTD(\"cqg.rtd\",,\"ContractData\",G25,\"LongDescription\",,\"T\"))","v":"Euro STOXX 50, Dec 20"}]
[null,{"$f":"'Symbols (2)'!B26","v":"F.RTY?"},{"$f":" IFERROR(RTD(\"cqg.rtd\",,\"StudyData\",B26, \"PCB\",\"BaseType=Index,Price=1000,Index=1,Date=12/30/2016\", \"Close\",$C$1,,\"all\",,,,\"T\")/100,\"\")","v":-3.5686376660588812E-2},{"$f":"RANK($C26,$C$2:C$31)+COUNTIF($C$2:C26,C26)-1","v":26},"F.RTY?",25,"F.CLE?",{"$f":"IFERROR( RTD(\"cqg.rtd\",,\"StudyData\",G26, \"PCB\",\"BaseType=Index,Price=1000,Index=1,Date=12/30/2016\", \"Close\",$C$1,,\"all\",,,,\"T\")/100,\"\")","v":-3.3397870280735785E-2},"",3.3397870280735785E-2,-3.3397870280735785E-2,{"$f":"IF(G26=\"\",\"\",RTD(\"cqg.rtd\",,\"ContractData\",G26,\"LongDescription\",,\"T\"))","v":"Crude Light (Globex), Nov 20"}]
[null,{"$f":"'Symbols (2)'!B27","v":"F.DD?"},{"$f":" IFERROR(RTD(\"cqg.rtd\",,\"StudyData\",B27, \"PCB\",\"BaseType=Index,Price=1000,Index=1,Date=12/30/2016\", \"Close\",$C$1,,\"all\",,,,\"T\")/100,\"\")","v":-3.7131443789233408E-2},{"$f":"RANK($C27,$C$2:C$31)+COUNTIF($C$2:C27,C27)-1","v":27},"F.DD?",26,"F.RTY?",{"$f":"IFERROR( RTD(\"cqg.rtd\",,\"StudyData\",G27, \"PCB\",\"BaseType=Index,Price=1000,Index=1,Date=12/30/2016\", \"Close\",$C$1,,\"all\",,,,\"T\")/100,\"\")","v":-3.5686376660588812E-2},"",3.5686376660588812E-2,-3.5686376660588812E-2,{"$f":"IF(G27=\"\",\"\",RTD(\"cqg.rtd\",,\"ContractData\",G27,\"LongDescription\",,\"T\"))","v":"E-mini Russell 2000, Dec 20"}]
[null,{"$f":"'Symbols (2)'!B28","v":"F.DSX?"},{"$f":" IFERROR(RTD(\"cqg.rtd\",,\"StudyData\",B28, \"PCB\",\"BaseType=Index,Price=1000,Index=1,Date=12/30/2016\", \"Close\",$C$1,,\"all\",,,,\"T\")/100,\"\")","v":-3.1707317073170732E-2},{"$f":"RANK($C28,$C$2:C$31)+COUNTIF($C$2:C28,C28)-1","v":24},"F.DSX?",27,"F.DD?",{"$f":"IFERROR( RTD(\"cqg.rtd\",,\"StudyData\",G28, \"PCB\",\"BaseType=Index,Price=1000,Index=1,Date=12/30/2016\", \"Close\",$C$1,,\"all\",,,,\"T\")/100,\"\")","v":-3.7131443789233408E-2},"",3.7131443789233408E-2,-3.7131443789233408E-2,{"$f":"IF(G28=\"\",\"\",RTD(\"cqg.rtd\",,\"ContractData\",G28,\"LongDescription\",,\"T\"))","v":"DAX Index, Dec 20"}]
[null,{"$f":"'Symbols (2)'!B29","v":"F.QFA?"},{"$f":" IFERROR(RTD(\"cqg.rtd\",,\"StudyData\",B29, \"PCB\",\"BaseType=Index,Price=1000,Index=1,Date=12/30/2016\", \"Close\",$C$1,,\"all\",,,,\"T\")/100,\"\")","v":-2.3286982744178255E-2},{"$f":"RANK($C29,$C$2:C$31)+COUNTIF($C$2:C29,C29)-1","v":18},"F.QFA?",28,"F.RBE?",{"$f":"IFERROR( RTD(\"cqg.rtd\",,\"StudyData\",G29, \"PCB\",\"BaseType=Index,Price=1000,Index=1,Date=12/30/2016\", \"Close\",$C$1,,\"all\",,,,\"T\")/100,\"\")","v":-6.6472586123241181E-2},"",6.6472586123241181E-2,-6.6472586123241181E-2,{"$f":"IF(G29=\"\",\"\",RTD(\"cqg.rtd\",,\"ContractData\",G29,\"LongDescription\",,\"T\"))","v":"RBOB Gasoline (Globex), Nov 20"}]
[null,{"$f":"'Symbols (2)'!B30","v":"F.PIL?"},{"$f":" IFERROR(RTD(\"cqg.rtd\",,\"StudyData\",B30, \"PCB\",\"BaseType=Index,Price=1000,Index=1,Date=12/30/2016\", \"Close\",$C$1,,\"all\",,,,\"T\")/100,\"\")","v":-3.1445273130417256E-2},{"$f":"RANK($C30,$C$2:C$31)+COUNTIF($C$2:C30,C30)-1","v":23},"F.PIL?",29,"F.PLE?",{"$f":"IFERROR( RTD(\"cqg.rtd\",,\"StudyData\",G30, \"PCB\",\"BaseType=Index,Price=1000,Index=1,Date=12/30/2016\", \"Close\",$C$1,,\"all\",,,,\"T\")/100,\"\")","v":-7.4693660095897604E-2},"",7.4693660095897604E-2,-7.4693660095897604E-2,{"$f":"IF(G30=\"\",\"\",RTD(\"cqg.rtd\",,\"ContractData\",G30,\"LongDescription\",,\"T\"))","v":"Platinum (Globex), Oct 20"}]
[null,{"$f":"'Symbols (2)'!B31","v":"F.NKD?"},{"$f":" IFERROR(RTD(\"cqg.rtd\",,\"StudyData\",B31, \"PCB\",\"BaseType=Index,Price=1000,Index=1,Date=12/30/2016\", \"Close\",$C$1,,\"all\",,,,\"T\")/100,\"\")","v":-1.5331461887281366E-2},{"$f":"RANK($C31,$C$2:C$31)+COUNTIF($C$2:C31,C31)-1","v":13},"F.NKD?",30,"F.SIE?",{"$f":"IFERROR( RTD(\"cqg.rtd\",,\"StudyData\",G31, \"PCB\",\"BaseType=Index,Price=1000,Index=1,Date=12/30/2016\", \"Close\",$C$1,,\"all\",,,,\"T\")/100,\"\")","v":-9.5985845405285819E-2},"",9.5985845405285819E-2,-9.5985845405285819E-2,{"$f":"IF(G31=\"\",\"\",RTD(\"cqg.rtd\",,\"ContractData\",G31,\"LongDescription\",,\"T\"))","v":"Silver (Globex), Dec 20"}]

{"sheet":"Monthly (2)","index":10,"n_rows":31,"n_cols":12,"rows_kept":31,"cut":false,"hidden":true,"merged":[]}
[null,null,{"$f":"\"A\"&'Symbols (2)'!G2","v":"AM"}]
[null,{"$f":"'Symbols (2)'!B2","v":"F.DXE?"},{"$f":" IFERROR(RTD(\"cqg.rtd\",,\"StudyData\",B2, \"PCB\",\"BaseType=Index,Price=1000,Index=1,Date=12/30/2016\", \"Close\",$C$1,,\"all\",,,,\"T\")/100,\"\")","v":1.9255190978063854E-2},{"$f":"RANK($C2,$C$2:C$31)+COUNTIF($C$2:C2,C2)-1","v":5},{"$f":"B2","v":"F.DXE?"},1,{"$f":"IFERROR(VLOOKUP($F2,$D$2:$E$31,2,FALSE),\"\")","v":"F.HE"},{"$f":"IFERROR( RTD(\"cqg.rtd\",,\"StudyData\",G2, \"PCB\",\"BaseType=Index,Price=1000,Index=1,Date=12/30/2016\", \"Close\",$C$1,,\"all\",,,,\"T\")/100,\"\")","v":0.20055970149253718},{"$f":"IF(H2<0,\"\",H2)","v":0.20055970149253718},{"$f":"IF(H2>=0,\"\",-H2)","v":""},{"$f":"IF(J2=\"\",\"\",H2)","v":""},{"$f":"IF(G2=\"\",\"\",RTD(\"cqg.rtd\",,\"ContractData\",G2,\"LongDescription\",,\"T\"))","v":"Lean Hogs (Globex), Dec 20"}]
[null,{"$f":"'Symbols (2)'!B3","v":"F.EU6?"},{"$f":" IFERROR(RTD(\"cqg.rtd\",,\"StudyData\",B3, \"PCB\",\"BaseType=Index,Price=1000,Index=1,Date=12/30/2016\", \"Close\",$C$1,,\"all\",,,,\"T\")/100,\"\")","v":-1.6499853427698018E-2},{"$f":"RANK($C3,$C$2:C$31)+COUNTIF($C$2:C3,C3)-1","v":13},{"$f":"B3","v":"F.EU6?"},{"$f":"F2+1","v":2},{"$f":"IFERROR(VLOOKUP($F3,$D$2:$E$31,2,FALSE),\"\")","v":"F.ZSE"},{"$f":"IFERROR( RTD(\"cqg.rtd\",,\"StudyData\",G3, \"PCB\",\"BaseType=Index,Price=1000,Index=1,Date=12/30/2016\", \"Close\",$C$1,,\"all\",,,,\"T\")/100,\"\")","v":7.7346617724174088E-2},{"$f":"IF(H3<0,\"\",H3)","v":7.7346617724174088E-2},{"$f":"IF(H3>=0,\"\",-H3)","v":""},{"$f":"IF(J3=\"\",\"\",H3)","v":""},{"$f":"IF(G3=\"\",\"\",RTD(\"cqg.rtd\",,\"ContractData\",G3,\"LongDescription\",,\"T\"))","v":"Soybeans (Globex), Nov 20"}]
[null,{"$f":"'Symbols (2)'!B4","v":"F.JY6?"},{"$f":" IFERROR(RTD(\"cqg.rtd\",,\"StudyData\",B4, \"PCB\",\"BaseType=Index,Price=1000,Index=1,Date=12/30/2016\", \"Close\",$C$1,,\"all\",,,,\"T\")/100,\"\")","v":9.57925377083888E-3},{"$f":"RANK($C4,$C$2:C$31)+COUNTIF($C$2:C4,C4)-1","v":8},"F.JY6?",{"$f":"F3+1","v":3},"F.GLE",{"$f":"IFERROR( RTD(\"cqg.rtd\",,\"StudyData\",G4, \"PCB\",\"BaseType=Index,Price=1000,Index=1,Date=12/30/2016\", \"Close\",$C$1,,\"all\",,,,\"T\")/100,\"\")","v":4.8670465337131999E-2},4.8670465337131999E-2,"","",{"$f":"IF(G4=\"\",\"\",RTD(\"cqg.rtd\",,\"ContractData\",G4,\"LongDescription\",,\"T\"))","v":"Live Cattle (Globex), Dec 20"}]
[null,{"$f":"'Symbols (2)'!B5","v":"F.BP6?"},{"$f":" IFERROR(RTD(\"cqg.rtd\",,\"StudyData\",B5, \"PCB\",\"BaseType=Index,Price=1000,Index=1,Date=12/30/2016\", \"Close\",$C$1,,\"all\",,,,\"T\")/100,\"\")","v":-4.6864489124747728E-2},{"$f":"RANK($C5,$C$2:C$31)+COUNTIF($C$2:C5,C5)-1","v":21},"F.BP6?",4,"F.ZCE",{"$f":"IFERROR( RTD(\"cqg.rtd\",,\"StudyData\",G5, \"PCB\",\"BaseType=Index,Price=1000,Index=1,Date=12/30/2016\", \"Close\",$C$1,,\"all\",,,,\"T\")/100,\"\")","v":3.2145352900069882E-2},3.2145352900069882E-2,"","",{"$f":"IF(G5=\"\",\"\",RTD(\"cqg.rtd\",,\"ContractData\",G5,\"LongDescription\",,\"T\"))","v":"Corn (Globex), Dec 20"}]
[null,{"$f":"'Symbols (2)'!B6","v":"F.CA6?"},{"$f":" IFERROR(RTD(\"cqg.rtd\",,\"StudyData\",B6, \"PCB\",\"BaseType=Index,Price=1000,Index=1,Date=12/30/2016\", \"Close\",$C$1,,\"all\",,,,\"T\")/100,\"\")","v":-2.1101992966002334E-2},{"$f":"RANK($C6,$C$2:C$31)+COUNTIF($C$2:C6,C6)-1","v":15},"F.CA6?",5,"F.DXE?",{"$f":"IFERROR( RTD(\"cqg.rtd\",,\"StudyData\",G6, \"PCB\",\"BaseType=Index,Price=1000,Index=1,Date=12/30/2016\", \"Close\",$C$1,,\"all\",,,,\"T\")/100,\"\")","v":1.9255190978063854E-2},1.9255190978063854E-2,"","",{"$f":"IF(G6=\"\",\"\",RTD(\"cqg.rtd\",,\"ContractData\",G6,\"LongDescription\",,\"T\"))","v":"Dollar Index (ICE), Dec 20"}]
[null,{"$f":"'Symbols (2)'!B7","v":"F.SF6?"},{"$f":" IFERROR(RTD(\"cqg.rtd\",,\"StudyData\",B7, \"PCB\",\"BaseType=Index,Price=1000,Index=1,Date=12/30/2016\", \"Close\",$C$1,,\"all\",,,,\"T\")/100,\"\")","v":-1.4446952595936806E-2},{"$f":"RANK($C7,$C$2:C$31)+COUNTIF($C$2:C7,C7)-1","v":11},"F.SF6?",6,"F.ZWA",{"$f":"IFERROR( RTD(\"cqg.rtd\",,\"StudyData\",G7, \"PCB\",\"BaseType=Index,Price=1000,Index=1,Date=12/30/2016\", \"Close\",$C$1,,\"all\",,,,\"T\")/100,\"\")","v":1.4486192847442281E-2},1.4486192847442281E-2,"","",{"$f":"IF(G7=\"\",\"\",RTD(\"cqg.rtd\",,\"ContractData\",G7,\"LongDescription\",,\"T\"))","v":"Wheat (Globex), Dec 20"}]
[null,{"$f":"'Symbols (2)'!B8","v":"F.DA6?"},{"$f":" IFERROR(RTD(\"cqg.rtd\",,\"StudyData\",B8, \"PCB\",\"BaseType=Index,Price=1000,Index=1,Date=12/30/2016\", \"Close\",$C$1,,\"all\",,,,\"T\")/100,\"\")","v":-2.6119907971308681E-2},{"$f":"RANK($C8,$C$2:C$31)+COUNTIF($C$2:C8,C8)-1","v":17},"F.DA6?",7,"F.MX6?",{"$f":"IFERROR( RTD(\"cqg.rtd\",,\"StudyData\",G8, \"PCB\",\"BaseType=Index,Price=1000,Index=1,Date=12/30/2016\", \"Close\",$C$1,,\"all\",,,,\"T\")/100,\"\")","v":1.1836913634370862E-2},1.1836913634370862E-2,"","",{"$f":"IF(G8=\"\",\"\",RTD(\"cqg.rtd\",,\"ContractData\",G8,\"LongDescription\",,\"T\"))","v":"Mexican Peso (Globex), Dec 20"}]
[null,{"$f":"'Symbols (2)'!B9","v":"F.NE6?"},{"$f":" IFERROR(RTD(\"cqg.rtd\",,\"StudyData\",B9, \"PCB\",\"BaseType=Index,Price=1000,Index=1,Date=12/30/2016\", \"Close\",$C$1,,\"all\",,,,\"T\")/100,\"\")","v":-1.4971835161577227E-2},{"$f":"RANK($C9,$C$2:C$31)+COUNTIF($C$2:C9,C9)-1","v":12},"F.NE6?",8,"F.JY6?",{"$f":"IFERROR( RTD(\"cqg.rtd\",,\"StudyData\",G9, \"PCB\",\"BaseType=Index,Price=1000,Index=1,Date=12/30/2016\", \"Close\",$C$1,,\"all\",,,,\"T\")/100,\"\")","v":9.57925377083888E-3},9.57925377083888E-3,"","",{"$f":"IF(G9=\"\",\"\",RTD(\"cqg.rtd\",,\"ContractData\",G9,\"LongDescription\",,\"T\"))","v":"Japanese Yen (Globex), Dec 20"}]
[null,{"$f":"'Symbols (2)'!B10","v":"F.MX6?"},{"$f":" IFERROR(RTD(\"cqg.rtd\",,\"StudyData\",B10, \"PCB\",\"BaseType=Index,Price=1000,Index=1,Date=12/30/2016\", \"Close\",$C$1,,\"all\",,,,\"T\")/100,\"\")","v":1.1836913634370862E-2},{"$f":"RANK($C10,$C$2:C$31)+COUNTIF($C$2:C10,C10)-1","v":7},"F.MX6?",9,"F.TYA?",{"$f":"IFERROR( RTD(\"cqg.rtd\",,\"StudyData\",G10, \"PCB\",\"BaseType=Index,Price=1000,Index=1,Date=12/30/2016\", \"Close\",$C$1,,\"all\",,,,\"T\")/100,\"\")","v":2.1319569120287251E-3},2.1319569120287251E-3,"","",{"$f":"IF(G10=\"\",\"\",RTD(\"cqg.rtd\",,\"ContractData\",G10,\"LongDescription\",,\"T\"))","v":"10yr US Treasury Notes (Globex), Dec 20"}]
[null,{"$f":"'Symbols (2)'!B11","v":"F.GCE?"},{"$f":" IFERROR(RTD(\"cqg.rtd\",,\"StudyData\",B11, \"PCB\",\"BaseType=Index,Price=1000,Index=1,Date=12/30/2016\", \"Close\",$C$1,,\"all\",,,,\"T\")/100,\"\")","v":-3.3508541392904045E-2},{"$f":"RANK($C11,$C$2:C$31)+COUNTIF($C$2:C11,C11)-1","v":20},"F.GCE?",10,"F.NKD?",{"$f":"IFERROR( RTD(\"cqg.rtd\",,\"StudyData\",G11, \"PCB\",\"BaseType=Index,Price=1000,Index=1,Date=12/30/2016\", \"Close\",$C$1,,\"all\",,,,\"T\")/100,\"\")","v":-1.3200605929452498E-2},"",1.3200605929452498E-2,-1.3200605929452498E-2,{"$f":"IF(G11=\"\",\"\",RTD(\"cqg.rtd\",,\"ContractData\",G11,\"LongDescription\",,\"T\"))","v":"Nikkei 225 (Globex), Dec 20"}]
[null,{"$f":"'Symbols (2)'!B12","v":"F.SIE?"},{"$f":" IFERROR(RTD(\"cqg.rtd\",,\"StudyData\",B12, \"PCB\",\"BaseType=Index,Price=1000,Index=1,Date=12/30/2016\", \"Close\",$C$1,,\"all\",,,,\"T\")/100,\"\")","v":-0.14230258096104073},{"$f":"RANK($C12,$C$2:C$31)+COUNTIF($C$2:C12,C12)-1","v":30},"F.SIE?",11,"F.SF6?",{"$f":"IFERROR( RTD(\"cqg.rtd\",,\"StudyData\",G12, \"PCB\",\"BaseType=Index,Price=1000,Index=1,Date=12/30/2016\", \"Close\",$C$1,,\"all\",,,,\"T\")/100,\"\")","v":-1.4446952595936806E-2},"",1.4446952595936806E-2,-1.4446952595936806E-2,{"$f":"IF(G12=\"\",\"\",RTD(\"cqg.rtd\",,\"ContractData\",G12,\"LongDescription\",,\"T\"))","v":"Swiss Franc (Globex), Dec 20"}]
[null,{"$f":"'Symbols (2)'!B13","v":"F.PLE?"},{"$f":" IFERROR(RTD(\"cqg.rtd\",,\"StudyData\",B13, \"PCB\",\"BaseType=Index,Price=1000,Index=1,Date=12/30/2016\", \"Close\",$C$1,,\"all\",,,,\"T\")/100,\"\")","v":-7.4101716600916939E-2},{"$f":"RANK($C13,$C$2:C$31)+COUNTIF($C$2:C13,C13)-1","v":27},"F.PLE?",12,"F.NE6?",{"$f":"IFERROR( RTD(\"cqg.rtd\",,\"StudyData\",G13, \"PCB\",\"BaseType=Index,Price=1000,Index=1,Date=12/30/2016\", \"Close\",$C$1,,\"all\",,,,\"T\")/100,\"\")","v":-1.4971835161577227E-2},"",1.4971835161577227E-2,-1.4971835161577227E-2,{"$f":"IF(G13=\"\",\"\",RTD(\"cqg.rtd\",,\"ContractData\",G13,\"LongDescription\",,\"T\"))","v":"New Zealand Dollar (Globex), Dec 20"}]
[null,{"$f":"'Symbols (2)'!B14","v":"F.TYA?"},{"$f":" IFERROR(RTD(\"cqg.rtd\",,\"StudyData\",B14, \"PCB\",\"BaseType=Index,Price=1000,Index=1,Date=12/30/2016\", \"Close\",$C$1,,\"all\",,,,\"T\")/100,\"\")","v":2.1319569120287251E-3},{"$f":"RANK($C14,$C$2:C$31)+COUNTIF($C$2:C14,C14)-1","v":9},"F.TYA?",13,"F.EU6?",{"$f":"IFERROR( RTD(\"cqg.rtd\",,\"StudyData\",G14, \"PCB\",\"BaseType=Index,Price=1000,Index=1,Date=12/30/2016\", \"Close\",$C$1,,\"all\",,,,\"T\")/100,\"\")","v":-1.6499853427698018E-2},"",1.6499853427698018E-2,-1.6499853427698018E-2,{"$f":"IF(G14=\"\",\"\",RTD(\"cqg.rtd\",,\"ContractData\",G14,\"LongDescription\",,\"T\"))","v":"Euro FX (Globex), Dec 20"}]
[null,{"$f":"'Symbols (2)'!B15","v":"F.CLE?"},{"$f":" IFERROR(RTD(\"cqg.rtd\",,\"StudyData\",B15, \"PCB\",\"BaseType=Index,Price=1000,Index=1,Date=12/30/2016\", \"Close\",$C$1,,\"all\",,,,\"T\")/100,\"\")","v":-6.2661347101619372E-2},{"$f":"RANK($C15,$C$2:C$31)+COUNTIF($C$2:C15,C15)-1","v":26},"F.CLE?",14,"F.DD?",{"$f":"IFERROR( RTD(\"cqg.rtd\",,\"StudyData\",G15, \"PCB\",\"BaseType=Index,Price=1000,Index=1,Date=12/30/2016\", \"Close\",$C$1,,\"all\",,,,\"T\")/100,\"\")","v":-2.1004177626489248E-2},"",2.1004177626489248E-2,-2.1004177626489248E-2,{"$f":"IF(G15=\"\",\"\",RTD(\"cqg.rtd\",,\"ContractData\",G15,\"LongDescription\",,\"T\"))","v":"DAX Index, Dec 20"}]
[null,{"$f":"'Symbols (2)'!B16","v":"F.HOE?"},{"$f":" IFERROR(RTD(\"cqg.rtd\",,\"StudyData\",B16, \"PCB\",\"BaseType=Index,Price=1000,Index=1,Date=12/30/2016\", \"Close\",$C$1,,\"all\",,,,\"T\")/100,\"\")","v":-7.7548673293354173E-2},{"$f":"RANK($C16,$C$2:C$31)+COUNTIF($C$2:C16,C16)-1","v":28},"F.HOE?",15,"F.CA6?",{"$f":"IFERROR( RTD(\"cqg.rtd\",,\"StudyData\",G16, \"PCB\",\"BaseType=Index,Price=1000,Index=1,Date=12/30/2016\", \"Close\",$C$1,,\"all\",,,,\"T\")/100,\"\")","v":-2.1101992966002334E-2},"",2.1101992966002334E-2,-2.1101992966002334E-2,{"$f":"IF(G16=\"\",\"\",RTD(\"cqg.rtd\",,\"ContractData\",G16,\"LongDescription\",,\"T\"))","v":"Canadian Dollar (Globex), Dec 20"}]
[null,{"$f":"'Symbols (2)'!B17","v":"F.RBE?"},{"$f":" IFERROR(RTD(\"cqg.rtd\",,\"StudyData\",B17, \"PCB\",\"BaseType=Index,Price=1000,Index=1,Date=12/30/2016\", \"Close\",$C$1,,\"all\",,,,\"T\")/100,\"\")","v":-4.8858861333113547E-2},{"$f":"RANK($C17,$C$2:C$31)+COUNTIF($C$2:C17,C17)-1","v":23},"F.RBE?",16,"F.QFA?",{"$f":"IFERROR( RTD(\"cqg.rtd\",,\"StudyData\",G17, \"PCB\",\"BaseType=Index,Price=1000,Index=1,Date=12/30/2016\", \"Close\",$C$1,,\"all\",,,,\"T\")/100,\"\")","v":-2.5328094959458328E-2},"",2.5328094959458328E-2,-2.5328094959458328E-2,{"$f":"IF(G17=\"\",\"\",RTD(\"cqg.rtd\",,\"ContractData\",G17,\"LongDescription\",,\"T\"))","v":"FTSE 100 - Stnd Index, Dec 20"}]
[null,{"$f":"'Symbols (2)'!B18","v":"F.ZSE"},{"$f":" IFERROR(RTD(\"cqg.rtd\",,\"StudyData\",B18, \"PCB\",\"BaseType=Index,Price=1000,Index=1,Date=12/30/2016\", \"Close\",$C$1,,\"all\",,,,\"T\")/100,\"\")","v":7.7346617724174088E-2},{"$f":"RANK($C18,$C$2:C$31)+COUNTIF($C$2:C18,C18)-1","v":2},"F.ZSE",17,"F.DA6?",{"$f":"IFERROR( RTD(\"cqg.rtd\",,\"StudyData\",G18, \"PCB\",\"BaseType=Index,Price=1000,Index=1,Date=12/30/2016\", \"Close\",$C$1,,\"all\",,,,\"T\")/100,\"\")","v":-2.6119907971308681E-2},"",2.6119907971308681E-2,-2.6119907971308681E-2,{"$f":"IF(G18=\"\",\"\",RTD(\"cqg.rtd\",,\"ContractData\",G18,\"LongDescription\",,\"T\"))","v":"Australian Dollar (Globex), Dec 20"}]
[null,{"$f":"'Symbols (2)'!B19","v":"F.ZWA"},{"$f":" IFERROR(RTD(\"cqg.rtd\",,\"StudyData\",B19, \"PCB\",\"BaseType=Index,Price=1000,Index=1,Date=12/30/2016\", \"Close\",$C$1,,\"all\",,,,\"T\")/100,\"\")","v":1.4486192847442281E-2},{"$f":"RANK($C19,$C$2:C$31)+COUNTIF($C$2:C19,C19)-1","v":6},"F.ZWA",18,"F.PIL?",{"$f":"IFERROR( RTD(\"cqg.rtd\",,\"StudyData\",G19, \"PCB\",\"BaseType=Index,Price=1000,Index=1,Date=12/30/2016\", \"Close\",$C$1,,\"all\",,,,\"T\")/100,\"\")","v":-2.6736884747822563E-2},"",2.6736884747822563E-2,-2.6736884747822563E-2,{"$f":"IF(G19=\"\",\"\",RTD(\"cqg.rtd\",,\"ContractData\",G19,\"LongDescription\",,\"T\"))","v":"CAC40, Oct 20"}]
[null,{"$f":"'Symbols (2)'!B20","v":"F.ZCE"},{"$f":" IFERROR(RTD(\"cqg.rtd\",,\"StudyData\",B20, \"PCB\",\"BaseType=Index,Price=1000,Index=1,Date=12/30/2016\", \"Close\",$C$1,,\"all\",,,,\"T\")/100,\"\")","v":3.2145352900069882E-2},{"$f":"RANK($C20,$C$2:C$31)+COUNTIF($C$2:C20,C20)-1","v":4},"F.ZCE",19,"F.DSX?",{"$f":"IFERROR( RTD(\"cqg.rtd\",,\"StudyData\",G20, \"PCB\",\"BaseType=Index,Price=1000,Index=1,Date=12/30/2016\", \"Close\",$C$1,,\"all\",,,,\"T\")/100,\"\")","v":-2.7258805513016845E-2},"",2.7258805513016845E-2,-2.7258805513016845E-2,{"$f":"IF(G20=\"\",\"\",RTD(\"cqg.rtd\",,\"ContractData\",G20,\"LongDescription\",,\"T\"))","v":"Euro STOXX 50, Dec 20"}]
[null,{"$f":"'Symbols (2)'!B21","v":"F.GLE"},{"$f":" IFERROR(RTD(\"cqg.rtd\",,\"StudyData\",B21, \"PCB\",\"BaseType=Index,Price=1000,Index=1,Date=12/30/2016\", \"Close\",$C$1,,\"all\",,,,\"T\")/100,\"\")","v":4.8670465337131999E-2},{"$f":"RANK($C21,$C$2:C$31)+COUNTIF($C$2:C21,C21)-1","v":3},"F.GLE",20,"F.GCE?",{"$f":"IFERROR( RTD(\"cqg.rtd\",,\"StudyData\",G21, \"PCB\",\"BaseType=Index,Price=1000,Index=1,Date=12/30/2016\", \"Close\",$C$1,,\"all\",,,,\"T\")/100,\"\")","v":-3.3508541392904045E-2},"",3.3508541392904045E-2,-3.3508541392904045E-2,{"$f":"IF(G21=\"\",\"\",RTD(\"cqg.rtd\",,\"ContractData\",G21,\"LongDescription\",,\"T\"))","v":"Gold (Globex), Dec 20"}]
[null,{"$f":"'Symbols (2)'!B22","v":"F.HE"},{"$f":" IFERROR(RTD(\"cqg.rtd\",,\"StudyData\",B22, \"PCB\",\"BaseType=Index,Price=1000,Index=1,Date=12/30/2016\", \"Close\",$C$1,,\"all\",,,,\"T\")/100,\"\")","v":0.20055970149253718},{"$f":"RANK($C22,$C$2:C$31)+COUNTIF($C$2:C22,C22)-1","v":1},"F.HE",21,"F.BP6?",{"$f":"IFERROR( RTD(\"cqg.rtd\",,\"StudyData\",G22, \"PCB\",\"BaseType=Index,Price=1000,Index=1,Date=12/30/2016\", \"Close\",$C$1,,\"all\",,,,\"T\")/100,\"\")","v":-4.6864489124747728E-2},"",4.6864489124747728E-2,-4.6864489124747728E-2,{"$f":"IF(G22=\"\",\"\",RTD(\"cqg.rtd\",,\"ContractData\",G22,\"LongDescription\",,\"T\"))","v":"British Pound (Globex), Dec 20"}]
[null,{"$f":"'Symbols (2)'!B23","v":"F.YM?"},{"$f":" IFERROR(RTD(\"cqg.rtd\",,\"StudyData\",B23, \"PCB\",\"BaseType=Index,Price=1000,Index=1,Date=12/30/2016\", \"Close\",$C$1,,\"all\",,,,\"T\")/100,\"\")","v":-4.8353040540540543E-2},{"$f":"RANK($C23,$C$2:C$31)+COUNTIF($C$2:C23,C23)-1","v":22},"F.YM?",22,"F.YM?",{"$f":"IFERROR( RTD(\"cqg.rtd\",,\"StudyData\",G23, \"PCB\",\"BaseType=Index,Price=1000,Index=1,Date=12/30/2016\", \"Close\",$C$1,,\"all\",,,,\"T\")/100,\"\")","v":-4.8353040540540543E-2},"",4.8353040540540543E-2,-4.8353040540540543E-2,{"$f":"IF(G23=\"\",\"\",RTD(\"cqg.rtd\",,\"ContractData\",G23,\"LongDescription\",,\"T\"))","v":"E-mini Dow ($5), Dec 20"}]
[null,{"$f":"'Symbols (2)'!B24","v":"F.EP?"},{"$f":" IFERROR(RTD(\"cqg.rtd\",,\"StudyData\",B24, \"PCB\",\"BaseType=Index,Price=1000,Index=1,Date=12/30/2016\", \"Close\",$C$1,,\"all\",,,,\"T\")/100,\"\")","v":-6.1517576450414405E-2},{"$f":"RANK($C24,$C$2:C$31)+COUNTIF($C$2:C24,C24)-1","v":25},"F.EP?",23,"F.RBE?",{"$f":"IFERROR( RTD(\"cqg.rtd\",,\"StudyData\",G24, \"PCB\",\"BaseType=Index,Price=1000,Index=1,Date=12/30/2016\", \"Close\",$C$1,,\"all\",,,,\"T\")/100,\"\")","v":-4.8858861333113547E-2},"",4.8858861333113547E-2,-4.8858861333113547E-2,{"$f":"IF(G24=\"\",\"\",RTD(\"cqg.rtd\",,\"ContractData\",G24,\"LongDescription\",,\"T\"))","v":"RBOB Gasoline (Globex), Nov 20"}]
[null,{"$f":"'Symbols (2)'!B25","v":"F.ENQ?"},{"$f":" IFERROR(RTD(\"cqg.rtd\",,\"StudyData\",B25, \"PCB\",\"BaseType=Index,Price=1000,Index=1,Date=12/30/2016\", \"Close\",$C$1,,\"all\",,,,\"T\")/100,\"\")","v":-8.9668978041934952E-2},{"$f":"RANK($C25,$C$2:C$31)+COUNTIF($C$2:C25,C25)-1","v":29},"F.ENQ?",24,"F.RTY?",{"$f":"IFERROR( RTD(\"cqg.rtd\",,\"StudyData\",G25, \"PCB\",\"BaseType=Index,Price=1000,Index=1,Date=12/30/2016\", \"Close\",$C$1,,\"all\",,,,\"T\")/100,\"\")","v":-5.1559597771088199E-2},"",5.1559597771088199E-2,-5.1559597771088199E-2,{"$f":"IF(G25=\"\",\"\",RTD(\"cqg.rtd\",,\"ContractData\",G25,\"LongDescription\",,\"T\"))","v":"E-mini Russell 2000, Dec 20"}]
[null,{"$f":"'Symbols (2)'!B26","v":"F.RTY?"},{"$f":" IFERROR(RTD(\"cqg.rtd\",,\"StudyData\",B26, \"PCB\",\"BaseType=Index,Price=1000,Index=1,Date=12/30/2016\", \"Close\",$C$1,,\"all\",,,,\"T\")/100,\"\")","v":-5.1559597771088199E-2},{"$f":"RANK($C26,$C$2:C$31)+COUNTIF($C$2:C26,C26)-1","v":24},"F.RTY?",25,"F.EP?",{"$f":"IFERROR( RTD(\"cqg.rtd\",,\"StudyData\",G26, \"PCB\",\"BaseType=Index,Price=1000,Index=1,Date=12/30/2016\", \"Close\",$C$1,,\"all\",,,,\"T\")/100,\"\")","v":-6.1517576450414405E-2},"",6.1517576450414405E-2,-6.1517576450414405E-2,{"$f":"IF(G26=\"\",\"\",RTD(\"cqg.rtd\",,\"ContractData\",G26,\"LongDescription\",,\"T\"))","v":"E-Mini S&P 500, Dec 20"}]
[null,{"$f":"'Symbols (2)'!B27","v":"F.DD?"},{"$f":" IFERROR(RTD(\"cqg.rtd\",,\"StudyData\",B27, \"PCB\",\"BaseType=Index,Price=1000,Index=1,Date=12/30/2016\", \"Close\",$C$1,,\"all\",,,,\"T\")/100,\"\")","v":-2.1004177626489248E-2},{"$f":"RANK($C27,$C$2:C$31)+COUNTIF($C$2:C27,C27)-1","v":14},"F.DD?",26,"F.CLE?",{"$f":"IFERROR( RTD(\"cqg.rtd\",,\"StudyData\",G27, \"PCB\",\"BaseType=Index,Price=1000,Index=1,Date=12/30/2016\", \"Close\",$C$1,,\"all\",,,,\"T\")/100,\"\")","v":-6.2661347101619372E-2},"",6.2661347101619372E-2,-6.2661347101619372E-2,{"$f":"IF(G27=\"\",\"\",RTD(\"cqg.rtd\",,\"ContractData\",G27,\"LongDescription\",,\"T\"))","v":"Crude Light (Globex), Nov 20"}]
[null,{"$f":"'Symbols (2)'!B28","v":"F.DSX?"},{"$f":" IFERROR(RTD(\"cqg.rtd\",,\"StudyData\",B28, \"PCB\",\"BaseType=Index,Price=1000,Index=1,Date=12/30/2016\", \"Close\",$C$1,,\"all\",,,,\"T\")/100,\"\")","v":-2.7258805513016845E-2},{"$f":"RANK($C28,$C$2:C$31)+COUNTIF($C$2:C28,C28)-1","v":19},"F.DSX?",27,"F.PLE?",{"$f":"IFERROR( RTD(\"cqg.rtd\",,\"StudyData\",G28, \"PCB\",\"BaseType=Index,Price=1000,Index=1,Date=12/30/2016\", \"Close\",$C$1,,\"all\",,,,\"T\")/100,\"\")","v":-7.4101716600916939E-2},"",7.4101716600916939E-2,-7.4101716600916939E-2,{"$f":"IF(G28=\"\",\"\",RTD(\"cqg.rtd\",,\"ContractData\",G28,\"LongDescription\",,\"T\"))","v":"Platinum (Globex), Oct 20"}]
[null,{"$f":"'Symbols (2)'!B29","v":"F.QFA?"},{"$f":" IFERROR(RTD(\"cqg.rtd\",,\"StudyData\",B29, \"PCB\",\"BaseType=Index,Price=1000,Index=1,Date=12/30/2016\", \"Close\",$C$1,,\"all\",,,,\"T\")/100,\"\")","v":-2.5328094959458328E-2},{"$f":"RANK($C29,$C$2:C$31)+COUNTIF($C$2:C29,C29)-1","v":16},"F.QFA?",28,"F.HOE?",{"$f":"IFERROR( RTD(\"cqg.rtd\",,\"StudyData\",G29, \"PCB\",\"BaseType=Index,Price=1000,Index=1,Date=12/30/2016\", \"Close\",$C$1,,\"all\",,,,\"T\")/100,\"\")","v":-7.7548673293354173E-2},"",7.7548673293354173E-2,-7.7548673293354173E-2,{"$f":"IF(G29=\"\",\"\",RTD(\"cqg.rtd\",,\"ContractData\",G29,\"LongDescription\",,\"T\"))","v":"NY Harbor ULSD, Nov 20"}]
[null,{"$f":"'Symbols (2)'!B30","v":"F.PIL?"},{"$f":" IFERROR(RTD(\"cqg.rtd\",,\"StudyData\",B30, \"PCB\",\"BaseType=Index,Price=1000,Index=1,Date=12/30/2016\", \"Close\",$C$1,,\"all\",,,,\"T\")/100,\"\")","v":-2.6736884747822563E-2},{"$f":"RANK($C30,$C$2:C$31)+COUNTIF($C$2:C30,C30)-1","v":18},"F.PIL?",29,"F.ENQ?",{"$f":"IFERROR( RTD(\"cqg.rtd\",,\"StudyData\",G30, \"PCB\",\"BaseType=Index,Price=1000,Index=1,Date=12/30/2016\", \"Close\",$C$1,,\"all\",,,,\"T\")/100,\"\")","v":-8.9668978041934952E-2},"",8.9668978041934952E-2,-8.9668978041934952E-2,{"$f":"IF(G30=\"\",\"\",RTD(\"cqg.rtd\",,\"ContractData\",G30,\"LongDescription\",,\"T\"))","v":"E-mini NASDAQ-100, Dec 20"}]
[null,{"$f":"'Symbols (2)'!B31","v":"F.NKD?"},{"$f":" IFERROR(RTD(\"cqg.rtd\",,\"StudyData\",B31, \"PCB\",\"BaseType=Index,Price=1000,Index=1,Date=12/30/2016\", \"Close\",$C$1,,\"all\",,,,\"T\")/100,\"\")","v":-1.3200605929452498E-2},{"$f":"RANK($C31,$C$2:C$31)+COUNTIF($C$2:C31,C31)-1","v":10},"F.NKD?",30,"F.SIE?",{"$f":"IFERROR( RTD(\"cqg.rtd\",,\"StudyData\",G31, \"PCB\",\"BaseType=Index,Price=1000,Index=1,Date=12/30/2016\", \"Close\",$C$1,,\"all\",,,,\"T\")/100,\"\")","v":-0.14230258096104073},"",0.14230258096104073,-0.14230258096104073,{"$f":"IF(G31=\"\",\"\",RTD(\"cqg.rtd\",,\"ContractData\",G31,\"LongDescription\",,\"T\"))","v":"Silver (Globex), Dec 20"}]