{"text_format":"1","workbook":"xlsx","n_sheets":4,"sheets":["Main","Data","Ranked","BarData"],"not_rendered":{"charts":2,"images":4,"macros":1,"external_links":0,"defined_names":0,"comments":0,"pivot_tables":0},"unopened":[],"bounds":{"document_bytes":16777216,"sheet_cells":100000,"rows_first":2000,"rows_last":500,"rows_between":2000,"halvings":0,"cell_chars":16384,"cell_head_chars":4096},"cells_cut":0,"cells_raw":0,"read":"whole","date_system":"1900"}

{"sheet":"Main","index":0,"n_rows":47,"n_cols":28,"rows_kept":47,"cut":false,"hidden":false,"merged":[[23,22,23,23],[24,24,24,25],[23,24,23,25],[4,7,4,10],[46,8,46,12],[43,9,43,12],[45,9,45,12],[4,1,4,2],[4,4,4,5],[45,2,45,5],[28,9,28,12],[29,9,29,12],[30,9,30,12],[31,9,31,12],[32,9,32,12],[33,9,33,12],[34,9,34,12],[35,9,35,12],[36,9,36,12],[37,9,37,12],[38,9,38,12],[39,9,39,12],[40,9,40,12],[44,9,44,12],[41,9,41,12],[42,9,42,12],[40,2,40,5],[41,2,41,5],[42,2,42,5],[43,2,43,5],[44,2,44,5],[35,2,35,5],[36,2,36,5],[37,2,37,5],[38,2,38,5],[39,2,39,5],[31,2,31,5],[32,2,32,5],[33,2,33,5],[34,2,34,5],[27,9,27,12],[5,1,5,6],[5,8,5,13],[28,2,28,5],[29,2,29,5],[25,2,25,5],[26,2,26,5],[27,2,27,5],[22,9,22,12],[23,9,23,12],[24,9,24,12],[25,9,25,12],[26,9,26,12],[22,2,22,5],[23,2,23,5],[24,2,24,5],[13,2,13,5],[14,2,14,5],[15,2,15,5],[7,9,7,12],[30,2,30,5],[20,9,20,12],[21,9,21,12],[20,2,20,5],[21,2,21,5],[18,9,18,12],[19,9,19,12],[18,2,18,5],[19,2,19,5],[1,22,3,25],[1,20,1,21],[6,16,6,19],[7,16,7,19],[8,16,8,19],[9,16,9,19],[10,16,10,19],[11,16,11,19],[12,16,12,19],[1,6,3,19],[10,9,10,12],[11,9,11,12],[16,2,16,5],[7,2,7,5],[8,2,8,5],[9,2,9,5],[10,2,10,5],[1,1,3,5],[6,9,6,12],[23,18,23,19],[8,9,8,12],[9,9,9,12],[12,9,12,12],[13,9,13,12],[14,9,14,12],[14,16,14,19],[17,2,17,5],[15,9,15,12],[16,9,16,12],[17,9,17,12],[6,2,6,5],[12,2,12,5],[11,2,11,5],[24,17,24,19],[4,16,4,19],[5,16,5,19],[15,16,15,19],[16,16,16,19],[17,16,17,19],[18,16,18,19],[19,16,19,19],[20,16,20,19],[21,16,21,19],[22,16,22,19],[24,14,24,16],[23,14,23,16],[13,16,13,19]]}
[]
[null,null,null,null,null,null,"CQG NASDAQ 100 Index Internal Performance ",null,null,null,null,null,null,null,null,null,null,null,null,null,"Ribbon",null,{"$f":"RTD(\"cqg.rtd\", ,\"SystemInfo\", \"Linetime\")","v":44187.404652777775}]
[]
[]
[null,"Lookback Period: ",null,12,"Time Frame: ",null,5,"Number of Stocks Making New Highs:",null,null,null,{"$f":"Ranked!U2","v":12},"New Lows:",{"$f":"Ranked!V2","v":4},null,"Symbol","Description",null,null,null,"Last:","NC","%NC","Open","High","Low"]
[null,{"$f":"\"New \"&$D$5&\"-Bar High Symbols, Descriptions and Net % Daily Change\"","v":"New 12-Bar High Symbols, Descriptions and Net % Daily Change"},null,null,null,null,null,null,{"$f":"\"New \"&$D$5&\"-Bar Low Symbols, Descriptions and Net % Daily Change\"","v":"New 12-Bar Low Symbols, Descriptions and Net % Daily Change"},null,null,null,null,null,null,"DJI",{"$f":"IF(P6=\"\",\"\",RTD(\"cqg.rtd\", ,\"ContractData\",P6, \"LongDescription\",, \"T\"))","v":"DJ Industrial Average"},null,null,null,{"$f":"IF(P6=\"\",\"\",TEXT(RTD(\"cqg.rtd\",,\"ContractData\",P6,\"LastTradeToday\",,\"T\"),AB6))","v":"30137.8"},{"$f":"IF(P6=\"\",\"\",TEXT(RTD(\"cqg.rtd\", ,\"ContractData\", P6, \"NetLastTradeToday\",, \"T\"),AB6))","v":"-78.6"},{"$f":"IFERROR(IF(P6=\"\",\"\",RTD(\"cqg.rtd\", ,\"ContractData\", P6, \"PerCentNetLastTrade\",, \"T\")/100),\"\")","v":-2.6012364146622362E-3},{"$f":"IF(P6=\"\",\"\",TEXT(RTD(\"cqg.rtd\", ,\"ContractData\", P6, \"OPen\",, \"T\"),AB6))","v":"30200.2"},{"$f":"IF(P6=\"\",\"\",TEXT(RTD(\"cqg.rtd\", ,\"ContractData\", P6, \"HIgh\",, \"T\"),AB6))","v":"30200.2"},{"$f":"IF(P6=\"\",\"\",TEXT(RTD(\"cqg.rtd\", ,\"ContractData\", P6, \"LOw\",, \"T\"),AB6))","v":"30034.3"},{"$f":"IF(P6=\"\",\"\",IF(LEN(RTD(\"cqg.rtd\",,\"ContractData\",P6,\"TickSize\",,\"T\"))=1,0,LEN(RTD(\"cqg.rtd\",,\"ContractData\",P6,\"TickSize\",,\"T\"))-2))","v":1},{"$f":"IF(AA6=0,\"#\",IF(AA6=1,\"#.0\",IF(AA6=2,\"#.00\",IF(AA6=3,\"#.000\",IF(AA6=4,\"#.0000\",IF(AA6=5,\"#.00000\",IF(AA6=6,\"#.000000\",IF(AA6=7,\"#.0000000\"))))))))","v":"#.0"}]
[{"$f":"IF(OR(B7<>\"\",I7<>\"\"),1,0)","v":1},{"$f":"Ranked!G2","v":"S.US.OKTA "},{"$f":"IF(B7=\"\",\"\",RTD(\"cqg.rtd\", ,\"ContractData\",B7, \"LongDescription\",, \"T\"))","v":"Okta, Inc. Cl A"},null,null,null,{"$f":"IFERROR(RTD(\"cqg.rtd\", ,\"ContractData\",B7, \"PerCentNetLastTrade\",, \"T\")/100,\"\")","v":3.0195252957828263E-2},null,{"$f":"Ranked!Q2","v":"S.US.ORLY "},{"$f":"IF(I7=\"\",\"\",RTD(\"cqg.rtd\", ,\"ContractData\",I7, \"LongDescription\",, \"T\"))","v":"OReilly Automotive Inc"},null,null,null,{"$f":"IFERROR(RTD(\"cqg.rtd\", ,\"ContractData\",I7, \"PerCentNetLastTrade\",, \"T\")/100,\"\")","v":-6.054044499436576E-3},null,"SPY",{"$f":"IF(P7=\"\",\"\",RTD(\"cqg.rtd\", ,\"ContractData\",P7, \"LongDescription\",, \"T\"))","v":"SPDR S&P 500"},null,null,null,{"$f":"IF(P7=\"\",\"\",TEXT(RTD(\"cqg.rtd\",,\"ContractData\",P7,\"LastTradeToday\",,\"T\"),AB7))","v":"368.28"},{"$f":"IF(P7=\"\",\"\",TEXT(RTD(\"cqg.rtd\", ,\"ContractData\", P7, \"NetLastTradeToday\",, \"T\"),AB7))","v":".42"},{"$f":"IFERROR(IF(P7=\"\",\"\",RTD(\"cqg.rtd\", ,\"ContractData\", P7, \"PerCentNetLastTrade\",, \"T\")/100),\"\")","v":1.1417387049420975E-3},{"$f":"IF(P7=\"\",\"\",TEXT(RTD(\"cqg.rtd\", ,\"ContractData\", P7, \"OPen\",, \"T\"),AB7))","v":"368.21"},{"$f":"IF(P7=\"\",\"\",TEXT(RTD(\"cqg.rtd\", ,\"ContractData\", P7, \"HIgh\",, \"T\"),AB7))","v":"368.33"},{"$f":"IF(P7=\"\",\"\",TEXT(RTD(\"cqg.rtd\", ,\"ContractData\", P7, \"LOw\",, \"T\"),AB7))","v":"367.06"},{"$f":"IF(P7=\"\",\"\",IF(LEN(RTD(\"cqg.rtd\",,\"ContractData\",P7,\"TickSize\",,\"T\"))=1,0,LEN(RTD(\"cqg.rtd\",,\"ContractData\",P7,\"TickSize\",,\"T\"))-2))","v":2},{"$f":"IF(AA7=0,\"#\",IF(AA7=1,\"#.0\",IF(AA7=2,\"#.00\",IF(AA7=3,\"#.000\",IF(AA7=4,\"#.0000\",IF(AA7=5,\"#.00000\",IF(AA7=6,\"#.000000\",IF(AA7=7,\"#.0000000\"))))))))","v":"#.00"}]
[1,{"$f":"Ranked!G3","v":"S.US.SPLK "},{"$f":"IF(B8=\"\",\"\",RTD(\"cqg.rtd\", ,\"ContractData\",B8, \"LongDescription\",, \"T\"))","v":"Splunk, Inc."},null,null,null,{"$f":"IFERROR(RTD(\"cqg.rtd\", ,\"ContractData\",B8, \"PerCentNetLastTrade\",, \"T\")/100,\"\")","v":1.2043356081894821E-2},null,{"$f":"Ranked!Q3","v":"S.US.ALXN "},{"$f":"IF(I8=\"\",\"\",RTD(\"cqg.rtd\", ,\"ContractData\",I8, \"LongDescription\",, \"T\"))","v":"Alexion Pharmaceuticals"},null,null,null,{"$f":"IFERROR(RTD(\"cqg.rtd\", ,\"ContractData\",I8, \"PerCentNetLastTrade\",, \"T\")/100,\"\")","v":-9.1067622553768646E-3},null,"RSP",{"$f":"IF(P8=\"\",\"\",RTD(\"cqg.rtd\", ,\"ContractData\",P8, \"LongDescription\",, \"T\"))","v":"Invesco S&P 500 Equal Weight ETF"},null,null,null,{"$f":"IF(P8=\"\",\"\",TEXT(RTD(\"cqg.rtd\",,\"ContractData\",P8,\"LastTradeToday\",,\"T\"),AB8))","v":"125.50"},{"$f":"IF(P8=\"\",\"\",TEXT(RTD(\"cqg.rtd\", ,\"ContractData\", P8, \"NetLastTradeToday\",, \"T\"),AB8))","v":"-.09"},{"$f":"IFERROR(IF(P8=\"\",\"\",RTD(\"cqg.rtd\", ,\"ContractData\", P8, \"PerCentNetLastTrade\",, \"T\")/100),\"\")","v":-7.1661756509276209E-4},{"$f":"IF(P8=\"\",\"\",TEXT(RTD(\"cqg.rtd\", ,\"ContractData\", P8, \"OPen\",, \"T\"),AB8))","v":"125.66"},{"$f":"IF(P8=\"\",\"\",TEXT(RTD(\"cqg.rtd\", ,\"ContractData\", P8, \"HIgh\",, \"T\"),AB8))","v":"125.67"},{"$f":"IF(P8=\"\",\"\",TEXT(RTD(\"cqg.rtd\", ,\"ContractData\", P8, \"LOw\",, \"T\"),AB8))","v":"124.91"},{"$f":"IF(P8=\"\",\"\",IF(LEN(RTD(\"cqg.rtd\",,\"ContractData\",P8,\"TickSize\",,\"T\"))=1,0,LEN(RTD(\"cqg.rtd\",,\"ContractData\",P8,\"TickSize\",,\"T\"))-2))","v":2},"#.00"]
[1,{"$f":"Ranked!G4","v":"S.US.ANSS "},{"$f":"IF(B9=\"\",\"\",RTD(\"cqg.rtd\", ,\"ContractData\",B9, \"LongDescription\",, \"T\"))","v":"ANSYS Inc"},null,null,null,{"$f":"IFERROR(RTD(\"cqg.rtd\", ,\"ContractData\",B9, \"PerCentNetLastTrade\",, \"T\")/100,\"\")","v":1.1771316196094957E-2},null,{"$f":"Ranked!Q4","v":"S.US.PDD "},{"$f":"IF(I9=\"\",\"\",RTD(\"cqg.rtd\", ,\"ContractData\",I9, \"LongDescription\",, \"T\"))","v":"Pinduoduo Inc"},null,null,null,{"$f":"IFERROR(RTD(\"cqg.rtd\", ,\"ContractData\",I9, \"PerCentNetLastTrade\",, \"T\")/100,\"\")","v":-2.3149724245931775E-2},null,"NDX",{"$f":"IF(P9=\"\",\"\",RTD(\"cqg.rtd\", ,\"ContractData\",P9, \"LongDescription\",, \"T\"))","v":"NASDAQ-100 Index"},null,null,null,{"$f":"IF(P9=\"\",\"\",TEXT(RTD(\"cqg.rtd\",,\"ContractData\",P9,\"LastTradeToday\",,\"T\"),AB9))","v":"12737.66"},{"$f":"IF(P9=\"\",\"\",TEXT(RTD(\"cqg.rtd\", ,\"ContractData\", P9, \"NetLastTradeToday\",, \"T\"),AB9))","v":"47.67"},{"$f":"IFERROR(IF(P9=\"\",\"\",RTD(\"cqg.rtd\", ,\"ContractData\", P9, \"PerCentNetLastTrade\",, \"T\")/100),\"\")","v":3.7564242182587275E-3},{"$f":"IF(P9=\"\",\"\",TEXT(RTD(\"cqg.rtd\", ,\"ContractData\", P9, \"OPen\",, \"T\"),AB9))","v":"12715.48"},{"$f":"IF(P9=\"\",\"\",TEXT(RTD(\"cqg.rtd\", ,\"ContractData\", P9, \"HIgh\",, \"T\"),AB9))","v":"12761.23"},{"$f":"IF(P9=\"\",\"\",TEXT(RTD(\"cqg.rtd\", ,\"ContractData\", P9, \"LOw\",, \"T\"),AB9))","v":"12688.02"},{"$f":"IF(P9=\"\",\"\",IF(LEN(RTD(\"cqg.rtd\",,\"ContractData\",P9,\"TickSize\",,\"T\"))=1,0,LEN(RTD(\"cqg.rtd\",,\"ContractData\",P9,\"TickSize\",,\"T\"))-2))","v":2},"#.00"]
[1,{"$f":"Ranked!G5","v":"S.US.IDXX "},{"$f":"IF(B10=\"\",\"\",RTD(\"cqg.rtd\", ,\"ContractData\",B10, \"LongDescription\",, \"T\"))","v":"IDEXX Laboratories Inc"},null,null,null,{"$f":"IFERROR(RTD(\"cqg.rtd\", ,\"ContractData\",B10, \"PerCentNetLastTrade\",, \"T\")/100,\"\")","v":1.1088874366933508E-2},null,{"$f":"Ranked!Q5","v":"S.US.GILD "},{"$f":"IF(I10=\"\",\"\",RTD(\"cqg.rtd\", ,\"ContractData\",I10, \"LongDescription\",, \"T\"))","v":"Gilead Sciences Inc"},null,null,null,{"$f":"IFERROR(RTD(\"cqg.rtd\", ,\"ContractData\",I10, \"PerCentNetLastTrade\",, \"T\")/100,\"\")","v":-2.4086094977792964E-2},null,"S.MSFT",{"$f":"IF(P10=\"\",\"\",RTD(\"cqg.rtd\", ,\"ContractData\",P10, \"LongDescription\",, \"T\"))","v":"Microsoft Corporation"},null,null,null,{"$f":"IF(P10=\"\",\"\",TEXT(RTD(\"cqg.rtd\",,\"ContractData\",P10,\"LastTradeToday\",,\"T\"),AB10))","v":"224.73"},{"$f":"IF(P10=\"\",\"\",TEXT(RTD(\"cqg.rtd\", ,\"ContractData\", P10, \"NetLastTradeToday\",, \"T\"),AB10))","v":"2.14"},{"$f":"IFERROR(IF(P10=\"\",\"\",RTD(\"cqg.rtd\", ,\"ContractData\", P10, \"PerCentNetLastTrade\",, \"T\")/100),\"\")","v":9.614088683229256E-3},{"$f":"IF(P10=\"\",\"\",TEXT(RTD(\"cqg.rtd\", ,\"ContractData\", P10, \"OPen\",, \"T\"),AB10))","v":"222.69"},{"$f":"IF(P10=\"\",\"\",TEXT(RTD(\"cqg.rtd\", ,\"ContractData\", P10, \"HIgh\",, \"T\"),AB10))","v":"225.63"},{"$f":"IF(P10=\"\",\"\",TEXT(RTD(\"cqg.rtd\", ,\"ContractData\", P10, \"LOw\",, \"T\"),AB10))","v":"221.85"},{"$f":"IF(P10=\"\",\"\",IF(LEN(RTD(\"cqg.rtd\",,\"ContractData\",P10,\"TickSize\",,\"T\"))=1,0,LEN(RTD(\"cqg.rtd\",,\"ContractData\",P10,\"TickSize\",,\"T\"))-2))","v":2},"#.00"]
[1,{"$f":"Ranked!G6","v":"S.US.EXC "},{"$f":"IF(B11=\"\",\"\",RTD(\"cqg.rtd\", ,\"ContractData\",B11, \"LongDescription\",, \"T\"))","v":"Exelon Corporation"},null,null,null,{"$f":"IFERROR(RTD(\"cqg.rtd\", ,\"ContractData\",B11, \"PerCentNetLastTrade\",, \"T\")/100,\"\")","v":9.6362322331968193E-3},null,{"$f":"Ranked!Q6","v":""},{"$f":"IF(I11=\"\",\"\",RTD(\"cqg.rtd\", ,\"ContractData\",I11, \"LongDescription\",, \"T\"))","v":""},null,null,null,{"$f":"IFERROR(RTD(\"cqg.rtd\", ,\"ContractData\",I11, \"PerCentNetLastTrade\",, \"T\")/100,\"\")","v":""},null,"S.AMZN",{"$f":"IF(P11=\"\",\"\",RTD(\"cqg.rtd\", ,\"ContractData\",P11, \"LongDescription\",, \"T\"))","v":"Amazon.com Inc"},null,null,null,{"$f":"IF(P11=\"\",\"\",TEXT(RTD(\"cqg.rtd\",,\"ContractData\",P11,\"LastTradeToday\",,\"T\"),AB11))","v":"3205.10"},{"$f":"IF(P11=\"\",\"\",TEXT(RTD(\"cqg.rtd\", ,\"ContractData\", P11, \"NetLastTradeToday\",, \"T\"),AB11))","v":"-1.08"},{"$f":"IFERROR(IF(P11=\"\",\"\",RTD(\"cqg.rtd\", ,\"ContractData\", P11, \"PerCentNetLastTrade\",, \"T\")/100),\"\")","v":-3.3684945948137657E-4},{"$f":"IF(P11=\"\",\"\",TEXT(RTD(\"cqg.rtd\", ,\"ContractData\", P11, \"OPen\",, \"T\"),AB11))","v":"3202.84"},{"$f":"IF(P11=\"\",\"\",TEXT(RTD(\"cqg.rtd\", ,\"ContractData\", P11, \"HIgh\",, \"T\"),AB11))","v":"3222.00"},{"$f":"IF(P11=\"\",\"\",TEXT(RTD(\"cqg.rtd\", ,\"ContractData\", P11, \"LOw\",, \"T\"),AB11))","v":"3188.00"},{"$f":"IF(P11=\"\",\"\",IF(LEN(RTD(\"cqg.rtd\",,\"ContractData\",P11,\"TickSize\",,\"T\"))=1,0,LEN(RTD(\"cqg.rtd\",,\"ContractData\",P11,\"TickSize\",,\"T\"))-2))","v":2},"#.00"]
[1,{"$f":"Ranked!G7","v":"S.US.CERN "},{"$f":"IF(B12=\"\",\"\",RTD(\"cqg.rtd\", ,\"ContractData\",B12, \"LongDescription\",, \"T\"))","v":"Cerner Corporation"},null,null,null,{"$f":"IFERROR(RTD(\"cqg.rtd\", ,\"ContractData\",B12, \"PerCentNetLastTrade\",, \"T\")/100,\"\")","v":7.1810941376158769E-3},null,{"$f":"Ranked!Q7","v":""},{"$f":"IF(I12=\"\",\"\",RTD(\"cqg.rtd\", ,\"ContractData\",I12, \"LongDescription\",, \"T\"))","v":""},null,null,null,{"$f":"IFERROR(RTD(\"cqg.rtd\", ,\"ContractData\",I12, \"PerCentNetLastTrade\",, \"T\")/100,\"\")","v":""},null,"S.AAPL",{"$f":"IF(P12=\"\",\"\",RTD(\"cqg.rtd\", ,\"ContractData\",P12, \"LongDescription\",, \"T\"))","v":"Apple Inc"},null,null,null,{"$f":"IF(P12=\"\",\"\",TEXT(RTD(\"cqg.rtd\",,\"ContractData\",P12,\"LastTradeToday\",,\"T\"),AB12))","v":"133.16"},{"$f":"IF(P12=\"\",\"\",TEXT(RTD(\"cqg.rtd\", ,\"ContractData\", P12, \"NetLastTradeToday\",, \"T\"),AB12))","v":"4.93"},{"$f":"IFERROR(IF(P12=\"\",\"\",RTD(\"cqg.rtd\", ,\"ContractData\", P12, \"PerCentNetLastTrade\",, \"T\")/100),\"\")","v":3.844654137097403E-2},{"$f":"IF(P12=\"\",\"\",TEXT(RTD(\"cqg.rtd\", ,\"ContractData\", P12, \"OPen\",, \"T\"),AB12))","v":"131.61"},{"$f":"IF(P12=\"\",\"\",TEXT(RTD(\"cqg.rtd\", ,\"ContractData\", P12, \"HIgh\",, \"T\"),AB12))","v":"134.40"},{"$f":"IF(P12=\"\",\"\",TEXT(RTD(\"cqg.rtd\", ,\"ContractData\", P12, \"LOw\",, \"T\"),AB12))","v":"130.40"},{"$f":"IF(P12=\"\",\"\",IF(LEN(RTD(\"cqg.rtd\",,\"ContractData\",P12,\"TickSize\",,\"T\"))=1,0,LEN(RTD(\"cqg.rtd\",,\"ContractData\",P12,\"TickSize\",,\"T\"))-2))","v":2},"#.00"]
[1,{"$f":"Ranked!G8","v":"S.US.VRSN "},{"$f":"IF(B13=\"\",\"\",RTD(\"cqg.rtd\", ,\"ContractData\",B13, \"LongDescription\",, \"T\"))","v":"Verisign Inc"},null,null,null,{"$f":"IFERROR(RTD(\"cqg.rtd\", ,\"ContractData\",B13, \"PerCentNetLastTrade\",, \"T\")/100,\"\")","v":6.4218902694401789E-3},null,{"$f":"Ranked!Q8","v":""},{"$f":"IF(I13=\"\",\"\",RTD(\"cqg.rtd\", ,\"ContractData\",I13, \"LongDescription\",, \"T\"))","v":""},null,null,null,{"$f":"IFERROR(RTD(\"cqg.rtd\", ,\"ContractData\",I13, \"PerCentNetLastTrade\",, \"T\")/100,\"\")","v":""},null,"S.INTC",{"$f":"IF(P13=\"\",\"\",RTD(\"cqg.rtd\", ,\"ContractData\",P13, \"LongDescription\",, \"T\"))","v":"Intel Corporation"},null,null,null,{"$f":"IF(P13=\"\",\"\",TEXT(RTD(\"cqg.rtd\",,\"ContractData\",P13,\"LastTradeToday\",,\"T\"),AB13))","v":"46.05"},{"$f":"IF(P13=\"\",\"\",TEXT(RTD(\"cqg.rtd\", ,\"ContractData\", P13, \"NetLastTradeToday\",, \"T\"),AB13))","v":"-.31"},{"$f":"IFERROR(IF(P13=\"\",\"\",RTD(\"cqg.rtd\", ,\"ContractData\", P13, \"PerCentNetLastTrade\",, \"T\")/100),\"\")","v":-6.686798964624676E-3},{"$f":"IF(P13=\"\",\"\",TEXT(RTD(\"cqg.rtd\", ,\"ContractData\", P13, \"OPen\",, \"T\"),AB13))","v":"46.25"},{"$f":"IF(P13=\"\",\"\",TEXT(RTD(\"cqg.rtd\", ,\"ContractData\", P13, \"HIgh\",, \"T\"),AB13))","v":"46.34"},{"$f":"IF(P13=\"\",\"\",TEXT(RTD(\"cqg.rtd\", ,\"ContractData\", P13, \"LOw\",, \"T\"),AB13))","v":"45.76"},{"$f":"IF(P13=\"\",\"\",IF(LEN(RTD(\"cqg.rtd\",,\"ContractData\",P13,\"TickSize\",,\"T\"))=1,0,LEN(RTD(\"cqg.rtd\",,\"ContractData\",P13,\"TickSize\",,\"T\"))-2))","v":2},"#.00"]
[1,{"$f":"Ranked!G9","v":"S.US.CPRT "},{"$f":"IF(B14=\"\",\"\",RTD(\"cqg.rtd\", ,\"ContractData\",B14, \"LongDescription\",, \"T\"))","v":"Copart Inc"},null,null,null,{"$f":"IFERROR(RTD(\"cqg.rtd\", ,\"ContractData\",B14, \"PerCentNetLastTrade\",, \"T\")/100,\"\")","v":5.9747912915370759E-3},null,{"$f":"Ranked!Q9","v":""},{"$f":"IF(I14=\"\",\"\",RTD(\"cqg.rtd\", ,\"ContractData\",I14, \"LongDescription\",, \"T\"))","v":""},null,null,null,{"$f":"IFERROR(RTD(\"cqg.rtd\", ,\"ContractData\",I14, \"PerCentNetLastTrade\",, \"T\")/100,\"\")","v":""},null,"CLE",{"$f":"IF(P14=\"\",\"\",RTD(\"cqg.rtd\", ,\"ContractData\",P14, \"LongDescription\",, \"T\"))","v":"Crude Light (Globex), Feb 21"},null,null,null,{"$f":"IF(P14=\"\",\"\",TEXT(RTD(\"cqg.rtd\",,\"ContractData\",P14,\"LastTradeToday\",,\"T\"),AB14))","v":"47.31"},{"$f":"IF(P14=\"\",\"\",TEXT(RTD(\"cqg.rtd\", ,\"ContractData\", P14, \"NetLastTradeToday\",, \"T\"),AB14))","v":"-.66"},{"$f":"IFERROR(IF(P14=\"\",\"\",RTD(\"cqg.rtd\", ,\"ContractData\", P14, \"PerCentNetLastTrade\",, \"T\")/100),\"\")","v":-1.3758599124452785E-2},{"$f":"IF(P14=\"\",\"\",TEXT(RTD(\"cqg.rtd\", ,\"ContractData\", P14, \"OPen\",, \"T\"),AB14))","v":"47.93"},{"$f":"IF(P14=\"\",\"\",TEXT(RTD(\"cqg.rtd\", ,\"ContractData\", P14, \"HIgh\",, \"T\"),AB14))","v":"47.96"},{"$f":"IF(P14=\"\",\"\",TEXT(RTD(\"cqg.rtd\", ,\"ContractData\", P14, \"LOw\",, \"T\"),AB14))","v":"46.60"},{"$f":"IF(P14=\"\",\"\",IF(LEN(RTD(\"cqg.rtd\",,\"ContractData\",P14,\"TickSize\",,\"T\"))=1,0,LEN(RTD(\"cqg.rtd\",,\"ContractData\",P14,\"TickSize\",,\"T\"))-2))","v":2},"#.00"]
[1,{"$f":"Ranked!G10","v":"S.US.ROST "},{"$f":"IF(B15=\"\",\"\",RTD(\"cqg.rtd\", ,\"ContractData\",B15, \"LongDescription\",, \"T\"))","v":"Ross Stores Inc"},null,null,null,{"$f":"IFERROR(RTD(\"cqg.rtd\", ,\"ContractData\",B15, \"PerCentNetLastTrade\",, \"T\")/100,\"\")","v":1.6268516140080485E-3},null,{"$f":"Ranked!Q10","v":""},{"$f":"IF(I15=\"\",\"\",RTD(\"cqg.rtd\", ,\"ContractData\",I15, \"LongDescription\",, \"T\"))","v":""},null,null,null,{"$f":"IFERROR(RTD(\"cqg.rtd\", ,\"ContractData\",I15, \"PerCentNetLastTrade\",, \"T\")/100,\"\")","v":""},null,"GCE",{"$f":"IF(P15=\"\",\"\",RTD(\"cqg.rtd\", ,\"ContractData\",P15, \"LongDescription\",, \"T\"))","v":"Gold (Globex), Feb 21"},null,null,null,{"$f":"IF(P15=\"\",\"\",TEXT(RTD(\"cqg.rtd\",,\"ContractData\",P15,\"LastTradeToday\",,\"T\"),AB15))","v":"1875.5"},{"$f":"IF(P15=\"\",\"\",TEXT(RTD(\"cqg.rtd\", ,\"ContractData\", P15, \"NetLastTradeToday\",, \"T\"),AB15))","v":"-7.3"},{"$f":"IFERROR(IF(P15=\"\",\"\",RTD(\"cqg.rtd\", ,\"ContractData\", P15, \"PerCentNetLastTrade\",, \"T\")/100),\"\")","v":-3.8772041640110473E-3},{"$f":"IF(P15=\"\",\"\",TEXT(RTD(\"cqg.rtd\", ,\"ContractData\", P15, \"OPen\",, \"T\"),AB15))","v":"1883.0"},{"$f":"IF(P15=\"\",\"\",TEXT(RTD(\"cqg.rtd\", ,\"ContractData\", P15, \"HIgh\",, \"T\"),AB15))","v":"1889.4"},{"$f":"IF(P15=\"\",\"\",TEXT(RTD(\"cqg.rtd\", ,\"ContractData\", P15, \"LOw\",, \"T\"),AB15))","v":"1870.5"},{"$f":"IF(P15=\"\",\"\",IF(LEN(RTD(\"cqg.rtd\",,\"ContractData\",P15,\"TickSize\",,\"T\"))=1,0,LEN(RTD(\"cqg.rtd\",,\"ContractData\",P15,\"TickSize\",,\"T\"))-2))","v":1},"#.0"]
[1,{"$f":"Ranked!G11","v":"S.US.CSX "},{"$f":"IF(B16=\"\",\"\",RTD(\"cqg.rtd\", ,\"ContractData\",B16, \"LongDescription\",, \"T\"))","v":"CSX Corporation"},null,null,null,{"$f":"IFERROR(RTD(\"cqg.rtd\", ,\"ContractData\",B16, \"PerCentNetLastTrade\",, \"T\")/100,\"\")","v":1.5609320994536737E-3},null,{"$f":"Ranked!Q11","v":""},{"$f":"IF(I16=\"\",\"\",RTD(\"cqg.rtd\", ,\"ContractData\",I16, \"LongDescription\",, \"T\"))","v":""},null,null,null,{"$f":"IFERROR(RTD(\"cqg.rtd\", ,\"ContractData\",I16, \"PerCentNetLastTrade\",, \"T\")/100,\"\")","v":""},null,"EU6",{"$f":"IF(P16=\"\",\"\",RTD(\"cqg.rtd\", ,\"ContractData\",P16, \"LongDescription\",, \"T\"))","v":"Euro FX (Globex), Mar 21"},null,null,null,{"$f":"IF(P16=\"\",\"\",TEXT(RTD(\"cqg.rtd\",,\"ContractData\",P16,\"LastTradeToday\",,\"T\"),AB16))","v":"1.22375"},{"$f":"IF(P16=\"\",\"\",TEXT(RTD(\"cqg.rtd\", ,\"ContractData\", P16, \"NetLastTradeToday\",, \"T\"),AB16))","v":"-.00425"},{"$f":"IFERROR(IF(P16=\"\",\"\",RTD(\"cqg.rtd\", ,\"ContractData\", P16, \"PerCentNetLastTrade\",, \"T\")/100),\"\")","v":-3.4609120521172636E-3},{"$f":"IF(P16=\"\",\"\",TEXT(RTD(\"cqg.rtd\", ,\"ContractData\", P16, \"OPen\",, \"T\"),AB16))","v":"1.22710"},{"$f":"IF(P16=\"\",\"\",TEXT(RTD(\"cqg.rtd\", ,\"ContractData\", P16, \"HIgh\",, \"T\"),AB16))","v":"1.22905"},{"$f":"IF(P16=\"\",\"\",TEXT(RTD(\"cqg.rtd\", ,\"ContractData\", P16, \"LOw\",, \"T\"),AB16))","v":"1.22330"},{"$f":"IF(P16=\"\",\"\",IF(LEN(RTD(\"cqg.rtd\",,\"ContractData\",P16,\"TickSize\",,\"T\"))=1,0,LEN(RTD(\"cqg.rtd\",,\"ContractData\",P16,\"TickSize\",,\"T\"))-2))","v":5},"#.00000"]
[1,{"$f":"Ranked!G12","v":"S.US.GOOG "},{"$f":"IF(B17=\"\",\"\",RTD(\"cqg.rtd\", ,\"ContractData\",B17, \"LongDescription\",, \"T\"))","v":"Alphabet, Inc. Class C"},null,null,null,{"$f":"IFERROR(RTD(\"cqg.rtd\", ,\"ContractData\",B17, \"PerCentNetLastTrade\",, \"T\")/100,\"\")","v":-1.5350385484399524E-3},null,{"$f":"Ranked!Q12","v":""},{"$f":"IF(I17=\"\",\"\",RTD(\"cqg.rtd\", ,\"ContractData\",I17, \"LongDescription\",, \"T\"))","v":""},null,null,null,{"$f":"IFERROR(RTD(\"cqg.rtd\", ,\"ContractData\",I17, \"PerCentNetLastTrade\",, \"T\")/100,\"\")","v":""},null,"S.HD",{"$f":"IF(P17=\"\",\"\",RTD(\"cqg.rtd\", ,\"ContractData\",P17, \"LongDescription\",, \"T\"))","v":"Home Depot, Inc."},null,null,null,{"$f":"IF(P17=\"\",\"\",TEXT(RTD(\"cqg.rtd\",,\"ContractData\",P17,\"LastTradeToday\",,\"T\"),AB17))","v":"269.93"},{"$f":"IF(P17=\"\",\"\",TEXT(RTD(\"cqg.rtd\", ,\"ContractData\", P17, \"NetLastTradeToday\",, \"T\"),AB17))","v":"-1.06"},{"$f":"IFERROR(IF(P17=\"\",\"\",RTD(\"cqg.rtd\", ,\"ContractData\", P17, \"PerCentNetLastTrade\",, \"T\")/100),\"\")","v":-3.9115834532639582E-3},{"$f":"IF(P17=\"\",\"\",TEXT(RTD(\"cqg.rtd\", ,\"ContractData\", P17, \"OPen\",, \"T\"),AB17))","v":"270.06"},{"$f":"IF(P17=\"\",\"\",TEXT(RTD(\"cqg.rtd\", ,\"ContractData\", P17, \"HIgh\",, \"T\"),AB17))","v":"270.68"},{"$f":"IF(P17=\"\",\"\",TEXT(RTD(\"cqg.rtd\", ,\"ContractData\", P17, \"LOw\",, \"T\"),AB17))","v":"268.51"},{"$f":"IF(P17=\"\",\"\",IF(LEN(RTD(\"cqg.rtd\",,\"ContractData\",P17,\"TickSize\",,\"T\"))=1,0,LEN(RTD(\"cqg.rtd\",,\"ContractData\",P17,\"TickSize\",,\"T\"))-2))","v":2},"#.00"]
[1,{"$f":"Ranked!G13","v":"S.US.LRCX "},{"$f":"IF(B18=\"\",\"\",RTD(\"cqg.rtd\", ,\"ContractData\",B18, \"LongDescription\",, \"T\"))","v":"LAM Research Corporation"},null,null,null,{"$f":"IFERROR(RTD(\"cqg.rtd\", ,\"ContractData\",B18, \"PerCentNetLastTrade\",, \"T\")/100,\"\")","v":-6.4565527802495706E-3},null,{"$f":"Ranked!Q13","v":""},{"$f":"IF(I18=\"\",\"\",RTD(\"cqg.rtd\", ,\"ContractData\",I18, \"LongDescription\",, \"T\"))","v":""},null,null,null,{"$f":"IFERROR(RTD(\"cqg.rtd\", ,\"ContractData\",I18, \"PerCentNetLastTrade\",, \"T\")/100,\"\")","v":""},null,"S.IBM",{"$f":"IF(P18=\"\",\"\",RTD(\"cqg.rtd\", ,\"ContractData\",P18, \"LongDescription\",, \"T\"))","v":"International Business Machines"},null,null,null,{"$f":"IF(P18=\"\",\"\",TEXT(RTD(\"cqg.rtd\",,\"ContractData\",P18,\"LastTradeToday\",,\"T\"),AB18))","v":"122.70"},{"$f":"IF(P18=\"\",\"\",TEXT(RTD(\"cqg.rtd\", ,\"ContractData\", P18, \"NetLastTradeToday\",, \"T\"),AB18))","v":"-.69"},{"$f":"IFERROR(IF(P18=\"\",\"\",RTD(\"cqg.rtd\", ,\"ContractData\", P18, \"PerCentNetLastTrade\",, \"T\")/100),\"\")","v":-5.5920252856795525E-3},{"$f":"IF(P18=\"\",\"\",TEXT(RTD(\"cqg.rtd\", ,\"ContractData\", P18, \"OPen\",, \"T\"),AB18))","v":"123.31"},{"$f":"IF(P18=\"\",\"\",TEXT(RTD(\"cqg.rtd\", ,\"ContractData\", P18, \"HIgh\",, \"T\"),AB18))","v":"123.41"},{"$f":"IF(P18=\"\",\"\",TEXT(RTD(\"cqg.rtd\", ,\"ContractData\", P18, \"LOw\",, \"T\"),AB18))","v":"122.41"},{"$f":"IF(P18=\"\",\"\",IF(LEN(RTD(\"cqg.rtd\",,\"ContractData\",P18,\"TickSize\",,\"T\"))=1,0,LEN(RTD(\"cqg.rtd\",,\"ContractData\",P18,\"TickSize\",,\"T\"))-2))","v":2},"#.00"]
[0,{"$f":"Ranked!G14","v":""},{"$f":"IF(B19=\"\",\"\",RTD(\"cqg.rtd\", ,\"ContractData\",B19, \"LongDescription\",, \"T\"))","v":""},null,null,null,{"$f":"IFERROR(RTD(\"cqg.rtd\", ,\"ContractData\",B19, \"PerCentNetLastTrade\",, \"T\")/100,\"\")","v":""},null,{"$f":"Ranked!Q14","v":""},{"$f":"IF(I19=\"\",\"\",RTD(\"cqg.rtd\", ,\"ContractData\",I19, \"LongDescription\",, \"T\"))","v":""},null,null,null,{"$f":"IFERROR(RTD(\"cqg.rtd\", ,\"ContractData\",I19, \"PerCentNetLastTrade\",, \"T\")/100,\"\")","v":""},null,"S.INTC",{"$f":"IF(P19=\"\",\"\",RTD(\"cqg.rtd\", ,\"ContractData\",P19, \"LongDescription\",, \"T\"))","v":"Intel Corporation"},null,null,null,{"$f":"IF(P19=\"\",\"\",TEXT(RTD(\"cqg.rtd\",,\"ContractData\",P19,\"LastTradeToday\",,\"T\"),AB19))","v":"46.05"},{"$f":"IF(P19=\"\",\"\",TEXT(RTD(\"cqg.rtd\", ,\"ContractData\", P19, \"NetLastTradeToday\",, \"T\"),AB19))","v":"-.31"},{"$f":"IFERROR(IF(P19=\"\",\"\",RTD(\"cqg.rtd\", ,\"ContractData\", P19, \"PerCentNetLastTrade\",, \"T\")/100),\"\")","v":-6.686798964624676E-3},{"$f":"IF(P19=\"\",\"\",TEXT(RTD(\"cqg.rtd\", ,\"ContractData\", P19, \"OPen\",, \"T\"),AB19))","v":"46.25"},{"$f":"IF(P19=\"\",\"\",TEXT(RTD(\"cqg.rtd\", ,\"ContractData\", P19, \"HIgh\",, \"T\"),AB19))","v":"46.34"},{"$f":"IF(P19=\"\",\"\",TEXT(RTD(\"cqg.rtd\", ,\"ContractData\", P19, \"LOw\",, \"T\"),AB19))","v":"45.76"},{"$f":"IF(P19=\"\",\"\",IF(LEN(RTD(\"cqg.rtd\",,\"ContractData\",P19,\"TickSize\",,\"T\"))=1,0,LEN(RTD(\"cqg.rtd\",,\"ContractData\",P19,\"TickSize\",,\"T\"))-2))","v":2},"#.00"]
[0,{"$f":"Ranked!G15","v":""},{"$f":"IF(B20=\"\",\"\",RTD(\"cqg.rtd\", ,\"ContractData\",B20, \"LongDescription\",, \"T\"))","v":""},null,null,null,{"$f":"IFERROR(RTD(\"cqg.rtd\", ,\"ContractData\",B20, \"PerCentNetLastTrade\",, \"T\")/100,\"\")","v":""},null,{"$f":"Ranked!Q15","v":""},{"$f":"IF(I20=\"\",\"\",RTD(\"cqg.rtd\", ,\"ContractData\",I20, \"LongDescription\",, \"T\"))","v":""},null,null,null,{"$f":"IFERROR(RTD(\"cqg.rtd\", ,\"ContractData\",I20, \"PerCentNetLastTrade\",, \"T\")/100,\"\")","v":""},null,"S.JNJ",{"$f":"IF(P20=\"\",\"\",RTD(\"cqg.rtd\", ,\"ContractData\",P20, \"LongDescription\",, \"T\"))","v":"Johnson & Johnson"},null,null,null,{"$f":"IF(P20=\"\",\"\",TEXT(RTD(\"cqg.rtd\",,\"ContractData\",P20,\"LastTradeToday\",,\"T\"),AB20))","v":"152.94"},{"$f":"IF(P20=\"\",\"\",TEXT(RTD(\"cqg.rtd\", ,\"ContractData\", P20, \"NetLastTradeToday\",, \"T\"),AB20))","v":"-.08"},{"$f":"IFERROR(IF(P20=\"\",\"\",RTD(\"cqg.rtd\", ,\"ContractData\", P20, \"PerCentNetLastTrade\",, \"T\")/100),\"\")","v":-5.2280747614690893E-4},{"$f":"IF(P20=\"\",\"\",TEXT(RTD(\"cqg.rtd\", ,\"ContractData\", P20, \"OPen\",, \"T\"),AB20))","v":"152.40"},{"$f":"IF(P20=\"\",\"\",TEXT(RTD(\"cqg.rtd\", ,\"ContractData\", P20, \"HIgh\",, \"T\"),AB20))","v":"153.11"},{"$f":"IF(P20=\"\",\"\",TEXT(RTD(\"cqg.rtd\", ,\"ContractData\", P20, \"LOw\",, \"T\"),AB20))","v":"151.86"},{"$f":"IF(P20=\"\",\"\",IF(LEN(RTD(\"cqg.rtd\",,\"ContractData\",P20,\"TickSize\",,\"T\"))=1,0,LEN(RTD(\"cqg.rtd\",,\"ContractData\",P20,\"TickSize\",,\"T\"))-2))","v":2},"#.00"]
[0,{"$f":"Ranked!G16","v":""},{"$f":"IF(B21=\"\",\"\",RTD(\"cqg.rtd\", ,\"ContractData\",B21, \"LongDescription\",, \"T\"))","v":""},null,null,null,{"$f":"IFERROR(RTD(\"cqg.rtd\", ,\"ContractData\",B21, \"PerCentNetLastTrade\",, \"T\")/100,\"\")","v":""},null,{"$f":"Ranked!Q16","v":""},{"$f":"IF(I21=\"\",\"\",RTD(\"cqg.rtd\", ,\"ContractData\",I21, \"LongDescription\",, \"T\"))","v":""},null,null,null,{"$f":"IFERROR(RTD(\"cqg.rtd\", ,\"ContractData\",I21, \"PerCentNetLastTrade\",, \"T\")/100,\"\")","v":""},null,"S.JPM",{"$f":"IF(P21=\"\",\"\",RTD(\"cqg.rtd\", ,\"ContractData\",P21, \"LongDescription\",, \"T\"))","v":"JPMorgan Chase & Co."},null,null,null,{"$f":"IF(P21=\"\",\"\",TEXT(RTD(\"cqg.rtd\",,\"ContractData\",P21,\"LastTradeToday\",,\"T\"),AB21))","v":"123.13"},{"$f":"IF(P21=\"\",\"\",TEXT(RTD(\"cqg.rtd\", ,\"ContractData\", P21, \"NetLastTradeToday\",, \"T\"),AB21))","v":"-.42"},{"$f":"IFERROR(IF(P21=\"\",\"\",RTD(\"cqg.rtd\", ,\"ContractData\", P21, \"PerCentNetLastTrade\",, \"T\")/100),\"\")","v":-3.3994334277620396E-3},{"$f":"IF(P21=\"\",\"\",TEXT(RTD(\"cqg.rtd\", ,\"ContractData\", P21, \"OPen\",, \"T\"),AB21))","v":"123.39"},{"$f":"IF(P21=\"\",\"\",TEXT(RTD(\"cqg.rtd\", ,\"ContractData\", P21, \"HIgh\",, \"T\"),AB21))","v":"123.52"},{"$f":"IF(P21=\"\",\"\",TEXT(RTD(\"cqg.rtd\", ,\"ContractData\", P21, \"LOw\",, \"T\"),AB21))","v":"122.53"},{"$f":"IF(P21=\"\",\"\",IF(LEN(RTD(\"cqg.rtd\",,\"ContractData\",P21,\"TickSize\",,\"T\"))=1,0,LEN(RTD(\"cqg.rtd\",,\"ContractData\",P21,\"TickSize\",,\"T\"))-2))","v":2},"#.00"]
[0,{"$f":"Ranked!G17","v":""},{"$f":"IF(B22=\"\",\"\",RTD(\"cqg.rtd\", ,\"ContractData\",B22, \"LongDescription\",, \"T\"))","v":""},null,null,null,{"$f":"IFERROR(RTD(\"cqg.rtd\", ,\"ContractData\",B22, \"PerCentNetLastTrade\",, \"T\")/100,\"\")","v":""},null,{"$f":"Ranked!Q17","v":""},{"$f":"IF(I22=\"\",\"\",RTD(\"cqg.rtd\", ,\"ContractData\",I22, \"LongDescription\",, \"T\"))","v":""},null,null,null,{"$f":"IFERROR(RTD(\"cqg.rtd\", ,\"ContractData\",I22, \"PerCentNetLastTrade\",, \"T\")/100,\"\")","v":""},null,"S.MCD",{"$f":"IF(P22=\"\",\"\",RTD(\"cqg.rtd\", ,\"ContractData\",P22, \"LongDescription\",, \"T\"))","v":"McDonald's Corporation"},null,null,null,{"$f":"IF(P22=\"\",\"\",TEXT(RTD(\"cqg.rtd\",,\"ContractData\",P22,\"LastTradeToday\",,\"T\"),AB22))","v":"211.72"},{"$f":"IF(P22=\"\",\"\",TEXT(RTD(\"cqg.rtd\", ,\"ContractData\", P22, \"NetLastTradeToday\",, \"T\"),AB22))","v":".05"},{"$f":"IFERROR(IF(P22=\"\",\"\",RTD(\"cqg.rtd\", ,\"ContractData\", P22, \"PerCentNetLastTrade\",, \"T\")/100),\"\")","v":2.3621675249208674E-4},{"$f":"IF(P22=\"\",\"\",TEXT(RTD(\"cqg.rtd\", ,\"ContractData\", P22, \"OPen\",, \"T\"),AB22))","v":"211.20"},{"$f":"IF(P22=\"\",\"\",TEXT(RTD(\"cqg.rtd\", ,\"ContractData\", P22, \"HIgh\",, \"T\"),AB22))","v":"211.90"},{"$f":"IF(P22=\"\",\"\",TEXT(RTD(\"cqg.rtd\", ,\"ContractData\", P22, \"LOw\",, \"T\"),AB22))","v":"210.37"},{"$f":"IF(P22=\"\",\"\",IF(LEN(RTD(\"cqg.rtd\",,\"ContractData\",P22,\"TickSize\",,\"T\"))=1,0,LEN(RTD(\"cqg.rtd\",,\"ContractData\",P22,\"TickSize\",,\"T\"))-2))","v":2},"#.00"]
[0,{"$f":"Ranked!G18","v":""},{"$f":"IF(B23=\"\",\"\",RTD(\"cqg.rtd\", ,\"ContractData\",B23, \"LongDescription\",, \"T\"))","v":""},null,null,null,{"$f":"IFERROR(RTD(\"cqg.rtd\", ,\"ContractData\",B23, \"PerCentNetLastTrade\",, \"T\")/100,\"\")","v":""},null,{"$f":"Ranked!Q18","v":""},{"$f":"IF(I23=\"\",\"\",RTD(\"cqg.rtd\", ,\"ContractData\",I23, \"LongDescription\",, \"T\"))","v":""},null,null,null,{"$f":"IFERROR(RTD(\"cqg.rtd\", ,\"ContractData\",I23, \"PerCentNetLastTrade\",, \"T\")/100,\"\")","v":""},null,"S.BA",{"$f":"IF(P23=\"\",\"\",RTD(\"cqg.rtd\", ,\"ContractData\",P23, \"LongDescription\",, \"T\"))","v":"Boeing Company"},null,null,null,{"$f":"IF(P23=\"\",\"\",TEXT(RTD(\"cqg.rtd\",,\"ContractData\",P23,\"LastTradeToday\",,\"T\"),AB23))","v":"222.24"},{"$f":"IF(P23=\"\",\"\",TEXT(RTD(\"cqg.rtd\", ,\"ContractData\", P23, \"NetLastTradeToday\",, \"T\"),AB23))","v":"2.93"},{"$f":"IFERROR(IF(P23=\"\",\"\",RTD(\"cqg.rtd\", ,\"ContractData\", P23, \"PerCentNetLastTrade\",, \"T\")/100),\"\")","v":1.3360083899502986E-2},{"$f":"IF(P23=\"\",\"\",TEXT(RTD(\"cqg.rtd\", ,\"ContractData\", P23, \"OPen\",, \"T\"),AB23))","v":"223.28"},{"$f":"IF(P23=\"\",\"\",TEXT(RTD(\"cqg.rtd\", ,\"ContractData\", P23, \"HIgh\",, \"T\"),AB23))","v":"223.89"},{"$f":"IF(P23=\"\",\"\",TEXT(RTD(\"cqg.rtd\", ,\"ContractData\", P23, \"LOw\",, \"T\"),AB23))","v":"218.55"},{"$f":"IF(P23=\"\",\"\",IF(LEN(RTD(\"cqg.rtd\",,\"ContractData\",P23,\"TickSize\",,\"T\"))=1,0,LEN(RTD(\"cqg.rtd\",,\"ContractData\",P23,\"TickSize\",,\"T\"))-2))","v":2},"#.00"]
[0,{"$f":"Ranked!G19","v":""},{"$f":"IF(B24=\"\",\"\",RTD(\"cqg.rtd\", ,\"ContractData\",B24, \"LongDescription\",, \"T\"))","v":""},null,null,null,{"$f":"IFERROR(RTD(\"cqg.rtd\", ,\"ContractData\",B24, \"PerCentNetLastTrade\",, \"T\")/100,\"\")","v":""},null,{"$f":"Ranked!Q19","v":""},{"$f":"IF(I24=\"\",\"\",RTD(\"cqg.rtd\", ,\"ContractData\",I24, \"LongDescription\",, \"T\"))","v":""},null,null,null,{"$f":"IFERROR(RTD(\"cqg.rtd\", ,\"ContractData\",I24, \"PerCentNetLastTrade\",, \"T\")/100,\"\")","v":""},"Chart Symbol: ",null,null,"S.QQQ","Time Frame:  ",null,5,"Sessions: ","All",null,"NASDAQ closes in:"]
[0,{"$f":"Ranked!G20","v":""},{"$f":"IF(B25=\"\",\"\",RTD(\"cqg.rtd\", ,\"ContractData\",B25, \"LongDescription\",, \"T\"))","v":""},null,null,null,{"$f":"IFERROR(RTD(\"cqg.rtd\", ,\"ContractData\",B25, \"PerCentNetLastTrade\",, \"T\")/100,\"\")","v":""},null,{"$f":"Ranked!Q20","v":""},{"$f":"IF(I25=\"\",\"\",RTD(\"cqg.rtd\", ,\"ContractData\",I25, \"LongDescription\",, \"T\"))","v":""},null,null,null,{"$f":"IFERROR(RTD(\"cqg.rtd\", ,\"ContractData\",I25, \"PerCentNetLastTrade\",, \"T\")/100,\"\")","v":""},"Description: ",null,null,{"$f":"RTD(\"cqg.rtd\", ,\"ContractData\",R24, \"LongDescription\",, \"T\")","v":"Invesco QQQ Trust"},null,null,"Last: ",{"$f":"RTD(\"cqg.rtd\", ,\"ContractData\",R24, \"LastTradeToday\",, \"T\")","v":310.19},"NC: ",{"$f":"RTD(\"cqg.rtd\", ,\"ContractData\",R24, \"NetChange\",, \"T\")","v":1.2699999999999818},{"$f":"IF(0.625-MOD(W2,1)<0,\"Market is Closed\",0.625-MOD(W2,1))","v":0.22034722222451819}]
[0,{"$f":"Ranked!G21","v":""},{"$f":"IF(B26=\"\",\"\",RTD(\"cqg.rtd\", ,\"ContractData\",B26, \"LongDescription\",, \"T\"))","v":""},null,null,null,{"$f":"IFERROR(RTD(\"cqg.rtd\", ,\"ContractData\",B26, \"PerCentNetLastTrade\",, \"T\")/100,\"\")","v":""},null,{"$f":"Ranked!Q21","v":""},{"$f":"IF(I26=\"\",\"\",RTD(\"cqg.rtd\", ,\"ContractData\",I26, \"LongDescription\",, \"T\"))","v":""},null,null,null,{"$f":"IFERROR(RTD(\"cqg.rtd\", ,\"ContractData\",I26, \"PerCentNetLastTrade\",, \"T\")/100,\"\")","v":""}]
[0,{"$f":"Ranked!G22","v":""},{"$f":"IF(B27=\"\",\"\",RTD(\"cqg.rtd\", ,\"ContractData\",B27, \"LongDescription\",, \"T\"))","v":""},null,null,null,{"$f":"IFERROR(RTD(\"cqg.rtd\", ,\"ContractData\",B27, \"PerCentNetLastTrade\",, \"T\")/100,\"\")","v":""},null,{"$f":"Ranked!Q22","v":""},{"$f":"IF(I27=\"\",\"\",RTD(\"cqg.rtd\", ,\"ContractData\",I27, \"LongDescription\",, \"T\"))","v":""},null,null,null,{"$f":"IFERROR(RTD(\"cqg.rtd\", ,\"ContractData\",I27, \"PerCentNetLastTrade\",, \"T\")/100,\"\")","v":""}]
[0,{"$f":"Ranked!G23","v":""},{"$f":"IF(B28=\"\",\"\",RTD(\"cqg.rtd\", ,\"ContractData\",B28, \"LongDescription\",, \"T\"))","v":""},null,null,null,{"$f":"IFERROR(RTD(\"cqg.rtd\", ,\"ContractData\",B28, \"PerCentNetLastTrade\",, \"T\")/100,\"\")","v":""},null,{"$f":"Ranked!Q23","v":""},{"$f":"IF(I28=\"\",\"\",RTD(\"cqg.rtd\", ,\"ContractData\",I28, \"LongDescription\",, \"T\"))","v":""},null,null,null,{"$f":"IFERROR(RTD(\"cqg.rtd\", ,\"ContractData\",I28, \"PerCentNetLastTrade\",, \"T\")/100,\"\")","v":""}]
[0,{"$f":"Ranked!G24","v":""},{"$f":"IF(B29=\"\",\"\",RTD(\"cqg.rtd\", ,\"ContractData\",B29, \"LongDescription\",, \"T\"))","v":""},null,null,null,{"$f":"IFERROR(RTD(\"cqg.rtd\", ,\"ContractData\",B29, \"PerCentNetLastTrade\",, \"T\")/100,\"\")","v":""},null,{"$f":"Ranked!Q24","v":""},{"$f":"IF(I29=\"\",\"\",RTD(\"cqg.rtd\", ,\"ContractData\",I29, \"LongDescription\",, \"T\"))","v":""},null,null,null,{"$f":"IFERROR(RTD(\"cqg.rtd\", ,\"ContractData\",I29, \"PerCentNetLastTrade\",, \"T\")/100,\"\")","v":""}]
[0,{"$f":"Ranked!G25","v":""},{"$f":"IF(B30=\"\",\"\",RTD(\"cqg.rtd\", ,\"ContractData\",B30, \"LongDescription\",, \"T\"))","v":""},null,null,null,{"$f":"IFERROR(RTD(\"cqg.rtd\", ,\"ContractData\",B30, \"PerCentNetLastTrade\",, \"T\")/100,\"\")","v":""},null,{"$f":"Ranked!Q25","v":""},{"$f":"IF(I30=\"\",\"\",RTD(\"cqg.rtd\", ,\"ContractData\",I30, \"LongDescription\",, \"T\"))","v":""},null,null,null,{"$f":"IFERROR(RTD(\"cqg.rtd\", ,\"ContractData\",I30, \"PerCentNetLastTrade\",, \"T\")/100,\"\")","v":""}]
[0,{"$f":"Ranked!G26","v":""},{"$f":"IF(B31=\"\",\"\",RTD(\"cqg.rtd\", ,\"ContractData\",B31, \"LongDescription\",, \"T\"))","v":""},null,null,null,{"$f":"IFERROR(RTD(\"cqg.rtd\", ,\"ContractData\",B31, \"PerCentNetLastTrade\",, \"T\")/100,\"\")","v":""},null,{"$f":"Ranked!Q26","v":""},{"$f":"IF(I31=\"\",\"\",RTD(\"cqg.rtd\", ,\"ContractData\",I31, \"LongDescription\",, \"T\"))","v":""},null,null,null,{"$f":"IFERROR(RTD(\"cqg.rtd\", ,\"ContractData\",I31, \"PerCentNetLastTrade\",, \"T\")/100,\"\")","v":""}]
[0,{"$f":"Ranked!G27","v":""},{"$f":"IF(B32=\"\",\"\",RTD(\"cqg.rtd\", ,\"ContractData\",B32, \"LongDescription\",, \"T\"))","v":""},null,null,null,{"$f":"IFERROR(RTD(\"cqg.rtd\", ,\"ContractData\",B32, \"PerCentNetLastTrade\",, \"T\")/100,\"\")","v":""},null,{"$f":"Ranked!Q27","v":""},{"$f":"IF(I32=\"\",\"\",RTD(\"cqg.rtd\", ,\"ContractData\",I32, \"LongDescription\",, \"T\"))","v":""},null,null,null,{"$f":"IFERROR(RTD(\"cqg.rtd\", ,\"ContractData\",I32, \"PerCentNetLastTrade\",, \"T\")/100,\"\")","v":""}]
[0,{"$f":"Ranked!G28","v":""},{"$f":"IF(B33=\"\",\"\",RTD(\"cqg.rtd\", ,\"ContractData\",B33, \"LongDescription\",, \"T\"))","v":""},null,null,null,{"$f":"IFERROR(RTD(\"cqg.rtd\", ,\"ContractData\",B33, \"PerCentNetLastTrade\",, \"T\")/100,\"\")","v":""},null,{"$f":"Ranked!Q28","v":""},{"$f":"IF(I33=\"\",\"\",RTD(\"cqg.rtd\", ,\"ContractData\",I33, \"LongDescription\",, \"T\"))","v":""},null,null,null,{"$f":"IFERROR(RTD(\"cqg.rtd\", ,\"ContractData\",I33, \"PerCentNetLastTrade\",, \"T\")/100,\"\")","v":""}]
[0,{"$f":"Ranked!G29","v":""},{"$f":"IF(B34=\"\",\"\",RTD(\"cqg.rtd\", ,\"ContractData\",B34, \"LongDescription\",, \"T\"))","v":""},null,null,null,{"$f":"IFERROR(RTD(\"cqg.rtd\", ,\"ContractData\",B34, \"PerCentNetLastTrade\",, \"T\")/100,\"\")","v":""},null,{"$f":"Ranked!Q29","v":""},{"$f":"IF(I34=\"\",\"\",RTD(\"cqg.rtd\", ,\"ContractData\",I34, \"LongDescription\",, \"T\"))","v":""},null,null,null,{"$f":"IFERROR(RTD(\"cqg.rtd\", ,\"ContractData\",I34, \"PerCentNetLastTrade\",, \"T\")/100,\"\")","v":""}]
[0,{"$f":"Ranked!G30","v":""},{"$f":"IF(B35=\"\",\"\",RTD(\"cqg.rtd\", ,\"ContractData\",B35, \"LongDescription\",, \"T\"))","v":""},null,null,null,{"$f":"IFERROR(RTD(\"cqg.rtd\", ,\"ContractData\",B35, \"PerCentNetLastTrade\",, \"T\")/100,\"\")","v":""},null,{"$f":"Ranked!Q30","v":""},{"$f":"IF(I35=\"\",\"\",RTD(\"cqg.rtd\", ,\"ContractData\",I35, \"LongDescription\",, \"T\"))","v":""},null,null,null,{"$f":"IFERROR(RTD(\"cqg.rtd\", ,\"ContractData\",I35, \"PerCentNetLastTrade\",, \"T\")/100,\"\")","v":""}]
[0,{"$f":"Ranked!G31","v":""},{"$f":"IF(B36=\"\",\"\",RTD(\"cqg.rtd\", ,\"ContractData\",B36, \"LongDescription\",, \"T\"))","v":""},null,null,null,{"$f":"IFERROR(RTD(\"cqg.rtd\", ,\"ContractData\",B36, \"PerCentNetLastTrade\",, \"T\")/100,\"\")","v":""},null,{"$f":"Ranked!Q31","v":""},{"$f":"IF(I36=\"\",\"\",RTD(\"cqg.rtd\", ,\"ContractData\",I36, \"LongDescription\",, \"T\"))","v":""},null,null,null,{"$f":"IFERROR(RTD(\"cqg.rtd\", ,\"ContractData\",I36, \"PerCentNetLastTrade\",, \"T\")/100,\"\")","v":""}]
[0,{"$f":"Ranked!G32","v":""},{"$f":"IF(B37=\"\",\"\",RTD(\"cqg.rtd\", ,\"ContractData\",B37, \"LongDescription\",, \"T\"))","v":""},null,null,null,{"$f":"IFERROR(RTD(\"cqg.rtd\", ,\"ContractData\",B37, \"PerCentNetLastTrade\",, \"T\")/100,\"\")","v":""},null,{"$f":"Ranked!Q32","v":""},{"$f":"IF(I37=\"\",\"\",RTD(\"cqg.rtd\", ,\"ContractData\",I37, \"LongDescription\",, \"T\"))","v":""},null,null,null,{"$f":"IFERROR(RTD(\"cqg.rtd\", ,\"ContractData\",I37, \"PerCentNetLastTrade\",, \"T\")/100,\"\")","v":""}]
[0,{"$f":"Ranked!G33","v":""},{"$f":"IF(B38=\"\",\"\",RTD(\"cqg.rtd\", ,\"ContractData\",B38, \"LongDescription\",, \"T\"))","v":""},null,null,null,{"$f":"IFERROR(RTD(\"cqg.rtd\", ,\"ContractData\",B38, \"PerCentNetLastTrade\",, \"T\")/100,\"\")","v":""},null,{"$f":"Ranked!Q33","v":""},{"$f":"IF(I38=\"\",\"\",RTD(\"cqg.rtd\", ,\"ContractData\",I38, \"LongDescription\",, \"T\"))","v":""},null,null,null,{"$f":"IFERROR(RTD(\"cqg.rtd\", ,\"ContractData\",I38, \"PerCentNetLastTrade\",, \"T\")/100,\"\")","v":""}]
[0,{"$f":"Ranked!G34","v":""},{"$f":"IF(B39=\"\",\"\",RTD(\"cqg.rtd\", ,\"ContractData\",B39, \"LongDescription\",, \"T\"))","v":""},null,null,null,{"$f":"IFERROR(RTD(\"cqg.rtd\", ,\"ContractData\",B39, \"PerCentNetLastTrade\",, \"T\")/100,\"\")","v":""},null,{"$f":"Ranked!Q34","v":""},{"$f":"IF(I39=\"\",\"\",RTD(\"cqg.rtd\", ,\"ContractData\",I39, \"LongDescription\",, \"T\"))","v":""},null,null,null,{"$f":"IFERROR(RTD(\"cqg.rtd\", ,\"ContractData\",I39, \"PerCentNetLastTrade\",, \"T\")/100,\"\")","v":""}]
[0,{"$f":"Ranked!G35","v":""},{"$f":"IF(B40=\"\",\"\",RTD(\"cqg.rtd\", ,\"ContractData\",B40, \"LongDescription\",, \"T\"))","v":""},null,null,null,{"$f":"IFERROR(RTD(\"cqg.rtd\", ,\"ContractData\",B40, \"PerCentNetLastTrade\",, \"T\")/100,\"\")","v":""},null,{"$f":"Ranked!Q35","v":""},{"$f":"IF(I40=\"\",\"\",RTD(\"cqg.rtd\", ,\"ContractData\",I40, \"LongDescription\",, \"T\"))","v":""},null,null,null,{"$f":"IFERROR(RTD(\"cqg.rtd\", ,\"ContractData\",I40, \"PerCentNetLastTrade\",, \"T\")/100,\"\")","v":""}]
[0,{"$f":"Ranked!G36","v":""},{"$f":"IF(B41=\"\",\"\",RTD(\"cqg.rtd\", ,\"ContractData\",B41, \"LongDescription\",, \"T\"))","v":""},null,null,null,{"$f":"IFERROR(RTD(\"cqg.rtd\", ,\"ContractData\",B41, \"PerCentNetLastTrade\",, \"T\")/100,\"\")","v":""},null,{"$f":"Ranked!Q36","v":""},{"$f":"IF(I41=\"\",\"\",RTD(\"cqg.rtd\", ,\"ContractData\",I41, \"LongDescription\",, \"T\"))","v":""},null,null,null,{"$f":"IFERROR(RTD(\"cqg.rtd\", ,\"ContractData\",I41, \"PerCentNetLastTrade\",, \"T\")/100,\"\")","v":""}]
[0,{"$f":"Ranked!G37","v":""},{"$f":"IF(B42=\"\",\"\",RTD(\"cqg.rtd\", ,\"ContractData\",B42, \"LongDescription\",, \"T\"))","v":""},null,null,null,{"$f":"IFERROR(RTD(\"cqg.rtd\", ,\"ContractData\",B42, \"PerCentNetLastTrade\",, \"T\")/100,\"\")","v":""},null,{"$f":"Ranked!Q37","v":""},{"$f":"IF(I42=\"\",\"\",RTD(\"cqg.rtd\", ,\"ContractData\",I42, \"LongDescription\",, \"T\"))","v":""},null,null,null,{"$f":"IFERROR(RTD(\"cqg.rtd\", ,\"ContractData\",I42, \"PerCentNetLastTrade\",, \"T\")/100,\"\")","v":""}]
[0,{"$f":"Ranked!G38","v":""},{"$f":"IF(B43=\"\",\"\",RTD(\"cqg.rtd\", ,\"ContractData\",B43, \"LongDescription\",, \"T\"))","v":""},null,null,null,{"$f":"IFERROR(RTD(\"cqg.rtd\", ,\"ContractData\",B43, \"PerCentNetLastTrade\",, \"T\")/100,\"\")","v":""},null,{"$f":"Ranked!Q38","v":""},{"$f":"IF(I43=\"\",\"\",RTD(\"cqg.rtd\", ,\"ContractData\",I43, \"LongDescription\",, \"T\"))","v":""},null,null,null,{"$f":"IFERROR(RTD(\"cqg.rtd\", ,\"ContractData\",I43, \"PerCentNetLastTrade\",, \"T\")/100,\"\")","v":""}]
[0,{"$f":"Ranked!G39","v":""},{"$f":"IF(B44=\"\",\"\",RTD(\"cqg.rtd\", ,\"ContractData\",B44, \"LongDescription\",, \"T\"))","v":""},null,null,null,{"$f":"IFERROR(RTD(\"cqg.rtd\", ,\"ContractData\",B44, \"PerCentNetLastTrade\",, \"T\")/100,\"\")","v":""},null,{"$f":"Ranked!Q39","v":""},{"$f":"IF(I44=\"\",\"\",RTD(\"cqg.rtd\", ,\"ContractData\",I44, \"LongDescription\",, \"T\"))","v":""},null,null,null,{"$f":"IFERROR(RTD(\"cqg.rtd\", ,\"ContractData\",I44, \"PerCentNetLastTrade\",, \"T\")/100,\"\")","v":""}]
[0,{"$f":"Ranked!G40","v":""},{"$f":"IF(B45=\"\",\"\",RTD(\"cqg.rtd\", ,\"ContractData\",B45, \"LongDescription\",, \"T\"))","v":""},null,null,null,{"$f":"IFERROR(RTD(\"cqg.rtd\", ,\"ContractData\",B45, \"PerCentNetLastTrade\",, \"T\")/100,\"\")","v":""},null,{"$f":"Ranked!Q40","v":""},{"$f":"IF(I45=\"\",\"\",RTD(\"cqg.rtd\", ,\"ContractData\",I45, \"LongDescription\",, \"T\"))","v":""},null,null,null,{"$f":"IFERROR(RTD(\"cqg.rtd\", ,\"ContractData\",I45, \"PerCentNetLastTrade\",, \"T\")/100,\"\")","v":""}]
[0,{"$f":"Ranked!G41","v":""},{"$f":"IF(B46=\"\",\"\",RTD(\"cqg.rtd\", ,\"ContractData\",B46, \"LongDescription\",, \"T\"))","v":""},null,null,null,{"$f":"IFERROR(RTD(\"cqg.rtd\", ,\"ContractData\",B46, \"PerCentNetLastTrade\",, \"T\")/100,\"\")","v":""},null,{"$f":"Ranked!Q41","v":""},{"$f":"IF(I46=\"\",\"\",RTD(\"cqg.rtd\", ,\"ContractData\",I46, \"LongDescription\",, \"T\"))","v":""},null,null,null,{"$f":"IFERROR(RTD(\"cqg.rtd\", ,\"ContractData\",I46, \"PerCentNetLastTrade\",, \"T\")/100,\"\")","v":""}]
[null,null,"  Copyright © 2019",null,null,null,null,null,{"$f":"IF(OR(I46<>\"\",B46<>\"\"),\"Please check Ranked Tab for a full view\",\"\")","v":""},null,null,null,null,null,null,null,null,null,null,null,null,null,null,"Designed by Thom Hartle"]

{"sheet":"Data","index":1,"n_rows":103,"n_cols":20,"rows_kept":103,"cut":false,"hidden":true,"merged":[]}
["Symbol",{"$f":"Main!D5","v":12},{"$f":"Main!G5","v":5},null,null,null,null,0,0,null,null,null,null,null,null,null,null,null,"UP"]
["S.US.AAPL ",{"$f":"IFERROR(RTD(\"cqg.rtd\",,\"StudyData\",A2,\"Bar\",, \"High\",$C$1,\"0\",,,,,\"T\"),\"\")","v":133.18},{"$f":"IFERROR(RTD(\"cqg.rtd\",,\"StudyData\",A2,\"Bar\",, \"Low\",$C$1,\"0\",,,,,\"T\"),\"\")","v":132.84},{"$f":"IFERROR(RTD(\"cqg.rtd\",,\"StudyData\",\"HiLevel(\"&A2&\",Period1:=\"&$B$1&\",AllowGaps:=0,InputChoice1:=High,InputChoice3:=High)\",\"Bar\",, \"Close\",$C$1,\"-1\",,,,,\"T\"),\"\")","v":134.4},{"$f":"IFERROR(RTD(\"cqg.rtd\",,\"StudyData\",\"LoLevel(\"&A2&\",Period2:=\"&$B$1&\",AllowGaps:=0,InputChoice2:=Low,InputChoice4:=Low)\",\"Bar\",, \"Close\",$C$1,\"-1\",,,,,\"T\"),\"\")","v":131.55000000000001},{"$f":"IF(B2=\"\",0,IFERROR(IF(B2>D2,1,0),\"\"))","v":0},{"$f":"IF(C2=\"\",0,IFERROR(IF(C2<E2,1,0),\"\"))","v":0},{"$f":"IF(F2=1,INT(H1+1),H1+0.001)","v":1E-3},{"$f":"IF(G2=1,INT(I1+1),I1+0.001)","v":1E-3},{"$f":"A2","v":"S.US.AAPL "},{"$f":"RTD(\"cqg.rtd\", ,\"ContractData\",A2, \"PerCentNetLastTrade\",, \"T\")/100","v":3.844654137097403E-2},{"$f":"RANK($K2,$K$2:K$103)+COUNTIF($K$2:K2,K2)-1","v":3},{"$f":"J2","v":"S.US.AAPL "},1,{"$f":"IFERROR(VLOOKUP(N2,$L$2:$M$103,2,FALSE),\"\")","v":"S.US.PTON "},{"$f":"RTD(\"cqg.rtd\", ,\"ContractData\",O2, \"PerCentNetLastTrade\",, \"T\")/100","v":0.13366576632730798},{"$f":"VLOOKUP(O2,$A$2:$H103,8,FALSE)","v":9.0059999999999967},null,1,{"$f":"IFERROR(VLOOKUP(S2,$H$2:$J$103,3,FALSE),\"\")","v":"S.US.ANSS "}]
["S.US.ADBE ",{"$f":"IFERROR(RTD(\"cqg.rtd\",,\"StudyData\",A3,\"Bar\",, \"High\",$C$1,\"0\",,,,,\"T\"),\"\")","v":503},{"$f":"IFERROR(RTD(\"cqg.rtd\",,\"StudyData\",A3,\"Bar\",, \"Low\",$C$1,\"0\",,,,,\"T\"),\"\")","v":502.55},{"$f":"IFERROR(RTD(\"cqg.rtd\",,\"StudyData\",\"HiLevel(\"&A3&\",Period1:=\"&$B$1&\",AllowGaps:=0,InputChoice1:=High,InputChoice3:=High)\",\"Bar\",, \"Close\",$C$1,\"-1\",,,,,\"T\"),\"\")","v":503.35},{"$f":"IFERROR(RTD(\"cqg.rtd\",,\"StudyData\",\"LoLevel(\"&A3&\",Period2:=\"&$B$1&\",AllowGaps:=0,InputChoice2:=Low,InputChoice4:=Low)\",\"Bar\",, \"Close\",$C$1,\"-1\",,,,,\"T\"),\"\")","v":497.65},{"$f":"IF(B3=\"\",0,IFERROR(IF(B3>D3,1,0),\"\"))","v":0},{"$f":"IF(C3=\"\",0,IFERROR(IF(C3<E3,1,0),\"\"))","v":0},{"$f":"IF(F3=1,INT(H2+1),H2+0.001)","v":2E-3},2E-3,{"$f":"A3","v":"S.US.ADBE "},{"$f":"RTD(\"cqg.rtd\", ,\"ContractData\",A3, \"PerCentNetLastTrade\",, \"T\")/100","v":8.70803988844078E-3},{"$f":"RANK($K3,$K$2:K$103)+COUNTIF($K$2:K3,K3)-1","v":22},{"$f":"J3","v":"S.US.ADBE "},{"$f":"N2+1","v":2},{"$f":"IFERROR(VLOOKUP(N3,$L$2:$M$103,2,FALSE),\"\")","v":"S.US.WDAY "},{"$f":"RTD(\"cqg.rtd\", ,\"ContractData\",O3, \"PerCentNetLastTrade\",, \"T\")/100","v":4.89022779795312E-2},{"$f":"VLOOKUP(O3,$A$2:$H104,8,FALSE)","v":12.002999999999998},null,{"$f":"S2+1","v":2},{"$f":"IFERROR(VLOOKUP(S3,$H$2:$J$103,3,FALSE),\"\")","v":"S.US.CERN "}]
["S.US.ADI ",{"$f":"IFERROR(RTD(\"cqg.rtd\",,\"StudyData\",A4,\"Bar\",, \"High\",$C$1,\"0\",,,,,\"T\"),\"\")","v":143.63},{"$f":"IFERROR(RTD(\"cqg.rtd\",,\"StudyData\",A4,\"Bar\",, \"Low\",$C$1,\"0\",,,,,\"T\"),\"\")","v":143.44999999999999},{"$f":"IFERROR(RTD(\"cqg.rtd\",,\"StudyData\",\"HiLevel(\"&A4&\",Period1:=\"&$B$1&\",AllowGaps:=0,InputChoice1:=High,InputChoice3:=High)\",\"Bar\",, \"Close\",$C$1,\"-1\",,,,,\"T\"),\"\")","v":143.68},{"$f":"IFERROR(RTD(\"cqg.rtd\",,\"StudyData\",\"LoLevel(\"&A4&\",Period2:=\"&$B$1&\",AllowGaps:=0,InputChoice2:=Low,InputChoice4:=Low)\",\"Bar\",, \"Close\",$C$1,\"-1\",,,,,\"T\"),\"\")","v":142.66999999999999},{"$f":"IF(B4=\"\",0,IFERROR(IF(B4>D4,1,0),\"\"))","v":0},0,3.0000000000000001E-3,3.0000000000000001E-3,"S.US.ADI ",{"$f":"RTD(\"cqg.rtd\", ,\"ContractData\",A4, \"PerCentNetLastTrade\",, \"T\")/100","v":7.0131145241601796E-3},{"$f":"RANK($K4,$K$2:K$103)+COUNTIF($K$2:K4,K4)-1","v":26},"S.US.ADI ",{"$f":"N3+1","v":3},"S.US.AAPL ",{"$f":"RTD(\"cqg.rtd\", ,\"ContractData\",O4, \"PerCentNetLastTrade\",, \"T\")/100","v":3.844654137097403E-2},{"$f":"VLOOKUP(O4,$A$2:$H105,8,FALSE)","v":1E-3},null,{"$f":"S3+1","v":3},"S.US.CPRT "]
["S.US.ADP ",{"$f":"IFERROR(RTD(\"cqg.rtd\",,\"StudyData\",A5,\"Bar\",, \"High\",$C$1,\"0\",,,,,\"T\"),\"\")","v":176.1},{"$f":"IFERROR(RTD(\"cqg.rtd\",,\"StudyData\",A5,\"Bar\",, \"Low\",$C$1,\"0\",,,,,\"T\"),\"\")","v":175.96},{"$f":"IFERROR(RTD(\"cqg.rtd\",,\"StudyData\",\"HiLevel(\"&A5&\",Period1:=\"&$B$1&\",AllowGaps:=0,InputChoice1:=High,InputChoice3:=High)\",\"Bar\",, \"Close\",$C$1,\"-1\",,,,,\"T\"),\"\")","v":177.02},{"$f":"IFERROR(RTD(\"cqg.rtd\",,\"StudyData\",\"LoLevel(\"&A5&\",Period2:=\"&$B$1&\",AllowGaps:=0,InputChoice2:=Low,InputChoice4:=Low)\",\"Bar\",, \"Close\",$C$1,\"-1\",,,,,\"T\"),\"\")","v":175.46},0,0,4.0000000000000001E-3,4.0000000000000001E-3,"S.US.ADP ",{"$f":"RTD(\"cqg.rtd\", ,\"ContractData\",A5, \"PerCentNetLastTrade\",, \"T\")/100","v":-7.831427122654798E-3},{"$f":"RANK($K5,$K$2:K$103)+COUNTIF($K$2:K5,K5)-1","v":81},"S.US.ADP ",4,"S.US.ILMN ",{"$f":"RTD(\"cqg.rtd\", ,\"ContractData\",O5, \"PerCentNetLastTrade\",, \"T\")/100","v":3.1767917712268702E-2},{"$f":"VLOOKUP(O5,$A$2:$H106,8,FALSE)","v":7.0010000000000003},null,4,"S.US.CSX "]
["S.US.ADSK ",{"$f":"IFERROR(RTD(\"cqg.rtd\",,\"StudyData\",A6,\"Bar\",, \"High\",$C$1,\"0\",,,,,\"T\"),\"\")","v":303.3},{"$f":"IFERROR(RTD(\"cqg.rtd\",,\"StudyData\",A6,\"Bar\",, \"Low\",$C$1,\"0\",,,,,\"T\"),\"\")","v":302.88},{"$f":"IFERROR(RTD(\"cqg.rtd\",,\"StudyData\",\"HiLevel(\"&A6&\",Period1:=\"&$B$1&\",AllowGaps:=0,InputChoice1:=High,InputChoice3:=High)\",\"Bar\",, \"Close\",$C$1,\"-1\",,,,,\"T\"),\"\")","v":303.36},{"$f":"IFERROR(RTD(\"cqg.rtd\",,\"StudyData\",\"LoLevel(\"&A6&\",Period2:=\"&$B$1&\",AllowGaps:=0,InputChoice2:=Low,InputChoice4:=Low)\",\"Bar\",, \"Close\",$C$1,\"-1\",,,,,\"T\"),\"\")","v":300},0,0,5.0000000000000001E-3,5.0000000000000001E-3,"S.US.ADSK ",{"$f":"RTD(\"cqg.rtd\", ,\"ContractData\",A6, \"PerCentNetLastTrade\",, \"T\")/100","v":7.3118851369316671E-3},{"$f":"RANK($K6,$K$2:K$103)+COUNTIF($K$2:K6,K6)-1","v":24},"S.US.ADSK ",5,"S.US.OKTA ",{"$f":"RTD(\"cqg.rtd\", ,\"ContractData\",O6, \"PerCentNetLastTrade\",, \"T\")/100","v":3.0195252957828263E-2},{"$f":"VLOOKUP(O6,$A$2:$H107,8,FALSE)","v":9},null,5,"S.US.EXC "]
["S.US.AEP ",{"$f":"IFERROR(RTD(\"cqg.rtd\",,\"StudyData\",A7,\"Bar\",, \"High\",$C$1,\"0\",,,,,\"T\"),\"\")","v":81.81},{"$f":"IFERROR(RTD(\"cqg.rtd\",,\"StudyData\",A7,\"Bar\",, \"Low\",$C$1,\"0\",,,,,\"T\"),\"\")","v":81.66},{"$f":"IFERROR(RTD(\"cqg.rtd\",,\"StudyData\",\"HiLevel(\"&A7&\",Period1:=\"&$B$1&\",AllowGaps:=0,InputChoice1:=High,InputChoice3:=High)\",\"Bar\",, \"Close\",$C$1,\"-1\",,,,,\"T\"),\"\")","v":82},{"$f":"IFERROR(RTD(\"cqg.rtd\",,\"StudyData\",\"LoLevel(\"&A7&\",Period2:=\"&$B$1&\",AllowGaps:=0,InputChoice2:=Low,InputChoice4:=Low)\",\"Bar\",, \"Close\",$C$1,\"-1\",,,,,\"T\"),\"\")","v":81.44},0,0,6.0000000000000001E-3,6.0000000000000001E-3,"S.US.AEP ",{"$f":"RTD(\"cqg.rtd\", ,\"ContractData\",A7, \"PerCentNetLastTrade\",, \"T\")/100","v":-4.0185094982951777E-3},{"$f":"RANK($K7,$K$2:K$103)+COUNTIF($K$2:K7,K7)-1","v":57},"S.US.AEP ",6,"S.US.SWKS ",{"$f":"RTD(\"cqg.rtd\", ,\"ContractData\",O7, \"PerCentNetLastTrade\",, \"T\")/100","v":2.5522984225847947E-2},{"$f":"VLOOKUP(O7,$A$2:$H108,8,FALSE)","v":11.000999999999999},null,6,"S.US.GOOG "]
["S.US.ALGN ",{"$f":"IFERROR(RTD(\"cqg.rtd\",,\"StudyData\",A8,\"Bar\",, \"High\",$C$1,\"0\",,,,,\"T\"),\"\")","v":531.13},{"$f":"IFERROR(RTD(\"cqg.rtd\",,\"StudyData\",A8,\"Bar\",, \"Low\",$C$1,\"0\",,,,,\"T\"),\"\")","v":530.61},{"$f":"IFERROR(RTD(\"cqg.rtd\",,\"StudyData\",\"HiLevel(\"&A8&\",Period1:=\"&$B$1&\",AllowGaps:=0,InputChoice1:=High,InputChoice3:=High)\",\"Bar\",, \"Close\",$C$1,\"-1\",,,,,\"T\"),\"\")","v":532.19000000000005},{"$f":"IFERROR(RTD(\"cqg.rtd\",,\"StudyData\",\"LoLevel(\"&A8&\",Period2:=\"&$B$1&\",AllowGaps:=0,InputChoice2:=Low,InputChoice4:=Low)\",\"Bar\",, \"Close\",$C$1,\"-1\",,,,,\"T\"),\"\")","v":527.6},0,0,7.0000000000000001E-3,7.0000000000000001E-3,"S.US.ALGN ",{"$f":"RTD(\"cqg.rtd\", ,\"ContractData\",A8, \"PerCentNetLastTrade\",, \"T\")/100","v":2.4495487177554598E-4},{"$f":"RANK($K8,$K$2:K$103)+COUNTIF($K$2:K8,K8)-1","v":46},"S.US.ALGN ",7,"S.US.MTCH ",{"$f":"RTD(\"cqg.rtd\", ,\"ContractData\",O8, \"PerCentNetLastTrade\",, \"T\")/100","v":2.4586441777489459E-2},{"$f":"VLOOKUP(O8,$A$2:$H109,8,FALSE)","v":8.0099999999999945},null,7,"S.US.IDXX "]
["S.US.ALXN ",{"$f":"IFERROR(RTD(\"cqg.rtd\",,\"StudyData\",A9,\"Bar\",, \"High\",$C$1,\"0\",,,,,\"T\"),\"\")","v":153.53},{"$f":"IFERROR(RTD(\"cqg.rtd\",,\"StudyData\",A9,\"Bar\",, \"Low\",$C$1,\"0\",,,,,\"T\"),\"\")","v":153.16},{"$f":"IFERROR(RTD(\"cqg.rtd\",,\"StudyData\",\"HiLevel(\"&A9&\",Period1:=\"&$B$1&\",AllowGaps:=0,InputChoice1:=High,InputChoice3:=High)\",\"Bar\",, \"Close\",$C$1,\"-1\",,,,,\"T\"),\"\")","v":154.03},{"$f":"IFERROR(RTD(\"cqg.rtd\",,\"StudyData\",\"LoLevel(\"&A9&\",Period2:=\"&$B$1&\",AllowGaps:=0,InputChoice2:=Low,InputChoice4:=Low)\",\"Bar\",, \"Close\",$C$1,\"-1\",,,,,\"T\"),\"\")","v":153.24},0,1,8.0000000000000002E-3,1,"S.US.ALXN ",{"$f":"RTD(\"cqg.rtd\", ,\"ContractData\",A9, \"PerCentNetLastTrade\",, \"T\")/100","v":-9.1067622553768646E-3},{"$f":"RANK($K9,$K$2:K$103)+COUNTIF($K$2:K9,K9)-1","v":85},"S.US.ALXN ",8,"S.US.CDNS ",{"$f":"RTD(\"cqg.rtd\", ,\"ContractData\",O9, \"PerCentNetLastTrade\",, \"T\")/100","v":2.3912548394443182E-2},{"$f":"VLOOKUP(O9,$A$2:$H110,8,FALSE)","v":1.0069999999999992},null,8,"S.US.LRCX "]
["S.US.AMAT ",{"$f":"IFERROR(RTD(\"cqg.rtd\",,\"StudyData\",A10,\"Bar\",, \"High\",$C$1,\"0\",,,,,\"T\"),\"\")","v":86.32},{"$f":"IFERROR(RTD(\"cqg.rtd\",,\"StudyData\",A10,\"Bar\",, \"Low\",$C$1,\"0\",,,,,\"T\"),\"\")","v":86.25},{"$f":"IFERROR(RTD(\"cqg.rtd\",,\"StudyData\",\"HiLevel(\"&A10&\",Period1:=\"&$B$1&\",AllowGaps:=0,InputChoice1:=High,InputChoice3:=High)\",\"Bar\",, \"Close\",$C$1,\"-1\",,,,,\"T\"),\"\")","v":86.55},{"$f":"IFERROR(RTD(\"cqg.rtd\",,\"StudyData\",\"LoLevel(\"&A10&\",Period2:=\"&$B$1&\",AllowGaps:=0,InputChoice2:=Low,InputChoice4:=Low)\",\"Bar\",, \"Close\",$C$1,\"-1\",,,,,\"T\"),\"\")","v":85.94},0,0,9.0000000000000011E-3,1.0009999999999999,"S.US.AMAT ",{"$f":"RTD(\"cqg.rtd\", ,\"ContractData\",A10, \"PerCentNetLastTrade\",, \"T\")/100","v":-1.8516375419511629E-3},{"$f":"RANK($K10,$K$2:K$103)+COUNTIF($K$2:K10,K10)-1","v":51},"S.US.AMAT ",9,"S.US.PYPL ",{"$f":"RTD(\"cqg.rtd\", ,\"ContractData\",O10, \"PerCentNetLastTrade\",, \"T\")/100","v":1.7078916372202591E-2},{"$f":"VLOOKUP(O10,$A$2:$H111,8,FALSE)","v":9.0069999999999961},null,9,"S.US.OKTA "]
["S.US.AMD ",{"$f":"IFERROR(RTD(\"cqg.rtd\",,\"StudyData\",A11,\"Bar\",, \"High\",$C$1,\"0\",,,,,\"T\"),\"\")","v":92.52},{"$f":"IFERROR(RTD(\"cqg.rtd\",,\"StudyData\",A11,\"Bar\",, \"Low\",$C$1,\"0\",,,,,\"T\"),\"\")","v":92.27},{"$f":"IFERROR(RTD(\"cqg.rtd\",,\"StudyData\",\"HiLevel(\"&A11&\",Period1:=\"&$B$1&\",AllowGaps:=0,InputChoice1:=High,InputChoice3:=High)\",\"Bar\",, \"Close\",$C$1,\"-1\",,,,,\"T\"),\"\")","v":92.76},{"$f":"IFERROR(RTD(\"cqg.rtd\",,\"StudyData\",\"LoLevel(\"&A11&\",Period2:=\"&$B$1&\",AllowGaps:=0,InputChoice2:=Low,InputChoice4:=Low)\",\"Bar\",, \"Close\",$C$1,\"-1\",,,,,\"T\"),\"\")","v":91.8},0,0,1.0000000000000002E-2,1.0019999999999998,"S.US.AMD ",{"$f":"RTD(\"cqg.rtd\", ,\"ContractData\",A11, \"PerCentNetLastTrade\",, \"T\")/100","v":-8.5809288855518608E-3},{"$f":"RANK($K11,$K$2:K$103)+COUNTIF($K$2:K11,K11)-1","v":82},"S.US.AMD ",10,"S.US.ISRG ",{"$f":"RTD(\"cqg.rtd\", ,\"ContractData\",O11, \"PerCentNetLastTrade\",, \"T\")/100","v":1.6787664550787437E-2},{"$f":"VLOOKUP(O11,$A$2:$H112,8,FALSE)","v":7.0050000000000017},null,10,"S.US.ROST "]
["S.US.AMGN ",{"$f":"IFERROR(RTD(\"cqg.rtd\",,\"StudyData\",A12,\"Bar\",, \"High\",$C$1,\"0\",,,,,\"T\"),\"\")","v":221.73},{"$f":"IFERROR(RTD(\"cqg.rtd\",,\"StudyData\",A12,\"Bar\",, \"Low\",$C$1,\"0\",,,,,\"T\"),\"\")","v":221.44},{"$f":"IFERROR(RTD(\"cqg.rtd\",,\"StudyData\",\"HiLevel(\"&A12&\",Period1:=\"&$B$1&\",AllowGaps:=0,InputChoice1:=High,InputChoice3:=High)\",\"Bar\",, \"Close\",$C$1,\"-1\",,,,,\"T\"),\"\")","v":223.47},{"$f":"IFERROR(RTD(\"cqg.rtd\",,\"StudyData\",\"LoLevel(\"&A12&\",Period2:=\"&$B$1&\",AllowGaps:=0,InputChoice2:=Low,InputChoice4:=Low)\",\"Bar\",, \"Close\",$C$1,\"-1\",,,,,\"T\"),\"\")","v":221.2},0,0,1.1000000000000003E-2,1.0029999999999997,"S.US.AMGN ",{"$f":"RTD(\"cqg.rtd\", ,\"ContractData\",A12, \"PerCentNetLastTrade\",, \"T\")/100","v":-2.5075887554441071E-2},{"$f":"RANK($K12,$K$2:K$103)+COUNTIF($K$2:K12,K12)-1","v":101},"S.US.AMGN ",11,"S.US.MELI ",{"$f":"RTD(\"cqg.rtd\", ,\"ContractData\",O12, \"PerCentNetLastTrade\",, \"T\")/100","v":1.5972766198045808E-2},{"$f":"VLOOKUP(O12,$A$2:$H113,8,FALSE)","v":8.0049999999999972},null,11,"S.US.SPLK "]
["S.US.AMZN ",{"$f":"IFERROR(RTD(\"cqg.rtd\",,\"StudyData\",A13,\"Bar\",, \"High\",$C$1,\"0\",,,,,\"T\"),\"\")","v":3208.65},{"$f":"IFERROR(RTD(\"cqg.rtd\",,\"StudyData\",A13,\"Bar\",, \"Low\",$C$1,\"0\",,,,,\"T\"),\"\")","v":3203.9},{"$f":"IFERROR(RTD(\"cqg.rtd\",,\"StudyData\",\"HiLevel(\"&A13&\",Period1:=\"&$B$1&\",AllowGaps:=0,InputChoice1:=High,InputChoice3:=High)\",\"Bar\",, \"Close\",$C$1,\"-1\",,,,,\"T\"),\"\")","v":3222},{"$f":"IFERROR(RTD(\"cqg.rtd\",,\"StudyData\",\"LoLevel(\"&A13&\",Period2:=\"&$B$1&\",AllowGaps:=0,InputChoice2:=Low,InputChoice4:=Low)\",\"Bar\",, \"Close\",$C$1,\"-1\",,,,,\"T\"),\"\")","v":3188},0,0,1.2000000000000004E-2,1.0039999999999996,"S.US.AMZN ",{"$f":"RTD(\"cqg.rtd\", ,\"ContractData\",A13, \"PerCentNetLastTrade\",, \"T\")/100","v":-3.3684945948137657E-4},{"$f":"RANK($K13,$K$2:K$103)+COUNTIF($K$2:K13,K13)-1","v":47},"S.US.AMZN ",12,"S.US.CHKP ",{"$f":"RTD(\"cqg.rtd\", ,\"ContractData\",O13, \"PerCentNetLastTrade\",, \"T\")/100","v":1.5909269906277071E-2},{"$f":"VLOOKUP(O13,$A$2:$H114,8,FALSE)","v":2.0009999999999999},null,12,"S.US.VRSN "]
["S.US.ANSS ",{"$f":"IFERROR(RTD(\"cqg.rtd\",,\"StudyData\",A14,\"Bar\",, \"High\",$C$1,\"0\",,,,,\"T\"),\"\")","v":360.25},{"$f":"IFERROR(RTD(\"cqg.rtd\",,\"StudyData\",A14,\"Bar\",, \"Low\",$C$1,\"0\",,,,,\"T\"),\"\")","v":360.14},{"$f":"IFERROR(RTD(\"cqg.rtd\",,\"StudyData\",\"HiLevel(\"&A14&\",Period1:=\"&$B$1&\",AllowGaps:=0,InputChoice1:=High,InputChoice3:=High)\",\"Bar\",, \"Close\",$C$1,\"-1\",,,,,\"T\"),\"\")","v":360},{"$f":"IFERROR(RTD(\"cqg.rtd\",,\"StudyData\",\"LoLevel(\"&A14&\",Period2:=\"&$B$1&\",AllowGaps:=0,InputChoice2:=Low,InputChoice4:=Low)\",\"Bar\",, \"Close\",$C$1,\"-1\",,,,,\"T\"),\"\")","v":355.93},1,0,1,1.0049999999999994,"S.US.ANSS ",{"$f":"RTD(\"cqg.rtd\", ,\"ContractData\",A14, \"PerCentNetLastTrade\",, \"T\")/100","v":1.1771316196094957E-2},{"$f":"RANK($K14,$K$2:K$103)+COUNTIF($K$2:K14,K14)-1","v":16},"S.US.ANSS ",13,"S.US.SNPS ",{"$f":"RTD(\"cqg.rtd\", ,\"ContractData\",O14, \"PerCentNetLastTrade\",, \"T\")/100","v":1.5103838892385148E-2},{"$f":"VLOOKUP(O14,$A$2:$H115,8,FALSE)","v":10.003999999999998},null,13,""]
["S.US.ASML ",{"$f":"IFERROR(RTD(\"cqg.rtd\",,\"StudyData\",A15,\"Bar\",, \"High\",$C$1,\"0\",,,,,\"T\"),\"\")","v":476.65},{"$f":"IFERROR(RTD(\"cqg.rtd\",,\"StudyData\",A15,\"Bar\",, \"Low\",$C$1,\"0\",,,,,\"T\"),\"\")","v":476.4},{"$f":"IFERROR(RTD(\"cqg.rtd\",,\"StudyData\",\"HiLevel(\"&A15&\",Period1:=\"&$B$1&\",AllowGaps:=0,InputChoice1:=High,InputChoice3:=High)\",\"Bar\",, \"Close\",$C$1,\"-1\",,,,,\"T\"),\"\")","v":476.95},{"$f":"IFERROR(RTD(\"cqg.rtd\",,\"StudyData\",\"LoLevel(\"&A15&\",Period2:=\"&$B$1&\",AllowGaps:=0,InputChoice2:=Low,InputChoice4:=Low)\",\"Bar\",, \"Close\",$C$1,\"-1\",,,,,\"T\"),\"\")","v":474.25},0,0,1.0009999999999999,1.0059999999999993,"S.US.ASML ",{"$f":"RTD(\"cqg.rtd\", ,\"ContractData\",A15, \"PerCentNetLastTrade\",, \"T\")/100","v":9.295726930080888E-3},{"$f":"RANK($K15,$K$2:K$103)+COUNTIF($K$2:K15,K15)-1","v":20},"S.US.ASML ",14,"S.US.JD ",{"$f":"RTD(\"cqg.rtd\", ,\"ContractData\",O15, \"PerCentNetLastTrade\",, \"T\")/100","v":1.3640873015873016E-2},{"$f":"VLOOKUP(O15,$A$2:$H116,8,FALSE)","v":7.006000000000002},null,14,""]
["S.US.ATVI ",{"$f":"IFERROR(RTD(\"cqg.rtd\",,\"StudyData\",A16,\"Bar\",, \"High\",$C$1,\"0\",,,,,\"T\"),\"\")","v":89.02},{"$f":"IFERROR(RTD(\"cqg.rtd\",,\"StudyData\",A16,\"Bar\",, \"Low\",$C$1,\"0\",,,,,\"T\"),\"\")","v":88.97},{"$f":"IFERROR(RTD(\"cqg.rtd\",,\"StudyData\",\"HiLevel(\"&A16&\",Period1:=\"&$B$1&\",AllowGaps:=0,InputChoice1:=High,InputChoice3:=High)\",\"Bar\",, \"Close\",$C$1,\"-1\",,,,,\"T\"),\"\")","v":89.23},{"$f":"IFERROR(RTD(\"cqg.rtd\",,\"StudyData\",\"LoLevel(\"&A16&\",Period2:=\"&$B$1&\",AllowGaps:=0,InputChoice2:=Low,InputChoice4:=Low)\",\"Bar\",, \"Close\",$C$1,\"-1\",,,,,\"T\"),\"\")","v":88.8},0,0,1.0019999999999998,1.0069999999999992,"S.US.ATVI ",{"$f":"RTD(\"cqg.rtd\", ,\"ContractData\",A16, \"PerCentNetLastTrade\",, \"T\")/100","v":2.0267987839207298E-3},{"$f":"RANK($K16,$K$2:K$103)+COUNTIF($K$2:K16,K16)-1","v":38},"S.US.ATVI ",15,"S.US.SPLK ",{"$f":"RTD(\"cqg.rtd\", ,\"ContractData\",O16, \"PerCentNetLastTrade\",, \"T\")/100","v":1.2043356081894821E-2},{"$f":"VLOOKUP(O16,$A$2:$H117,8,FALSE)","v":11},null,15,""]
["S.US.AVGO ",{"$f":"IFERROR(RTD(\"cqg.rtd\",,\"StudyData\",A17,\"Bar\",, \"High\",$C$1,\"0\",,,,,\"T\"),\"\")","v":430.27},{"$f":"IFERROR(RTD(\"cqg.rtd\",,\"StudyData\",A17,\"Bar\",, \"Low\",$C$1,\"0\",,,,,\"T\"),\"\")","v":429.8},{"$f":"IFERROR(RTD(\"cqg.rtd\",,\"StudyData\",\"HiLevel(\"&A17&\",Period1:=\"&$B$1&\",AllowGaps:=0,InputChoice1:=High,InputChoice3:=High)\",\"Bar\",, \"Close\",$C$1,\"-1\",,,,,\"T\"),\"\")","v":432.15},{"$f":"IFERROR(RTD(\"cqg.rtd\",,\"StudyData\",\"LoLevel(\"&A17&\",Period2:=\"&$B$1&\",AllowGaps:=0,InputChoice2:=Low,InputChoice4:=Low)\",\"Bar\",, \"Close\",$C$1,\"-1\",,,,,\"T\"),\"\")","v":428.3},0,0,1.0029999999999997,1.0079999999999991,"S.US.AVGO ",{"$f":"RTD(\"cqg.rtd\", ,\"ContractData\",A17, \"PerCentNetLastTrade\",, \"T\")/100","v":3.1011005409438534E-3},{"$f":"RANK($K17,$K$2:K$103)+COUNTIF($K$2:K17,K17)-1","v":36},"S.US.AVGO ",16,"S.US.ANSS ",{"$f":"RTD(\"cqg.rtd\", ,\"ContractData\",O17, \"PerCentNetLastTrade\",, \"T\")/100","v":1.1771316196094957E-2},{"$f":"VLOOKUP(O17,$A$2:$H118,8,FALSE)","v":1},null,16,""]
["S.US.BIDU ",{"$f":"IFERROR(RTD(\"cqg.rtd\",,\"StudyData\",A18,\"Bar\",, \"High\",$C$1,\"0\",,,,,\"T\"),\"\")","v":192.84},{"$f":"IFERROR(RTD(\"cqg.rtd\",,\"StudyData\",A18,\"Bar\",, \"Low\",$C$1,\"0\",,,,,\"T\"),\"\")","v":191.52},{"$f":"IFERROR(RTD(\"cqg.rtd\",,\"StudyData\",\"HiLevel(\"&A18&\",Period1:=\"&$B$1&\",AllowGaps:=0,InputChoice1:=High,InputChoice3:=High)\",\"Bar\",, \"Close\",$C$1,\"-1\",,,,,\"T\"),\"\")","v":195.63},{"$f":"IFERROR(RTD(\"cqg.rtd\",,\"StudyData\",\"LoLevel(\"&A18&\",Period2:=\"&$B$1&\",AllowGaps:=0,InputChoice2:=Low,InputChoice4:=Low)\",\"Bar\",, \"Close\",$C$1,\"-1\",,,,,\"T\"),\"\")","v":190.38},0,0,1.0039999999999996,1.008999999999999,"S.US.BIDU ",{"$f":"RTD(\"cqg.rtd\", ,\"ContractData\",A18, \"PerCentNetLastTrade\",, \"T\")/100","v":-7.4580484773151025E-3},{"$f":"RANK($K18,$K$2:K$103)+COUNTIF($K$2:K18,K18)-1","v":80},"S.US.BIDU ",17,"S.US.IDXX ",{"$f":"RTD(\"cqg.rtd\", ,\"ContractData\",O18, \"PerCentNetLastTrade\",, \"T\")/100","v":1.1088874366933508E-2},{"$f":"VLOOKUP(O18,$A$2:$H119,8,FALSE)","v":7},null,17,""]
["S.US.BIIB ",{"$f":"IFERROR(RTD(\"cqg.rtd\",,\"StudyData\",A19,\"Bar\",, \"High\",$C$1,\"0\",,,,,\"T\"),\"\")","v":245.45},{"$f":"IFERROR(RTD(\"cqg.rtd\",,\"StudyData\",A19,\"Bar\",, \"Low\",$C$1,\"0\",,,,,\"T\"),\"\")","v":245.26},{"$f":"IFERROR(RTD(\"cqg.rtd\",,\"StudyData\",\"HiLevel(\"&A19&\",Period1:=\"&$B$1&\",AllowGaps:=0,InputChoice1:=High,InputChoice3:=High)\",\"Bar\",, \"Close\",$C$1,\"-1\",,,,,\"T\"),\"\")","v":247.19},{"$f":"IFERROR(RTD(\"cqg.rtd\",,\"StudyData\",\"LoLevel(\"&A19&\",Period2:=\"&$B$1&\",AllowGaps:=0,InputChoice2:=Low,InputChoice4:=Low)\",\"Bar\",, \"Close\",$C$1,\"-1\",,,,,\"T\"),\"\")","v":244.6},0,0,1.0049999999999994,1.0099999999999989,"S.US.BIIB ",{"$f":"RTD(\"cqg.rtd\", ,\"ContractData\",A19, \"PerCentNetLastTrade\",, \"T\")/100","v":-1.2201997422680412E-2},{"$f":"RANK($K19,$K$2:K$103)+COUNTIF($K$2:K19,K19)-1","v":88},"S.US.BIIB ",18,"S.US.EXC ",{"$f":"RTD(\"cqg.rtd\", ,\"ContractData\",O19, \"PerCentNetLastTrade\",, \"T\")/100","v":9.6362322331968193E-3},{"$f":"VLOOKUP(O19,$A$2:$H120,8,FALSE)","v":5},null,18,""]
["S.US.BKNG ",{"$f":"IFERROR(RTD(\"cqg.rtd\",,\"StudyData\",A20,\"Bar\",, \"High\",$C$1,\"0\",,,,,\"T\"),\"\")","v":""},{"$f":"IFERROR(RTD(\"cqg.rtd\",,\"StudyData\",A20,\"Bar\",, \"Low\",$C$1,\"0\",,,,,\"T\"),\"\")","v":""},{"$f":"IFERROR(RTD(\"cqg.rtd\",,\"StudyData\",\"HiLevel(\"&A20&\",Period1:=\"&$B$1&\",AllowGaps:=0,InputChoice1:=High,InputChoice3:=High)\",\"Bar\",, \"Close\",$C$1,\"-1\",,,,,\"T\"),\"\")","v":2057.17},{"$f":"IFERROR(RTD(\"cqg.rtd\",,\"StudyData\",\"LoLevel(\"&A20&\",Period2:=\"&$B$1&\",AllowGaps:=0,InputChoice2:=Low,InputChoice4:=Low)\",\"Bar\",, \"Close\",$C$1,\"-1\",,,,,\"T\"),\"\")","v":2042.91},0,0,1.0059999999999993,1.0109999999999988,"S.US.BKNG ",{"$f":"RTD(\"cqg.rtd\", ,\"ContractData\",A20, \"PerCentNetLastTrade\",, \"T\")/100","v":-6.1067595010153748E-3},{"$f":"RANK($K20,$K$2:K$103)+COUNTIF($K$2:K20,K20)-1","v":69},"S.US.BKNG ",19,"S.US.MSFT ",{"$f":"RTD(\"cqg.rtd\", ,\"ContractData\",O20, \"PerCentNetLastTrade\",, \"T\")/100","v":9.614088683229256E-3},{"$f":"VLOOKUP(O20,$A$2:$H121,8,FALSE)","v":8.008999999999995},null,19,""]
["S.US.CDNS ",{"$f":"IFERROR(RTD(\"cqg.rtd\",,\"StudyData\",A21,\"Bar\",, \"High\",$C$1,\"0\",,,,,\"T\"),\"\")","v":134.88},{"$f":"IFERROR(RTD(\"cqg.rtd\",,\"StudyData\",A21,\"Bar\",, \"Low\",$C$1,\"0\",,,,,\"T\"),\"\")","v":134.66999999999999},{"$f":"IFERROR(RTD(\"cqg.rtd\",,\"StudyData\",\"HiLevel(\"&A21&\",Period1:=\"&$B$1&\",AllowGaps:=0,InputChoice1:=High,InputChoice3:=High)\",\"Bar\",, \"Close\",$C$1,\"-1\",,,,,\"T\"),\"\")","v":134.91},{"$f":"IFERROR(RTD(\"cqg.rtd\",,\"StudyData\",\"LoLevel(\"&A21&\",Period2:=\"&$B$1&\",AllowGaps:=0,InputChoice2:=Low,InputChoice4:=Low)\",\"Bar\",, \"Close\",$C$1,\"-1\",,,,,\"T\"),\"\")","v":132.86000000000001},0,0,1.0069999999999992,1.0119999999999987,"S.US.CDNS ",{"$f":"RTD(\"cqg.rtd\", ,\"ContractData\",A21, \"PerCentNetLastTrade\",, \"T\")/100","v":2.3912548394443182E-2},{"$f":"RANK($K21,$K$2:K$103)+COUNTIF($K$2:K21,K21)-1","v":8},"S.US.CDNS ",20,"S.US.ASML ",{"$f":"RTD(\"cqg.rtd\", ,\"ContractData\",O21, \"PerCentNetLastTrade\",, \"T\")/100","v":9.295726930080888E-3},{"$f":"VLOOKUP(O21,$A$2:$H122,8,FALSE)","v":1.0009999999999999},null,20,""]
["S.US.CDW ",{"$f":"IFERROR(RTD(\"cqg.rtd\",,\"StudyData\",A22,\"Bar\",, \"High\",$C$1,\"0\",,,,,\"T\"),\"\")","v":131.07},{"$f":"IFERROR(RTD(\"cqg.rtd\",,\"StudyData\",A22,\"Bar\",, \"Low\",$C$1,\"0\",,,,,\"T\"),\"\")","v":130.88},{"$f":"IFERROR(RTD(\"cqg.rtd\",,\"StudyData\",\"HiLevel(\"&A22&\",Period1:=\"&$B$1&\",AllowGaps:=0,InputChoice1:=High,InputChoice3:=High)\",\"Bar\",, \"Close\",$C$1,\"-1\",,,,,\"T\"),\"\")","v":131.63999999999999},{"$f":"IFERROR(RTD(\"cqg.rtd\",,\"StudyData\",\"LoLevel(\"&A22&\",Period2:=\"&$B$1&\",AllowGaps:=0,InputChoice2:=Low,InputChoice4:=Low)\",\"Bar\",, \"Close\",$C$1,\"-1\",,,,,\"T\"),\"\")","v":130.16999999999999},0,0,1.0079999999999991,1.0129999999999986,"S.US.CDW ",{"$f":"RTD(\"cqg.rtd\", ,\"ContractData\",A22, \"PerCentNetLastTrade\",, \"T\")/100","v":3.0536682189480114E-4},{"$f":"RANK($K22,$K$2:K$103)+COUNTIF($K$2:K22,K22)-1","v":45},"S.US.CDW ",21,"S.US.DOCU ",{"$f":"RTD(\"cqg.rtd\", ,\"ContractData\",O22, \"PerCentNetLastTrade\",, \"T\")/100","v":9.0725806451612892E-3},{"$f":"VLOOKUP(O22,$A$2:$H123,8,FALSE)","v":4.0040000000000013},null,21,""]
["S.US.CERN ",{"$f":"IFERROR(RTD(\"cqg.rtd\",,\"StudyData\",A23,\"Bar\",, \"High\",$C$1,\"0\",,,,,\"T\"),\"\")","v":77.150000000000006},{"$f":"IFERROR(RTD(\"cqg.rtd\",,\"StudyData\",A23,\"Bar\",, \"Low\",$C$1,\"0\",,,,,\"T\"),\"\")","v":77.08},{"$f":"IFERROR(RTD(\"cqg.rtd\",,\"StudyData\",\"HiLevel(\"&A23&\",Period1:=\"&$B$1&\",AllowGaps:=0,InputChoice1:=High,InputChoice3:=High)\",\"Bar\",, \"Close\",$C$1,\"-1\",,,,,\"T\"),\"\")","v":77.13},{"$f":"IFERROR(RTD(\"cqg.rtd\",,\"StudyData\",\"LoLevel(\"&A23&\",Period2:=\"&$B$1&\",AllowGaps:=0,InputChoice2:=Low,InputChoice4:=Low)\",\"Bar\",, \"Close\",$C$1,\"-1\",,,,,\"T\"),\"\")","v":76.53},1,0,2,1.0139999999999985,"S.US.CERN ",{"$f":"RTD(\"cqg.rtd\", ,\"ContractData\",A23, \"PerCentNetLastTrade\",, \"T\")/100","v":7.1810941376158769E-3},{"$f":"RANK($K23,$K$2:K$103)+COUNTIF($K$2:K23,K23)-1","v":25},"S.US.CERN ",22,"S.US.ADBE ",{"$f":"RTD(\"cqg.rtd\", ,\"ContractData\",O23, \"PerCentNetLastTrade\",, \"T\")/100","v":8.70803988844078E-3},{"$f":"VLOOKUP(O23,$A$2:$H124,8,FALSE)","v":2E-3},null,22,""]
["S.US.CHKP ",{"$f":"IFERROR(RTD(\"cqg.rtd\",,\"StudyData\",A24,\"Bar\",, \"High\",$C$1,\"0\",,,,,\"T\"),\"\")","v":129.09},{"$f":"IFERROR(RTD(\"cqg.rtd\",,\"StudyData\",A24,\"Bar\",, \"Low\",$C$1,\"0\",,,,,\"T\"),\"\")","v":128.9},{"$f":"IFERROR(RTD(\"cqg.rtd\",,\"StudyData\",\"HiLevel(\"&A24&\",Period1:=\"&$B$1&\",AllowGaps:=0,InputChoice1:=High,InputChoice3:=High)\",\"Bar\",, \"Close\",$C$1,\"-1\",,,,,\"T\"),\"\")","v":129.69999999999999},{"$f":"IFERROR(RTD(\"cqg.rtd\",,\"StudyData\",\"LoLevel(\"&A24&\",Period2:=\"&$B$1&\",AllowGaps:=0,InputChoice2:=Low,InputChoice4:=Low)\",\"Bar\",, \"Close\",$C$1,\"-1\",,,,,\"T\"),\"\")","v":127.74},0,0,2.0009999999999999,1.0149999999999983,"S.US.CHKP ",{"$f":"RTD(\"cqg.rtd\", ,\"ContractData\",A24, \"PerCentNetLastTrade\",, \"T\")/100","v":1.5909269906277071E-2},{"$f":"RANK($K24,$K$2:K$103)+COUNTIF($K$2:K24,K24)-1","v":12},"S.US.CHKP ",23,"S.US.TMUS ",{"$f":"RTD(\"cqg.rtd\", ,\"ContractData\",O24, \"PerCentNetLastTrade\",, \"T\")/100","v":7.3721394563047151E-3},{"$f":"VLOOKUP(O24,$A$2:$H125,8,FALSE)","v":11.003999999999998},null,23,""]
["S.US.CHTR ",{"$f":"IFERROR(RTD(\"cqg.rtd\",,\"StudyData\",A25,\"Bar\",, \"High\",$C$1,\"0\",,,,,\"T\"),\"\")","v":652.15},{"$f":"IFERROR(RTD(\"cqg.rtd\",,\"StudyData\",A25,\"Bar\",, \"Low\",$C$1,\"0\",,,,,\"T\"),\"\")","v":651.82000000000005},{"$f":"IFERROR(RTD(\"cqg.rtd\",,\"StudyData\",\"HiLevel(\"&A25&\",Period1:=\"&$B$1&\",AllowGaps:=0,InputChoice1:=High,InputChoice3:=High)\",\"Bar\",, \"Close\",$C$1,\"-1\",,,,,\"T\"),\"\")","v":654.79},{"$f":"IFERROR(RTD(\"cqg.rtd\",,\"StudyData\",\"LoLevel(\"&A25&\",Period2:=\"&$B$1&\",AllowGaps:=0,InputChoice2:=Low,InputChoice4:=Low)\",\"Bar\",, \"Close\",$C$1,\"-1\",,,,,\"T\"),\"\")","v":649.13},0,0,2.0019999999999998,1.0159999999999982,"S.US.CHTR ",{"$f":"RTD(\"cqg.rtd\", ,\"ContractData\",A25, \"PerCentNetLastTrade\",, \"T\")/100","v":-3.879698788739709E-3},{"$f":"RANK($K25,$K$2:K$103)+COUNTIF($K$2:K25,K25)-1","v":56},"S.US.CHTR ",24,"S.US.ADSK ",{"$f":"RTD(\"cqg.rtd\", ,\"ContractData\",O25, \"PerCentNetLastTrade\",, \"T\")/100","v":7.3118851369316671E-3},{"$f":"VLOOKUP(O25,$A$2:$H126,8,FALSE)","v":5.0000000000000001E-3},null,24,""]
["S.US.CMCSA ",{"$f":"IFERROR(RTD(\"cqg.rtd\",,\"StudyData\",A26,\"Bar\",, \"High\",$C$1,\"0\",,,,,\"T\"),\"\")","v":50.14},{"$f":"IFERROR(RTD(\"cqg.rtd\",,\"StudyData\",A26,\"Bar\",, \"Low\",$C$1,\"0\",,,,,\"T\"),\"\")","v":50.11},{"$f":"IFERROR(RTD(\"cqg.rtd\",,\"StudyData\",\"HiLevel(\"&A26&\",Period1:=\"&$B$1&\",AllowGaps:=0,InputChoice1:=High,InputChoice3:=High)\",\"Bar\",, \"Close\",$C$1,\"-1\",,,,,\"T\"),\"\")","v":50.24},{"$f":"IFERROR(RTD(\"cqg.rtd\",,\"StudyData\",\"LoLevel(\"&A26&\",Period2:=\"&$B$1&\",AllowGaps:=0,InputChoice2:=Low,InputChoice4:=Low)\",\"Bar\",, \"Close\",$C$1,\"-1\",,,,,\"T\"),\"\")","v":49.81},0,0,2.0029999999999997,1.0169999999999981,"S.US.CMCSA ",{"$f":"RTD(\"cqg.rtd\", ,\"ContractData\",A26, \"PerCentNetLastTrade\",, \"T\")/100","v":-4.5662100456621002E-3},{"$f":"RANK($K26,$K$2:K$103)+COUNTIF($K$2:K26,K26)-1","v":58},"S.US.CMCSA ",25,"S.US.CERN ",{"$f":"RTD(\"cqg.rtd\", ,\"ContractData\",O26, \"PerCentNetLastTrade\",, \"T\")/100","v":7.1810941376158769E-3},{"$f":"VLOOKUP(O26,$A$2:$H127,8,FALSE)","v":2},null,25,""]
["S.US.COST ",{"$f":"IFERROR(RTD(\"cqg.rtd\",,\"StudyData\",A27,\"Bar\",, \"High\",$C$1,\"0\",,,,,\"T\"),\"\")","v":362.44},{"$f":"IFERROR(RTD(\"cqg.rtd\",,\"StudyData\",A27,\"Bar\",, \"Low\",$C$1,\"0\",,,,,\"T\"),\"\")","v":362.06},{"$f":"IFERROR(RTD(\"cqg.rtd\",,\"StudyData\",\"HiLevel(\"&A27&\",Period1:=\"&$B$1&\",AllowGaps:=0,InputChoice1:=High,InputChoice3:=High)\",\"Bar\",, \"Close\",$C$1,\"-1\",,,,,\"T\"),\"\")","v":363.82},{"$f":"IFERROR(RTD(\"cqg.rtd\",,\"StudyData\",\"LoLevel(\"&A27&\",Period2:=\"&$B$1&\",AllowGaps:=0,InputChoice2:=Low,InputChoice4:=Low)\",\"Bar\",, \"Close\",$C$1,\"-1\",,,,,\"T\"),\"\")","v":360.75},0,0,2.0039999999999996,1.017999999999998,"S.US.COST ",{"$f":"RTD(\"cqg.rtd\", ,\"ContractData\",A27, \"PerCentNetLastTrade\",, \"T\")/100","v":-6.9320766090363592E-3},{"$f":"RANK($K27,$K$2:K$103)+COUNTIF($K$2:K27,K27)-1","v":79},"S.US.COST ",26,"S.US.ADI ",{"$f":"RTD(\"cqg.rtd\", ,\"ContractData\",O27, \"PerCentNetLastTrade\",, \"T\")/100","v":7.0131145241601796E-3},{"$f":"VLOOKUP(O27,$A$2:$H128,8,FALSE)","v":3.0000000000000001E-3},null,26,""]
["S.US.CPRT ",{"$f":"IFERROR(RTD(\"cqg.rtd\",,\"StudyData\",A28,\"Bar\",, \"High\",$C$1,\"0\",,,,,\"T\"),\"\")","v":122.91},{"$f":"IFERROR(RTD(\"cqg.rtd\",,\"StudyData\",A28,\"Bar\",, \"Low\",$C$1,\"0\",,,,,\"T\"),\"\")","v":122.6},{"$f":"IFERROR(RTD(\"cqg.rtd\",,\"StudyData\",\"HiLevel(\"&A28&\",Period1:=\"&$B$1&\",AllowGaps:=0,InputChoice1:=High,InputChoice3:=High)\",\"Bar\",, \"Close\",$C$1,\"-1\",,,,,\"T\"),\"\")","v":122.82},{"$f":"IFERROR(RTD(\"cqg.rtd\",,\"StudyData\",\"LoLevel(\"&A28&\",Period2:=\"&$B$1&\",AllowGaps:=0,InputChoice2:=Low,InputChoice4:=Low)\",\"Bar\",, \"Close\",$C$1,\"-1\",,,,,\"T\"),\"\")","v":121.97},1,0,3,1.0189999999999979,"S.US.CPRT ",{"$f":"RTD(\"cqg.rtd\", ,\"ContractData\",A28, \"PerCentNetLastTrade\",, \"T\")/100","v":5.9747912915370759E-3},{"$f":"RANK($K28,$K$2:K$103)+COUNTIF($K$2:K28,K28)-1","v":29},"S.US.CPRT ",27,"S.US.INTU ",{"$f":"RTD(\"cqg.rtd\", ,\"ContractData\",O28, \"PerCentNetLastTrade\",, \"T\")/100","v":6.8363791131327645E-3},{"$f":"VLOOKUP(O28,$A$2:$H129,8,FALSE)","v":7.0040000000000013},null,27,""]
["S.US.CSCO ",{"$f":"IFERROR(RTD(\"cqg.rtd\",,\"StudyData\",A29,\"Bar\",, \"High\",$C$1,\"0\",,,,,\"T\"),\"\")","v":44.93},{"$f":"IFERROR(RTD(\"cqg.rtd\",,\"StudyData\",A29,\"Bar\",, \"Low\",$C$1,\"0\",,,,,\"T\"),\"\")","v":44.89},{"$f":"IFERROR(RTD(\"cqg.rtd\",,\"StudyData\",\"HiLevel(\"&A29&\",Period1:=\"&$B$1&\",AllowGaps:=0,InputChoice1:=High,InputChoice3:=High)\",\"Bar\",, \"Close\",$C$1,\"-1\",,,,,\"T\"),\"\")","v":44.98},{"$f":"IFERROR(RTD(\"cqg.rtd\",,\"StudyData\",\"LoLevel(\"&A29&\",Period2:=\"&$B$1&\",AllowGaps:=0,InputChoice2:=Low,InputChoice4:=Low)\",\"Bar\",, \"Close\",$C$1,\"-1\",,,,,\"T\"),\"\")","v":44.71},0,0,3.0009999999999999,1.0199999999999978,"S.US.CSCO ",{"$f":"RTD(\"cqg.rtd\", ,\"ContractData\",A29, \"PerCentNetLastTrade\",, \"T\")/100","v":8.9126559714795004E-4},{"$f":"RANK($K29,$K$2:K$103)+COUNTIF($K$2:K29,K29)-1","v":44},"S.US.CSCO ",28,"S.US.VRSN ",{"$f":"RTD(\"cqg.rtd\", ,\"ContractData\",O29, \"PerCentNetLastTrade\",, \"T\")/100","v":6.4218902694401789E-3},{"$f":"VLOOKUP(O29,$A$2:$H130,8,FALSE)","v":12},null,28,""]
["S.US.CSX ",{"$f":"IFERROR(RTD(\"cqg.rtd\",,\"StudyData\",A30,\"Bar\",, \"High\",$C$1,\"0\",,,,,\"T\"),\"\")","v":89.84},{"$f":"IFERROR(RTD(\"cqg.rtd\",,\"StudyData\",A30,\"Bar\",, \"Low\",$C$1,\"0\",,,,,\"T\"),\"\")","v":89.73},{"$f":"IFERROR(RTD(\"cqg.rtd\",,\"StudyData\",\"HiLevel(\"&A30&\",Period1:=\"&$B$1&\",AllowGaps:=0,InputChoice1:=High,InputChoice3:=High)\",\"Bar\",, \"Close\",$C$1,\"-1\",,,,,\"T\"),\"\")","v":89.81},{"$f":"IFERROR(RTD(\"cqg.rtd\",,\"StudyData\",\"LoLevel(\"&A30&\",Period2:=\"&$B$1&\",AllowGaps:=0,InputChoice2:=Low,InputChoice4:=Low)\",\"Bar\",, \"Close\",$C$1,\"-1\",,,,,\"T\"),\"\")","v":89.1},1,0,4,1.0209999999999977,"S.US.CSX ",{"$f":"RTD(\"cqg.rtd\", ,\"ContractData\",A30, \"PerCentNetLastTrade\",, \"T\")/100","v":1.5609320994536737E-3},{"$f":"RANK($K30,$K$2:K$103)+COUNTIF($K$2:K30,K30)-1","v":42},"S.US.CSX ",29,"S.US.CPRT ",{"$f":"RTD(\"cqg.rtd\", ,\"ContractData\",O30, \"PerCentNetLastTrade\",, \"T\")/100","v":5.9747912915370759E-3},{"$f":"VLOOKUP(O30,$A$2:$H131,8,FALSE)","v":3},null,29,""]
["S.US.CTAS ",{"$f":"IFERROR(RTD(\"cqg.rtd\",,\"StudyData\",A31,\"Bar\",, \"High\",$C$1,\"0\",,,,,\"T\"),\"\")","v":342.05},{"$f":"IFERROR(RTD(\"cqg.rtd\",,\"StudyData\",A31,\"Bar\",, \"Low\",$C$1,\"0\",,,,,\"T\"),\"\")","v":340.64},{"$f":"IFERROR(RTD(\"cqg.rtd\",,\"StudyData\",\"HiLevel(\"&A31&\",Period1:=\"&$B$1&\",AllowGaps:=0,InputChoice1:=High,InputChoice3:=High)\",\"Bar\",, \"Close\",$C$1,\"-1\",,,,,\"T\"),\"\")","v":343.45},{"$f":"IFERROR(RTD(\"cqg.rtd\",,\"StudyData\",\"LoLevel(\"&A31&\",Period2:=\"&$B$1&\",AllowGaps:=0,InputChoice2:=Low,InputChoice4:=Low)\",\"Bar\",, \"Close\",$C$1,\"-1\",,,,,\"T\"),\"\")","v":334.13},0,0,4.0010000000000003,1.0219999999999976,"S.US.CTAS ",{"$f":"RTD(\"cqg.rtd\", ,\"ContractData\",A31, \"PerCentNetLastTrade\",, \"T\")/100","v":-1.3752058475139399E-2},{"$f":"RANK($K31,$K$2:K$103)+COUNTIF($K$2:K31,K31)-1","v":91},"S.US.CTAS ",30,"S.US.NXPI ",{"$f":"RTD(\"cqg.rtd\", ,\"ContractData\",O31, \"PerCentNetLastTrade\",, \"T\")/100","v":5.8587531045023247E-3},{"$f":"VLOOKUP(O31,$A$2:$H132,8,FALSE)","v":8.0159999999999911},null,30,""]
["S.US.CTSH ",{"$f":"IFERROR(RTD(\"cqg.rtd\",,\"StudyData\",A32,\"Bar\",, \"High\",$C$1,\"0\",,,,,\"T\"),\"\")","v":80.77},{"$f":"IFERROR(RTD(\"cqg.rtd\",,\"StudyData\",A32,\"Bar\",, \"Low\",$C$1,\"0\",,,,,\"T\"),\"\")","v":80.69},{"$f":"IFERROR(RTD(\"cqg.rtd\",,\"StudyData\",\"HiLevel(\"&A32&\",Period1:=\"&$B$1&\",AllowGaps:=0,InputChoice1:=High,InputChoice3:=High)\",\"Bar\",, \"Close\",$C$1,\"-1\",,,,,\"T\"),\"\")","v":80.959999999999994},{"$f":"IFERROR(RTD(\"cqg.rtd\",,\"StudyData\",\"LoLevel(\"&A32&\",Period2:=\"&$B$1&\",AllowGaps:=0,InputChoice2:=Low,InputChoice4:=Low)\",\"Bar\",, \"Close\",$C$1,\"-1\",,,,,\"T\"),\"\")","v":80.13},0,0,4.0020000000000007,1.0229999999999975,"S.US.CTSH ",{"$f":"RTD(\"cqg.rtd\", ,\"ContractData\",A32, \"PerCentNetLastTrade\",, \"T\")/100","v":3.7280974276127747E-3},{"$f":"RANK($K32,$K$2:K$103)+COUNTIF($K$2:K32,K32)-1","v":33},"S.US.CTSH ",31,"S.US.MXIM ",{"$f":"RTD(\"cqg.rtd\", ,\"ContractData\",O32, \"PerCentNetLastTrade\",, \"T\")/100","v":5.7511737089201874E-3},{"$f":"VLOOKUP(O32,$A$2:$H133,8,FALSE)","v":8.0119999999999933},null,31,""]
["S.US.DLTR ",{"$f":"IFERROR(RTD(\"cqg.rtd\",,\"StudyData\",A33,\"Bar\",, \"High\",$C$1,\"0\",,,,,\"T\"),\"\")","v":109.42},{"$f":"IFERROR(RTD(\"cqg.rtd\",,\"StudyData\",A33,\"Bar\",, \"Low\",$C$1,\"0\",,,,,\"T\"),\"\")","v":109.25},{"$f":"IFERROR(RTD(\"cqg.rtd\",,\"StudyData\",\"HiLevel(\"&A33&\",Period1:=\"&$B$1&\",AllowGaps:=0,InputChoice1:=High,InputChoice3:=High)\",\"Bar\",, \"Close\",$C$1,\"-1\",,,,,\"T\"),\"\")","v":110.54},{"$f":"IFERROR(RTD(\"cqg.rtd\",,\"StudyData\",\"LoLevel(\"&A33&\",Period2:=\"&$B$1&\",AllowGaps:=0,InputChoice2:=Low,InputChoice4:=Low)\",\"Bar\",, \"Close\",$C$1,\"-1\",,,,,\"T\"),\"\")","v":108.35},0,0,4.003000000000001,1.0239999999999974,"S.US.DLTR ",{"$f":"RTD(\"cqg.rtd\", ,\"ContractData\",A33, \"PerCentNetLastTrade\",, \"T\")/100","v":-1.918938307030129E-2},{"$f":"RANK($K33,$K$2:K$103)+COUNTIF($K$2:K33,K33)-1","v":96},"S.US.DLTR ",32,"S.US.MRVL ",{"$f":"RTD(\"cqg.rtd\", ,\"ContractData\",O33, \"PerCentNetLastTrade\",, \"T\")/100","v":3.8095238095238095E-3},{"$f":"VLOOKUP(O33,$A$2:$H134,8,FALSE)","v":8.0079999999999956},null,32,""]
["S.US.DOCU ",{"$f":"IFERROR(RTD(\"cqg.rtd\",,\"StudyData\",A34,\"Bar\",, \"High\",$C$1,\"0\",,,,,\"T\"),\"\")","v":250.73},{"$f":"IFERROR(RTD(\"cqg.rtd\",,\"StudyData\",A34,\"Bar\",, \"Low\",$C$1,\"0\",,,,,\"T\"),\"\")","v":250.11},{"$f":"IFERROR(RTD(\"cqg.rtd\",,\"StudyData\",\"HiLevel(\"&A34&\",Period1:=\"&$B$1&\",AllowGaps:=0,InputChoice1:=High,InputChoice3:=High)\",\"Bar\",, \"Close\",$C$1,\"-1\",,,,,\"T\"),\"\")","v":252.79},{"$f":"IFERROR(RTD(\"cqg.rtd\",,\"StudyData\",\"LoLevel(\"&A34&\",Period2:=\"&$B$1&\",AllowGaps:=0,InputChoice2:=Low,InputChoice4:=Low)\",\"Bar\",, \"Close\",$C$1,\"-1\",,,,,\"T\"),\"\")","v":247.66},0,0,4.0040000000000013,1.0249999999999972,"S.US.DOCU ",{"$f":"RTD(\"cqg.rtd\", ,\"ContractData\",A34, \"PerCentNetLastTrade\",, \"T\")/100","v":9.0725806451612892E-3},{"$f":"RANK($K34,$K$2:K$103)+COUNTIF($K$2:K34,K34)-1","v":21},"S.US.DOCU ",33,"S.US.CTSH ",{"$f":"RTD(\"cqg.rtd\", ,\"ContractData\",O34, \"PerCentNetLastTrade\",, \"T\")/100","v":3.7280974276127747E-3},{"$f":"VLOOKUP(O34,$A$2:$H135,8,FALSE)","v":4.0020000000000007},null,33,""]
["S.US.DXCM ",{"$f":"IFERROR(RTD(\"cqg.rtd\",,\"StudyData\",A35,\"Bar\",, \"High\",$C$1,\"0\",,,,,\"T\"),\"\")","v":348.08},{"$f":"IFERROR(RTD(\"cqg.rtd\",,\"StudyData\",A35,\"Bar\",, \"Low\",$C$1,\"0\",,,,,\"T\"),\"\")","v":347.36},{"$f":"IFERROR(RTD(\"cqg.rtd\",,\"StudyData\",\"HiLevel(\"&A35&\",Period1:=\"&$B$1&\",AllowGaps:=0,InputChoice1:=High,InputChoice3:=High)\",\"Bar\",, \"Close\",$C$1,\"-1\",,,,,\"T\"),\"\")","v":349.46},{"$f":"IFERROR(RTD(\"cqg.rtd\",,\"StudyData\",\"LoLevel(\"&A35&\",Period2:=\"&$B$1&\",AllowGaps:=0,InputChoice2:=Low,InputChoice4:=Low)\",\"Bar\",, \"Close\",$C$1,\"-1\",,,,,\"T\"),\"\")","v":345.43},0,0,4.0050000000000017,1.0259999999999971,"S.US.DXCM ",{"$f":"RTD(\"cqg.rtd\", ,\"ContractData\",A35, \"PerCentNetLastTrade\",, \"T\")/100","v":-3.1818833309445321E-3},{"$f":"RANK($K35,$K$2:K$103)+COUNTIF($K$2:K35,K35)-1","v":54},"S.US.DXCM ",34,"S.US.KDP ",{"$f":"RTD(\"cqg.rtd\", ,\"ContractData\",O35, \"PerCentNetLastTrade\",, \"T\")/100","v":3.2499187520311991E-3},{"$f":"VLOOKUP(O35,$A$2:$H136,8,FALSE)","v":7.0070000000000023},null,34,""]
["S.US.EA ",{"$f":"IFERROR(RTD(\"cqg.rtd\",,\"StudyData\",A36,\"Bar\",, \"High\",$C$1,\"0\",,,,,\"T\"),\"\")","v":140.29},{"$f":"IFERROR(RTD(\"cqg.rtd\",,\"StudyData\",A36,\"Bar\",, \"Low\",$C$1,\"0\",,,,,\"T\"),\"\")","v":140.22},{"$f":"IFERROR(RTD(\"cqg.rtd\",,\"StudyData\",\"HiLevel(\"&A36&\",Period1:=\"&$B$1&\",AllowGaps:=0,InputChoice1:=High,InputChoice3:=High)\",\"Bar\",, \"Close\",$C$1,\"-1\",,,,,\"T\"),\"\")","v":140.88999999999999},{"$f":"IFERROR(RTD(\"cqg.rtd\",,\"StudyData\",\"LoLevel(\"&A36&\",Period2:=\"&$B$1&\",AllowGaps:=0,InputChoice2:=Low,InputChoice4:=Low)\",\"Bar\",, \"Close\",$C$1,\"-1\",,,,,\"T\"),\"\")","v":139.83000000000001},0,0,4.006000000000002,1.026999999999997,"S.US.EA ",{"$f":"RTD(\"cqg.rtd\", ,\"ContractData\",A36, \"PerCentNetLastTrade\",, \"T\")/100","v":-5.2478547620736114E-3},{"$f":"RANK($K36,$K$2:K$103)+COUNTIF($K$2:K36,K36)-1","v":64},"S.US.EA ",35,"S.US.KHC ",{"$f":"RTD(\"cqg.rtd\", ,\"ContractData\",O36, \"PerCentNetLastTrade\",, \"T\")/100","v":3.1819496673416259E-3},{"$f":"VLOOKUP(O36,$A$2:$H137,8,FALSE)","v":7.0080000000000027},null,35,""]
["S.US.EBAY ",{"$f":"IFERROR(RTD(\"cqg.rtd\",,\"StudyData\",A37,\"Bar\",, \"High\",$C$1,\"0\",,,,,\"T\"),\"\")","v":51.66},{"$f":"IFERROR(RTD(\"cqg.rtd\",,\"StudyData\",A37,\"Bar\",, \"Low\",$C$1,\"0\",,,,,\"T\"),\"\")","v":51.54},{"$f":"IFERROR(RTD(\"cqg.rtd\",,\"StudyData\",\"HiLevel(\"&A37&\",Period1:=\"&$B$1&\",AllowGaps:=0,InputChoice1:=High,InputChoice3:=High)\",\"Bar\",, \"Close\",$C$1,\"-1\",,,,,\"T\"),\"\")","v":51.73},{"$f":"IFERROR(RTD(\"cqg.rtd\",,\"StudyData\",\"LoLevel(\"&A37&\",Period2:=\"&$B$1&\",AllowGaps:=0,InputChoice2:=Low,InputChoice4:=Low)\",\"Bar\",, \"Close\",$C$1,\"-1\",,,,,\"T\"),\"\")","v":51.28},0,0,4.0070000000000023,1.0279999999999969,"S.US.EBAY ",{"$f":"RTD(\"cqg.rtd\", ,\"ContractData\",A37, \"PerCentNetLastTrade\",, \"T\")/100","v":1.7452006980802793E-3},{"$f":"RANK($K37,$K$2:K$103)+COUNTIF($K$2:K37,K37)-1","v":40},"S.US.EBAY ",36,"S.US.AVGO ",{"$f":"RTD(\"cqg.rtd\", ,\"ContractData\",O37, \"PerCentNetLastTrade\",, \"T\")/100","v":3.1011005409438534E-3},{"$f":"VLOOKUP(O37,$A$2:$H138,8,FALSE)","v":1.0029999999999997},null,36,""]
["S.US.EXC ",{"$f":"IFERROR(RTD(\"cqg.rtd\",,\"StudyData\",A38,\"Bar\",, \"High\",$C$1,\"0\",,,,,\"T\"),\"\")","v":41.91},{"$f":"IFERROR(RTD(\"cqg.rtd\",,\"StudyData\",A38,\"Bar\",, \"Low\",$C$1,\"0\",,,,,\"T\"),\"\")","v":41.82},{"$f":"IFERROR(RTD(\"cqg.rtd\",,\"StudyData\",\"HiLevel(\"&A38&\",Period1:=\"&$B$1&\",AllowGaps:=0,InputChoice1:=High,InputChoice3:=High)\",\"Bar\",, \"Close\",$C$1,\"-1\",,,,,\"T\"),\"\")","v":41.86},{"$f":"IFERROR(RTD(\"cqg.rtd\",,\"StudyData\",\"LoLevel(\"&A38&\",Period2:=\"&$B$1&\",AllowGaps:=0,InputChoice2:=Low,InputChoice4:=Low)\",\"Bar\",, \"Close\",$C$1,\"-1\",,,,,\"T\"),\"\")","v":41.48},1,0,5,1.0289999999999968,"S.US.EXC ",{"$f":"RTD(\"cqg.rtd\", ,\"ContractData\",A38, \"PerCentNetLastTrade\",, \"T\")/100","v":9.6362322331968193E-3},{"$f":"RANK($K38,$K$2:K$103)+COUNTIF($K$2:K38,K38)-1","v":18},"S.US.EXC ",37,"S.US.PAYX ",{"$f":"RTD(\"cqg.rtd\", ,\"ContractData\",O38, \"PerCentNetLastTrade\",, \"T\")/100","v":2.3811988818718292E-3},{"$f":"VLOOKUP(O38,$A$2:$H139,8,FALSE)","v":9.0019999999999989},null,37,""]
["S.US.FAST ",{"$f":"IFERROR(RTD(\"cqg.rtd\",,\"StudyData\",A39,\"Bar\",, \"High\",$C$1,\"0\",,,,,\"T\"),\"\")","v":49.48},{"$f":"IFERROR(RTD(\"cqg.rtd\",,\"StudyData\",A39,\"Bar\",, \"Low\",$C$1,\"0\",,,,,\"T\"),\"\")","v":49.38},{"$f":"IFERROR(RTD(\"cqg.rtd\",,\"StudyData\",\"HiLevel(\"&A39&\",Period1:=\"&$B$1&\",AllowGaps:=0,InputChoice1:=High,InputChoice3:=High)\",\"Bar\",, \"Close\",$C$1,\"-1\",,,,,\"T\"),\"\")","v":49.67},{"$f":"IFERROR(RTD(\"cqg.rtd\",,\"StudyData\",\"LoLevel(\"&A39&\",Period2:=\"&$B$1&\",AllowGaps:=0,InputChoice2:=Low,InputChoice4:=Low)\",\"Bar\",, \"Close\",$C$1,\"-1\",,,,,\"T\"),\"\")","v":49.2},0,0,5.0010000000000003,1.0299999999999967,"S.US.FAST ",{"$f":"RTD(\"cqg.rtd\", ,\"ContractData\",A39, \"PerCentNetLastTrade\",, \"T\")/100","v":-2.6204394275347715E-3},{"$f":"RANK($K39,$K$2:K$103)+COUNTIF($K$2:K39,K39)-1","v":53},"S.US.FAST ",38,"S.US.ATVI ",{"$f":"RTD(\"cqg.rtd\", ,\"ContractData\",O39, \"PerCentNetLastTrade\",, \"T\")/100","v":2.0267987839207298E-3},{"$f":"VLOOKUP(O39,$A$2:$H140,8,FALSE)","v":1.0019999999999998},null,38,""]
["S.US.FB ",{"$f":"IFERROR(RTD(\"cqg.rtd\",,\"StudyData\",A40,\"Bar\",, \"High\",$C$1,\"0\",,,,,\"T\"),\"\")","v":269.64},{"$f":"IFERROR(RTD(\"cqg.rtd\",,\"StudyData\",A40,\"Bar\",, \"Low\",$C$1,\"0\",,,,,\"T\"),\"\")","v":269.33},{"$f":"IFERROR(RTD(\"cqg.rtd\",,\"StudyData\",\"HiLevel(\"&A40&\",Period1:=\"&$B$1&\",AllowGaps:=0,InputChoice1:=High,InputChoice3:=High)\",\"Bar\",, \"Close\",$C$1,\"-1\",,,,,\"T\"),\"\")","v":271.33999999999997},{"$f":"IFERROR(RTD(\"cqg.rtd\",,\"StudyData\",\"LoLevel(\"&A40&\",Period2:=\"&$B$1&\",AllowGaps:=0,InputChoice2:=Low,InputChoice4:=Low)\",\"Bar\",, \"Close\",$C$1,\"-1\",,,,,\"T\"),\"\")","v":267.89999999999998},0,0,5.0020000000000007,1.0309999999999966,"S.US.FB ",{"$f":"RTD(\"cqg.rtd\", ,\"ContractData\",A40, \"PerCentNetLastTrade\",, \"T\")/100","v":-1.1913926463580042E-2},{"$f":"RANK($K40,$K$2:K$103)+COUNTIF($K$2:K40,K40)-1","v":87},"S.US.FB ",39,"S.US.TXN ",{"$f":"RTD(\"cqg.rtd\", ,\"ContractData\",O40, \"PerCentNetLastTrade\",, \"T\")/100","v":1.9085144369882412E-3},{"$f":"VLOOKUP(O40,$A$2:$H141,8,FALSE)","v":11.005999999999997},null,39,""]
["S.US.FISV ",{"$f":"IFERROR(RTD(\"cqg.rtd\",,\"StudyData\",A41,\"Bar\",, \"High\",$C$1,\"0\",,,,,\"T\"),\"\")","v":110.77},{"$f":"IFERROR(RTD(\"cqg.rtd\",,\"StudyData\",A41,\"Bar\",, \"Low\",$C$1,\"0\",,,,,\"T\"),\"\")","v":110.64},{"$f":"IFERROR(RTD(\"cqg.rtd\",,\"StudyData\",\"HiLevel(\"&A41&\",Period1:=\"&$B$1&\",AllowGaps:=0,InputChoice1:=High,InputChoice3:=High)\",\"Bar\",, \"Close\",$C$1,\"-1\",,,,,\"T\"),\"\")","v":111.57},{"$f":"IFERROR(RTD(\"cqg.rtd\",,\"StudyData\",\"LoLevel(\"&A41&\",Period2:=\"&$B$1&\",AllowGaps:=0,InputChoice2:=Low,InputChoice4:=Low)\",\"Bar\",, \"Close\",$C$1,\"-1\",,,,,\"T\"),\"\")","v":110.19},0,0,5.003000000000001,1.0319999999999965,"S.US.FISV ",{"$f":"RTD(\"cqg.rtd\", ,\"ContractData\",A41, \"PerCentNetLastTrade\",, \"T\")/100","v":-1.5645835185349809E-2},{"$f":"RANK($K41,$K$2:K$103)+COUNTIF($K$2:K41,K41)-1","v":93},"S.US.FISV ",40,"S.US.EBAY ",{"$f":"RTD(\"cqg.rtd\", ,\"ContractData\",O41, \"PerCentNetLastTrade\",, \"T\")/100","v":1.7452006980802793E-3},{"$f":"VLOOKUP(O41,$A$2:$H142,8,FALSE)","v":4.0070000000000023},null,40,""]
["S.US.FOX ",{"$f":"IFERROR(RTD(\"cqg.rtd\",,\"StudyData\",A42,\"Bar\",, \"High\",$C$1,\"0\",,,,,\"T\"),\"\")","v":27.24},{"$f":"IFERROR(RTD(\"cqg.rtd\",,\"StudyData\",A42,\"Bar\",, \"Low\",$C$1,\"0\",,,,,\"T\"),\"\")","v":27.22},{"$f":"IFERROR(RTD(\"cqg.rtd\",,\"StudyData\",\"HiLevel(\"&A42&\",Period1:=\"&$B$1&\",AllowGaps:=0,InputChoice1:=High,InputChoice3:=High)\",\"Bar\",, \"Close\",$C$1,\"-1\",,,,,\"T\"),\"\")","v":27.31},{"$f":"IFERROR(RTD(\"cqg.rtd\",,\"StudyData\",\"LoLevel(\"&A42&\",Period2:=\"&$B$1&\",AllowGaps:=0,InputChoice2:=Low,InputChoice4:=Low)\",\"Bar\",, \"Close\",$C$1,\"-1\",,,,,\"T\"),\"\")","v":26.98},0,0,5.0040000000000013,1.0329999999999964,"S.US.FOX ",{"$f":"RTD(\"cqg.rtd\", ,\"ContractData\",A42, \"PerCentNetLastTrade\",, \"T\")/100","v":-5.4764512595837896E-3},{"$f":"RANK($K42,$K$2:K$103)+COUNTIF($K$2:K42,K42)-1","v":65},"S.US.FOX ",41,"S.US.ROST ",{"$f":"RTD(\"cqg.rtd\", ,\"ContractData\",O42, \"PerCentNetLastTrade\",, \"T\")/100","v":1.6268516140080485E-3},{"$f":"VLOOKUP(O42,$A$2:$H143,8,FALSE)","v":10},null,41,""]
["S.US.FOXA ",{"$f":"IFERROR(RTD(\"cqg.rtd\",,\"StudyData\",A43,\"Bar\",, \"High\",$C$1,\"0\",,,,,\"T\"),\"\")","v":27.53},{"$f":"IFERROR(RTD(\"cqg.rtd\",,\"StudyData\",A43,\"Bar\",, \"Low\",$C$1,\"0\",,,,,\"T\"),\"\")","v":27.51},{"$f":"IFERROR(RTD(\"cqg.rtd\",,\"StudyData\",\"HiLevel(\"&A43&\",Period1:=\"&$B$1&\",AllowGaps:=0,InputChoice1:=High,InputChoice3:=High)\",\"Bar\",, \"Close\",$C$1,\"-1\",,,,,\"T\"),\"\")","v":27.59},{"$f":"IFERROR(RTD(\"cqg.rtd\",,\"StudyData\",\"LoLevel(\"&A43&\",Period2:=\"&$B$1&\",AllowGaps:=0,InputChoice2:=Low,InputChoice4:=Low)\",\"Bar\",, \"Close\",$C$1,\"-1\",,,,,\"T\"),\"\")","v":27.22},0,0,5.0050000000000017,1.0339999999999963,"S.US.FOXA ",{"$f":"RTD(\"cqg.rtd\", ,\"ContractData\",A43, \"PerCentNetLastTrade\",, \"T\")/100","v":-6.854256854256854E-3},{"$f":"RANK($K43,$K$2:K$103)+COUNTIF($K$2:K43,K43)-1","v":77},"S.US.FOXA ",42,"S.US.CSX ",{"$f":"RTD(\"cqg.rtd\", ,\"ContractData\",O43, \"PerCentNetLastTrade\",, \"T\")/100","v":1.5609320994536737E-3},{"$f":"VLOOKUP(O43,$A$2:$H144,8,FALSE)","v":4},null,42,""]
["S.US.GILD ",{"$f":"IFERROR(RTD(\"cqg.rtd\",,\"StudyData\",A44,\"Bar\",, \"High\",$C$1,\"0\",,,,,\"T\"),\"\")","v":57.19},{"$f":"IFERROR(RTD(\"cqg.rtd\",,\"StudyData\",A44,\"Bar\",, \"Low\",$C$1,\"0\",,,,,\"T\"),\"\")","v":57.1},{"$f":"IFERROR(RTD(\"cqg.rtd\",,\"StudyData\",\"HiLevel(\"&A44&\",Period1:=\"&$B$1&\",AllowGaps:=0,InputChoice1:=High,InputChoice3:=High)\",\"Bar\",, \"Close\",$C$1,\"-1\",,,,,\"T\"),\"\")","v":57.97},{"$f":"IFERROR(RTD(\"cqg.rtd\",,\"StudyData\",\"LoLevel(\"&A44&\",Period2:=\"&$B$1&\",AllowGaps:=0,InputChoice2:=Low,InputChoice4:=Low)\",\"Bar\",, \"Close\",$C$1,\"-1\",,,,,\"T\"),\"\")","v":57.12},0,1,5.006000000000002,2,"S.US.GILD ",{"$f":"RTD(\"cqg.rtd\", ,\"ContractData\",A44, \"PerCentNetLastTrade\",, \"T\")/100","v":-2.4086094977792964E-2},{"$f":"RANK($K44,$K$2:K$103)+COUNTIF($K$2:K44,K44)-1","v":100},"S.US.GILD ",43,"S.US.INCY ",{"$f":"RTD(\"cqg.rtd\", ,\"ContractData\",O44, \"PerCentNetLastTrade\",, \"T\")/100","v":1.3797861331493618E-3},{"$f":"VLOOKUP(O44,$A$2:$H145,8,FALSE)","v":7.0020000000000007},null,43,""]
["S.US.GOOG ",{"$f":"IFERROR(RTD(\"cqg.rtd\",,\"StudyData\",A45,\"Bar\",, \"High\",$C$1,\"0\",,,,,\"T\"),\"\")","v":1737.11},{"$f":"IFERROR(RTD(\"cqg.rtd\",,\"StudyData\",A45,\"Bar\",, \"Low\",$C$1,\"0\",,,,,\"T\"),\"\")","v":1735.07},{"$f":"IFERROR(RTD(\"cqg.rtd\",,\"StudyData\",\"HiLevel(\"&A45&\",Period1:=\"&$B$1&\",AllowGaps:=0,InputChoice1:=High,InputChoice3:=High)\",\"Bar\",, \"Close\",$C$1,\"-1\",,,,,\"T\"),\"\")","v":1736.78},{"$f":"IFERROR(RTD(\"cqg.rtd\",,\"StudyData\",\"LoLevel(\"&A45&\",Period2:=\"&$B$1&\",AllowGaps:=0,InputChoice2:=Low,InputChoice4:=Low)\",\"Bar\",, \"Close\",$C$1,\"-1\",,,,,\"T\"),\"\")","v":1721.31},1,0,6,2.0009999999999999,"S.US.GOOG ",{"$f":"RTD(\"cqg.rtd\", ,\"ContractData\",A45, \"PerCentNetLastTrade\",, \"T\")/100","v":-1.5350385484399524E-3},{"$f":"RANK($K45,$K$2:K$103)+COUNTIF($K$2:K45,K45)-1","v":50},"S.US.GOOG ",44,"S.US.CSCO ",{"$f":"RTD(\"cqg.rtd\", ,\"ContractData\",O45, \"PerCentNetLastTrade\",, \"T\")/100","v":8.9126559714795004E-4},{"$f":"VLOOKUP(O45,$A$2:$H146,8,FALSE)","v":3.0009999999999999},null,44,""]
["S.US.GOOGL ",{"$f":"IFERROR(RTD(\"cqg.rtd\",,\"StudyData\",A46,\"Bar\",, \"High\",$C$1,\"0\",,,,,\"T\"),\"\")","v":1732.19},{"$f":"IFERROR(RTD(\"cqg.rtd\",,\"StudyData\",A46,\"Bar\",, \"Low\",$C$1,\"0\",,,,,\"T\"),\"\")","v":1730.5},{"$f":"IFERROR(RTD(\"cqg.rtd\",,\"StudyData\",\"HiLevel(\"&A46&\",Period1:=\"&$B$1&\",AllowGaps:=0,InputChoice1:=High,InputChoice3:=High)\",\"Bar\",, \"Close\",$C$1,\"-1\",,,,,\"T\"),\"\")","v":1732.2},{"$f":"IFERROR(RTD(\"cqg.rtd\",,\"StudyData\",\"LoLevel(\"&A46&\",Period2:=\"&$B$1&\",AllowGaps:=0,InputChoice2:=Low,InputChoice4:=Low)\",\"Bar\",, \"Close\",$C$1,\"-1\",,,,,\"T\"),\"\")","v":1717.3},0,0,6.0010000000000003,2.0019999999999998,"S.US.GOOGL ",{"$f":"RTD(\"cqg.rtd\", ,\"ContractData\",A46, \"PerCentNetLastTrade\",, \"T\")/100","v":-1.3663407434738493E-3},{"$f":"RANK($K46,$K$2:K$103)+COUNTIF($K$2:K46,K46)-1","v":49},"S.US.GOOGL ",45,"S.US.CDW ",{"$f":"RTD(\"cqg.rtd\", ,\"ContractData\",O46, \"PerCentNetLastTrade\",, \"T\")/100","v":3.0536682189480114E-4},{"$f":"VLOOKUP(O46,$A$2:$H147,8,FALSE)","v":1.0079999999999991},null,45,""]
["S.US.IDXX ",{"$f":"IFERROR(RTD(\"cqg.rtd\",,\"StudyData\",A47,\"Bar\",, \"High\",$C$1,\"0\",,,,,\"T\"),\"\")","v":495.11},{"$f":"IFERROR(RTD(\"cqg.rtd\",,\"StudyData\",A47,\"Bar\",, \"Low\",$C$1,\"0\",,,,,\"T\"),\"\")","v":494.62},{"$f":"IFERROR(RTD(\"cqg.rtd\",,\"StudyData\",\"HiLevel(\"&A47&\",Period1:=\"&$B$1&\",AllowGaps:=0,InputChoice1:=High,InputChoice3:=High)\",\"Bar\",, \"Close\",$C$1,\"-1\",,,,,\"T\"),\"\")","v":494.97},{"$f":"IFERROR(RTD(\"cqg.rtd\",,\"StudyData\",\"LoLevel(\"&A47&\",Period2:=\"&$B$1&\",AllowGaps:=0,InputChoice2:=Low,InputChoice4:=Low)\",\"Bar\",, \"Close\",$C$1,\"-1\",,,,,\"T\"),\"\")","v":489.85},1,0,7,2.0029999999999997,"S.US.IDXX ",{"$f":"RTD(\"cqg.rtd\", ,\"ContractData\",A47, \"PerCentNetLastTrade\",, \"T\")/100","v":1.1088874366933508E-2},{"$f":"RANK($K47,$K$2:K$103)+COUNTIF($K$2:K47,K47)-1","v":17},"S.US.IDXX ",46,"S.US.ALGN ",{"$f":"RTD(\"cqg.rtd\", ,\"ContractData\",O47, \"PerCentNetLastTrade\",, \"T\")/100","v":2.4495487177554598E-4},{"$f":"VLOOKUP(O47,$A$2:$H148,8,FALSE)","v":7.0000000000000001E-3},null,46,""]
["S.US.ILMN ",{"$f":"IFERROR(RTD(\"cqg.rtd\",,\"StudyData\",A48,\"Bar\",, \"High\",$C$1,\"0\",,,,,\"T\"),\"\")","v":375.37},{"$f":"IFERROR(RTD(\"cqg.rtd\",,\"StudyData\",A48,\"Bar\",, \"Low\",$C$1,\"0\",,,,,\"T\"),\"\")","v":374.15},{"$f":"IFERROR(RTD(\"cqg.rtd\",,\"StudyData\",\"HiLevel(\"&A48&\",Period1:=\"&$B$1&\",AllowGaps:=0,InputChoice1:=High,InputChoice3:=High)\",\"Bar\",, \"Close\",$C$1,\"-1\",,,,,\"T\"),\"\")","v":378.33},{"$f":"IFERROR(RTD(\"cqg.rtd\",,\"StudyData\",\"LoLevel(\"&A48&\",Period2:=\"&$B$1&\",AllowGaps:=0,InputChoice2:=Low,InputChoice4:=Low)\",\"Bar\",, \"Close\",$C$1,\"-1\",,,,,\"T\"),\"\")","v":372.01},0,0,7.0010000000000003,2.0039999999999996,"S.US.ILMN ",{"$f":"RTD(\"cqg.rtd\", ,\"ContractData\",A48, \"PerCentNetLastTrade\",, \"T\")/100","v":3.1767917712268702E-2},{"$f":"RANK($K48,$K$2:K$103)+COUNTIF($K$2:K48,K48)-1","v":4},"S.US.ILMN ",47,"S.US.AMZN ",{"$f":"RTD(\"cqg.rtd\", ,\"ContractData\",O48, \"PerCentNetLastTrade\",, \"T\")/100","v":-3.3684945948137657E-4},{"$f":"VLOOKUP(O48,$A$2:$H149,8,FALSE)","v":1.2000000000000004E-2},null,47,""]
["S.US.INCY ",{"$f":"IFERROR(RTD(\"cqg.rtd\",,\"StudyData\",A49,\"Bar\",, \"High\",$C$1,\"0\",,,,,\"T\"),\"\")","v":87.27},{"$f":"IFERROR(RTD(\"cqg.rtd\",,\"StudyData\",A49,\"Bar\",, \"Low\",$C$1,\"0\",,,,,\"T\"),\"\")","v":87.09},{"$f":"IFERROR(RTD(\"cqg.rtd\",,\"StudyData\",\"HiLevel(\"&A49&\",Period1:=\"&$B$1&\",AllowGaps:=0,InputChoice1:=High,InputChoice3:=High)\",\"Bar\",, \"Close\",$C$1,\"-1\",,,,,\"T\"),\"\")","v":87.88},{"$f":"IFERROR(RTD(\"cqg.rtd\",,\"StudyData\",\"LoLevel(\"&A49&\",Period2:=\"&$B$1&\",AllowGaps:=0,InputChoice2:=Low,InputChoice4:=Low)\",\"Bar\",, \"Close\",$C$1,\"-1\",,,,,\"T\"),\"\")","v":86.87},0,0,7.0020000000000007,2.0049999999999994,"S.US.INCY ",{"$f":"RTD(\"cqg.rtd\", ,\"ContractData\",A49, \"PerCentNetLastTrade\",, \"T\")/100","v":1.3797861331493618E-3},{"$f":"RANK($K49,$K$2:K$103)+COUNTIF($K$2:K49,K49)-1","v":43},"S.US.INCY ",48,"S.US.MCHP ",{"$f":"RTD(\"cqg.rtd\", ,\"ContractData\",O49, \"PerCentNetLastTrade\",, \"T\")/100","v":-1.1594202898550724E-3},{"$f":"VLOOKUP(O49,$A$2:$H150,8,FALSE)","v":8.0029999999999983},null,48,""]
["S.US.INTC ",{"$f":"IFERROR(RTD(\"cqg.rtd\",,\"StudyData\",A50,\"Bar\",, \"High\",$C$1,\"0\",,,,,\"T\"),\"\")","v":46.11},{"$f":"IFERROR(RTD(\"cqg.rtd\",,\"StudyData\",A50,\"Bar\",, \"Low\",$C$1,\"0\",,,,,\"T\"),\"\")","v":46.04},{"$f":"IFERROR(RTD(\"cqg.rtd\",,\"StudyData\",\"HiLevel(\"&A50&\",Period1:=\"&$B$1&\",AllowGaps:=0,InputChoice1:=High,InputChoice3:=High)\",\"Bar\",, \"Close\",$C$1,\"-1\",,,,,\"T\"),\"\")","v":46.19},{"$f":"IFERROR(RTD(\"cqg.rtd\",,\"StudyData\",\"LoLevel(\"&A50&\",Period2:=\"&$B$1&\",AllowGaps:=0,InputChoice2:=Low,InputChoice4:=Low)\",\"Bar\",, \"Close\",$C$1,\"-1\",,,,,\"T\"),\"\")","v":45.76},0,0,7.003000000000001,2.0059999999999993,"S.US.INTC ",{"$f":"RTD(\"cqg.rtd\", ,\"ContractData\",A50, \"PerCentNetLastTrade\",, \"T\")/100","v":-6.686798964624676E-3},{"$f":"RANK($K50,$K$2:K$103)+COUNTIF($K$2:K50,K50)-1","v":75},"S.US.INTC ",49,"S.US.GOOGL ",{"$f":"RTD(\"cqg.rtd\", ,\"ContractData\",O50, \"PerCentNetLastTrade\",, \"T\")/100","v":-1.3663407434738493E-3},{"$f":"VLOOKUP(O50,$A$2:$H151,8,FALSE)","v":6.0010000000000003},null,49,""]
["S.US.INTU ",{"$f":"IFERROR(RTD(\"cqg.rtd\",,\"StudyData\",A51,\"Bar\",, \"High\",$C$1,\"0\",,,,,\"T\"),\"\")","v":378.64},{"$f":"IFERROR(RTD(\"cqg.rtd\",,\"StudyData\",A51,\"Bar\",, \"Low\",$C$1,\"0\",,,,,\"T\"),\"\")","v":378.43},{"$f":"IFERROR(RTD(\"cqg.rtd\",,\"StudyData\",\"HiLevel(\"&A51&\",Period1:=\"&$B$1&\",AllowGaps:=0,InputChoice1:=High,InputChoice3:=High)\",\"Bar\",, \"Close\",$C$1,\"-1\",,,,,\"T\"),\"\")","v":379.08},{"$f":"IFERROR(RTD(\"cqg.rtd\",,\"StudyData\",\"LoLevel(\"&A51&\",Period2:=\"&$B$1&\",AllowGaps:=0,InputChoice2:=Low,InputChoice4:=Low)\",\"Bar\",, \"Close\",$C$1,\"-1\",,,,,\"T\"),\"\")","v":375.1},0,0,7.0040000000000013,2.0069999999999992,"S.US.INTU ",{"$f":"RTD(\"cqg.rtd\", ,\"ContractData\",A51, \"PerCentNetLastTrade\",, \"T\")/100","v":6.8363791131327645E-3},{"$f":"RANK($K51,$K$2:K$103)+COUNTIF($K$2:K51,K51)-1","v":27},"S.US.INTU ",50,"S.US.GOOG ",{"$f":"RTD(\"cqg.rtd\", ,\"ContractData\",O51, \"PerCentNetLastTrade\",, \"T\")/100","v":-1.5350385484399524E-3},{"$f":"VLOOKUP(O51,$A$2:$H152,8,FALSE)","v":6},null,50,""]
["S.US.ISRG ",{"$f":"IFERROR(RTD(\"cqg.rtd\",,\"StudyData\",A52,\"Bar\",, \"High\",$C$1,\"0\",,,,,\"T\"),\"\")","v":803.1},{"$f":"IFERROR(RTD(\"cqg.rtd\",,\"StudyData\",A52,\"Bar\",, \"Low\",$C$1,\"0\",,,,,\"T\"),\"\")","v":802.45},{"$f":"IFERROR(RTD(\"cqg.rtd\",,\"StudyData\",\"HiLevel(\"&A52&\",Period1:=\"&$B$1&\",AllowGaps:=0,InputChoice1:=High,InputChoice3:=High)\",\"Bar\",, \"Close\",$C$1,\"-1\",,,,,\"T\"),\"\")","v":806.16},{"$f":"IFERROR(RTD(\"cqg.rtd\",,\"StudyData\",\"LoLevel(\"&A52&\",Period2:=\"&$B$1&\",AllowGaps:=0,InputChoice2:=Low,InputChoice4:=Low)\",\"Bar\",, \"Close\",$C$1,\"-1\",,,,,\"T\"),\"\")","v":796.31},0,0,7.0050000000000017,2.0079999999999991,"S.US.ISRG ",{"$f":"RTD(\"cqg.rtd\", ,\"ContractData\",A52, \"PerCentNetLastTrade\",, \"T\")/100","v":1.6787664550787437E-2},{"$f":"RANK($K52,$K$2:K$103)+COUNTIF($K$2:K52,K52)-1","v":10},"S.US.ISRG ",51,"S.US.AMAT ",{"$f":"RTD(\"cqg.rtd\", ,\"ContractData\",O52, \"PerCentNetLastTrade\",, \"T\")/100","v":-1.8516375419511629E-3},{"$f":"VLOOKUP(O52,$A$2:$H153,8,FALSE)","v":9.0000000000000011E-3},null,51,""]
["S.US.JD ",{"$f":"IFERROR(RTD(\"cqg.rtd\",,\"StudyData\",A53,\"Bar\",, \"High\",$C$1,\"0\",,,,,\"T\"),\"\")","v":81.819999999999993},{"$f":"IFERROR(RTD(\"cqg.rtd\",,\"StudyData\",A53,\"Bar\",, \"Low\",$C$1,\"0\",,,,,\"T\"),\"\")","v":81.73},{"$f":"IFERROR(RTD(\"cqg.rtd\",,\"StudyData\",\"HiLevel(\"&A53&\",Period1:=\"&$B$1&\",AllowGaps:=0,InputChoice1:=High,InputChoice3:=High)\",\"Bar\",, \"Close\",$C$1,\"-1\",,,,,\"T\"),\"\")","v":81.819999999999993},{"$f":"IFERROR(RTD(\"cqg.rtd\",,\"StudyData\",\"LoLevel(\"&A53&\",Period2:=\"&$B$1&\",AllowGaps:=0,InputChoice2:=Low,InputChoice4:=Low)\",\"Bar\",, \"Close\",$C$1,\"-1\",,,,,\"T\"),\"\")","v":80.83},0,0,7.006000000000002,2.008999999999999,"S.US.JD ",{"$f":"RTD(\"cqg.rtd\", ,\"ContractData\",A53, \"PerCentNetLastTrade\",, \"T\")/100","v":1.3640873015873016E-2},{"$f":"RANK($K53,$K$2:K$103)+COUNTIF($K$2:K53,K53)-1","v":14},"S.US.JD ",52,"S.US.TEAM ",{"$f":"RTD(\"cqg.rtd\", ,\"ContractData\",O53, \"PerCentNetLastTrade\",, \"T\")/100","v":-2.1757524477215035E-3},{"$f":"VLOOKUP(O53,$A$2:$H154,8,FALSE)","v":11.002999999999998},null,52,""]
["S.US.KDP ",{"$f":"IFERROR(RTD(\"cqg.rtd\",,\"StudyData\",A54,\"Bar\",, \"High\",$C$1,\"0\",,,,,\"T\"),\"\")","v":30.87},{"$f":"IFERROR(RTD(\"cqg.rtd\",,\"StudyData\",A54,\"Bar\",, \"Low\",$C$1,\"0\",,,,,\"T\"),\"\")","v":30.84},{"$f":"IFERROR(RTD(\"cqg.rtd\",,\"StudyData\",\"HiLevel(\"&A54&\",Period1:=\"&$B$1&\",AllowGaps:=0,InputChoice1:=High,InputChoice3:=High)\",\"Bar\",, \"Close\",$C$1,\"-1\",,,,,\"T\"),\"\")","v":30.92},{"$f":"IFERROR(RTD(\"cqg.rtd\",,\"StudyData\",\"LoLevel(\"&A54&\",Period2:=\"&$B$1&\",AllowGaps:=0,InputChoice2:=Low,InputChoice4:=Low)\",\"Bar\",, \"Close\",$C$1,\"-1\",,,,,\"T\"),\"\")","v":30.79},0,0,7.0070000000000023,2.0099999999999989,"S.US.KDP ",{"$f":"RTD(\"cqg.rtd\", ,\"ContractData\",A54, \"PerCentNetLastTrade\",, \"T\")/100","v":3.2499187520311991E-3},{"$f":"RANK($K54,$K$2:K$103)+COUNTIF($K$2:K54,K54)-1","v":34},"S.US.KDP ",53,"S.US.FAST ",{"$f":"RTD(\"cqg.rtd\", ,\"ContractData\",O54, \"PerCentNetLastTrade\",, \"T\")/100","v":-2.6204394275347715E-3},{"$f":"VLOOKUP(O54,$A$2:$H155,8,FALSE)","v":5.0010000000000003}]
["S.US.KHC ",{"$f":"IFERROR(RTD(\"cqg.rtd\",,\"StudyData\",A55,\"Bar\",, \"High\",$C$1,\"0\",,,,,\"T\"),\"\")","v":34.69},{"$f":"IFERROR(RTD(\"cqg.rtd\",,\"StudyData\",A55,\"Bar\",, \"Low\",$C$1,\"0\",,,,,\"T\"),\"\")","v":34.659999999999997},{"$f":"IFERROR(RTD(\"cqg.rtd\",,\"StudyData\",\"HiLevel(\"&A55&\",Period1:=\"&$B$1&\",AllowGaps:=0,InputChoice1:=High,InputChoice3:=High)\",\"Bar\",, \"Close\",$C$1,\"-1\",,,,,\"T\"),\"\")","v":34.69},{"$f":"IFERROR(RTD(\"cqg.rtd\",,\"StudyData\",\"LoLevel(\"&A55&\",Period2:=\"&$B$1&\",AllowGaps:=0,InputChoice2:=Low,InputChoice4:=Low)\",\"Bar\",, \"Close\",$C$1,\"-1\",,,,,\"T\"),\"\")","v":34.369999999999997},0,0,7.0080000000000027,2.0109999999999988,"S.US.KHC ",{"$f":"RTD(\"cqg.rtd\", ,\"ContractData\",A55, \"PerCentNetLastTrade\",, \"T\")/100","v":3.1819496673416259E-3},{"$f":"RANK($K55,$K$2:K$103)+COUNTIF($K$2:K55,K55)-1","v":35},"S.US.KHC ",54,"S.US.DXCM ",{"$f":"RTD(\"cqg.rtd\", ,\"ContractData\",O55, \"PerCentNetLastTrade\",, \"T\")/100","v":-3.1818833309445321E-3},{"$f":"VLOOKUP(O55,$A$2:$H156,8,FALSE)","v":4.0050000000000017}]
["S.US.KLAC ",{"$f":"IFERROR(RTD(\"cqg.rtd\",,\"StudyData\",A56,\"Bar\",, \"High\",$C$1,\"0\",,,,,\"T\"),\"\")","v":259.27},{"$f":"IFERROR(RTD(\"cqg.rtd\",,\"StudyData\",A56,\"Bar\",, \"Low\",$C$1,\"0\",,,,,\"T\"),\"\")","v":258.91000000000003},{"$f":"IFERROR(RTD(\"cqg.rtd\",,\"StudyData\",\"HiLevel(\"&A56&\",Period1:=\"&$B$1&\",AllowGaps:=0,InputChoice1:=High,InputChoice3:=High)\",\"Bar\",, \"Close\",$C$1,\"-1\",,,,,\"T\"),\"\")","v":260.16000000000003},{"$f":"IFERROR(RTD(\"cqg.rtd\",,\"StudyData\",\"LoLevel(\"&A56&\",Period2:=\"&$B$1&\",AllowGaps:=0,InputChoice2:=Low,InputChoice4:=Low)\",\"Bar\",, \"Close\",$C$1,\"-1\",,,,,\"T\"),\"\")","v":257.58},0,0,7.009000000000003,2.0119999999999987,"S.US.KLAC ",{"$f":"RTD(\"cqg.rtd\", ,\"ContractData\",A56, \"PerCentNetLastTrade\",, \"T\")/100","v":-5.7521954212524451E-3},{"$f":"RANK($K56,$K$2:K$103)+COUNTIF($K$2:K56,K56)-1","v":66},"S.US.KLAC ",55,"S.US.VRSK ",{"$f":"RTD(\"cqg.rtd\", ,\"ContractData\",O56, \"PerCentNetLastTrade\",, \"T\")/100","v":-3.4028702470779702E-3},{"$f":"VLOOKUP(O56,$A$2:$H157,8,FALSE)","v":11.006999999999996}]
["S.US.LRCX ",{"$f":"IFERROR(RTD(\"cqg.rtd\",,\"StudyData\",A57,\"Bar\",, \"High\",$C$1,\"0\",,,,,\"T\"),\"\")","v":480.2},{"$f":"IFERROR(RTD(\"cqg.rtd\",,\"StudyData\",A57,\"Bar\",, \"Low\",$C$1,\"0\",,,,,\"T\"),\"\")","v":479.57},{"$f":"IFERROR(RTD(\"cqg.rtd\",,\"StudyData\",\"HiLevel(\"&A57&\",Period1:=\"&$B$1&\",AllowGaps:=0,InputChoice1:=High,InputChoice3:=High)\",\"Bar\",, \"Close\",$C$1,\"-1\",,,,,\"T\"),\"\")","v":480.13},{"$f":"IFERROR(RTD(\"cqg.rtd\",,\"StudyData\",\"LoLevel(\"&A57&\",Period2:=\"&$B$1&\",AllowGaps:=0,InputChoice2:=Low,InputChoice4:=Low)\",\"Bar\",, \"Close\",$C$1,\"-1\",,,,,\"T\"),\"\")","v":476.51},1,0,8,2.0129999999999986,"S.US.LRCX ",{"$f":"RTD(\"cqg.rtd\", ,\"ContractData\",A57, \"PerCentNetLastTrade\",, \"T\")/100","v":-6.4565527802495706E-3},{"$f":"RANK($K57,$K$2:K$103)+COUNTIF($K$2:K57,K57)-1","v":73},"S.US.LRCX ",56,"S.US.CHTR ",{"$f":"RTD(\"cqg.rtd\", ,\"ContractData\",O57, \"PerCentNetLastTrade\",, \"T\")/100","v":-3.879698788739709E-3},{"$f":"VLOOKUP(O57,$A$2:$H158,8,FALSE)","v":2.0019999999999998}]
["S.US.LULU ",{"$f":"IFERROR(RTD(\"cqg.rtd\",,\"StudyData\",A58,\"Bar\",, \"High\",$C$1,\"0\",,,,,\"T\"),\"\")","v":366.56},{"$f":"IFERROR(RTD(\"cqg.rtd\",,\"StudyData\",A58,\"Bar\",, \"Low\",$C$1,\"0\",,,,,\"T\"),\"\")","v":365.49},{"$f":"IFERROR(RTD(\"cqg.rtd\",,\"StudyData\",\"HiLevel(\"&A58&\",Period1:=\"&$B$1&\",AllowGaps:=0,InputChoice1:=High,InputChoice3:=High)\",\"Bar\",, \"Close\",$C$1,\"-1\",,,,,\"T\"),\"\")","v":372.06},{"$f":"IFERROR(RTD(\"cqg.rtd\",,\"StudyData\",\"LoLevel(\"&A58&\",Period2:=\"&$B$1&\",AllowGaps:=0,InputChoice2:=Low,InputChoice4:=Low)\",\"Bar\",, \"Close\",$C$1,\"-1\",,,,,\"T\"),\"\")","v":365.2},0,0,8.0009999999999994,2.0139999999999985,"S.US.LULU ",{"$f":"RTD(\"cqg.rtd\", ,\"ContractData\",A58, \"PerCentNetLastTrade\",, \"T\")/100","v":-2.0782003213711837E-2},{"$f":"RANK($K58,$K$2:K$103)+COUNTIF($K$2:K58,K58)-1","v":97},"S.US.LULU ",57,"S.US.AEP ",{"$f":"RTD(\"cqg.rtd\", ,\"ContractData\",O58, \"PerCentNetLastTrade\",, \"T\")/100","v":-4.0185094982951777E-3},{"$f":"VLOOKUP(O58,$A$2:$H159,8,FALSE)","v":6.0000000000000001E-3}]
["S.US.MAR ",{"$f":"IFERROR(RTD(\"cqg.rtd\",,\"StudyData\",A59,\"Bar\",, \"High\",$C$1,\"0\",,,,,\"T\"),\"\")","v":126.53},{"$f":"IFERROR(RTD(\"cqg.rtd\",,\"StudyData\",A59,\"Bar\",, \"Low\",$C$1,\"0\",,,,,\"T\"),\"\")","v":126.26},{"$f":"IFERROR(RTD(\"cqg.rtd\",,\"StudyData\",\"HiLevel(\"&A59&\",Period1:=\"&$B$1&\",AllowGaps:=0,InputChoice1:=High,InputChoice3:=High)\",\"Bar\",, \"Close\",$C$1,\"-1\",,,,,\"T\"),\"\")","v":126.6},{"$f":"IFERROR(RTD(\"cqg.rtd\",,\"StudyData\",\"LoLevel(\"&A59&\",Period2:=\"&$B$1&\",AllowGaps:=0,InputChoice2:=Low,InputChoice4:=Low)\",\"Bar\",, \"Close\",$C$1,\"-1\",,,,,\"T\"),\"\")","v":124.44},0,0,8.0019999999999989,2.0149999999999983,"S.US.MAR ",{"$f":"RTD(\"cqg.rtd\", ,\"ContractData\",A59, \"PerCentNetLastTrade\",, \"T\")/100","v":-6.3619227144203587E-3},{"$f":"RANK($K59,$K$2:K$103)+COUNTIF($K$2:K59,K59)-1","v":72},"S.US.MAR ",58,"S.US.CMCSA ",{"$f":"RTD(\"cqg.rtd\", ,\"ContractData\",O59, \"PerCentNetLastTrade\",, \"T\")/100","v":-4.5662100456621002E-3},{"$f":"VLOOKUP(O59,$A$2:$H160,8,FALSE)","v":2.0029999999999997}]
["S.US.MCHP ",{"$f":"IFERROR(RTD(\"cqg.rtd\",,\"StudyData\",A60,\"Bar\",, \"High\",$C$1,\"0\",,,,,\"T\"),\"\")","v":138.15},{"$f":"IFERROR(RTD(\"cqg.rtd\",,\"StudyData\",A60,\"Bar\",, \"Low\",$C$1,\"0\",,,,,\"T\"),\"\")","v":137.84},{"$f":"IFERROR(RTD(\"cqg.rtd\",,\"StudyData\",\"HiLevel(\"&A60&\",Period1:=\"&$B$1&\",AllowGaps:=0,InputChoice1:=High,InputChoice3:=High)\",\"Bar\",, \"Close\",$C$1,\"-1\",,,,,\"T\"),\"\")","v":138.63},{"$f":"IFERROR(RTD(\"cqg.rtd\",,\"StudyData\",\"LoLevel(\"&A60&\",Period2:=\"&$B$1&\",AllowGaps:=0,InputChoice2:=Low,InputChoice4:=Low)\",\"Bar\",, \"Close\",$C$1,\"-1\",,,,,\"T\"),\"\")","v":137.47999999999999},0,0,8.0029999999999983,2.0159999999999982,"S.US.MCHP ",{"$f":"RTD(\"cqg.rtd\", ,\"ContractData\",A60, \"PerCentNetLastTrade\",, \"T\")/100","v":-1.1594202898550724E-3},{"$f":"RANK($K60,$K$2:K$103)+COUNTIF($K$2:K60,K60)-1","v":48},"S.US.MCHP ",59,"S.US.VRTX ",{"$f":"RTD(\"cqg.rtd\", ,\"ContractData\",O60, \"PerCentNetLastTrade\",, \"T\")/100","v":-4.6471967597527183E-3},{"$f":"VLOOKUP(O60,$A$2:$H161,8,FALSE)","v":12.000999999999999}]
["S.US.MDLZ ",{"$f":"IFERROR(RTD(\"cqg.rtd\",,\"StudyData\",A61,\"Bar\",, \"High\",$C$1,\"0\",,,,,\"T\"),\"\")","v":57.3},{"$f":"IFERROR(RTD(\"cqg.rtd\",,\"StudyData\",A61,\"Bar\",, \"Low\",$C$1,\"0\",,,,,\"T\"),\"\")","v":57.26},{"$f":"IFERROR(RTD(\"cqg.rtd\",,\"StudyData\",\"HiLevel(\"&A61&\",Period1:=\"&$B$1&\",AllowGaps:=0,InputChoice1:=High,InputChoice3:=High)\",\"Bar\",, \"Close\",$C$1,\"-1\",,,,,\"T\"),\"\")","v":57.61},{"$f":"IFERROR(RTD(\"cqg.rtd\",,\"StudyData\",\"LoLevel(\"&A61&\",Period2:=\"&$B$1&\",AllowGaps:=0,InputChoice2:=Low,InputChoice4:=Low)\",\"Bar\",, \"Close\",$C$1,\"-1\",,,,,\"T\"),\"\")","v":57.17},0,0,8.0039999999999978,2.0169999999999981,"S.US.MDLZ ",{"$f":"RTD(\"cqg.rtd\", ,\"ContractData\",A61, \"PerCentNetLastTrade\",, \"T\")/100","v":-6.761442441054092E-3},{"$f":"RANK($K61,$K$2:K$103)+COUNTIF($K$2:K61,K61)-1","v":76},"S.US.MDLZ ",60,"S.US.SIRI ",{"$f":"RTD(\"cqg.rtd\", ,\"ContractData\",O61, \"PerCentNetLastTrade\",, \"T\")/100","v":-4.7543581616481777E-3},{"$f":"VLOOKUP(O61,$A$2:$H162,8,FALSE)","v":10.002999999999998}]
["S.US.MELI ",{"$f":"IFERROR(RTD(\"cqg.rtd\",,\"StudyData\",A62,\"Bar\",, \"High\",$C$1,\"0\",,,,,\"T\"),\"\")","v":1729.34},{"$f":"IFERROR(RTD(\"cqg.rtd\",,\"StudyData\",A62,\"Bar\",, \"Low\",$C$1,\"0\",,,,,\"T\"),\"\")","v":1725.01},{"$f":"IFERROR(RTD(\"cqg.rtd\",,\"StudyData\",\"HiLevel(\"&A62&\",Period1:=\"&$B$1&\",AllowGaps:=0,InputChoice1:=High,InputChoice3:=High)\",\"Bar\",, \"Close\",$C$1,\"-1\",,,,,\"T\"),\"\")","v":1735.75},{"$f":"IFERROR(RTD(\"cqg.rtd\",,\"StudyData\",\"LoLevel(\"&A62&\",Period2:=\"&$B$1&\",AllowGaps:=0,InputChoice2:=Low,InputChoice4:=Low)\",\"Bar\",, \"Close\",$C$1,\"-1\",,,,,\"T\"),\"\")","v":1716.24},0,0,8.0049999999999972,2.017999999999998,"S.US.MELI ",{"$f":"RTD(\"cqg.rtd\", ,\"ContractData\",A62, \"PerCentNetLastTrade\",, \"T\")/100","v":1.5972766198045808E-2},{"$f":"RANK($K62,$K$2:K$103)+COUNTIF($K$2:K62,K62)-1","v":11},"S.US.MELI ",61,"S.US.MNST ",{"$f":"RTD(\"cqg.rtd\", ,\"ContractData\",O62, \"PerCentNetLastTrade\",, \"T\")/100","v":-5.0578846802292908E-3},{"$f":"VLOOKUP(O62,$A$2:$H163,8,FALSE)","v":8.0059999999999967}]
["S.US.MNST ",{"$f":"IFERROR(RTD(\"cqg.rtd\",,\"StudyData\",A63,\"Bar\",, \"High\",$C$1,\"0\",,,,,\"T\"),\"\")","v":88.52},{"$f":"IFERROR(RTD(\"cqg.rtd\",,\"StudyData\",A63,\"Bar\",, \"Low\",$C$1,\"0\",,,,,\"T\"),\"\")","v":88.41},{"$f":"IFERROR(RTD(\"cqg.rtd\",,\"StudyData\",\"HiLevel(\"&A63&\",Period1:=\"&$B$1&\",AllowGaps:=0,InputChoice1:=High,InputChoice3:=High)\",\"Bar\",, \"Close\",$C$1,\"-1\",,,,,\"T\"),\"\")","v":88.79},{"$f":"IFERROR(RTD(\"cqg.rtd\",,\"StudyData\",\"LoLevel(\"&A63&\",Period2:=\"&$B$1&\",AllowGaps:=0,InputChoice2:=Low,InputChoice4:=Low)\",\"Bar\",, \"Close\",$C$1,\"-1\",,,,,\"T\"),\"\")","v":88.09},0,0,8.0059999999999967,2.0189999999999979,"S.US.MNST ",{"$f":"RTD(\"cqg.rtd\", ,\"ContractData\",A63, \"PerCentNetLastTrade\",, \"T\")/100","v":-5.0578846802292908E-3},{"$f":"RANK($K63,$K$2:K$103)+COUNTIF($K$2:K63,K63)-1","v":61},"S.US.MNST ",62,"S.US.SGEN ",{"$f":"RTD(\"cqg.rtd\", ,\"ContractData\",O63, \"PerCentNetLastTrade\",, \"T\")/100","v":-5.1051354630004039E-3},{"$f":"VLOOKUP(O63,$A$2:$H164,8,FALSE)","v":10.001999999999999}]
["S.US.MRNA ",{"$f":"IFERROR(RTD(\"cqg.rtd\",,\"StudyData\",A64,\"Bar\",, \"High\",$C$1,\"0\",,,,,\"T\"),\"\")","v":130.97999999999999},{"$f":"IFERROR(RTD(\"cqg.rtd\",,\"StudyData\",A64,\"Bar\",, \"Low\",$C$1,\"0\",,,,,\"T\"),\"\")","v":129.75},{"$f":"IFERROR(RTD(\"cqg.rtd\",,\"StudyData\",\"HiLevel(\"&A64&\",Period1:=\"&$B$1&\",AllowGaps:=0,InputChoice1:=High,InputChoice3:=High)\",\"Bar\",, \"Close\",$C$1,\"-1\",,,,,\"T\"),\"\")","v":139.26},{"$f":"IFERROR(RTD(\"cqg.rtd\",,\"StudyData\",\"LoLevel(\"&A64&\",Period2:=\"&$B$1&\",AllowGaps:=0,InputChoice2:=Low,InputChoice4:=Low)\",\"Bar\",, \"Close\",$C$1,\"-1\",,,,,\"T\"),\"\")","v":125.21},0,0,8.0069999999999961,2.0199999999999978,"S.US.MRNA ",{"$f":"RTD(\"cqg.rtd\", ,\"ContractData\",A64, \"PerCentNetLastTrade\",, \"T\")/100","v":-6.0086767895878523E-2},{"$f":"RANK($K64,$K$2:K$103)+COUNTIF($K$2:K64,K64)-1","v":102},"S.US.MRNA ",63,"S.US.PCAR ",{"$f":"RTD(\"cqg.rtd\", ,\"ContractData\",O64, \"PerCentNetLastTrade\",, \"T\")/100","v":-5.2417006406523005E-3},{"$f":"VLOOKUP(O64,$A$2:$H165,8,FALSE)","v":9.0029999999999983}]
["S.US.MRVL ",{"$f":"IFERROR(RTD(\"cqg.rtd\",,\"StudyData\",A65,\"Bar\",, \"High\",$C$1,\"0\",,,,,\"T\"),\"\")","v":47.45},{"$f":"IFERROR(RTD(\"cqg.rtd\",,\"StudyData\",A65,\"Bar\",, \"Low\",$C$1,\"0\",,,,,\"T\"),\"\")","v":47.4},{"$f":"IFERROR(RTD(\"cqg.rtd\",,\"StudyData\",\"HiLevel(\"&A65&\",Period1:=\"&$B$1&\",AllowGaps:=0,InputChoice1:=High,InputChoice3:=High)\",\"Bar\",, \"Close\",$C$1,\"-1\",,,,,\"T\"),\"\")","v":47.62},{"$f":"IFERROR(RTD(\"cqg.rtd\",,\"StudyData\",\"LoLevel(\"&A65&\",Period2:=\"&$B$1&\",AllowGaps:=0,InputChoice2:=Low,InputChoice4:=Low)\",\"Bar\",, \"Close\",$C$1,\"-1\",,,,,\"T\"),\"\")","v":47.24},0,0,8.0079999999999956,2.0209999999999977,"S.US.MRVL ",{"$f":"RTD(\"cqg.rtd\", ,\"ContractData\",A65, \"PerCentNetLastTrade\",, \"T\")/100","v":3.8095238095238095E-3},{"$f":"RANK($K65,$K$2:K$103)+COUNTIF($K$2:K65,K65)-1","v":32},"S.US.MRVL ",64,"S.US.EA ",{"$f":"RTD(\"cqg.rtd\", ,\"ContractData\",O65, \"PerCentNetLastTrade\",, \"T\")/100","v":-5.2478547620736114E-3},{"$f":"VLOOKUP(O65,$A$2:$H166,8,FALSE)","v":4.006000000000002}]
["S.US.MSFT ",{"$f":"IFERROR(RTD(\"cqg.rtd\",,\"StudyData\",A66,\"Bar\",, \"High\",$C$1,\"0\",,,,,\"T\"),\"\")","v":224.74},{"$f":"IFERROR(RTD(\"cqg.rtd\",,\"StudyData\",A66,\"Bar\",, \"Low\",$C$1,\"0\",,,,,\"T\"),\"\")","v":224.49},{"$f":"IFERROR(RTD(\"cqg.rtd\",,\"StudyData\",\"HiLevel(\"&A66&\",Period1:=\"&$B$1&\",AllowGaps:=0,InputChoice1:=High,InputChoice3:=High)\",\"Bar\",, \"Close\",$C$1,\"-1\",,,,,\"T\"),\"\")","v":225.63},{"$f":"IFERROR(RTD(\"cqg.rtd\",,\"StudyData\",\"LoLevel(\"&A66&\",Period2:=\"&$B$1&\",AllowGaps:=0,InputChoice2:=Low,InputChoice4:=Low)\",\"Bar\",, \"Close\",$C$1,\"-1\",,,,,\"T\"),\"\")","v":223.45},0,0,8.008999999999995,2.0219999999999976,"S.US.MSFT ",{"$f":"RTD(\"cqg.rtd\", ,\"ContractData\",A66, \"PerCentNetLastTrade\",, \"T\")/100","v":9.614088683229256E-3},{"$f":"RANK($K66,$K$2:K$103)+COUNTIF($K$2:K66,K66)-1","v":19},"S.US.MSFT ",65,"S.US.FOX ",{"$f":"RTD(\"cqg.rtd\", ,\"ContractData\",O66, \"PerCentNetLastTrade\",, \"T\")/100","v":-5.4764512595837896E-3},{"$f":"VLOOKUP(O66,$A$2:$H167,8,FALSE)","v":5.0040000000000013}]
["S.US.MTCH ",{"$f":"IFERROR(RTD(\"cqg.rtd\",,\"StudyData\",A67,\"Bar\",, \"High\",$C$1,\"0\",,,,,\"T\"),\"\")","v":158.38},{"$f":"IFERROR(RTD(\"cqg.rtd\",,\"StudyData\",A67,\"Bar\",, \"Low\",$C$1,\"0\",,,,,\"T\"),\"\")","v":157.91999999999999},{"$f":"IFERROR(RTD(\"cqg.rtd\",,\"StudyData\",\"HiLevel(\"&A67&\",Period1:=\"&$B$1&\",AllowGaps:=0,InputChoice1:=High,InputChoice3:=High)\",\"Bar\",, \"Close\",$C$1,\"-1\",,,,,\"T\"),\"\")","v":158.4},{"$f":"IFERROR(RTD(\"cqg.rtd\",,\"StudyData\",\"LoLevel(\"&A67&\",Period2:=\"&$B$1&\",AllowGaps:=0,InputChoice2:=Low,InputChoice4:=Low)\",\"Bar\",, \"Close\",$C$1,\"-1\",,,,,\"T\"),\"\")","v":155.36000000000001},{"$f":"IF(B67=\"\",0,IFERROR(IF(B67>D67,1,0),\"\"))","v":0},{"$f":"IF(C67=\"\",0,IFERROR(IF(C67<E67,1,0),\"\"))","v":0},{"$f":"IF(F67=1,INT(H66+1),H66+0.001)","v":8.0099999999999945},2.0229999999999975,{"$f":"A67","v":"S.US.MTCH "},{"$f":"RTD(\"cqg.rtd\", ,\"ContractData\",A67, \"PerCentNetLastTrade\",, \"T\")/100","v":2.4586441777489459E-2},{"$f":"RANK($K67,$K$2:K$103)+COUNTIF($K$2:K67,K67)-1","v":7},{"$f":"J67","v":"S.US.MTCH "},66,{"$f":"IFERROR(VLOOKUP(N67,$L$2:$M$103,2,FALSE),\"\")","v":"S.US.KLAC "},{"$f":"RTD(\"cqg.rtd\", ,\"ContractData\",O67, \"PerCentNetLastTrade\",, \"T\")/100","v":-5.7521954212524451E-3},{"$f":"VLOOKUP(O67,$A$2:$H168,8,FALSE)","v":7.009000000000003}]
["S.US.MU ",{"$f":"IFERROR(RTD(\"cqg.rtd\",,\"StudyData\",A68,\"Bar\",, \"High\",$C$1,\"0\",,,,,\"T\"),\"\")","v":70.900000000000006},{"$f":"IFERROR(RTD(\"cqg.rtd\",,\"StudyData\",A68,\"Bar\",, \"Low\",$C$1,\"0\",,,,,\"T\"),\"\")","v":70.81},{"$f":"IFERROR(RTD(\"cqg.rtd\",,\"StudyData\",\"HiLevel(\"&A68&\",Period1:=\"&$B$1&\",AllowGaps:=0,InputChoice1:=High,InputChoice3:=High)\",\"Bar\",, \"Close\",$C$1,\"-1\",,,,,\"T\"),\"\")","v":71.56},{"$f":"IFERROR(RTD(\"cqg.rtd\",,\"StudyData\",\"LoLevel(\"&A68&\",Period2:=\"&$B$1&\",AllowGaps:=0,InputChoice2:=Low,InputChoice4:=Low)\",\"Bar\",, \"Close\",$C$1,\"-1\",,,,,\"T\"),\"\")","v":70.58},0,0,8.0109999999999939,2.0239999999999974,"S.US.MU ",{"$f":"RTD(\"cqg.rtd\", ,\"ContractData\",A68, \"PerCentNetLastTrade\",, \"T\")/100","v":-9.0947250594655103E-3},{"$f":"RANK($K68,$K$2:K$103)+COUNTIF($K$2:K68,K68)-1","v":84},"S.US.MU ",{"$f":"N67+1","v":67},"S.US.QCOM ",{"$f":"RTD(\"cqg.rtd\", ,\"ContractData\",O68, \"PerCentNetLastTrade\",, \"T\")/100","v":-5.9945504087193461E-3},{"$f":"VLOOKUP(O68,$A$2:$H169,8,FALSE)","v":9.0079999999999956}]
["S.US.MXIM ",{"$f":"IFERROR(RTD(\"cqg.rtd\",,\"StudyData\",A69,\"Bar\",, \"High\",$C$1,\"0\",,,,,\"T\"),\"\")","v":85.73},{"$f":"IFERROR(RTD(\"cqg.rtd\",,\"StudyData\",A69,\"Bar\",, \"Low\",$C$1,\"0\",,,,,\"T\"),\"\")","v":85.69},{"$f":"IFERROR(RTD(\"cqg.rtd\",,\"StudyData\",\"HiLevel(\"&A69&\",Period1:=\"&$B$1&\",AllowGaps:=0,InputChoice1:=High,InputChoice3:=High)\",\"Bar\",, \"Close\",$C$1,\"-1\",,,,,\"T\"),\"\")","v":85.79},{"$f":"IFERROR(RTD(\"cqg.rtd\",,\"StudyData\",\"LoLevel(\"&A69&\",Period2:=\"&$B$1&\",AllowGaps:=0,InputChoice2:=Low,InputChoice4:=Low)\",\"Bar\",, \"Close\",$C$1,\"-1\",,,,,\"T\"),\"\")","v":85.12},0,0,8.0119999999999933,2.0249999999999972,"S.US.MXIM ",{"$f":"RTD(\"cqg.rtd\", ,\"ContractData\",A69, \"PerCentNetLastTrade\",, \"T\")/100","v":5.7511737089201874E-3},{"$f":"RANK($K69,$K$2:K$103)+COUNTIF($K$2:K69,K69)-1","v":31},"S.US.MXIM ",68,"S.US.ORLY ",{"$f":"RTD(\"cqg.rtd\", ,\"ContractData\",O69, \"PerCentNetLastTrade\",, \"T\")/100","v":-6.054044499436576E-3},{"$f":"VLOOKUP(O69,$A$2:$H170,8,FALSE)","v":9.0009999999999994}]
["S.US.NFLX ",{"$f":"IFERROR(RTD(\"cqg.rtd\",,\"StudyData\",A70,\"Bar\",, \"High\",$C$1,\"0\",,,,,\"T\"),\"\")","v":525.76},{"$f":"IFERROR(RTD(\"cqg.rtd\",,\"StudyData\",A70,\"Bar\",, \"Low\",$C$1,\"0\",,,,,\"T\"),\"\")","v":525.01},{"$f":"IFERROR(RTD(\"cqg.rtd\",,\"StudyData\",\"HiLevel(\"&A70&\",Period1:=\"&$B$1&\",AllowGaps:=0,InputChoice1:=High,InputChoice3:=High)\",\"Bar\",, \"Close\",$C$1,\"-1\",,,,,\"T\"),\"\")","v":529.29999999999995},{"$f":"IFERROR(RTD(\"cqg.rtd\",,\"StudyData\",\"LoLevel(\"&A70&\",Period2:=\"&$B$1&\",AllowGaps:=0,InputChoice2:=Low,InputChoice4:=Low)\",\"Bar\",, \"Close\",$C$1,\"-1\",,,,,\"T\"),\"\")","v":521.27},0,0,8.0129999999999928,2.0259999999999971,"S.US.NFLX ",{"$f":"RTD(\"cqg.rtd\", ,\"ContractData\",A70, \"PerCentNetLastTrade\",, \"T\")/100","v":-6.5984761112476593E-3},{"$f":"RANK($K70,$K$2:K$103)+COUNTIF($K$2:K70,K70)-1","v":74},"S.US.NFLX ",69,"S.US.BKNG ",{"$f":"RTD(\"cqg.rtd\", ,\"ContractData\",O70, \"PerCentNetLastTrade\",, \"T\")/100","v":-6.1067595010153748E-3},{"$f":"VLOOKUP(O70,$A$2:$H171,8,FALSE)","v":1.0059999999999993}]
["S.US.NTES ",{"$f":"IFERROR(RTD(\"cqg.rtd\",,\"StudyData\",A71,\"Bar\",, \"High\",$C$1,\"0\",,,,,\"T\"),\"\")","v":91.84},{"$f":"IFERROR(RTD(\"cqg.rtd\",,\"StudyData\",A71,\"Bar\",, \"Low\",$C$1,\"0\",,,,,\"T\"),\"\")","v":91.75},{"$f":"IFERROR(RTD(\"cqg.rtd\",,\"StudyData\",\"HiLevel(\"&A71&\",Period1:=\"&$B$1&\",AllowGaps:=0,InputChoice1:=High,InputChoice3:=High)\",\"Bar\",, \"Close\",$C$1,\"-1\",,,,,\"T\"),\"\")","v":92.74},{"$f":"IFERROR(RTD(\"cqg.rtd\",,\"StudyData\",\"LoLevel(\"&A71&\",Period2:=\"&$B$1&\",AllowGaps:=0,InputChoice2:=Low,InputChoice4:=Low)\",\"Bar\",, \"Close\",$C$1,\"-1\",,,,,\"T\"),\"\")","v":91.6},0,0,8.0139999999999922,2.026999999999997,"S.US.NTES ",{"$f":"RTD(\"cqg.rtd\", ,\"ContractData\",A71, \"PerCentNetLastTrade\",, \"T\")/100","v":-1.2482513720004305E-2},{"$f":"RANK($K71,$K$2:K$103)+COUNTIF($K$2:K71,K71)-1","v":89},"S.US.NTES ",70,"S.US.NVDA ",{"$f":"RTD(\"cqg.rtd\", ,\"ContractData\",O71, \"PerCentNetLastTrade\",, \"T\")/100","v":-6.2255058223480656E-3},{"$f":"VLOOKUP(O71,$A$2:$H172,8,FALSE)","v":8.0149999999999917}]
["S.US.NVDA ",{"$f":"IFERROR(RTD(\"cqg.rtd\",,\"StudyData\",A72,\"Bar\",, \"High\",$C$1,\"0\",,,,,\"T\"),\"\")","v":530.24},{"$f":"IFERROR(RTD(\"cqg.rtd\",,\"StudyData\",A72,\"Bar\",, \"Low\",$C$1,\"0\",,,,,\"T\"),\"\")","v":529.53},{"$f":"IFERROR(RTD(\"cqg.rtd\",,\"StudyData\",\"HiLevel(\"&A72&\",Period1:=\"&$B$1&\",AllowGaps:=0,InputChoice1:=High,InputChoice3:=High)\",\"Bar\",, \"Close\",$C$1,\"-1\",,,,,\"T\"),\"\")","v":531.85},{"$f":"IFERROR(RTD(\"cqg.rtd\",,\"StudyData\",\"LoLevel(\"&A72&\",Period2:=\"&$B$1&\",AllowGaps:=0,InputChoice2:=Low,InputChoice4:=Low)\",\"Bar\",, \"Close\",$C$1,\"-1\",,,,,\"T\"),\"\")","v":527.21},0,0,8.0149999999999917,2.0279999999999969,"S.US.NVDA ",{"$f":"RTD(\"cqg.rtd\", ,\"ContractData\",A72, \"PerCentNetLastTrade\",, \"T\")/100","v":-6.2255058223480656E-3},{"$f":"RANK($K72,$K$2:K$103)+COUNTIF($K$2:K72,K72)-1","v":70},"S.US.NVDA ",71,"S.US.SBUX ",{"$f":"RTD(\"cqg.rtd\", ,\"ContractData\",O72, \"PerCentNetLastTrade\",, \"T\")/100","v":-6.3143578783757528E-3},{"$f":"VLOOKUP(O72,$A$2:$H173,8,FALSE)","v":10.000999999999999}]
["S.US.NXPI ",{"$f":"IFERROR(RTD(\"cqg.rtd\",,\"StudyData\",A73,\"Bar\",, \"High\",$C$1,\"0\",,,,,\"T\"),\"\")","v":158.38},{"$f":"IFERROR(RTD(\"cqg.rtd\",,\"StudyData\",A73,\"Bar\",, \"Low\",$C$1,\"0\",,,,,\"T\"),\"\")","v":157.9},{"$f":"IFERROR(RTD(\"cqg.rtd\",,\"StudyData\",\"HiLevel(\"&A73&\",Period1:=\"&$B$1&\",AllowGaps:=0,InputChoice1:=High,InputChoice3:=High)\",\"Bar\",, \"Close\",$C$1,\"-1\",,,,,\"T\"),\"\")","v":159.6},{"$f":"IFERROR(RTD(\"cqg.rtd\",,\"StudyData\",\"LoLevel(\"&A73&\",Period2:=\"&$B$1&\",AllowGaps:=0,InputChoice2:=Low,InputChoice4:=Low)\",\"Bar\",, \"Close\",$C$1,\"-1\",,,,,\"T\"),\"\")","v":156.12},0,0,8.0159999999999911,2.0289999999999968,"S.US.NXPI ",{"$f":"RTD(\"cqg.rtd\", ,\"ContractData\",A73, \"PerCentNetLastTrade\",, \"T\")/100","v":5.8587531045023247E-3},{"$f":"RANK($K73,$K$2:K$103)+COUNTIF($K$2:K73,K73)-1","v":30},"S.US.NXPI ",72,"S.US.MAR ",{"$f":"RTD(\"cqg.rtd\", ,\"ContractData\",O73, \"PerCentNetLastTrade\",, \"T\")/100","v":-6.3619227144203587E-3},{"$f":"VLOOKUP(O73,$A$2:$H174,8,FALSE)","v":8.0019999999999989}]
["S.US.OKTA ",{"$f":"IFERROR(RTD(\"cqg.rtd\",,\"StudyData\",A74,\"Bar\",, \"High\",$C$1,\"0\",,,,,\"T\"),\"\")","v":284.16000000000003},{"$f":"IFERROR(RTD(\"cqg.rtd\",,\"StudyData\",A74,\"Bar\",, \"Low\",$C$1,\"0\",,,,,\"T\"),\"\")","v":282.85000000000002},{"$f":"IFERROR(RTD(\"cqg.rtd\",,\"StudyData\",\"HiLevel(\"&A74&\",Period1:=\"&$B$1&\",AllowGaps:=0,InputChoice1:=High,InputChoice3:=High)\",\"Bar\",, \"Close\",$C$1,\"-1\",,,,,\"T\"),\"\")","v":283.23},{"$f":"IFERROR(RTD(\"cqg.rtd\",,\"StudyData\",\"LoLevel(\"&A74&\",Period2:=\"&$B$1&\",AllowGaps:=0,InputChoice2:=Low,InputChoice4:=Low)\",\"Bar\",, \"Close\",$C$1,\"-1\",,,,,\"T\"),\"\")","v":277.7},1,0,9,2.0299999999999967,"S.US.OKTA ",{"$f":"RTD(\"cqg.rtd\", ,\"ContractData\",A74, \"PerCentNetLastTrade\",, \"T\")/100","v":3.0195252957828263E-2},{"$f":"RANK($K74,$K$2:K$103)+COUNTIF($K$2:K74,K74)-1","v":5},"S.US.OKTA ",73,"S.US.LRCX ",{"$f":"RTD(\"cqg.rtd\", ,\"ContractData\",O74, \"PerCentNetLastTrade\",, \"T\")/100","v":-6.4565527802495706E-3},{"$f":"VLOOKUP(O74,$A$2:$H175,8,FALSE)","v":8}]
["S.US.ORLY ",{"$f":"IFERROR(RTD(\"cqg.rtd\",,\"StudyData\",A75,\"Bar\",, \"High\",$C$1,\"0\",,,,,\"T\"),\"\")","v":449.85},{"$f":"IFERROR(RTD(\"cqg.rtd\",,\"StudyData\",A75,\"Bar\",, \"Low\",$C$1,\"0\",,,,,\"T\"),\"\")","v":449.62},{"$f":"IFERROR(RTD(\"cqg.rtd\",,\"StudyData\",\"HiLevel(\"&A75&\",Period1:=\"&$B$1&\",AllowGaps:=0,InputChoice1:=High,InputChoice3:=High)\",\"Bar\",, \"Close\",$C$1,\"-1\",,,,,\"T\"),\"\")","v":452.8},{"$f":"IFERROR(RTD(\"cqg.rtd\",,\"StudyData\",\"LoLevel(\"&A75&\",Period2:=\"&$B$1&\",AllowGaps:=0,InputChoice2:=Low,InputChoice4:=Low)\",\"Bar\",, \"Close\",$C$1,\"-1\",,,,,\"T\"),\"\")","v":449.63},0,1,9.0009999999999994,3,"S.US.ORLY ",{"$f":"RTD(\"cqg.rtd\", ,\"ContractData\",A75, \"PerCentNetLastTrade\",, \"T\")/100","v":-6.054044499436576E-3},{"$f":"RANK($K75,$K$2:K$103)+COUNTIF($K$2:K75,K75)-1","v":68},"S.US.ORLY ",74,"S.US.NFLX ",{"$f":"RTD(\"cqg.rtd\", ,\"ContractData\",O75, \"PerCentNetLastTrade\",, \"T\")/100","v":-6.5984761112476593E-3},{"$f":"VLOOKUP(O75,$A$2:$H176,8,FALSE)","v":8.0129999999999928}]
["S.US.PAYX ",{"$f":"IFERROR(RTD(\"cqg.rtd\",,\"StudyData\",A76,\"Bar\",, \"High\",$C$1,\"0\",,,,,\"T\"),\"\")","v":96.82},{"$f":"IFERROR(RTD(\"cqg.rtd\",,\"StudyData\",A76,\"Bar\",, \"Low\",$C$1,\"0\",,,,,\"T\"),\"\")","v":96.7},{"$f":"IFERROR(RTD(\"cqg.rtd\",,\"StudyData\",\"HiLevel(\"&A76&\",Period1:=\"&$B$1&\",AllowGaps:=0,InputChoice1:=High,InputChoice3:=High)\",\"Bar\",, \"Close\",$C$1,\"-1\",,,,,\"T\"),\"\")","v":96.99},{"$f":"IFERROR(RTD(\"cqg.rtd\",,\"StudyData\",\"LoLevel(\"&A76&\",Period2:=\"&$B$1&\",AllowGaps:=0,InputChoice2:=Low,InputChoice4:=Low)\",\"Bar\",, \"Close\",$C$1,\"-1\",,,,,\"T\"),\"\")","v":96.51},0,0,9.0019999999999989,3.0009999999999999,"S.US.PAYX ",{"$f":"RTD(\"cqg.rtd\", ,\"ContractData\",A76, \"PerCentNetLastTrade\",, \"T\")/100","v":2.3811988818718292E-3},{"$f":"RANK($K76,$K$2:K$103)+COUNTIF($K$2:K76,K76)-1","v":37},"S.US.PAYX ",75,"S.US.INTC ",{"$f":"RTD(\"cqg.rtd\", ,\"ContractData\",O76, \"PerCentNetLastTrade\",, \"T\")/100","v":-6.686798964624676E-3},{"$f":"VLOOKUP(O76,$A$2:$H177,8,FALSE)","v":7.003000000000001}]
["S.US.PCAR ",{"$f":"IFERROR(RTD(\"cqg.rtd\",,\"StudyData\",A77,\"Bar\",, \"High\",$C$1,\"0\",,,,,\"T\"),\"\")","v":85.4},{"$f":"IFERROR(RTD(\"cqg.rtd\",,\"StudyData\",A77,\"Bar\",, \"Low\",$C$1,\"0\",,,,,\"T\"),\"\")","v":85.23},{"$f":"IFERROR(RTD(\"cqg.rtd\",,\"StudyData\",\"HiLevel(\"&A77&\",Period1:=\"&$B$1&\",AllowGaps:=0,InputChoice1:=High,InputChoice3:=High)\",\"Bar\",, \"Close\",$C$1,\"-1\",,,,,\"T\"),\"\")","v":85.44},{"$f":"IFERROR(RTD(\"cqg.rtd\",,\"StudyData\",\"LoLevel(\"&A77&\",Period2:=\"&$B$1&\",AllowGaps:=0,InputChoice2:=Low,InputChoice4:=Low)\",\"Bar\",, \"Close\",$C$1,\"-1\",,,,,\"T\"),\"\")","v":84.8},0,0,9.0029999999999983,3.0019999999999998,"S.US.PCAR ",{"$f":"RTD(\"cqg.rtd\", ,\"ContractData\",A77, \"PerCentNetLastTrade\",, \"T\")/100","v":-5.2417006406523005E-3},{"$f":"RANK($K77,$K$2:K$103)+COUNTIF($K$2:K77,K77)-1","v":63},"S.US.PCAR ",76,"S.US.MDLZ ",{"$f":"RTD(\"cqg.rtd\", ,\"ContractData\",O77, \"PerCentNetLastTrade\",, \"T\")/100","v":-6.761442441054092E-3},{"$f":"VLOOKUP(O77,$A$2:$H178,8,FALSE)","v":8.0039999999999978}]
["S.US.PDD ",{"$f":"IFERROR(RTD(\"cqg.rtd\",,\"StudyData\",A78,\"Bar\",, \"High\",$C$1,\"0\",,,,,\"T\"),\"\")","v":144.21},{"$f":"IFERROR(RTD(\"cqg.rtd\",,\"StudyData\",A78,\"Bar\",, \"Low\",$C$1,\"0\",,,,,\"T\"),\"\")","v":143.44999999999999},{"$f":"IFERROR(RTD(\"cqg.rtd\",,\"StudyData\",\"HiLevel(\"&A78&\",Period1:=\"&$B$1&\",AllowGaps:=0,InputChoice1:=High,InputChoice3:=High)\",\"Bar\",, \"Close\",$C$1,\"-1\",,,,,\"T\"),\"\")","v":145.49},{"$f":"IFERROR(RTD(\"cqg.rtd\",,\"StudyData\",\"LoLevel(\"&A78&\",Period2:=\"&$B$1&\",AllowGaps:=0,InputChoice2:=Low,InputChoice4:=Low)\",\"Bar\",, \"Close\",$C$1,\"-1\",,,,,\"T\"),\"\")","v":143.5},0,1,9.0039999999999978,4,"S.US.PDD ",{"$f":"RTD(\"cqg.rtd\", ,\"ContractData\",A78, \"PerCentNetLastTrade\",, \"T\")/100","v":-2.3149724245931775E-2},{"$f":"RANK($K78,$K$2:K$103)+COUNTIF($K$2:K78,K78)-1","v":99},"S.US.PDD ",77,"S.US.FOXA ",{"$f":"RTD(\"cqg.rtd\", ,\"ContractData\",O78, \"PerCentNetLastTrade\",, \"T\")/100","v":-6.854256854256854E-3},{"$f":"VLOOKUP(O78,$A$2:$H179,8,FALSE)","v":5.0050000000000017}]
["S.US.PEP ",{"$f":"IFERROR(RTD(\"cqg.rtd\",,\"StudyData\",A79,\"Bar\",, \"High\",$C$1,\"0\",,,,,\"T\"),\"\")","v":144.16},{"$f":"IFERROR(RTD(\"cqg.rtd\",,\"StudyData\",A79,\"Bar\",, \"Low\",$C$1,\"0\",,,,,\"T\"),\"\")","v":144.06},{"$f":"IFERROR(RTD(\"cqg.rtd\",,\"StudyData\",\"HiLevel(\"&A79&\",Period1:=\"&$B$1&\",AllowGaps:=0,InputChoice1:=High,InputChoice3:=High)\",\"Bar\",, \"Close\",$C$1,\"-1\",,,,,\"T\"),\"\")","v":144.77000000000001},{"$f":"IFERROR(RTD(\"cqg.rtd\",,\"StudyData\",\"LoLevel(\"&A79&\",Period2:=\"&$B$1&\",AllowGaps:=0,InputChoice2:=Low,InputChoice4:=Low)\",\"Bar\",, \"Close\",$C$1,\"-1\",,,,,\"T\"),\"\")","v":143.77000000000001},0,0,9.0049999999999972,4.0010000000000003,"S.US.PEP ",{"$f":"RTD(\"cqg.rtd\", ,\"ContractData\",A79, \"PerCentNetLastTrade\",, \"T\")/100","v":-8.665749656121045E-3},{"$f":"RANK($K79,$K$2:K$103)+COUNTIF($K$2:K79,K79)-1","v":83},"S.US.PEP ",78,"S.US.XEL ",{"$f":"RTD(\"cqg.rtd\", ,\"ContractData\",O79, \"PerCentNetLastTrade\",, \"T\")/100","v":-6.8817862058418722E-3},{"$f":"VLOOKUP(O79,$A$2:$H180,8,FALSE)","v":12.003999999999998}]
["S.US.PTON ",{"$f":"IFERROR(RTD(\"cqg.rtd\",,\"StudyData\",A80,\"Bar\",, \"High\",$C$1,\"0\",,,,,\"T\"),\"\")","v":164.37},{"$f":"IFERROR(RTD(\"cqg.rtd\",,\"StudyData\",A80,\"Bar\",, \"Low\",$C$1,\"0\",,,,,\"T\"),\"\")","v":163.5},{"$f":"IFERROR(RTD(\"cqg.rtd\",,\"StudyData\",\"HiLevel(\"&A80&\",Period1:=\"&$B$1&\",AllowGaps:=0,InputChoice1:=High,InputChoice3:=High)\",\"Bar\",, \"Close\",$C$1,\"-1\",,,,,\"T\"),\"\")","v":166.23},{"$f":"IFERROR(RTD(\"cqg.rtd\",,\"StudyData\",\"LoLevel(\"&A80&\",Period2:=\"&$B$1&\",AllowGaps:=0,InputChoice2:=Low,InputChoice4:=Low)\",\"Bar\",, \"Close\",$C$1,\"-1\",,,,,\"T\"),\"\")","v":161.19999999999999},0,0,9.0059999999999967,4.0020000000000007,"S.US.PTON ",{"$f":"RTD(\"cqg.rtd\", ,\"ContractData\",A80, \"PerCentNetLastTrade\",, \"T\")/100","v":0.13366576632730798},{"$f":"RANK($K80,$K$2:K$103)+COUNTIF($K$2:K80,K80)-1","v":1},"S.US.PTON ",79,"S.US.COST ",{"$f":"RTD(\"cqg.rtd\", ,\"ContractData\",O80, \"PerCentNetLastTrade\",, \"T\")/100","v":-6.9320766090363592E-3},{"$f":"VLOOKUP(O80,$A$2:$H181,8,FALSE)","v":2.0039999999999996}]
["S.US.PYPL ",{"$f":"IFERROR(RTD(\"cqg.rtd\",,\"StudyData\",A81,\"Bar\",, \"High\",$C$1,\"0\",,,,,\"T\"),\"\")","v":241.79},{"$f":"IFERROR(RTD(\"cqg.rtd\",,\"StudyData\",A81,\"Bar\",, \"Low\",$C$1,\"0\",,,,,\"T\"),\"\")","v":241.42},{"$f":"IFERROR(RTD(\"cqg.rtd\",,\"StudyData\",\"HiLevel(\"&A81&\",Period1:=\"&$B$1&\",AllowGaps:=0,InputChoice1:=High,InputChoice3:=High)\",\"Bar\",, \"Close\",$C$1,\"-1\",,,,,\"T\"),\"\")","v":242.08},{"$f":"IFERROR(RTD(\"cqg.rtd\",,\"StudyData\",\"LoLevel(\"&A81&\",Period2:=\"&$B$1&\",AllowGaps:=0,InputChoice2:=Low,InputChoice4:=Low)\",\"Bar\",, \"Close\",$C$1,\"-1\",,,,,\"T\"),\"\")","v":238.69},0,0,9.0069999999999961,4.003000000000001,"S.US.PYPL ",{"$f":"RTD(\"cqg.rtd\", ,\"ContractData\",A81, \"PerCentNetLastTrade\",, \"T\")/100","v":1.7078916372202591E-2},{"$f":"RANK($K81,$K$2:K$103)+COUNTIF($K$2:K81,K81)-1","v":9},"S.US.PYPL ",80,"S.US.BIDU ",{"$f":"RTD(\"cqg.rtd\", ,\"ContractData\",O81, \"PerCentNetLastTrade\",, \"T\")/100","v":-7.4580484773151025E-3},{"$f":"VLOOKUP(O81,$A$2:$H182,8,FALSE)","v":1.0039999999999996}]
["S.US.QCOM ",{"$f":"IFERROR(RTD(\"cqg.rtd\",,\"StudyData\",A82,\"Bar\",, \"High\",$C$1,\"0\",,,,,\"T\"),\"\")","v":146.07},{"$f":"IFERROR(RTD(\"cqg.rtd\",,\"StudyData\",A82,\"Bar\",, \"Low\",$C$1,\"0\",,,,,\"T\"),\"\")","v":145.91999999999999},{"$f":"IFERROR(RTD(\"cqg.rtd\",,\"StudyData\",\"HiLevel(\"&A82&\",Period1:=\"&$B$1&\",AllowGaps:=0,InputChoice1:=High,InputChoice3:=High)\",\"Bar\",, \"Close\",$C$1,\"-1\",,,,,\"T\"),\"\")","v":146.6},{"$f":"IFERROR(RTD(\"cqg.rtd\",,\"StudyData\",\"LoLevel(\"&A82&\",Period2:=\"&$B$1&\",AllowGaps:=0,InputChoice2:=Low,InputChoice4:=Low)\",\"Bar\",, \"Close\",$C$1,\"-1\",,,,,\"T\"),\"\")","v":145.63999999999999},0,0,9.0079999999999956,4.0040000000000013,"S.US.QCOM ",{"$f":"RTD(\"cqg.rtd\", ,\"ContractData\",A82, \"PerCentNetLastTrade\",, \"T\")/100","v":-5.9945504087193461E-3},{"$f":"RANK($K82,$K$2:K$103)+COUNTIF($K$2:K82,K82)-1","v":67},"S.US.QCOM ",81,"S.US.ADP ",{"$f":"RTD(\"cqg.rtd\", ,\"ContractData\",O82, \"PerCentNetLastTrade\",, \"T\")/100","v":-7.831427122654798E-3},{"$f":"VLOOKUP(O82,$A$2:$H183,8,FALSE)","v":4.0000000000000001E-3}]
["S.US.REGN ",{"$f":"IFERROR(RTD(\"cqg.rtd\",,\"StudyData\",A83,\"Bar\",, \"High\",$C$1,\"0\",,,,,\"T\"),\"\")","v":493},{"$f":"IFERROR(RTD(\"cqg.rtd\",,\"StudyData\",A83,\"Bar\",, \"Low\",$C$1,\"0\",,,,,\"T\"),\"\")","v":491.63},{"$f":"IFERROR(RTD(\"cqg.rtd\",,\"StudyData\",\"HiLevel(\"&A83&\",Period1:=\"&$B$1&\",AllowGaps:=0,InputChoice1:=High,InputChoice3:=High)\",\"Bar\",, \"Close\",$C$1,\"-1\",,,,,\"T\"),\"\")","v":494.93},{"$f":"IFERROR(RTD(\"cqg.rtd\",,\"StudyData\",\"LoLevel(\"&A83&\",Period2:=\"&$B$1&\",AllowGaps:=0,InputChoice2:=Low,InputChoice4:=Low)\",\"Bar\",, \"Close\",$C$1,\"-1\",,,,,\"T\"),\"\")","v":488.5},0,0,9.008999999999995,4.0050000000000017,"S.US.REGN ",{"$f":"RTD(\"cqg.rtd\", ,\"ContractData\",A83, \"PerCentNetLastTrade\",, \"T\")/100","v":-1.0266940451745379E-2},{"$f":"RANK($K83,$K$2:K$103)+COUNTIF($K$2:K83,K83)-1","v":86},"S.US.REGN ",82,"S.US.AMD ",{"$f":"RTD(\"cqg.rtd\", ,\"ContractData\",O83, \"PerCentNetLastTrade\",, \"T\")/100","v":-8.5809288855518608E-3},{"$f":"VLOOKUP(O83,$A$2:$H184,8,FALSE)","v":1.0000000000000002E-2}]
["S.US.ROST ",{"$f":"IFERROR(RTD(\"cqg.rtd\",,\"StudyData\",A84,\"Bar\",, \"High\",$C$1,\"0\",,,,,\"T\"),\"\")","v":117.08},{"$f":"IFERROR(RTD(\"cqg.rtd\",,\"StudyData\",A84,\"Bar\",, \"Low\",$C$1,\"0\",,,,,\"T\"),\"\")","v":116.83},{"$f":"IFERROR(RTD(\"cqg.rtd\",,\"StudyData\",\"HiLevel(\"&A84&\",Period1:=\"&$B$1&\",AllowGaps:=0,InputChoice1:=High,InputChoice3:=High)\",\"Bar\",, \"Close\",$C$1,\"-1\",,,,,\"T\"),\"\")","v":117},{"$f":"IFERROR(RTD(\"cqg.rtd\",,\"StudyData\",\"LoLevel(\"&A84&\",Period2:=\"&$B$1&\",AllowGaps:=0,InputChoice2:=Low,InputChoice4:=Low)\",\"Bar\",, \"Close\",$C$1,\"-1\",,,,,\"T\"),\"\")","v":115.52},1,0,10,4.006000000000002,"S.US.ROST ",{"$f":"RTD(\"cqg.rtd\", ,\"ContractData\",A84, \"PerCentNetLastTrade\",, \"T\")/100","v":1.6268516140080485E-3},{"$f":"RANK($K84,$K$2:K$103)+COUNTIF($K$2:K84,K84)-1","v":41},"S.US.ROST ",83,"S.US.PEP ",{"$f":"RTD(\"cqg.rtd\", ,\"ContractData\",O84, \"PerCentNetLastTrade\",, \"T\")/100","v":-8.665749656121045E-3},{"$f":"VLOOKUP(O84,$A$2:$H185,8,FALSE)","v":9.0049999999999972}]
["S.US.SBUX ",{"$f":"IFERROR(RTD(\"cqg.rtd\",,\"StudyData\",A85,\"Bar\",, \"High\",$C$1,\"0\",,,,,\"T\"),\"\")","v":102.32},{"$f":"IFERROR(RTD(\"cqg.rtd\",,\"StudyData\",A85,\"Bar\",, \"Low\",$C$1,\"0\",,,,,\"T\"),\"\")","v":102.23},{"$f":"IFERROR(RTD(\"cqg.rtd\",,\"StudyData\",\"HiLevel(\"&A85&\",Period1:=\"&$B$1&\",AllowGaps:=0,InputChoice1:=High,InputChoice3:=High)\",\"Bar\",, \"Close\",$C$1,\"-1\",,,,,\"T\"),\"\")","v":102.4},{"$f":"IFERROR(RTD(\"cqg.rtd\",,\"StudyData\",\"LoLevel(\"&A85&\",Period2:=\"&$B$1&\",AllowGaps:=0,InputChoice2:=Low,InputChoice4:=Low)\",\"Bar\",, \"Close\",$C$1,\"-1\",,,,,\"T\"),\"\")","v":101.89},0,0,10.000999999999999,4.0070000000000023,"S.US.SBUX ",{"$f":"RTD(\"cqg.rtd\", ,\"ContractData\",A85, \"PerCentNetLastTrade\",, \"T\")/100","v":-6.3143578783757528E-3},{"$f":"RANK($K85,$K$2:K$103)+COUNTIF($K$2:K85,K85)-1","v":71},"S.US.SBUX ",84,"S.US.MU ",{"$f":"RTD(\"cqg.rtd\", ,\"ContractData\",O85, \"PerCentNetLastTrade\",, \"T\")/100","v":-9.0947250594655103E-3},{"$f":"VLOOKUP(O85,$A$2:$H186,8,FALSE)","v":8.0109999999999939}]
["S.US.SGEN ",{"$f":"IFERROR(RTD(\"cqg.rtd\",,\"StudyData\",A86,\"Bar\",, \"High\",$C$1,\"0\",,,,,\"T\"),\"\")","v":196.99},{"$f":"IFERROR(RTD(\"cqg.rtd\",,\"StudyData\",A86,\"Bar\",, \"Low\",$C$1,\"0\",,,,,\"T\"),\"\")","v":196.62},{"$f":"IFERROR(RTD(\"cqg.rtd\",,\"StudyData\",\"HiLevel(\"&A86&\",Period1:=\"&$B$1&\",AllowGaps:=0,InputChoice1:=High,InputChoice3:=High)\",\"Bar\",, \"Close\",$C$1,\"-1\",,,,,\"T\"),\"\")","v":198.25},{"$f":"IFERROR(RTD(\"cqg.rtd\",,\"StudyData\",\"LoLevel(\"&A86&\",Period2:=\"&$B$1&\",AllowGaps:=0,InputChoice2:=Low,InputChoice4:=Low)\",\"Bar\",, \"Close\",$C$1,\"-1\",,,,,\"T\"),\"\")","v":196.12},0,0,10.001999999999999,4.0080000000000027,"S.US.SGEN ",{"$f":"RTD(\"cqg.rtd\", ,\"ContractData\",A86, \"PerCentNetLastTrade\",, \"T\")/100","v":-5.1051354630004039E-3},{"$f":"RANK($K86,$K$2:K$103)+COUNTIF($K$2:K86,K86)-1","v":62},"S.US.SGEN ",85,"S.US.ALXN ",{"$f":"RTD(\"cqg.rtd\", ,\"ContractData\",O86, \"PerCentNetLastTrade\",, \"T\")/100","v":-9.1067622553768646E-3},{"$f":"VLOOKUP(O86,$A$2:$H187,8,FALSE)","v":8.0000000000000002E-3}]
["S.US.SIRI ",{"$f":"IFERROR(RTD(\"cqg.rtd\",,\"StudyData\",A87,\"Bar\",, \"High\",$C$1,\"0\",,,,,\"T\"),\"\")","v":6.29},{"$f":"IFERROR(RTD(\"cqg.rtd\",,\"StudyData\",A87,\"Bar\",, \"Low\",$C$1,\"0\",,,,,\"T\"),\"\")","v":6.28},{"$f":"IFERROR(RTD(\"cqg.rtd\",,\"StudyData\",\"HiLevel(\"&A87&\",Period1:=\"&$B$1&\",AllowGaps:=0,InputChoice1:=High,InputChoice3:=High)\",\"Bar\",, \"Close\",$C$1,\"-1\",,,,,\"T\"),\"\")","v":6.31},{"$f":"IFERROR(RTD(\"cqg.rtd\",,\"StudyData\",\"LoLevel(\"&A87&\",Period2:=\"&$B$1&\",AllowGaps:=0,InputChoice2:=Low,InputChoice4:=Low)\",\"Bar\",, \"Close\",$C$1,\"-1\",,,,,\"T\"),\"\")","v":6.25},0,0,10.002999999999998,4.009000000000003,"S.US.SIRI ",{"$f":"RTD(\"cqg.rtd\", ,\"ContractData\",A87, \"PerCentNetLastTrade\",, \"T\")/100","v":-4.7543581616481777E-3},{"$f":"RANK($K87,$K$2:K$103)+COUNTIF($K$2:K87,K87)-1","v":60},"S.US.SIRI ",86,"S.US.REGN ",{"$f":"RTD(\"cqg.rtd\", ,\"ContractData\",O87, \"PerCentNetLastTrade\",, \"T\")/100","v":-1.0266940451745379E-2},{"$f":"VLOOKUP(O87,$A$2:$H188,8,FALSE)","v":9.008999999999995}]
["S.US.SNPS ",{"$f":"IFERROR(RTD(\"cqg.rtd\",,\"StudyData\",A88,\"Bar\",, \"High\",$C$1,\"0\",,,,,\"T\"),\"\")","v":258.16000000000003},{"$f":"IFERROR(RTD(\"cqg.rtd\",,\"StudyData\",A88,\"Bar\",, \"Low\",$C$1,\"0\",,,,,\"T\"),\"\")","v":257.87},{"$f":"IFERROR(RTD(\"cqg.rtd\",,\"StudyData\",\"HiLevel(\"&A88&\",Period1:=\"&$B$1&\",AllowGaps:=0,InputChoice1:=High,InputChoice3:=High)\",\"Bar\",, \"Close\",$C$1,\"-1\",,,,,\"T\"),\"\")","v":258.48},{"$f":"IFERROR(RTD(\"cqg.rtd\",,\"StudyData\",\"LoLevel(\"&A88&\",Period2:=\"&$B$1&\",AllowGaps:=0,InputChoice2:=Low,InputChoice4:=Low)\",\"Bar\",, \"Close\",$C$1,\"-1\",,,,,\"T\"),\"\")","v":256},0,0,10.003999999999998,4.0100000000000033,"S.US.SNPS ",{"$f":"RTD(\"cqg.rtd\", ,\"ContractData\",A88, \"PerCentNetLastTrade\",, \"T\")/100","v":1.5103838892385148E-2},{"$f":"RANK($K88,$K$2:K$103)+COUNTIF($K$2:K88,K88)-1","v":13},"S.US.SNPS ",87,"S.US.FB ",{"$f":"RTD(\"cqg.rtd\", ,\"ContractData\",O88, \"PerCentNetLastTrade\",, \"T\")/100","v":-1.1913926463580042E-2},{"$f":"VLOOKUP(O88,$A$2:$H189,8,FALSE)","v":5.0020000000000007}]
["S.US.SPLK ",{"$f":"IFERROR(RTD(\"cqg.rtd\",,\"StudyData\",A89,\"Bar\",, \"High\",$C$1,\"0\",,,,,\"T\"),\"\")","v":176.55},{"$f":"IFERROR(RTD(\"cqg.rtd\",,\"StudyData\",A89,\"Bar\",, \"Low\",$C$1,\"0\",,,,,\"T\"),\"\")","v":176.28},{"$f":"IFERROR(RTD(\"cqg.rtd\",,\"StudyData\",\"HiLevel(\"&A89&\",Period1:=\"&$B$1&\",AllowGaps:=0,InputChoice1:=High,InputChoice3:=High)\",\"Bar\",, \"Close\",$C$1,\"-1\",,,,,\"T\"),\"\")","v":176.5},{"$f":"IFERROR(RTD(\"cqg.rtd\",,\"StudyData\",\"LoLevel(\"&A89&\",Period2:=\"&$B$1&\",AllowGaps:=0,InputChoice2:=Low,InputChoice4:=Low)\",\"Bar\",, \"Close\",$C$1,\"-1\",,,,,\"T\"),\"\")","v":173.83},1,0,11,4.0110000000000037,"S.US.SPLK ",{"$f":"RTD(\"cqg.rtd\", ,\"ContractData\",A89, \"PerCentNetLastTrade\",, \"T\")/100","v":1.2043356081894821E-2},{"$f":"RANK($K89,$K$2:K$103)+COUNTIF($K$2:K89,K89)-1","v":15},"S.US.SPLK ",88,"S.US.BIIB ",{"$f":"RTD(\"cqg.rtd\", ,\"ContractData\",O89, \"PerCentNetLastTrade\",, \"T\")/100","v":-1.2201997422680412E-2},{"$f":"VLOOKUP(O89,$A$2:$H190,8,FALSE)","v":1.0049999999999994}]
["S.US.SWKS ",{"$f":"IFERROR(RTD(\"cqg.rtd\",,\"StudyData\",A90,\"Bar\",, \"High\",$C$1,\"0\",,,,,\"T\"),\"\")","v":151.58000000000001},{"$f":"IFERROR(RTD(\"cqg.rtd\",,\"StudyData\",A90,\"Bar\",, \"Low\",$C$1,\"0\",,,,,\"T\"),\"\")","v":151.47},{"$f":"IFERROR(RTD(\"cqg.rtd\",,\"StudyData\",\"HiLevel(\"&A90&\",Period1:=\"&$B$1&\",AllowGaps:=0,InputChoice1:=High,InputChoice3:=High)\",\"Bar\",, \"Close\",$C$1,\"-1\",,,,,\"T\"),\"\")","v":151.6},{"$f":"IFERROR(RTD(\"cqg.rtd\",,\"StudyData\",\"LoLevel(\"&A90&\",Period2:=\"&$B$1&\",AllowGaps:=0,InputChoice2:=Low,InputChoice4:=Low)\",\"Bar\",, \"Close\",$C$1,\"-1\",,,,,\"T\"),\"\")","v":149.06},0,0,11.000999999999999,4.012000000000004,"S.US.SWKS ",{"$f":"RTD(\"cqg.rtd\", ,\"ContractData\",A90, \"PerCentNetLastTrade\",, \"T\")/100","v":2.5522984225847947E-2},{"$f":"RANK($K90,$K$2:K$103)+COUNTIF($K$2:K90,K90)-1","v":6},"S.US.SWKS ",89,"S.US.NTES ",{"$f":"RTD(\"cqg.rtd\", ,\"ContractData\",O90, \"PerCentNetLastTrade\",, \"T\")/100","v":-1.2482513720004305E-2},{"$f":"VLOOKUP(O90,$A$2:$H191,8,FALSE)","v":8.0139999999999922}]
["S.US.TCOM ",{"$f":"IFERROR(RTD(\"cqg.rtd\",,\"StudyData\",A91,\"Bar\",, \"High\",$C$1,\"0\",,,,,\"T\"),\"\")","v":33.07},{"$f":"IFERROR(RTD(\"cqg.rtd\",,\"StudyData\",A91,\"Bar\",, \"Low\",$C$1,\"0\",,,,,\"T\"),\"\")","v":33.04},{"$f":"IFERROR(RTD(\"cqg.rtd\",,\"StudyData\",\"HiLevel(\"&A91&\",Period1:=\"&$B$1&\",AllowGaps:=0,InputChoice1:=High,InputChoice3:=High)\",\"Bar\",, \"Close\",$C$1,\"-1\",,,,,\"T\"),\"\")","v":33.299999999999997},{"$f":"IFERROR(RTD(\"cqg.rtd\",,\"StudyData\",\"LoLevel(\"&A91&\",Period2:=\"&$B$1&\",AllowGaps:=0,InputChoice2:=Low,InputChoice4:=Low)\",\"Bar\",, \"Close\",$C$1,\"-1\",,,,,\"T\"),\"\")","v":32.97},0,0,11.001999999999999,4.0130000000000043,"S.US.TCOM ",{"$f":"RTD(\"cqg.rtd\", ,\"ContractData\",A91, \"PerCentNetLastTrade\",, \"T\")/100","v":-1.6666666666666666E-2},{"$f":"RANK($K91,$K$2:K$103)+COUNTIF($K$2:K91,K91)-1","v":95},"S.US.TCOM ",90,"S.US.XLNX ",{"$f":"RTD(\"cqg.rtd\", ,\"ContractData\",O91, \"PerCentNetLastTrade\",, \"T\")/100","v":-1.3147026431718061E-2},{"$f":"VLOOKUP(O91,$A$2:$H192,8,FALSE)","v":12.004999999999997}]
["S.US.TEAM ",{"$f":"IFERROR(RTD(\"cqg.rtd\",,\"StudyData\",A92,\"Bar\",, \"High\",$C$1,\"0\",,,,,\"T\"),\"\")","v":247.85},{"$f":"IFERROR(RTD(\"cqg.rtd\",,\"StudyData\",A92,\"Bar\",, \"Low\",$C$1,\"0\",,,,,\"T\"),\"\")","v":247.23},{"$f":"IFERROR(RTD(\"cqg.rtd\",,\"StudyData\",\"HiLevel(\"&A92&\",Period1:=\"&$B$1&\",AllowGaps:=0,InputChoice1:=High,InputChoice3:=High)\",\"Bar\",, \"Close\",$C$1,\"-1\",,,,,\"T\"),\"\")","v":249.87},{"$f":"IFERROR(RTD(\"cqg.rtd\",,\"StudyData\",\"LoLevel(\"&A92&\",Period2:=\"&$B$1&\",AllowGaps:=0,InputChoice2:=Low,InputChoice4:=Low)\",\"Bar\",, \"Close\",$C$1,\"-1\",,,,,\"T\"),\"\")","v":246.31},0,0,11.002999999999998,4.0140000000000047,"S.US.TEAM ",{"$f":"RTD(\"cqg.rtd\", ,\"ContractData\",A92, \"PerCentNetLastTrade\",, \"T\")/100","v":-2.1757524477215035E-3},{"$f":"RANK($K92,$K$2:K$103)+COUNTIF($K$2:K92,K92)-1","v":52},"S.US.TEAM ",91,"S.US.CTAS ",{"$f":"RTD(\"cqg.rtd\", ,\"ContractData\",O92, \"PerCentNetLastTrade\",, \"T\")/100","v":-1.3752058475139399E-2},{"$f":"VLOOKUP(O92,$A$2:$H193,8,FALSE)","v":4.0010000000000003}]
["S.US.TMUS ",{"$f":"IFERROR(RTD(\"cqg.rtd\",,\"StudyData\",A93,\"Bar\",, \"High\",$C$1,\"0\",,,,,\"T\"),\"\")","v":131.30000000000001},{"$f":"IFERROR(RTD(\"cqg.rtd\",,\"StudyData\",A93,\"Bar\",, \"Low\",$C$1,\"0\",,,,,\"T\"),\"\")","v":131.15},{"$f":"IFERROR(RTD(\"cqg.rtd\",,\"StudyData\",\"HiLevel(\"&A93&\",Period1:=\"&$B$1&\",AllowGaps:=0,InputChoice1:=High,InputChoice3:=High)\",\"Bar\",, \"Close\",$C$1,\"-1\",,,,,\"T\"),\"\")","v":131.88999999999999},{"$f":"IFERROR(RTD(\"cqg.rtd\",,\"StudyData\",\"LoLevel(\"&A93&\",Period2:=\"&$B$1&\",AllowGaps:=0,InputChoice2:=Low,InputChoice4:=Low)\",\"Bar\",, \"Close\",$C$1,\"-1\",,,,,\"T\"),\"\")","v":131.07},0,0,11.003999999999998,4.015000000000005,"S.US.TMUS ",{"$f":"RTD(\"cqg.rtd\", ,\"ContractData\",A93, \"PerCentNetLastTrade\",, \"T\")/100","v":7.3721394563047151E-3},{"$f":"RANK($K93,$K$2:K$103)+COUNTIF($K$2:K93,K93)-1","v":23},"S.US.TMUS ",92,"S.US.WBA ",{"$f":"RTD(\"cqg.rtd\", ,\"ContractData\",O93, \"PerCentNetLastTrade\",, \"T\")/100","v":-1.499877059257438E-2},{"$f":"VLOOKUP(O93,$A$2:$H194,8,FALSE)","v":12.001999999999999}]
["S.US.TSLA ",{"$f":"IFERROR(RTD(\"cqg.rtd\",,\"StudyData\",A94,\"Bar\",, \"High\",$C$1,\"0\",,,,,\"T\"),\"\")","v":637.01},{"$f":"IFERROR(RTD(\"cqg.rtd\",,\"StudyData\",A94,\"Bar\",, \"Low\",$C$1,\"0\",,,,,\"T\"),\"\")","v":635},{"$f":"IFERROR(RTD(\"cqg.rtd\",,\"StudyData\",\"HiLevel(\"&A94&\",Period1:=\"&$B$1&\",AllowGaps:=0,InputChoice1:=High,InputChoice3:=High)\",\"Bar\",, \"Close\",$C$1,\"-1\",,,,,\"T\"),\"\")","v":641.45000000000005},{"$f":"IFERROR(RTD(\"cqg.rtd\",,\"StudyData\",\"LoLevel(\"&A94&\",Period2:=\"&$B$1&\",AllowGaps:=0,InputChoice2:=Low,InputChoice4:=Low)\",\"Bar\",, \"Close\",$C$1,\"-1\",,,,,\"T\"),\"\")","v":632.02},0,0,11.004999999999997,4.0160000000000053,"S.US.TSLA ",{"$f":"RTD(\"cqg.rtd\", ,\"ContractData\",A94, \"PerCentNetLastTrade\",, \"T\")/100","v":-2.1866248114978611E-2},{"$f":"RANK($K94,$K$2:K$103)+COUNTIF($K$2:K94,K94)-1","v":98},"S.US.TSLA ",93,"S.US.FISV ",{"$f":"RTD(\"cqg.rtd\", ,\"ContractData\",O94, \"PerCentNetLastTrade\",, \"T\")/100","v":-1.5645835185349809E-2},{"$f":"VLOOKUP(O94,$A$2:$H195,8,FALSE)","v":5.003000000000001}]
["S.US.TXN ",{"$f":"IFERROR(RTD(\"cqg.rtd\",,\"StudyData\",A95,\"Bar\",, \"High\",$C$1,\"0\",,,,,\"T\"),\"\")","v":162.80000000000001},{"$f":"IFERROR(RTD(\"cqg.rtd\",,\"StudyData\",A95,\"Bar\",, \"Low\",$C$1,\"0\",,,,,\"T\"),\"\")","v":162.69},{"$f":"IFERROR(RTD(\"cqg.rtd\",,\"StudyData\",\"HiLevel(\"&A95&\",Period1:=\"&$B$1&\",AllowGaps:=0,InputChoice1:=High,InputChoice3:=High)\",\"Bar\",, \"Close\",$C$1,\"-1\",,,,,\"T\"),\"\")","v":163.46},{"$f":"IFERROR(RTD(\"cqg.rtd\",,\"StudyData\",\"LoLevel(\"&A95&\",Period2:=\"&$B$1&\",AllowGaps:=0,InputChoice2:=Low,InputChoice4:=Low)\",\"Bar\",, \"Close\",$C$1,\"-1\",,,,,\"T\"),\"\")","v":162.32},0,0,11.005999999999997,4.0170000000000057,"S.US.TXN ",{"$f":"RTD(\"cqg.rtd\", ,\"ContractData\",A95, \"PerCentNetLastTrade\",, \"T\")/100","v":1.9085144369882412E-3},{"$f":"RANK($K95,$K$2:K$103)+COUNTIF($K$2:K95,K95)-1","v":39},"S.US.TXN ",94,"S.US.ZM ",{"$f":"RTD(\"cqg.rtd\", ,\"ContractData\",O95, \"PerCentNetLastTrade\",, \"T\")/100","v":-1.6382619752060054E-2},{"$f":"VLOOKUP(O95,$A$2:$H196,8,FALSE)","v":12.005999999999997}]
["S.US.VRSK ",{"$f":"IFERROR(RTD(\"cqg.rtd\",,\"StudyData\",A96,\"Bar\",, \"High\",$C$1,\"0\",,,,,\"T\"),\"\")","v":202.16},{"$f":"IFERROR(RTD(\"cqg.rtd\",,\"StudyData\",A96,\"Bar\",, \"Low\",$C$1,\"0\",,,,,\"T\"),\"\")","v":201.92},{"$f":"IFERROR(RTD(\"cqg.rtd\",,\"StudyData\",\"HiLevel(\"&A96&\",Period1:=\"&$B$1&\",AllowGaps:=0,InputChoice1:=High,InputChoice3:=High)\",\"Bar\",, \"Close\",$C$1,\"-1\",,,,,\"T\"),\"\")","v":202.27},{"$f":"IFERROR(RTD(\"cqg.rtd\",,\"StudyData\",\"LoLevel(\"&A96&\",Period2:=\"&$B$1&\",AllowGaps:=0,InputChoice2:=Low,InputChoice4:=Low)\",\"Bar\",, \"Close\",$C$1,\"-1\",,,,,\"T\"),\"\")","v":200.81},0,0,11.006999999999996,4.018000000000006,"S.US.VRSK ",{"$f":"RTD(\"cqg.rtd\", ,\"ContractData\",A96, \"PerCentNetLastTrade\",, \"T\")/100","v":-3.4028702470779702E-3},{"$f":"RANK($K96,$K$2:K$103)+COUNTIF($K$2:K96,K96)-1","v":55},"S.US.VRSK ",95,"S.US.TCOM ",{"$f":"RTD(\"cqg.rtd\", ,\"ContractData\",O96, \"PerCentNetLastTrade\",, \"T\")/100","v":-1.6666666666666666E-2},{"$f":"VLOOKUP(O96,$A$2:$H197,8,FALSE)","v":11.001999999999999}]
["S.US.VRSN ",{"$f":"IFERROR(RTD(\"cqg.rtd\",,\"StudyData\",A97,\"Bar\",, \"High\",$C$1,\"0\",,,,,\"T\"),\"\")","v":216.38},{"$f":"IFERROR(RTD(\"cqg.rtd\",,\"StudyData\",A97,\"Bar\",, \"Low\",$C$1,\"0\",,,,,\"T\"),\"\")","v":216.12},{"$f":"IFERROR(RTD(\"cqg.rtd\",,\"StudyData\",\"HiLevel(\"&A97&\",Period1:=\"&$B$1&\",AllowGaps:=0,InputChoice1:=High,InputChoice3:=High)\",\"Bar\",, \"Close\",$C$1,\"-1\",,,,,\"T\"),\"\")","v":216.26},{"$f":"IFERROR(RTD(\"cqg.rtd\",,\"StudyData\",\"LoLevel(\"&A97&\",Period2:=\"&$B$1&\",AllowGaps:=0,InputChoice2:=Low,InputChoice4:=Low)\",\"Bar\",, \"Close\",$C$1,\"-1\",,,,,\"T\"),\"\")","v":213.84},1,0,12,4.0190000000000063,"S.US.VRSN ",{"$f":"RTD(\"cqg.rtd\", ,\"ContractData\",A97, \"PerCentNetLastTrade\",, \"T\")/100","v":6.4218902694401789E-3},{"$f":"RANK($K97,$K$2:K$103)+COUNTIF($K$2:K97,K97)-1","v":28},"S.US.VRSN ",96,"S.US.DLTR ",{"$f":"RTD(\"cqg.rtd\", ,\"ContractData\",O97, \"PerCentNetLastTrade\",, \"T\")/100","v":-1.918938307030129E-2},{"$f":"VLOOKUP(O97,$A$2:$H198,8,FALSE)","v":4.003000000000001}]
["S.US.VRTX ",{"$f":"IFERROR(RTD(\"cqg.rtd\",,\"StudyData\",A98,\"Bar\",, \"High\",$C$1,\"0\",,,,,\"T\"),\"\")","v":233.57},{"$f":"IFERROR(RTD(\"cqg.rtd\",,\"StudyData\",A98,\"Bar\",, \"Low\",$C$1,\"0\",,,,,\"T\"),\"\")","v":233.33},{"$f":"IFERROR(RTD(\"cqg.rtd\",,\"StudyData\",\"HiLevel(\"&A98&\",Period1:=\"&$B$1&\",AllowGaps:=0,InputChoice1:=High,InputChoice3:=High)\",\"Bar\",, \"Close\",$C$1,\"-1\",,,,,\"T\"),\"\")","v":234.99},{"$f":"IFERROR(RTD(\"cqg.rtd\",,\"StudyData\",\"LoLevel(\"&A98&\",Period2:=\"&$B$1&\",AllowGaps:=0,InputChoice2:=Low,InputChoice4:=Low)\",\"Bar\",, \"Close\",$C$1,\"-1\",,,,,\"T\"),\"\")","v":232.37},0,0,12.000999999999999,4.0200000000000067,"S.US.VRTX ",{"$f":"RTD(\"cqg.rtd\", ,\"ContractData\",A98, \"PerCentNetLastTrade\",, \"T\")/100","v":-4.6471967597527183E-3},{"$f":"RANK($K98,$K$2:K$103)+COUNTIF($K$2:K98,K98)-1","v":59},"S.US.VRTX ",97,"S.US.LULU ",{"$f":"RTD(\"cqg.rtd\", ,\"ContractData\",O98, \"PerCentNetLastTrade\",, \"T\")/100","v":-2.0782003213711837E-2},{"$f":"VLOOKUP(O98,$A$2:$H199,8,FALSE)","v":8.0009999999999994}]
["S.US.WBA ",{"$f":"IFERROR(RTD(\"cqg.rtd\",,\"StudyData\",A99,\"Bar\",, \"High\",$C$1,\"0\",,,,,\"T\"),\"\")","v":40.08},{"$f":"IFERROR(RTD(\"cqg.rtd\",,\"StudyData\",A99,\"Bar\",, \"Low\",$C$1,\"0\",,,,,\"T\"),\"\")","v":40.03},{"$f":"IFERROR(RTD(\"cqg.rtd\",,\"StudyData\",\"HiLevel(\"&A99&\",Period1:=\"&$B$1&\",AllowGaps:=0,InputChoice1:=High,InputChoice3:=High)\",\"Bar\",, \"Close\",$C$1,\"-1\",,,,,\"T\"),\"\")","v":40.33},{"$f":"IFERROR(RTD(\"cqg.rtd\",,\"StudyData\",\"LoLevel(\"&A99&\",Period2:=\"&$B$1&\",AllowGaps:=0,InputChoice2:=Low,InputChoice4:=Low)\",\"Bar\",, \"Close\",$C$1,\"-1\",,,,,\"T\"),\"\")","v":39.729999999999997},0,0,12.001999999999999,4.021000000000007,"S.US.WBA ",{"$f":"RTD(\"cqg.rtd\", ,\"ContractData\",A99, \"PerCentNetLastTrade\",, \"T\")/100","v":-1.499877059257438E-2},{"$f":"RANK($K99,$K$2:K$103)+COUNTIF($K$2:K99,K99)-1","v":92},"S.US.WBA ",98,"S.US.TSLA ",{"$f":"RTD(\"cqg.rtd\", ,\"ContractData\",O99, \"PerCentNetLastTrade\",, \"T\")/100","v":-2.1866248114978611E-2},{"$f":"VLOOKUP(O99,$A$2:$H200,8,FALSE)","v":11.004999999999997}]
["S.US.WDAY ",{"$f":"IFERROR(RTD(\"cqg.rtd\",,\"StudyData\",A100,\"Bar\",, \"High\",$C$1,\"0\",,,,,\"T\"),\"\")","v":254.59},{"$f":"IFERROR(RTD(\"cqg.rtd\",,\"StudyData\",A100,\"Bar\",, \"Low\",$C$1,\"0\",,,,,\"T\"),\"\")","v":254.02},{"$f":"IFERROR(RTD(\"cqg.rtd\",,\"StudyData\",\"HiLevel(\"&A100&\",Period1:=\"&$B$1&\",AllowGaps:=0,InputChoice1:=High,InputChoice3:=High)\",\"Bar\",, \"Close\",$C$1,\"-1\",,,,,\"T\"),\"\")","v":254.68},{"$f":"IFERROR(RTD(\"cqg.rtd\",,\"StudyData\",\"LoLevel(\"&A100&\",Period2:=\"&$B$1&\",AllowGaps:=0,InputChoice2:=Low,InputChoice4:=Low)\",\"Bar\",, \"Close\",$C$1,\"-1\",,,,,\"T\"),\"\")","v":245.82},0,0,12.002999999999998,4.0220000000000073,"S.US.WDAY ",{"$f":"RTD(\"cqg.rtd\", ,\"ContractData\",A100, \"PerCentNetLastTrade\",, \"T\")/100","v":4.89022779795312E-2},{"$f":"RANK($K100,$K$2:K$103)+COUNTIF($K$2:K100,K100)-1","v":2},"S.US.WDAY ",99,"S.US.PDD ",{"$f":"RTD(\"cqg.rtd\", ,\"ContractData\",O100, \"PerCentNetLastTrade\",, \"T\")/100","v":-2.3149724245931775E-2},{"$f":"VLOOKUP(O100,$A$2:$H201,8,FALSE)","v":9.0039999999999978}]
["S.US.XEL ",{"$f":"IFERROR(RTD(\"cqg.rtd\",,\"StudyData\",A101,\"Bar\",, \"High\",$C$1,\"0\",,,,,\"T\"),\"\")","v":64.95},{"$f":"IFERROR(RTD(\"cqg.rtd\",,\"StudyData\",A101,\"Bar\",, \"Low\",$C$1,\"0\",,,,,\"T\"),\"\")","v":64.849999999999994},{"$f":"IFERROR(RTD(\"cqg.rtd\",,\"StudyData\",\"HiLevel(\"&A101&\",Period1:=\"&$B$1&\",AllowGaps:=0,InputChoice1:=High,InputChoice3:=High)\",\"Bar\",, \"Close\",$C$1,\"-1\",,,,,\"T\"),\"\")","v":65.11},{"$f":"IFERROR(RTD(\"cqg.rtd\",,\"StudyData\",\"LoLevel(\"&A101&\",Period2:=\"&$B$1&\",AllowGaps:=0,InputChoice2:=Low,InputChoice4:=Low)\",\"Bar\",, \"Close\",$C$1,\"-1\",,,,,\"T\"),\"\")","v":64.510000000000005},0,0,12.003999999999998,4.0230000000000077,"S.US.XEL ",{"$f":"RTD(\"cqg.rtd\", ,\"ContractData\",A101, \"PerCentNetLastTrade\",, \"T\")/100","v":-6.8817862058418722E-3},{"$f":"RANK($K101,$K$2:K$103)+COUNTIF($K$2:K101,K101)-1","v":78},"S.US.XEL ",100,"S.US.GILD ",{"$f":"RTD(\"cqg.rtd\", ,\"ContractData\",O101, \"PerCentNetLastTrade\",, \"T\")/100","v":-2.4086094977792964E-2},{"$f":"VLOOKUP(O101,$A$2:$H202,8,FALSE)","v":5.006000000000002}]
["S.US.XLNX ",{"$f":"IFERROR(RTD(\"cqg.rtd\",,\"StudyData\",A102,\"Bar\",, \"High\",$C$1,\"0\",,,,,\"T\"),\"\")","v":143.51},{"$f":"IFERROR(RTD(\"cqg.rtd\",,\"StudyData\",A102,\"Bar\",, \"Low\",$C$1,\"0\",,,,,\"T\"),\"\")","v":143.18},{"$f":"IFERROR(RTD(\"cqg.rtd\",,\"StudyData\",\"HiLevel(\"&A102&\",Period1:=\"&$B$1&\",AllowGaps:=0,InputChoice1:=High,InputChoice3:=High)\",\"Bar\",, \"Close\",$C$1,\"-1\",,,,,\"T\"),\"\")","v":144.19},{"$f":"IFERROR(RTD(\"cqg.rtd\",,\"StudyData\",\"LoLevel(\"&A102&\",Period2:=\"&$B$1&\",AllowGaps:=0,InputChoice2:=Low,InputChoice4:=Low)\",\"Bar\",, \"Close\",$C$1,\"-1\",,,,,\"T\"),\"\")","v":142.52000000000001},0,0,12.004999999999997,4.024000000000008,"S.US.XLNX ",{"$f":"RTD(\"cqg.rtd\", ,\"ContractData\",A102, \"PerCentNetLastTrade\",, \"T\")/100","v":-1.3147026431718061E-2},{"$f":"RANK($K102,$K$2:K$103)+COUNTIF($K$2:K102,K102)-1","v":90},"S.US.XLNX ",101,"S.US.AMGN ",{"$f":"RTD(\"cqg.rtd\", ,\"ContractData\",O102, \"PerCentNetLastTrade\",, \"T\")/100","v":-2.5075887554441071E-2},{"$f":"VLOOKUP(O102,$A$2:$H203,8,FALSE)","v":1.1000000000000003E-2}]
["S.US.ZM ",{"$f":"IFERROR(RTD(\"cqg.rtd\",,\"StudyData\",A103,\"Bar\",, \"High\",$C$1,\"0\",,,,,\"T\"),\"\")","v":402.64},{"$f":"IFERROR(RTD(\"cqg.rtd\",,\"StudyData\",A103,\"Bar\",, \"Low\",$C$1,\"0\",,,,,\"T\"),\"\")","v":401.74},{"$f":"IFERROR(RTD(\"cqg.rtd\",,\"StudyData\",\"HiLevel(\"&A103&\",Period1:=\"&$B$1&\",AllowGaps:=0,InputChoice1:=High,InputChoice3:=High)\",\"Bar\",, \"Close\",$C$1,\"-1\",,,,,\"T\"),\"\")","v":412.38},{"$f":"IFERROR(RTD(\"cqg.rtd\",,\"StudyData\",\"LoLevel(\"&A103&\",Period2:=\"&$B$1&\",AllowGaps:=0,InputChoice2:=Low,InputChoice4:=Low)\",\"Bar\",, \"Close\",$C$1,\"-1\",,,,,\"T\"),\"\")","v":401.28},0,0,12.005999999999997,4.0250000000000083,"S.US.ZM ",{"$f":"RTD(\"cqg.rtd\", ,\"ContractData\",A103, \"PerCentNetLastTrade\",, \"T\")/100","v":-1.6382619752060054E-2},{"$f":"RANK($K103,$K$2:K$103)+COUNTIF($K$2:K103,K103)-1","v":94},"S.US.ZM ",102,"S.US.MRNA ",{"$f":"RTD(\"cqg.rtd\", ,\"ContractData\",O103, \"PerCentNetLastTrade\",, \"T\")/100","v":-6.0086767895878523E-2},{"$f":"VLOOKUP(O103,$A$2:$H204,8,FALSE)","v":8.0069999999999961}]

{"sheet":"Ranked","index":2,"n_rows":103,"n_cols":22,"rows_kept":103,"cut":false,"hidden":false,"merged":[]}
[null,null,null,null,null,null,null,"New Highs",null,null,null,null,null,null,null,null,null,"New Lows"]
[1,{"$f":"IFERROR(VLOOKUP(A2,Data!$H$2:$J$103,3,FALSE),\"\")","v":"S.US.ANSS "},{"$f":"IFERROR(RTD(\"cqg.rtd\", ,\"ContractData\",B2, \"PerCentNetLastTrade\",, \"T\")/100,\"\")","v":1.1771316196094957E-2},{"$f":"IFERROR(RANK($C2,$C$2:C$103)+COUNTIF($C$2:C2,C2)-1,\"\")","v":3},{"$f":"IF(B2=\"\",\"\",B2)","v":"S.US.ANSS "},1,{"$f":"IFERROR(VLOOKUP(F2,$D$2:$E$103,2,FALSE),\"\")","v":"S.US.OKTA "},{"$f":"IF(G2=\"\",\"\",RTD(\"cqg.rtd\", ,\"ContractData\",G2, \"LongDescription\",, \"T\"))","v":"Okta, Inc. Cl A"},{"$f":"IFERROR(RTD(\"cqg.rtd\", ,\"ContractData\",G2, \"PerCentNetLastTrade\",, \"T\")/100,\"\")","v":3.0195252957828263E-2},{"$f":"IF(I2<>\"\",1,0)","v":1},1,{"$f":"IFERROR(VLOOKUP(A2,Data!$I$2:$J$103,2,FALSE),\"\")","v":"S.US.ALXN "},{"$f":"IFERROR(RTD(\"cqg.rtd\", ,\"ContractData\",L2, \"PerCentNetLastTrade\",, \"T\")/100,\"\")","v":-9.1067622553768646E-3},{"$f":"IFERROR(RANK($M2,$M$2:M$104)+COUNTIF($M$2:M2,M2)-1,\"\")","v":2},{"$f":"IF(L2=\"\",\"\",L2)","v":"S.US.ALXN "},1,{"$f":"IFERROR(VLOOKUP(P2,$N$2:$O$103,2,FALSE),\"\")","v":"S.US.ORLY "},{"$f":"IF(Q2=\"\",\"\",RTD(\"cqg.rtd\", ,\"ContractData\",Q2, \"LongDescription\",, \"T\"))","v":"OReilly Automotive Inc"},{"$f":"IFERROR(RTD(\"cqg.rtd\", ,\"ContractData\",Q2, \"PerCentNetLastTrade\",, \"T\")/100,\"\")","v":-6.054044499436576E-3},{"$f":"IF(S2<>\"\",1,0)","v":1},{"$f":"COUNTIF(J2:J105,\"1\")","v":12},{"$f":"COUNTIF(T2:T105,\"1\")","v":4}]
[{"$f":"A2+1","v":2},{"$f":"IFERROR(VLOOKUP(A3,Data!$H$2:$J$103,3,FALSE),\"\")","v":"S.US.CERN "},{"$f":"IFERROR(RTD(\"cqg.rtd\", ,\"ContractData\",B3, \"PerCentNetLastTrade\",, \"T\")/100,\"\")","v":7.1810941376158769E-3},{"$f":"IFERROR(RANK($C3,$C$2:C$103)+COUNTIF($C$2:C3,C3)-1,\"\")","v":6},{"$f":"IF(B3=\"\",\"\",B3)","v":"S.US.CERN "},{"$f":"F2+1","v":2},{"$f":"IFERROR(VLOOKUP(F3,$D$2:$E$103,2,FALSE),\"\")","v":"S.US.SPLK "},{"$f":"IF(G3=\"\",\"\",RTD(\"cqg.rtd\", ,\"ContractData\",G3, \"LongDescription\",, \"T\"))","v":"Splunk, Inc."},{"$f":"IFERROR(RTD(\"cqg.rtd\", ,\"ContractData\",G3, \"PerCentNetLastTrade\",, \"T\")/100,\"\")","v":1.2043356081894821E-2},{"$f":"IF(I3<>\"\",1,0)","v":1},{"$f":"K2+1","v":2},{"$f":"IFERROR(VLOOKUP(A3,Data!$I$2:$J$103,2,FALSE),\"\")","v":"S.US.GILD "},{"$f":"IFERROR(RTD(\"cqg.rtd\", ,\"ContractData\",L3, \"PerCentNetLastTrade\",, \"T\")/100,\"\")","v":-2.4086094977792964E-2},{"$f":"IFERROR(RANK($M3,$M$2:M$104)+COUNTIF($M$2:M3,M3)-1,\"\")","v":4},{"$f":"IF(L3=\"\",\"\",L3)","v":"S.US.GILD "},{"$f":"P2+1","v":2},{"$f":"IFERROR(VLOOKUP(P3,$N$2:$O$103,2,FALSE),\"\")","v":"S.US.ALXN "},{"$f":"IF(Q3=\"\",\"\",RTD(\"cqg.rtd\", ,\"ContractData\",Q3, \"LongDescription\",, \"T\"))","v":"Alexion Pharmaceuticals"},{"$f":"IFERROR(RTD(\"cqg.rtd\", ,\"ContractData\",Q3, \"PerCentNetLastTrade\",, \"T\")/100,\"\")","v":-9.1067622553768646E-3},{"$f":"IF(S3<>\"\",1,0)","v":1}]
[{"$f":"A3+1","v":3},{"$f":"IFERROR(VLOOKUP(A4,Data!$H$2:$J$103,3,FALSE),\"\")","v":"S.US.CPRT "},{"$f":"IFERROR(RTD(\"cqg.rtd\", ,\"ContractData\",B4, \"PerCentNetLastTrade\",, \"T\")/100,\"\")","v":5.9747912915370759E-3},{"$f":"IFERROR(RANK($C4,$C$2:C$103)+COUNTIF($C$2:C4,C4)-1,\"\")","v":8},"S.US.CPRT ",{"$f":"F3+1","v":3},"S.US.ANSS ",{"$f":"IF(G4=\"\",\"\",RTD(\"cqg.rtd\", ,\"ContractData\",G4, \"LongDescription\",, \"T\"))","v":"ANSYS Inc"},{"$f":"IFERROR(RTD(\"cqg.rtd\", ,\"ContractData\",G4, \"PerCentNetLastTrade\",, \"T\")/100,\"\")","v":1.1771316196094957E-2},1,{"$f":"K3+1","v":3},{"$f":"IFERROR(VLOOKUP(A4,Data!$I$2:$J$103,2,FALSE),\"\")","v":"S.US.ORLY "},{"$f":"IFERROR(RTD(\"cqg.rtd\", ,\"ContractData\",L4, \"PerCentNetLastTrade\",, \"T\")/100,\"\")","v":-6.054044499436576E-3},{"$f":"IFERROR(RANK($M4,$M$2:M$104)+COUNTIF($M$2:M4,M4)-1,\"\")","v":1},"S.US.ORLY ",{"$f":"P3+1","v":3},"S.US.PDD ",{"$f":"IF(Q4=\"\",\"\",RTD(\"cqg.rtd\", ,\"ContractData\",Q4, \"LongDescription\",, \"T\"))","v":"Pinduoduo Inc"},{"$f":"IFERROR(RTD(\"cqg.rtd\", ,\"ContractData\",Q4, \"PerCentNetLastTrade\",, \"T\")/100,\"\")","v":-2.3149724245931775E-2},1]
[4,{"$f":"IFERROR(VLOOKUP(A5,Data!$H$2:$J$103,3,FALSE),\"\")","v":"S.US.CSX "},{"$f":"IFERROR(RTD(\"cqg.rtd\", ,\"ContractData\",B5, \"PerCentNetLastTrade\",, \"T\")/100,\"\")","v":1.5609320994536737E-3},{"$f":"IFERROR(RANK($C5,$C$2:C$103)+COUNTIF($C$2:C5,C5)-1,\"\")","v":10},"S.US.CSX ",4,"S.US.IDXX ",{"$f":"IF(G5=\"\",\"\",RTD(\"cqg.rtd\", ,\"ContractData\",G5, \"LongDescription\",, \"T\"))","v":"IDEXX Laboratories Inc"},{"$f":"IFERROR(RTD(\"cqg.rtd\", ,\"ContractData\",G5, \"PerCentNetLastTrade\",, \"T\")/100,\"\")","v":1.1088874366933508E-2},1,4,{"$f":"IFERROR(VLOOKUP(A5,Data!$I$2:$J$103,2,FALSE),\"\")","v":"S.US.PDD "},{"$f":"IFERROR(RTD(\"cqg.rtd\", ,\"ContractData\",L5, \"PerCentNetLastTrade\",, \"T\")/100,\"\")","v":-2.3149724245931775E-2},{"$f":"IFERROR(RANK($M5,$M$2:M$104)+COUNTIF($M$2:M5,M5)-1,\"\")","v":3},"S.US.PDD ",4,"S.US.GILD ",{"$f":"IF(Q5=\"\",\"\",RTD(\"cqg.rtd\", ,\"ContractData\",Q5, \"LongDescription\",, \"T\"))","v":"Gilead Sciences Inc"},{"$f":"IFERROR(RTD(\"cqg.rtd\", ,\"ContractData\",Q5, \"PerCentNetLastTrade\",, \"T\")/100,\"\")","v":-2.4086094977792964E-2},1]
[5,{"$f":"IFERROR(VLOOKUP(A6,Data!$H$2:$J$103,3,FALSE),\"\")","v":"S.US.EXC "},{"$f":"IFERROR(RTD(\"cqg.rtd\", ,\"ContractData\",B6, \"PerCentNetLastTrade\",, \"T\")/100,\"\")","v":9.6362322331968193E-3},{"$f":"IFERROR(RANK($C6,$C$2:C$103)+COUNTIF($C$2:C6,C6)-1,\"\")","v":5},"S.US.EXC ",5,"S.US.EXC ",{"$f":"IF(G6=\"\",\"\",RTD(\"cqg.rtd\", ,\"ContractData\",G6, \"LongDescription\",, \"T\"))","v":"Exelon Corporation"},{"$f":"IFERROR(RTD(\"cqg.rtd\", ,\"ContractData\",G6, \"PerCentNetLastTrade\",, \"T\")/100,\"\")","v":9.6362322331968193E-3},1,5,{"$f":"IFERROR(VLOOKUP(A6,Data!$I$2:$J$103,2,FALSE),\"\")","v":""},{"$f":"IFERROR(RTD(\"cqg.rtd\", ,\"ContractData\",L6, \"PerCentNetLastTrade\",, \"T\")/100,\"\")","v":""},{"$f":"IFERROR(RANK($M6,$M$2:M$104)+COUNTIF($M$2:M6,M6)-1,\"\")","v":""},"",5,"",{"$f":"IF(Q6=\"\",\"\",RTD(\"cqg.rtd\", ,\"ContractData\",Q6, \"LongDescription\",, \"T\"))","v":""},{"$f":"IFERROR(RTD(\"cqg.rtd\", ,\"ContractData\",Q6, \"PerCentNetLastTrade\",, \"T\")/100,\"\")","v":""},0]
[6,{"$f":"IFERROR(VLOOKUP(A7,Data!$H$2:$J$103,3,FALSE),\"\")","v":"S.US.GOOG "},{"$f":"IFERROR(RTD(\"cqg.rtd\", ,\"ContractData\",B7, \"PerCentNetLastTrade\",, \"T\")/100,\"\")","v":-1.5350385484399524E-3},{"$f":"IFERROR(RANK($C7,$C$2:C$103)+COUNTIF($C$2:C7,C7)-1,\"\")","v":11},"S.US.GOOG ",6,"S.US.CERN ",{"$f":"IF(G7=\"\",\"\",RTD(\"cqg.rtd\", ,\"ContractData\",G7, \"LongDescription\",, \"T\"))","v":"Cerner Corporation"},{"$f":"IFERROR(RTD(\"cqg.rtd\", ,\"ContractData\",G7, \"PerCentNetLastTrade\",, \"T\")/100,\"\")","v":7.1810941376158769E-3},1,6,{"$f":"IFERROR(VLOOKUP(A7,Data!$I$2:$J$103,2,FALSE),\"\")","v":""},{"$f":"IFERROR(RTD(\"cqg.rtd\", ,\"ContractData\",L7, \"PerCentNetLastTrade\",, \"T\")/100,\"\")","v":""},{"$f":"IFERROR(RANK($M7,$M$2:M$104)+COUNTIF($M$2:M7,M7)-1,\"\")","v":""},"",6,"",{"$f":"IF(Q7=\"\",\"\",RTD(\"cqg.rtd\", ,\"ContractData\",Q7, \"LongDescription\",, \"T\"))","v":""},{"$f":"IFERROR(RTD(\"cqg.rtd\", ,\"ContractData\",Q7, \"PerCentNetLastTrade\",, \"T\")/100,\"\")","v":""},0]
[7,{"$f":"IFERROR(VLOOKUP(A8,Data!$H$2:$J$103,3,FALSE),\"\")","v":"S.US.IDXX "},{"$f":"IFERROR(RTD(\"cqg.rtd\", ,\"ContractData\",B8, \"PerCentNetLastTrade\",, \"T\")/100,\"\")","v":1.1088874366933508E-2},{"$f":"IFERROR(RANK($C8,$C$2:C$103)+COUNTIF($C$2:C8,C8)-1,\"\")","v":4},"S.US.IDXX ",7,"S.US.VRSN ",{"$f":"IF(G8=\"\",\"\",RTD(\"cqg.rtd\", ,\"ContractData\",G8, \"LongDescription\",, \"T\"))","v":"Verisign Inc"},{"$f":"IFERROR(RTD(\"cqg.rtd\", ,\"ContractData\",G8, \"PerCentNetLastTrade\",, \"T\")/100,\"\")","v":6.4218902694401789E-3},1,7,{"$f":"IFERROR(VLOOKUP(A8,Data!$I$2:$J$103,2,FALSE),\"\")","v":""},{"$f":"IFERROR(RTD(\"cqg.rtd\", ,\"ContractData\",L8, \"PerCentNetLastTrade\",, \"T\")/100,\"\")","v":""},{"$f":"IFERROR(RANK($M8,$M$2:M$104)+COUNTIF($M$2:M8,M8)-1,\"\")","v":""},"",7,"",{"$f":"IF(Q8=\"\",\"\",RTD(\"cqg.rtd\", ,\"ContractData\",Q8, \"LongDescription\",, \"T\"))","v":""},{"$f":"IFERROR(RTD(\"cqg.rtd\", ,\"ContractData\",Q8, \"PerCentNetLastTrade\",, \"T\")/100,\"\")","v":""},0]
[8,{"$f":"IFERROR(VLOOKUP(A9,Data!$H$2:$J$103,3,FALSE),\"\")","v":"S.US.LRCX "},{"$f":"IFERROR(RTD(\"cqg.rtd\", ,\"ContractData\",B9, \"PerCentNetLastTrade\",, \"T\")/100,\"\")","v":-6.4565527802495706E-3},{"$f":"IFERROR(RANK($C9,$C$2:C$103)+COUNTIF($C$2:C9,C9)-1,\"\")","v":12},"S.US.LRCX ",8,"S.US.CPRT ",{"$f":"IF(G9=\"\",\"\",RTD(\"cqg.rtd\", ,\"ContractData\",G9, \"LongDescription\",, \"T\"))","v":"Copart Inc"},{"$f":"IFERROR(RTD(\"cqg.rtd\", ,\"ContractData\",G9, \"PerCentNetLastTrade\",, \"T\")/100,\"\")","v":5.9747912915370759E-3},1,8,{"$f":"IFERROR(VLOOKUP(A9,Data!$I$2:$J$103,2,FALSE),\"\")","v":""},{"$f":"IFERROR(RTD(\"cqg.rtd\", ,\"ContractData\",L9, \"PerCentNetLastTrade\",, \"T\")/100,\"\")","v":""},{"$f":"IFERROR(RANK($M9,$M$2:M$104)+COUNTIF($M$2:M9,M9)-1,\"\")","v":""},"",8,"",{"$f":"IF(Q9=\"\",\"\",RTD(\"cqg.rtd\", ,\"ContractData\",Q9, \"LongDescription\",, \"T\"))","v":""},{"$f":"IFERROR(RTD(\"cqg.rtd\", ,\"ContractData\",Q9, \"PerCentNetLastTrade\",, \"T\")/100,\"\")","v":""},0]
[9,{"$f":"IFERROR(VLOOKUP(A10,Data!$H$2:$J$103,3,FALSE),\"\")","v":"S.US.OKTA "},{"$f":"IFERROR(RTD(\"cqg.rtd\", ,\"ContractData\",B10, \"PerCentNetLastTrade\",, \"T\")/100,\"\")","v":3.0195252957828263E-2},{"$f":"IFERROR(RANK($C10,$C$2:C$103)+COUNTIF($C$2:C10,C10)-1,\"\")","v":1},"S.US.OKTA ",9,"S.US.ROST ",{"$f":"IF(G10=\"\",\"\",RTD(\"cqg.rtd\", ,\"ContractData\",G10, \"LongDescription\",, \"T\"))","v":"Ross Stores Inc"},{"$f":"IFERROR(RTD(\"cqg.rtd\", ,\"ContractData\",G10, \"PerCentNetLastTrade\",, \"T\")/100,\"\")","v":1.6268516140080485E-3},1,9,{"$f":"IFERROR(VLOOKUP(A10,Data!$I$2:$J$103,2,FALSE),\"\")","v":""},{"$f":"IFERROR(RTD(\"cqg.rtd\", ,\"ContractData\",L10, \"PerCentNetLastTrade\",, \"T\")/100,\"\")","v":""},{"$f":"IFERROR(RANK($M10,$M$2:M$104)+COUNTIF($M$2:M10,M10)-1,\"\")","v":""},"",9,"",{"$f":"IF(Q10=\"\",\"\",RTD(\"cqg.rtd\", ,\"ContractData\",Q10, \"LongDescription\",, \"T\"))","v":""},{"$f":"IFERROR(RTD(\"cqg.rtd\", ,\"ContractData\",Q10, \"PerCentNetLastTrade\",, \"T\")/100,\"\")","v":""},0]
[10,{"$f":"IFERROR(VLOOKUP(A11,Data!$H$2:$J$103,3,FALSE),\"\")","v":"S.US.ROST "},{"$f":"IFERROR(RTD(\"cqg.rtd\", ,\"ContractData\",B11, \"PerCentNetLastTrade\",, \"T\")/100,\"\")","v":1.6268516140080485E-3},{"$f":"IFERROR(RANK($C11,$C$2:C$103)+COUNTIF($C$2:C11,C11)-1,\"\")","v":9},"S.US.ROST ",10,"S.US.CSX ",{"$f":"IF(G11=\"\",\"\",RTD(\"cqg.rtd\", ,\"ContractData\",G11, \"LongDescription\",, \"T\"))","v":"CSX Corporation"},{"$f":"IFERROR(RTD(\"cqg.rtd\", ,\"ContractData\",G11, \"PerCentNetLastTrade\",, \"T\")/100,\"\")","v":1.5609320994536737E-3},1,10,{"$f":"IFERROR(VLOOKUP(A11,Data!$I$2:$J$103,2,FALSE),\"\")","v":""},{"$f":"IFERROR(RTD(\"cqg.rtd\", ,\"ContractData\",L11, \"PerCentNetLastTrade\",, \"T\")/100,\"\")","v":""},{"$f":"IFERROR(RANK($M11,$M$2:M$104)+COUNTIF($M$2:M11,M11)-1,\"\")","v":""},"",10,"",{"$f":"IF(Q11=\"\",\"\",RTD(\"cqg.rtd\", ,\"ContractData\",Q11, \"LongDescription\",, \"T\"))","v":""},{"$f":"IFERROR(RTD(\"cqg.rtd\", ,\"ContractData\",Q11, \"PerCentNetLastTrade\",, \"T\")/100,\"\")","v":""},0]
[11,{"$f":"IFERROR(VLOOKUP(A12,Data!$H$2:$J$103,3,FALSE),\"\")","v":"S.US.SPLK "},{"$f":"IFERROR(RTD(\"cqg.rtd\", ,\"ContractData\",B12, \"PerCentNetLastTrade\",, \"T\")/100,\"\")","v":1.2043356081894821E-2},{"$f":"IFERROR(RANK($C12,$C$2:C$103)+COUNTIF($C$2:C12,C12)-1,\"\")","v":2},"S.US.SPLK ",11,"S.US.GOOG ",{"$f":"IF(G12=\"\",\"\",RTD(\"cqg.rtd\", ,\"ContractData\",G12, \"LongDescription\",, \"T\"))","v":"Alphabet, Inc. Class C"},{"$f":"IFERROR(RTD(\"cqg.rtd\", ,\"ContractData\",G12, \"PerCentNetLastTrade\",, \"T\")/100,\"\")","v":-1.5350385484399524E-3},1,11,{"$f":"IFERROR(VLOOKUP(A12,Data!$I$2:$J$103,2,FALSE),\"\")","v":""},{"$f":"IFERROR(RTD(\"cqg.rtd\", ,\"ContractData\",L12, \"PerCentNetLastTrade\",, \"T\")/100,\"\")","v":""},{"$f":"IFERROR(RANK($M12,$M$2:M$104)+COUNTIF($M$2:M12,M12)-1,\"\")","v":""},"",11,"",{"$f":"IF(Q12=\"\",\"\",RTD(\"cqg.rtd\", ,\"ContractData\",Q12, \"LongDescription\",, \"T\"))","v":""},{"$f":"IFERROR(RTD(\"cqg.rtd\", ,\"ContractData\",Q12, \"PerCentNetLastTrade\",, \"T\")/100,\"\")","v":""},0]
[12,{"$f":"IFERROR(VLOOKUP(A13,Data!$H$2:$J$103,3,FALSE),\"\")","v":"S.US.VRSN "},{"$f":"IFERROR(RTD(\"cqg.rtd\", ,\"ContractData\",B13, \"PerCentNetLastTrade\",, \"T\")/100,\"\")","v":6.4218902694401789E-3},{"$f":"IFERROR(RANK($C13,$C$2:C$103)+COUNTIF($C$2:C13,C13)-1,\"\")","v":7},"S.US.VRSN ",12,"S.US.LRCX ",{"$f":"IF(G13=\"\",\"\",RTD(\"cqg.rtd\", ,\"ContractData\",G13, \"LongDescription\",, \"T\"))","v":"LAM Research Corporation"},{"$f":"IFERROR(RTD(\"cqg.rtd\", ,\"ContractData\",G13, \"PerCentNetLastTrade\",, \"T\")/100,\"\")","v":-6.4565527802495706E-3},1,12,{"$f":"IFERROR(VLOOKUP(A13,Data!$I$2:$J$103,2,FALSE),\"\")","v":""},{"$f":"IFERROR(RTD(\"cqg.rtd\", ,\"ContractData\",L13, \"PerCentNetLastTrade\",, \"T\")/100,\"\")","v":""},{"$f":"IFERROR(RANK($M13,$M$2:M$104)+COUNTIF($M$2:M13,M13)-1,\"\")","v":""},"",12,"",{"$f":"IF(Q13=\"\",\"\",RTD(\"cqg.rtd\", ,\"ContractData\",Q13, \"LongDescription\",, \"T\"))","v":""},{"$f":"IFERROR(RTD(\"cqg.rtd\", ,\"ContractData\",Q13, \"PerCentNetLastTrade\",, \"T\")/100,\"\")","v":""},0]
[13,{"$f":"IFERROR(VLOOKUP(A14,Data!$H$2:$J$103,3,FALSE),\"\")","v":""},{"$f":"IFERROR(RTD(\"cqg.rtd\", ,\"ContractData\",B14, \"PerCentNetLastTrade\",, \"T\")/100,\"\")","v":""},{"$f":"IFERROR(RANK($C14,$C$2:C$103)+COUNTIF($C$2:C14,C14)-1,\"\")","v":""},"",13,"",{"$f":"IF(G14=\"\",\"\",RTD(\"cqg.rtd\", ,\"ContractData\",G14, \"LongDescription\",, \"T\"))","v":""},{"$f":"IFERROR(RTD(\"cqg.rtd\", ,\"ContractData\",G14, \"PerCentNetLastTrade\",, \"T\")/100,\"\")","v":""},0,13,{"$f":"IFERROR(VLOOKUP(A14,Data!$I$2:$J$103,2,FALSE),\"\")","v":""},{"$f":"IFERROR(RTD(\"cqg.rtd\", ,\"ContractData\",L14, \"PerCentNetLastTrade\",, \"T\")/100,\"\")","v":""},{"$f":"IFERROR(RANK($M14,$M$2:M$104)+COUNTIF($M$2:M14,M14)-1,\"\")","v":""},"",13,"",{"$f":"IF(Q14=\"\",\"\",RTD(\"cqg.rtd\", ,\"ContractData\",Q14, \"LongDescription\",, \"T\"))","v":""},{"$f":"IFERROR(RTD(\"cqg.rtd\", ,\"ContractData\",Q14, \"PerCentNetLastTrade\",, \"T\")/100,\"\")","v":""},0]
[14,{"$f":"IFERROR(VLOOKUP(A15,Data!$H$2:$J$103,3,FALSE),\"\")","v":""},{"$f":"IFERROR(RTD(\"cqg.rtd\", ,\"ContractData\",B15, \"PerCentNetLastTrade\",, \"T\")/100,\"\")","v":""},{"$f":"IFERROR(RANK($C15,$C$2:C$103)+COUNTIF($C$2:C15,C15)-1,\"\")","v":""},"",14,"",{"$f":"IF(G15=\"\",\"\",RTD(\"cqg.rtd\", ,\"ContractData\",G15, \"LongDescription\",, \"T\"))","v":""},{"$f":"IFERROR(RTD(\"cqg.rtd\", ,\"ContractData\",G15, \"PerCentNetLastTrade\",, \"T\")/100,\"\")","v":""},0,14,{"$f":"IFERROR(VLOOKUP(A15,Data!$I$2:$J$103,2,FALSE),\"\")","v":""},{"$f":"IFERROR(RTD(\"cqg.rtd\", ,\"ContractData\",L15, \"PerCentNetLastTrade\",, \"T\")/100,\"\")","v":""},{"$f":"IFERROR(RANK($M15,$M$2:M$104)+COUNTIF($M$2:M15,M15)-1,\"\")","v":""},"",14,"",{"$f":"IF(Q15=\"\",\"\",RTD(\"cqg.rtd\", ,\"ContractData\",Q15, \"LongDescription\",, \"T\"))","v":""},{"$f":"IFERROR(RTD(\"cqg.rtd\", ,\"ContractData\",Q15, \"PerCentNetLastTrade\",, \"T\")/100,\"\")","v":""},0]
[15,{"$f":"IFERROR(VLOOKUP(A16,Data!$H$2:$J$103,3,FALSE),\"\")","v":""},{"$f":"IFERROR(RTD(\"cqg.rtd\", ,\"ContractData\",B16, \"PerCentNetLastTrade\",, \"T\")/100,\"\")","v":""},{"$f":"IFERROR(RANK($C16,$C$2:C$103)+COUNTIF($C$2:C16,C16)-1,\"\")","v":""},"",15,"",{"$f":"IF(G16=\"\",\"\",RTD(\"cqg.rtd\", ,\"ContractData\",G16, \"LongDescription\",, \"T\"))","v":""},{"$f":"IFERROR(RTD(\"cqg.rtd\", ,\"ContractData\",G16, \"PerCentNetLastTrade\",, \"T\")/100,\"\")","v":""},0,15,{"$f":"IFERROR(VLOOKUP(A16,Data!$I$2:$J$103,2,FALSE),\"\")","v":""},{"$f":"IFERROR(RTD(\"cqg.rtd\", ,\"ContractData\",L16, \"PerCentNetLastTrade\",, \"T\")/100,\"\")","v":""},{"$f":"IFERROR(RANK($M16,$M$2:M$104)+COUNTIF($M$2:M16,M16)-1,\"\")","v":""},"",15,"",{"$f":"IF(Q16=\"\",\"\",RTD(\"cqg.rtd\", ,\"ContractData\",Q16, \"LongDescription\",, \"T\"))","v":""},{"$f":"IFERROR(RTD(\"cqg.rtd\", ,\"ContractData\",Q16, \"PerCentNetLastTrade\",, \"T\")/100,\"\")","v":""},0]
[16,{"$f":"IFERROR(VLOOKUP(A17,Data!$H$2:$J$103,3,FALSE),\"\")","v":""},{"$f":"IFERROR(RTD(\"cqg.rtd\", ,\"ContractData\",B17, \"PerCentNetLastTrade\",, \"T\")/100,\"\")","v":""},{"$f":"IFERROR(RANK($C17,$C$2:C$103)+COUNTIF($C$2:C17,C17)-1,\"\")","v":""},"",16,"",{"$f":"IF(G17=\"\",\"\",RTD(\"cqg.rtd\", ,\"ContractData\",G17, \"LongDescription\",, \"T\"))","v":""},{"$f":"IFERROR(RTD(\"cqg.rtd\", ,\"ContractData\",G17, \"PerCentNetLastTrade\",, \"T\")/100,\"\")","v":""},0,16,{"$f":"IFERROR(VLOOKUP(A17,Data!$I$2:$J$103,2,FALSE),\"\")","v":""},{"$f":"IFERROR(RTD(\"cqg.rtd\", ,\"ContractData\",L17, \"PerCentNetLastTrade\",, \"T\")/100,\"\")","v":""},{"$f":"IFERROR(RANK($M17,$M$2:M$104)+COUNTIF($M$2:M17,M17)-1,\"\")","v":""},"",16,"",{"$f":"IF(Q17=\"\",\"\",RTD(\"cqg.rtd\", ,\"ContractData\",Q17, \"LongDescription\",, \"T\"))","v":""},{"$f":"IFERROR(RTD(\"cqg.rtd\", ,\"ContractData\",Q17, \"PerCentNetLastTrade\",, \"T\")/100,\"\")","v":""},0]
[17,{"$f":"IFERROR(VLOOKUP(A18,Data!$H$2:$J$103,3,FALSE),\"\")","v":""},{"$f":"IFERROR(RTD(\"cqg.rtd\", ,\"ContractData\",B18, \"PerCentNetLastTrade\",, \"T\")/100,\"\")","v":""},{"$f":"IFERROR(RANK($C18,$C$2:C$103)+COUNTIF($C$2:C18,C18)-1,\"\")","v":""},"",17,"",{"$f":"IF(G18=\"\",\"\",RTD(\"cqg.rtd\", ,\"ContractData\",G18, \"LongDescription\",, \"T\"))","v":""},{"$f":"IFERROR(RTD(\"cqg.rtd\", ,\"ContractData\",G18, \"PerCentNetLastTrade\",, \"T\")/100,\"\")","v":""},0,17,{"$f":"IFERROR(VLOOKUP(A18,Data!$I$2:$J$103,2,FALSE),\"\")","v":""},{"$f":"IFERROR(RTD(\"cqg.rtd\", ,\"ContractData\",L18, \"PerCentNetLastTrade\",, \"T\")/100,\"\")","v":""},{"$f":"IFERROR(RANK($M18,$M$2:M$104)+COUNTIF($M$2:M18,M18)-1,\"\")","v":""},"",17,"",{"$f":"IF(Q18=\"\",\"\",RTD(\"cqg.rtd\", ,\"ContractData\",Q18, \"LongDescription\",, \"T\"))","v":""},{"$f":"IFERROR(RTD(\"cqg.rtd\", ,\"ContractData\",Q18, \"PerCentNetLastTrade\",, \"T\")/100,\"\")","v":""},0]
[18,{"$f":"IFERROR(VLOOKUP(A19,Data!$H$2:$J$103,3,FALSE),\"\")","v":""},{"$f":"IFERROR(RTD(\"cqg.rtd\", ,\"ContractData\",B19, \"PerCentNetLastTrade\",, \"T\")/100,\"\")","v":""},{"$f":"IFERROR(RANK($C19,$C$2:C$103)+COUNTIF($C$2:C19,C19)-1,\"\")","v":""},"",18,"",{"$f":"IF(G19=\"\",\"\",RTD(\"cqg.rtd\", ,\"ContractData\",G19, \"LongDescription\",, \"T\"))","v":""},{"$f":"IFERROR(RTD(\"cqg.rtd\", ,\"ContractData\",G19, \"PerCentNetLastTrade\",, \"T\")/100,\"\")","v":""},0,18,{"$f":"IFERROR(VLOOKUP(A19,Data!$I$2:$J$103,2,FALSE),\"\")","v":""},{"$f":"IFERROR(RTD(\"cqg.rtd\", ,\"ContractData\",L19, \"PerCentNetLastTrade\",, \"T\")/100,\"\")","v":""},{"$f":"IFERROR(RANK($M19,$M$2:M$104)+COUNTIF($M$2:M19,M19)-1,\"\")","v":""},"",18,"",{"$f":"IF(Q19=\"\",\"\",RTD(\"cqg.rtd\", ,\"ContractData\",Q19, \"LongDescription\",, \"T\"))","v":""},{"$f":"IFERROR(RTD(\"cqg.rtd\", ,\"ContractData\",Q19, \"PerCentNetLastTrade\",, \"T\")/100,\"\")","v":""},0]
[19,{"$f":"IFERROR(VLOOKUP(A20,Data!$H$2:$J$103,3,FALSE),\"\")","v":""},{"$f":"IFERROR(RTD(\"cqg.rtd\", ,\"ContractData\",B20, \"PerCentNetLastTrade\",, \"T\")/100,\"\")","v":""},{"$f":"IFERROR(RANK($C20,$C$2:C$103)+COUNTIF($C$2:C20,C20)-1,\"\")","v":""},"",19,"",{"$f":"IF(G20=\"\",\"\",RTD(\"cqg.rtd\", ,\"ContractData\",G20, \"LongDescription\",, \"T\"))","v":""},{"$f":"IFERROR(RTD(\"cqg.rtd\", ,\"ContractData\",G20, \"PerCentNetLastTrade\",, \"T\")/100,\"\")","v":""},0,19,{"$f":"IFERROR(VLOOKUP(A20,Data!$I$2:$J$103,2,FALSE),\"\")","v":""},{"$f":"IFERROR(RTD(\"cqg.rtd\", ,\"ContractData\",L20, \"PerCentNetLastTrade\",, \"T\")/100,\"\")","v":""},{"$f":"IFERROR(RANK($M20,$M$2:M$104)+COUNTIF($M$2:M20,M20)-1,\"\")","v":""},"",19,"",{"$f":"IF(Q20=\"\",\"\",RTD(\"cqg.rtd\", ,\"ContractData\",Q20, \"LongDescription\",, \"T\"))","v":""},{"$f":"IFERROR(RTD(\"cqg.rtd\", ,\"ContractData\",Q20, \"PerCentNetLastTrade\",, \"T\")/100,\"\")","v":""},0]
[20,{"$f":"IFERROR(VLOOKUP(A21,Data!$H$2:$J$103,3,FALSE),\"\")","v":""},{"$f":"IFERROR(RTD(\"cqg.rtd\", ,\"ContractData\",B21, \"PerCentNetLastTrade\",, \"T\")/100,\"\")","v":""},{"$f":"IFERROR(RANK($C21,$C$2:C$103)+COUNTIF($C$2:C21,C21)-1,\"\")","v":""},"",20,"",{"$f":"IF(G21=\"\",\"\",RTD(\"cqg.rtd\", ,\"ContractData\",G21, \"LongDescription\",, \"T\"))","v":""},{"$f":"IFERROR(RTD(\"cqg.rtd\", ,\"ContractData\",G21, \"PerCentNetLastTrade\",, \"T\")/100,\"\")","v":""},0,20,{"$f":"IFERROR(VLOOKUP(A21,Data!$I$2:$J$103,2,FALSE),\"\")","v":""},{"$f":"IFERROR(RTD(\"cqg.rtd\", ,\"ContractData\",L21, \"PerCentNetLastTrade\",, \"T\")/100,\"\")","v":""},{"$f":"IFERROR(RANK($M21,$M$2:M$104)+COUNTIF($M$2:M21,M21)-1,\"\")","v":""},"",20,"",{"$f":"IF(Q21=\"\",\"\",RTD(\"cqg.rtd\", ,\"ContractData\",Q21, \"LongDescription\",, \"T\"))","v":""},{"$f":"IFERROR(RTD(\"cqg.rtd\", ,\"ContractData\",Q21, \"PerCentNetLastTrade\",, \"T\")/100,\"\")","v":""},0]
[21,{"$f":"IFERROR(VLOOKUP(A22,Data!$H$2:$J$103,3,FALSE),\"\")","v":""},{"$f":"IFERROR(RTD(\"cqg.rtd\", ,\"ContractData\",B22, \"PerCentNetLastTrade\",, \"T\")/100,\"\")","v":""},{"$f":"IFERROR(RANK($C22,$C$2:C$103)+COUNTIF($C$2:C22,C22)-1,\"\")","v":""},"",21,"",{"$f":"IF(G22=\"\",\"\",RTD(\"cqg.rtd\", ,\"ContractData\",G22, \"LongDescription\",, \"T\"))","v":""},{"$f":"IFERROR(RTD(\"cqg.rtd\", ,\"ContractData\",G22, \"PerCentNetLastTrade\",, \"T\")/100,\"\")","v":""},0,21,{"$f":"IFERROR(VLOOKUP(A22,Data!$I$2:$J$103,2,FALSE),\"\")","v":""},{"$f":"IFERROR(RTD(\"cqg.rtd\", ,\"ContractData\",L22, \"PerCentNetLastTrade\",, \"T\")/100,\"\")","v":""},{"$f":"IFERROR(RANK($M22,$M$2:M$104)+COUNTIF($M$2:M22,M22)-1,\"\")","v":""},"",21,"",{"$f":"IF(Q22=\"\",\"\",RTD(\"cqg.rtd\", ,\"ContractData\",Q22, \"LongDescription\",, \"T\"))","v":""},{"$f":"IFERROR(RTD(\"cqg.rtd\", ,\"ContractData\",Q22, \"PerCentNetLastTrade\",, \"T\")/100,\"\")","v":""},0]
[22,{"$f":"IFERROR(VLOOKUP(A23,Data!$H$2:$J$103,3,FALSE),\"\")","v":""},{"$f":"IFERROR(RTD(\"cqg.rtd\", ,\"ContractData\",B23, \"PerCentNetLastTrade\",, \"T\")/100,\"\")","v":""},{"$f":"IFERROR(RANK($C23,$C$2:C$103)+COUNTIF($C$2:C23,C23)-1,\"\")","v":""},"",22,"",{"$f":"IF(G23=\"\",\"\",RTD(\"cqg.rtd\", ,\"ContractData\",G23, \"LongDescription\",, \"T\"))","v":""},{"$f":"IFERROR(RTD(\"cqg.rtd\", ,\"ContractData\",G23, \"PerCentNetLastTrade\",, \"T\")/100,\"\")","v":""},0,22,{"$f":"IFERROR(VLOOKUP(A23,Data!$I$2:$J$103,2,FALSE),\"\")","v":""},{"$f":"IFERROR(RTD(\"cqg.rtd\", ,\"ContractData\",L23, \"PerCentNetLastTrade\",, \"T\")/100,\"\")","v":""},{"$f":"IFERROR(RANK($M23,$M$2:M$104)+COUNTIF($M$2:M23,M23)-1,\"\")","v":""},"",22,"",{"$f":"IF(Q23=\"\",\"\",RTD(\"cqg.rtd\", ,\"ContractData\",Q23, \"LongDescription\",, \"T\"))","v":""},{"$f":"IFERROR(RTD(\"cqg.rtd\", ,\"ContractData\",Q23, \"PerCentNetLastTrade\",, \"T\")/100,\"\")","v":""},0]
[23,{"$f":"IFERROR(VLOOKUP(A24,Data!$H$2:$J$103,3,FALSE),\"\")","v":""},{"$f":"IFERROR(RTD(\"cqg.rtd\", ,\"ContractData\",B24, \"PerCentNetLastTrade\",, \"T\")/100,\"\")","v":""},{"$f":"IFERROR(RANK($C24,$C$2:C$103)+COUNTIF($C$2:C24,C24)-1,\"\")","v":""},"",23,"",{"$f":"IF(G24=\"\",\"\",RTD(\"cqg.rtd\", ,\"ContractData\",G24, \"LongDescription\",, \"T\"))","v":""},{"$f":"IFERROR(RTD(\"cqg.rtd\", ,\"ContractData\",G24, \"PerCentNetLastTrade\",, \"T\")/100,\"\")","v":""},0,23,{"$f":"IFERROR(VLOOKUP(A24,Data!$I$2:$J$103,2,FALSE),\"\")","v":""},{"$f":"IFERROR(RTD(\"cqg.rtd\", ,\"ContractData\",L24, \"PerCentNetLastTrade\",, \"T\")/100,\"\")","v":""},{"$f":"IFERROR(RANK($M24,$M$2:M$104)+COUNTIF($M$2:M24,M24)-1,\"\")","v":""},"",23,"",{"$f":"IF(Q24=\"\",\"\",RTD(\"cqg.rtd\", ,\"ContractData\",Q24, \"LongDescription\",, \"T\"))","v":""},{"$f":"IFERROR(RTD(\"cqg.rtd\", ,\"ContractData\",Q24, \"PerCentNetLastTrade\",, \"T\")/100,\"\")","v":""},0]
[24,{"$f":"IFERROR(VLOOKUP(A25,Data!$H$2:$J$103,3,FALSE),\"\")","v":""},{"$f":"IFERROR(RTD(\"cqg.rtd\", ,\"ContractData\",B25, \"PerCentNetLastTrade\",, \"T\")/100,\"\")","v":""},{"$f":"IFERROR(RANK($C25,$C$2:C$103)+COUNTIF($C$2:C25,C25)-1,\"\")","v":""},"",24,"",{"$f":"IF(G25=\"\",\"\",RTD(\"cqg.rtd\", ,\"ContractData\",G25, \"LongDescription\",, \"T\"))","v":""},{"$f":"IFERROR(RTD(\"cqg.rtd\", ,\"ContractData\",G25, \"PerCentNetLastTrade\",, \"T\")/100,\"\")","v":""},0,24,{"$f":"IFERROR(VLOOKUP(A25,Data!$I$2:$J$103,2,FALSE),\"\")","v":""},{"$f":"IFERROR(RTD(\"cqg.rtd\", ,\"ContractData\",L25, \"PerCentNetLastTrade\",, \"T\")/100,\"\")","v":""},{"$f":"IFERROR(RANK($M25,$M$2:M$104)+COUNTIF($M$2:M25,M25)-1,\"\")","v":""},"",24,"",{"$f":"IF(Q25=\"\",\"\",RTD(\"cqg.rtd\", ,\"ContractData\",Q25, \"LongDescription\",, \"T\"))","v":""},{"$f":"IFERROR(RTD(\"cqg.rtd\", ,\"ContractData\",Q25, \"PerCentNetLastTrade\",, \"T\")/100,\"\")","v":""},0]
[25,{"$f":"IFERROR(VLOOKUP(A26,Data!$H$2:$J$103,3,FALSE),\"\")","v":""},{"$f":"IFERROR(RTD(\"cqg.rtd\", ,\"ContractData\",B26, \"PerCentNetLastTrade\",, \"T\")/100,\"\")","v":""},{"$f":"IFERROR(RANK($C26,$C$2:C$103)+COUNTIF($C$2:C26,C26)-1,\"\")","v":""},"",25,"",{"$f":"IF(G26=\"\",\"\",RTD(\"cqg.rtd\", ,\"ContractData\",G26, \"LongDescription\",, \"T\"))","v":""},{"$f":"IFERROR(RTD(\"cqg.rtd\", ,\"ContractData\",G26, \"PerCentNetLastTrade\",, \"T\")/100,\"\")","v":""},0,25,{"$f":"IFERROR(VLOOKUP(A26,Data!$I$2:$J$103,2,FALSE),\"\")","v":""},{"$f":"IFERROR(RTD(\"cqg.rtd\", ,\"ContractData\",L26, \"PerCentNetLastTrade\",, \"T\")/100,\"\")","v":""},{"$f":"IFERROR(RANK($M26,$M$2:M$104)+COUNTIF($M$2:M26,M26)-1,\"\")","v":""},"",25,"",{"$f":"IF(Q26=\"\",\"\",RTD(\"cqg.rtd\", ,\"ContractData\",Q26, \"LongDescription\",, \"T\"))","v":""},{"$f":"IFERROR(RTD(\"cqg.rtd\", ,\"ContractData\",Q26, \"PerCentNetLastTrade\",, \"T\")/100,\"\")","v":""},0]
[26,{"$f":"IFERROR(VLOOKUP(A27,Data!$H$2:$J$103,3,FALSE),\"\")","v":""},{"$f":"IFERROR(RTD(\"cqg.rtd\", ,\"ContractData\",B27, \"PerCentNetLastTrade\",, \"T\")/100,\"\")","v":""},{"$f":"IFERROR(RANK($C27,$C$2:C$103)+COUNTIF($C$2:C27,C27)-1,\"\")","v":""},"",26,"",{"$f":"IF(G27=\"\",\"\",RTD(\"cqg.rtd\", ,\"ContractData\",G27, \"LongDescription\",, \"T\"))","v":""},{"$f":"IFERROR(RTD(\"cqg.rtd\", ,\"ContractData\",G27, \"PerCentNetLastTrade\",, \"T\")/100,\"\")","v":""},0,26,{"$f":"IFERROR(VLOOKUP(A27,Data!$I$2:$J$103,2,FALSE),\"\")","v":""},{"$f":"IFERROR(RTD(\"cqg.rtd\", ,\"ContractData\",L27, \"PerCentNetLastTrade\",, \"T\")/100,\"\")","v":""},{"$f":"IFERROR(RANK($M27,$M$2:M$104)+COUNTIF($M$2:M27,M27)-1,\"\")","v":""},"",26,"",{"$f":"IF(Q27=\"\",\"\",RTD(\"cqg.rtd\", ,\"ContractData\",Q27, \"LongDescription\",, \"T\"))","v":""},{"$f":"IFERROR(RTD(\"cqg.rtd\", ,\"ContractData\",Q27, \"PerCentNetLastTrade\",, \"T\")/100,\"\")","v":""},0]
[27,{"$f":"IFERROR(VLOOKUP(A28,Data!$H$2:$J$103,3,FALSE),\"\")","v":""},{"$f":"IFERROR(RTD(\"cqg.rtd\", ,\"ContractData\",B28, \"PerCentNetLastTrade\",, \"T\")/100,\"\")","v":""},{"$f":"IFERROR(RANK($C28,$C$2:C$103)+COUNTIF($C$2:C28,C28)-1,\"\")","v":""},"",27,"",{"$f":"IF(G28=\"\",\"\",RTD(\"cqg.rtd\", ,\"ContractData\",G28, \"LongDescription\",, \"T\"))","v":""},{"$f":"IFERROR(RTD(\"cqg.rtd\", ,\"ContractData\",G28, \"PerCentNetLastTrade\",, \"T\")/100,\"\")","v":""},0,27,{"$f":"IFERROR(VLOOKUP(A28,Data!$I$2:$J$103,2,FALSE),\"\")","v":""},{"$f":"IFERROR(RTD(\"cqg.rtd\", ,\"ContractData\",L28, \"PerCentNetLastTrade\",, \"T\")/100,\"\")","v":""},{"$f":"IFERROR(RANK($M28,$M$2:M$104)+COUNTIF($M$2:M28,M28)-1,\"\")","v":""},"",27,"",{"$f":"IF(Q28=\"\",\"\",RTD(\"cqg.rtd\", ,\"ContractData\",Q28, \"LongDescription\",, \"T\"))","v":""},{"$f":"IFERROR(RTD(\"cqg.rtd\", ,\"ContractData\",Q28, \"PerCentNetLastTrade\",, \"T\")/100,\"\")","v":""},0]
[28,{"$f":"IFERROR(VLOOKUP(A29,Data!$H$2:$J$103,3,FALSE),\"\")","v":""},{"$f":"IFERROR(RTD(\"cqg.rtd\", ,\"ContractData\",B29, \"PerCentNetLastTrade\",, \"T\")/100,\"\")","v":""},{"$f":"IFERROR(RANK($C29,$C$2:C$103)+COUNTIF($C$2:C29,C29)-1,\"\")","v":""},"",28,"",{"$f":"IF(G29=\"\",\"\",RTD(\"cqg.rtd\", ,\"ContractData\",G29, \"LongDescription\",, \"T\"))","v":""},{"$f":"IFERROR(RTD(\"cqg.rtd\", ,\"ContractData\",G29, \"PerCentNetLastTrade\",, \"T\")/100,\"\")","v":""},0,28,{"$f":"IFERROR(VLOOKUP(A29,Data!$I$2:$J$103,2,FALSE),\"\")","v":""},{"$f":"IFERROR(RTD(\"cqg.rtd\", ,\"ContractData\",L29, \"PerCentNetLastTrade\",, \"T\")/100,\"\")","v":""},{"$f":"IFERROR(RANK($M29,$M$2:M$104)+COUNTIF($M$2:M29,M29)-1,\"\")","v":""},"",28,"",{"$f":"IF(Q29=\"\",\"\",RTD(\"cqg.rtd\", ,\"ContractData\",Q29, \"LongDescription\",, \"T\"))","v":""},{"$f":"IFERROR(RTD(\"cqg.rtd\", ,\"ContractData\",Q29, \"PerCentNetLastTrade\",, \"T\")/100,\"\")","v":""},0]
[29,{"$f":"IFERROR(VLOOKUP(A30,Data!$H$2:$J$103,3,FALSE),\"\")","v":""},{"$f":"IFERROR(RTD(\"cqg.rtd\", ,\"ContractData\",B30, \"PerCentNetLastTrade\",, \"T\")/100,\"\")","v":""},{"$f":"IFERROR(RANK($C30,$C$2:C$103)+COUNTIF($C$2:C30,C30)-1,\"\")","v":""},"",29,"",{"$f":"IF(G30=\"\",\"\",RTD(\"cqg.rtd\", ,\"ContractData\",G30, \"LongDescription\",, \"T\"))","v":""},{"$f":"IFERROR(RTD(\"cqg.rtd\", ,\"ContractData\",G30, \"PerCentNetLastTrade\",, \"T\")/100,\"\")","v":""},0,29,{"$f":"IFERROR(VLOOKUP(A30,Data!$I$2:$J$103,2,FALSE),\"\")","v":""},{"$f":"IFERROR(RTD(\"cqg.rtd\", ,\"ContractData\",L30, \"PerCentNetLastTrade\",, \"T\")/100,\"\")","v":""},{"$f":"IFERROR(RANK($M30,$M$2:M$104)+COUNTIF($M$2:M30,M30)-1,\"\")","v":""},"",29,"",{"$f":"IF(Q30=\"\",\"\",RTD(\"cqg.rtd\", ,\"ContractData\",Q30, \"LongDescription\",, \"T\"))","v":""},{"$f":"IFERROR(RTD(\"cqg.rtd\", ,\"ContractData\",Q30, \"PerCentNetLastTrade\",, \"T\")/100,\"\")","v":""},0]
[30,{"$f":"IFERROR(VLOOKUP(A31,Data!$H$2:$J$103,3,FALSE),\"\")","v":""},{"$f":"IFERROR(RTD(\"cqg.rtd\", ,\"ContractData\",B31, \"PerCentNetLastTrade\",, \"T\")/100,\"\")","v":""},{"$f":"IFERROR(RANK($C31,$C$2:C$103)+COUNTIF($C$2:C31,C31)-1,\"\")","v":""},"",30,"",{"$f":"IF(G31=\"\",\"\",RTD(\"cqg.rtd\", ,\"ContractData\",G31, \"LongDescription\",, \"T\"))","v":""},{"$f":"IFERROR(RTD(\"cqg.rtd\", ,\"ContractData\",G31, \"PerCentNetLastTrade\",, \"T\")/100,\"\")","v":""},0,30,{"$f":"IFERROR(VLOOKUP(A31,Data!$I$2:$J$103,2,FALSE),\"\")","v":""},{"$f":"IFERROR(RTD(\"cqg.rtd\", ,\"ContractData\",L31, \"PerCentNetLastTrade\",, \"T\")/100,\"\")","v":""},{"$f":"IFERROR(RANK($M31,$M$2:M$104)+COUNTIF($M$2:M31,M31)-1,\"\")","v":""},"",30,"",{"$f":"IF(Q31=\"\",\"\",RTD(\"cqg.rtd\", ,\"ContractData\",Q31, \"LongDescription\",, \"T\"))","v":""},{"$f":"IFERROR(RTD(\"cqg.rtd\", ,\"ContractData\",Q31, \"PerCentNetLastTrade\",, \"T\")/100,\"\")","v":""},0]
[31,{"$f":"IFERROR(VLOOKUP(A32,Data!$H$2:$J$103,3,FALSE),\"\")","v":""},{"$f":"IFERROR(RTD(\"cqg.rtd\", ,\"ContractData\",B32, \"PerCentNetLastTrade\",, \"T\")/100,\"\")","v":""},{"$f":"IFERROR(RANK($C32,$C$2:C$103)+COUNTIF($C$2:C32,C32)-1,\"\")","v":""},"",31,"",{"$f":"IF(G32=\"\",\"\",RTD(\"cqg.rtd\", ,\"ContractData\",G32, \"LongDescription\",, \"T\"))","v":""},{"$f":"IFERROR(RTD(\"cqg.rtd\", ,\"ContractData\",G32, \"PerCentNetLastTrade\",, \"T\")/100,\"\")","v":""},0,31,{"$f":"IFERROR(VLOOKUP(A32,Data!$I$2:$J$103,2,FALSE),\"\")","v":""},{"$f":"IFERROR(RTD(\"cqg.rtd\", ,\"ContractData\",L32, \"PerCentNetLastTrade\",, \"T\")/100,\"\")","v":""},{"$f":"IFERROR(RANK($M32,$M$2:M$104)+COUNTIF($M$2:M32,M32)-1,\"\")","v":""},"",31,"",{"$f":"IF(Q32=\"\",\"\",RTD(\"cqg.rtd\", ,\"ContractData\",Q32, \"LongDescription\",, \"T\"))","v":""},{"$f":"IFERROR(RTD(\"cqg.rtd\", ,\"ContractData\",Q32, \"PerCentNetLastTrade\",, \"T\")/100,\"\")","v":""},0]
[32,{"$f":"IFERROR(VLOOKUP(A33,Data!$H$2:$J$103,3,FALSE),\"\")","v":""},{"$f":"IFERROR(RTD(\"cqg.rtd\", ,\"ContractData\",B33, \"PerCentNetLastTrade\",, \"T\")/100,\"\")","v":""},{"$f":"IFERROR(RANK($C33,$C$2:C$103)+COUNTIF($C$2:C33,C33)-1,\"\")","v":""},"",32,"",{"$f":"IF(G33=\"\",\"\",RTD(\"cqg.rtd\", ,\"ContractData\",G33, \"LongDescription\",, \"T\"))","v":""},{"$f":"IFERROR(RTD(\"cqg.rtd\", ,\"ContractData\",G33, \"PerCentNetLastTrade\",, \"T\")/100,\"\")","v":""},0,32,{"$f":"IFERROR(VLOOKUP(A33,Data!$I$2:$J$103,2,FALSE),\"\")","v":""},{"$f":"IFERROR(RTD(\"cqg.rtd\", ,\"ContractData\",L33, \"PerCentNetLastTrade\",, \"T\")/100,\"\")","v":""},{"$f":"IFERROR(RANK($M33,$M$2:M$104)+COUNTIF($M$2:M33,M33)-1,\"\")","v":""},"",32,"",{"$f":"IF(Q33=\"\",\"\",RTD(\"cqg.rtd\", ,\"ContractData\",Q33, \"LongDescription\",, \"T\"))","v":""},{"$f":"IFERROR(RTD(\"cqg.rtd\", ,\"ContractData\",Q33, \"PerCentNetLastTrade\",, \"T\")/100,\"\")","v":""},0]
[33,{"$f":"IFERROR(VLOOKUP(A34,Data!$H$2:$J$103,3,FALSE),\"\")","v":""},{"$f":"IFERROR(RTD(\"cqg.rtd\", ,\"ContractData\",B34, \"PerCentNetLastTrade\",, \"T\")/100,\"\")","v":""},{"$f":"IFERROR(RANK($C34,$C$2:C$103)+COUNTIF($C$2:C34,C34)-1,\"\")","v":""},"",33,"",{"$f":"IF(G34=\"\",\"\",RTD(\"cqg.rtd\", ,\"ContractData\",G34, \"LongDescription\",, \"T\"))","v":""},{"$f":"IFERROR(RTD(\"cqg.rtd\", ,\"ContractData\",G34, \"PerCentNetLastTrade\",, \"T\")/100,\"\")","v":""},0,33,{"$f":"IFERROR(VLOOKUP(A34,Data!$I$2:$J$103,2,FALSE),\"\")","v":""},{"$f":"IFERROR(RTD(\"cqg.rtd\", ,\"ContractData\",L34, \"PerCentNetLastTrade\",, \"T\")/100,\"\")","v":""},{"$f":"IFERROR(RANK($M34,$M$2:M$104)+COUNTIF($M$2:M34,M34)-1,\"\")","v":""},"",33,"",{"$f":"IF(Q34=\"\",\"\",RTD(\"cqg.rtd\", ,\"ContractData\",Q34, \"LongDescription\",, \"T\"))","v":""},{"$f":"IFERROR(RTD(\"cqg.rtd\", ,\"ContractData\",Q34, \"PerCentNetLastTrade\",, \"T\")/100,\"\")","v":""},0]
[34,{"$f":"IFERROR(VLOOKUP(A35,Data!$H$2:$J$103,3,FALSE),\"\")","v":""},{"$f":"IFERROR(RTD(\"cqg.rtd\", ,\"ContractData\",B35, \"PerCentNetLastTrade\",, \"T\")/100,\"\")","v":""},{"$f":"IFERROR(RANK($C35,$C$2:C$103)+COUNTIF($C$2:C35,C35)-1,\"\")","v":""},"",34,"",{"$f":"IF(G35=\"\",\"\",RTD(\"cqg.rtd\", ,\"ContractData\",G35, \"LongDescription\",, \"T\"))","v":""},{"$f":"IFERROR(RTD(\"cqg.rtd\", ,\"ContractData\",G35, \"PerCentNetLastTrade\",, \"T\")/100,\"\")","v":""},0,34,{"$f":"IFERROR(VLOOKUP(A35,Data!$I$2:$J$103,2,FALSE),\"\")","v":""},{"$f":"IFERROR(RTD(\"cqg.rtd\", ,\"ContractData\",L35, \"PerCentNetLastTrade\",, \"T\")/100,\"\")","v":""},{"$f":"IFERROR(RANK($M35,$M$2:M$104)+COUNTIF($M$2:M35,M35)-1,\"\")","v":""},"",34,"",{"$f":"IF(Q35=\"\",\"\",RTD(\"cqg.rtd\", ,\"ContractData\",Q35, \"LongDescription\",, \"T\"))","v":""},{"$f":"IFERROR(RTD(\"cqg.rtd\", ,\"ContractData\",Q35, \"PerCentNetLastTrade\",, \"T\")/100,\"\")","v":""},0]
[35,{"$f":"IFERROR(VLOOKUP(A36,Data!$H$2:$J$103,3,FALSE),\"\")","v":""},{"$f":"IFERROR(RTD(\"cqg.rtd\", ,\"ContractData\",B36, \"PerCentNetLastTrade\",, \"T\")/100,\"\")","v":""},{"$f":"IFERROR(RANK($C36,$C$2:C$103)+COUNTIF($C$2:C36,C36)-1,\"\")","v":""},"",35,"",{"$f":"IF(G36=\"\",\"\",RTD(\"cqg.rtd\", ,\"ContractData\",G36, \"LongDescription\",, \"T\"))","v":""},{"$f":"IFERROR(RTD(\"cqg.rtd\", ,\"ContractData\",G36, \"PerCentNetLastTrade\",, \"T\")/100,\"\")","v":""},0,35,{"$f":"IFERROR(VLOOKUP(A36,Data!$I$2:$J$103,2,FALSE),\"\")","v":""},{"$f":"IFERROR(RTD(\"cqg.rtd\", ,\"ContractData\",L36, \"PerCentNetLastTrade\",, \"T\")/100,\"\")","v":""},{"$f":"IFERROR(RANK($M36,$M$2:M$104)+COUNTIF($M$2:M36,M36)-1,\"\")","v":""},"",35,"",{"$f":"IF(Q36=\"\",\"\",RTD(\"cqg.rtd\", ,\"ContractData\",Q36, \"LongDescription\",, \"T\"))","v":""},{"$f":"IFERROR(RTD(\"cqg.rtd\", ,\"ContractData\",Q36, \"PerCentNetLastTrade\",, \"T\")/100,\"\")","v":""},0]
[36,{"$f":"IFERROR(VLOOKUP(A37,Data!$H$2:$J$103,3,FALSE),\"\")","v":""},{"$f":"IFERROR(RTD(\"cqg.rtd\", ,\"ContractData\",B37, \"PerCentNetLastTrade\",, \"T\")/100,\"\")","v":""},{"$f":"IFERROR(RANK($C37,$C$2:C$103)+COUNTIF($C$2:C37,C37)-1,\"\")","v":""},"",36,"",{"$f":"IF(G37=\"\",\"\",RTD(\"cqg.rtd\", ,\"ContractData\",G37, \"LongDescription\",, \"T\"))","v":""},{"$f":"IFERROR(RTD(\"cqg.rtd\", ,\"ContractData\",G37, \"PerCentNetLastTrade\",, \"T\")/100,\"\")","v":""},0,36,{"$f":"IFERROR(VLOOKUP(A37,Data!$I$2:$J$103,2,FALSE),\"\")","v":""},{"$f":"IFERROR(RTD(\"cqg.rtd\", ,\"ContractData\",L37, \"PerCentNetLastTrade\",, \"T\")/100,\"\")","v":""},{"$f":"IFERROR(RANK($M37,$M$2:M$104)+COUNTIF($M$2:M37,M37)-1,\"\")","v":""},"",36,"",{"$f":"IF(Q37=\"\",\"\",RTD(\"cqg.rtd\", ,\"ContractData\",Q37, \"LongDescription\",, \"T\"))","v":""},{"$f":"IFERROR(RTD(\"cqg.rtd\", ,\"ContractData\",Q37, \"PerCentNetLastTrade\",, \"T\")/100,\"\")","v":""},0]
[37,{"$f":"IFERROR(VLOOKUP(A38,Data!$H$2:$J$103,3,FALSE),\"\")","v":""},{"$f":"IFERROR(RTD(\"cqg.rtd\", ,\"ContractData\",B38, \"PerCentNetLastTrade\",, \"T\")/100,\"\")","v":""},{"$f":"IFERROR(RANK($C38,$C$2:C$103)+COUNTIF($C$2:C38,C38)-1,\"\")","v":""},"",37,"",{"$f":"IF(G38=\"\",\"\",RTD(\"cqg.rtd\", ,\"ContractData\",G38, \"LongDescription\",, \"T\"))","v":""},{"$f":"IFERROR(RTD(\"cqg.rtd\", ,\"ContractData\",G38, \"PerCentNetLastTrade\",, \"T\")/100,\"\")","v":""},0,37,{"$f":"IFERROR(VLOOKUP(A38,Data!$I$2:$J$103,2,FALSE),\"\")","v":""},{"$f":"IFERROR(RTD(\"cqg.rtd\", ,\"ContractData\",L38, \"PerCentNetLastTrade\",, \"T\")/100,\"\")","v":""},{"$f":"IFERROR(RANK($M38,$M$2:M$104)+COUNTIF($M$2:M38,M38)-1,\"\")","v":""},"",37,"",{"$f":"IF(Q38=\"\",\"\",RTD(\"cqg.rtd\", ,\"ContractData\",Q38, \"LongDescription\",, \"T\"))","v":""},{"$f":"IFERROR(RTD(\"cqg.rtd\", ,\"ContractData\",Q38, \"PerCentNetLastTrade\",, \"T\")/100,\"\")","v":""},0]
[38,{"$f":"IFERROR(VLOOKUP(A39,Data!$H$2:$J$103,3,FALSE),\"\")","v":""},{"$f":"IFERROR(RTD(\"cqg.rtd\", ,\"ContractData\",B39, \"PerCentNetLastTrade\",, \"T\")/100,\"\")","v":""},{"$f":"IFERROR(RANK($C39,$C$2:C$103)+COUNTIF($C$2:C39,C39)-1,\"\")","v":""},"",38,"",{"$f":"IF(G39=\"\",\"\",RTD(\"cqg.rtd\", ,\"ContractData\",G39, \"LongDescription\",, \"T\"))","v":""},{"$f":"IFERROR(RTD(\"cqg.rtd\", ,\"ContractData\",G39, \"PerCentNetLastTrade\",, \"T\")/100,\"\")","v":""},0,38,{"$f":"IFERROR(VLOOKUP(A39,Data!$I$2:$J$103,2,FALSE),\"\")","v":""},{"$f":"IFERROR(RTD(\"cqg.rtd\", ,\"ContractData\",L39, \"PerCentNetLastTrade\",, \"T\")/100,\"\")","v":""},{"$f":"IFERROR(RANK($M39,$M$2:M$104)+COUNTIF($M$2:M39,M39)-1,\"\")","v":""},"",38,"",{"$f":"IF(Q39=\"\",\"\",RTD(\"cqg.rtd\", ,\"ContractData\",Q39, \"LongDescription\",, \"T\"))","v":""},{"$f":"IFERROR(RTD(\"cqg.rtd\", ,\"ContractData\",Q39, \"PerCentNetLastTrade\",, \"T\")/100,\"\")","v":""},0]
[39,{"$f":"IFERROR(VLOOKUP(A40,Data!$H$2:$J$103,3,FALSE),\"\")","v":""},{"$f":"IFERROR(RTD(\"cqg.rtd\", ,\"ContractData\",B40, \"PerCentNetLastTrade\",, \"T\")/100,\"\")","v":""},{"$f":"IFERROR(RANK($C40,$C$2:C$103)+COUNTIF($C$2:C40,C40)-1,\"\")","v":""},"",39,"",{"$f":"IF(G40=\"\",\"\",RTD(\"cqg.rtd\", ,\"ContractData\",G40, \"LongDescription\",, \"T\"))","v":""},{"$f":"IFERROR(RTD(\"cqg.rtd\", ,\"ContractData\",G40, \"PerCentNetLastTrade\",, \"T\")/100,\"\")","v":""},0,39,{"$f":"IFERROR(VLOOKUP(A40,Data!$I$2:$J$103,2,FALSE),\"\")","v":""},{"$f":"IFERROR(RTD(\"cqg.rtd\", ,\"ContractData\",L40, \"PerCentNetLastTrade\",, \"T\")/100,\"\")","v":""},{"$f":"IFERROR(RANK($M40,$M$2:M$104)+COUNTIF($M$2:M40,M40)-1,\"\")","v":""},"",39,"",{"$f":"IF(Q40=\"\",\"\",RTD(\"cqg.rtd\", ,\"ContractData\",Q40, \"LongDescription\",, \"T\"))","v":""},{"$f":"IFERROR(RTD(\"cqg.rtd\", ,\"ContractData\",Q40, \"PerCentNetLastTrade\",, \"T\")/100,\"\")","v":""},0]
[40,{"$f":"IFERROR(VLOOKUP(A41,Data!$H$2:$J$103,3,FALSE),\"\")","v":""},{"$f":"IFERROR(RTD(\"cqg.rtd\", ,\"ContractData\",B41, \"PerCentNetLastTrade\",, \"T\")/100,\"\")","v":""},{"$f":"IFERROR(RANK($C41,$C$2:C$103)+COUNTIF($C$2:C41,C41)-1,\"\")","v":""},"",40,"",{"$f":"IF(G41=\"\",\"\",RTD(\"cqg.rtd\", ,\"ContractData\",G41, \"LongDescription\",, \"T\"))","v":""},{"$f":"IFERROR(RTD(\"cqg.rtd\", ,\"ContractData\",G41, \"PerCentNetLastTrade\",, \"T\")/100,\"\")","v":""},0,40,{"$f":"IFERROR(VLOOKUP(A41,Data!$I$2:$J$103,2,FALSE),\"\")","v":""},{"$f":"IFERROR(RTD(\"cqg.rtd\", ,\"ContractData\",L41, \"PerCentNetLastTrade\",, \"T\")/100,\"\")","v":""},{"$f":"IFERROR(RANK($M41,$M$2:M$104)+COUNTIF($M$2:M41,M41)-1,\"\")","v":""},"",40,"",{"$f":"IF(Q41=\"\",\"\",RTD(\"cqg.rtd\", ,\"ContractData\",Q41, \"LongDescription\",, \"T\"))","v":""},{"$f":"IFERROR(RTD(\"cqg.rtd\", ,\"ContractData\",Q41, \"PerCentNetLastTrade\",, \"T\")/100,\"\")","v":""},0]
[41,{"$f":"IFERROR(VLOOKUP(A42,Data!$H$2:$J$103,3,FALSE),\"\")","v":""},{"$f":"IFERROR(RTD(\"cqg.rtd\", ,\"ContractData\",B42, \"PerCentNetLastTrade\",, \"T\")/100,\"\")","v":""},{"$f":"IFERROR(RANK($C42,$C$2:C$103)+COUNTIF($C$2:C42,C42)-1,\"\")","v":""},"",41,"",{"$f":"IF(G42=\"\",\"\",RTD(\"cqg.rtd\", ,\"ContractData\",G42, \"LongDescription\",, \"T\"))","v":""},{"$f":"IFERROR(RTD(\"cqg.rtd\", ,\"ContractData\",G42, \"PerCentNetLastTrade\",, \"T\")/100,\"\")","v":""},0,41,{"$f":"IFERROR(VLOOKUP(A42,Data!$I$2:$J$103,2,FALSE),\"\")","v":""},{"$f":"IFERROR(RTD(\"cqg.rtd\", ,\"ContractData\",L42, \"PerCentNetLastTrade\",, \"T\")/100,\"\")","v":""},{"$f":"IFERROR(RANK($M42,$M$2:M$104)+COUNTIF($M$2:M42,M42)-1,\"\")","v":""},"",41,"",{"$f":"IF(Q42=\"\",\"\",RTD(\"cqg.rtd\", ,\"ContractData\",Q42, \"LongDescription\",, \"T\"))","v":""},{"$f":"IFERROR(RTD(\"cqg.rtd\", ,\"ContractData\",Q42, \"PerCentNetLastTrade\",, \"T\")/100,\"\")","v":""},0]
[42,{"$f":"IFERROR(VLOOKUP(A43,Data!$H$2:$J$103,3,FALSE),\"\")","v":""},{"$f":"IFERROR(RTD(\"cqg.rtd\", ,\"ContractData\",B43, \"PerCentNetLastTrade\",, \"T\")/100,\"\")","v":""},{"$f":"IFERROR(RANK($C43,$C$2:C$103)+COUNTIF($C$2:C43,C43)-1,\"\")","v":""},"",42,"",{"$f":"IF(G43=\"\",\"\",RTD(\"cqg.rtd\", ,\"ContractData\",G43, \"LongDescription\",, \"T\"))","v":""},{"$f":"IFERROR(RTD(\"cqg.rtd\", ,\"ContractData\",G43, \"PerCentNetLastTrade\",, \"T\")/100,\"\")","v":""},0,42,{"$f":"IFERROR(VLOOKUP(A43,Data!$I$2:$J$103,2,FALSE),\"\")","v":""},{"$f":"IFERROR(RTD(\"cqg.rtd\", ,\"ContractData\",L43, \"PerCentNetLastTrade\",, \"T\")/100,\"\")","v":""},{"$f":"IFERROR(RANK($M43,$M$2:M$104)+COUNTIF($M$2:M43,M43)-1,\"\")","v":""},"",42,"",{"$f":"IF(Q43=\"\",\"\",RTD(\"cqg.rtd\", ,\"ContractData\",Q43, \"LongDescription\",, \"T\"))","v":""},{"$f":"IFERROR(RTD(\"cqg.rtd\", ,\"ContractData\",Q43, \"PerCentNetLastTrade\",, \"T\")/100,\"\")","v":""},0]
[43,{"$f":"IFERROR(VLOOKUP(A44,Data!$H$2:$J$103,3,FALSE),\"\")","v":""},{"$f":"IFERROR(RTD(\"cqg.rtd\", ,\"ContractData\",B44, \"PerCentNetLastTrade\",, \"T\")/100,\"\")","v":""},{"$f":"IFERROR(RANK($C44,$C$2:C$103)+COUNTIF($C$2:C44,C44)-1,\"\")","v":""},"",43,"",{"$f":"IF(G44=\"\",\"\",RTD(\"cqg.rtd\", ,\"ContractData\",G44, \"LongDescription\",, \"T\"))","v":""},{"$f":"IFERROR(RTD(\"cqg.rtd\", ,\"ContractData\",G44, \"PerCentNetLastTrade\",, \"T\")/100,\"\")","v":""},0,43,{"$f":"IFERROR(VLOOKUP(A44,Data!$I$2:$J$103,2,FALSE),\"\")","v":""},{"$f":"IFERROR(RTD(\"cqg.rtd\", ,\"ContractData\",L44, \"PerCentNetLastTrade\",, \"T\")/100,\"\")","v":""},{"$f":"IFERROR(RANK($M44,$M$2:M$104)+COUNTIF($M$2:M44,M44)-1,\"\")","v":""},"",43,"",{"$f":"IF(Q44=\"\",\"\",RTD(\"cqg.rtd\", ,\"ContractData\",Q44, \"LongDescription\",, \"T\"))","v":""},{"$f":"IFERROR(RTD(\"cqg.rtd\", ,\"ContractData\",Q44, \"PerCentNetLastTrade\",, \"T\")/100,\"\")","v":""},0]
[44,{"$f":"IFERROR(VLOOKUP(A45,Data!$H$2:$J$103,3,FALSE),\"\")","v":""},{"$f":"IFERROR(RTD(\"cqg.rtd\", ,\"ContractData\",B45, \"PerCentNetLastTrade\",, \"T\")/100,\"\")","v":""},{"$f":"IFERROR(RANK($C45,$C$2:C$103)+COUNTIF($C$2:C45,C45)-1,\"\")","v":""},"",44,"",{"$f":"IF(G45=\"\",\"\",RTD(\"cqg.rtd\", ,\"ContractData\",G45, \"LongDescription\",, \"T\"))","v":""},{"$f":"IFERROR(RTD(\"cqg.rtd\", ,\"ContractData\",G45, \"PerCentNetLastTrade\",, \"T\")/100,\"\")","v":""},0,44,{"$f":"IFERROR(VLOOKUP(A45,Data!$I$2:$J$103,2,FALSE),\"\")","v":""},{"$f":"IFERROR(RTD(\"cqg.rtd\", ,\"ContractData\",L45, \"PerCentNetLastTrade\",, \"T\")/100,\"\")","v":""},{"$f":"IFERROR(RANK($M45,$M$2:M$104)+COUNTIF($M$2:M45,M45)-1,\"\")","v":""},"",44,"",{"$f":"IF(Q45=\"\",\"\",RTD(\"cqg.rtd\", ,\"ContractData\",Q45, \"LongDescription\",, \"T\"))","v":""},{"$f":"IFERROR(RTD(\"cqg.rtd\", ,\"ContractData\",Q45, \"PerCentNetLastTrade\",, \"T\")/100,\"\")","v":""},0]
[45,{"$f":"IFERROR(VLOOKUP(A46,Data!$H$2:$J$103,3,FALSE),\"\")","v":""},{"$f":"IFERROR(RTD(\"cqg.rtd\", ,\"ContractData\",B46, \"PerCentNetLastTrade\",, \"T\")/100,\"\")","v":""},{"$f":"IFERROR(RANK($C46,$C$2:C$103)+COUNTIF($C$2:C46,C46)-1,\"\")","v":""},"",45,"",{"$f":"IF(G46=\"\",\"\",RTD(\"cqg.rtd\", ,\"ContractData\",G46, \"LongDescription\",, \"T\"))","v":""},{"$f":"IFERROR(RTD(\"cqg.rtd\", ,\"ContractData\",G46, \"PerCentNetLastTrade\",, \"T\")/100,\"\")","v":""},0,45,{"$f":"IFERROR(VLOOKUP(A46,Data!$I$2:$J$103,2,FALSE),\"\")","v":""},{"$f":"IFERROR(RTD(\"cqg.rtd\", ,\"ContractData\",L46, \"PerCentNetLastTrade\",, \"T\")/100,\"\")","v":""},{"$f":"IFERROR(RANK($M46,$M$2:M$104)+COUNTIF($M$2:M46,M46)-1,\"\")","v":""},"",45,"",{"$f":"IF(Q46=\"\",\"\",RTD(\"cqg.rtd\", ,\"ContractData\",Q46, \"LongDescription\",, \"T\"))","v":""},{"$f":"IFERROR(RTD(\"cqg.rtd\", ,\"ContractData\",Q46, \"PerCentNetLastTrade\",, \"T\")/100,\"\")","v":""},0]
[46,{"$f":"IFERROR(VLOOKUP(A47,Data!$H$2:$J$103,3,FALSE),\"\")","v":""},{"$f":"IFERROR(RTD(\"cqg.rtd\", ,\"ContractData\",B47, \"PerCentNetLastTrade\",, \"T\")/100,\"\")","v":""},{"$f":"IFERROR(RANK($C47,$C$2:C$103)+COUNTIF($C$2:C47,C47)-1,\"\")","v":""},"",46,"",{"$f":"IF(G47=\"\",\"\",RTD(\"cqg.rtd\", ,\"ContractData\",G47, \"LongDescription\",, \"T\"))","v":""},{"$f":"IFERROR(RTD(\"cqg.rtd\", ,\"ContractData\",G47, \"PerCentNetLastTrade\",, \"T\")/100,\"\")","v":""},0,46,{"$f":"IFERROR(VLOOKUP(A47,Data!$I$2:$J$103,2,FALSE),\"\")","v":""},{"$f":"IFERROR(RTD(\"cqg.rtd\", ,\"ContractData\",L47, \"PerCentNetLastTrade\",, \"T\")/100,\"\")","v":""},{"$f":"IFERROR(RANK($M47,$M$2:M$104)+COUNTIF($M$2:M47,M47)-1,\"\")","v":""},"",46,"",{"$f":"IF(Q47=\"\",\"\",RTD(\"cqg.rtd\", ,\"ContractData\",Q47, \"LongDescription\",, \"T\"))","v":""},{"$f":"IFERROR(RTD(\"cqg.rtd\", ,\"ContractData\",Q47, \"PerCentNetLastTrade\",, \"T\")/100,\"\")","v":""},0]
[47,{"$f":"IFERROR(VLOOKUP(A48,Data!$H$2:$J$103,3,FALSE),\"\")","v":""},{"$f":"IFERROR(RTD(\"cqg.rtd\", ,\"ContractData\",B48, \"PerCentNetLastTrade\",, \"T\")/100,\"\")","v":""},{"$f":"IFERROR(RANK($C48,$C$2:C$103)+COUNTIF($C$2:C48,C48)-1,\"\")","v":""},"",47,"",{"$f":"IF(G48=\"\",\"\",RTD(\"cqg.rtd\", ,\"ContractData\",G48, \"LongDescription\",, \"T\"))","v":""},{"$f":"IFERROR(RTD(\"cqg.rtd\", ,\"ContractData\",G48, \"PerCentNetLastTrade\",, \"T\")/100,\"\")","v":""},0,47,{"$f":"IFERROR(VLOOKUP(A48,Data!$I$2:$J$103,2,FALSE),\"\")","v":""},{"$f":"IFERROR(RTD(\"cqg.rtd\", ,\"ContractData\",L48, \"PerCentNetLastTrade\",, \"T\")/100,\"\")","v":""},{"$f":"IFERROR(RANK($M48,$M$2:M$104)+COUNTIF($M$2:M48,M48)-1,\"\")","v":""},"",47,"",{"$f":"IF(Q48=\"\",\"\",RTD(\"cqg.rtd\", ,\"ContractData\",Q48, \"LongDescription\",, \"T\"))","v":""},{"$f":"IFERROR(RTD(\"cqg.rtd\", ,\"ContractData\",Q48, \"PerCentNetLastTrade\",, \"T\")/100,\"\")","v":""},0]
[48,{"$f":"IFERROR(VLOOKUP(A49,Data!$H$2:$J$103,3,FALSE),\"\")","v":""},{"$f":"IFERROR(RTD(\"cqg.rtd\", ,\"ContractData\",B49, \"PerCentNetLastTrade\",, \"T\")/100,\"\")","v":""},{"$f":"IFERROR(RANK($C49,$C$2:C$103)+COUNTIF($C$2:C49,C49)-1,\"\")","v":""},"",48,"",{"$f":"IF(G49=\"\",\"\",RTD(\"cqg.rtd\", ,\"ContractData\",G49, \"LongDescription\",, \"T\"))","v":""},{"$f":"IFERROR(RTD(\"cqg.rtd\", ,\"ContractData\",G49, \"PerCentNetLastTrade\",, \"T\")/100,\"\")","v":""},0,48,{"$f":"IFERROR(VLOOKUP(A49,Data!$I$2:$J$103,2,FALSE),\"\")","v":""},{"$f":"IFERROR(RTD(\"cqg.rtd\", ,\"ContractData\",L49, \"PerCentNetLastTrade\",, \"T\")/100,\"\")","v":""},{"$f":"IFERROR(RANK($M49,$M$2:M$104)+COUNTIF($M$2:M49,M49)-1,\"\")","v":""},"",48,"",{"$f":"IF(Q49=\"\",\"\",RTD(\"cqg.rtd\", ,\"ContractData\",Q49, \"LongDescription\",, \"T\"))","v":""},{"$f":"IFERROR(RTD(\"cqg.rtd\", ,\"ContractData\",Q49, \"PerCentNetLastTrade\",, \"T\")/100,\"\")","v":""},0]
[49,{"$f":"IFERROR(VLOOKUP(A50,Data!$H$2:$J$103,3,FALSE),\"\")","v":""},{"$f":"IFERROR(RTD(\"cqg.rtd\", ,\"ContractData\",B50, \"PerCentNetLastTrade\",, \"T\")/100,\"\")","v":""},{"$f":"IFERROR(RANK($C50,$C$2:C$103)+COUNTIF($C$2:C50,C50)-1,\"\")","v":""},"",49,"",{"$f":"IF(G50=\"\",\"\",RTD(\"cqg.rtd\", ,\"ContractData\",G50, \"LongDescription\",, \"T\"))","v":""},{"$f":"IFERROR(RTD(\"cqg.rtd\", ,\"ContractData\",G50, \"PerCentNetLastTrade\",, \"T\")/100,\"\")","v":""},0,49,{"$f":"IFERROR(VLOOKUP(A50,Data!$I$2:$J$103,2,FALSE),\"\")","v":""},{"$f":"IFERROR(RTD(\"cqg.rtd\", ,\"ContractData\",L50, \"PerCentNetLastTrade\",, \"T\")/100,\"\")","v":""},{"$f":"IFERROR(RANK($M50,$M$2:M$104)+COUNTIF($M$2:M50,M50)-1,\"\")","v":""},"",49,"",{"$f":"IF(Q50=\"\",\"\",RTD(\"cqg.rtd\", ,\"ContractData\",Q50, \"LongDescription\",, \"T\"))","v":""},{"$f":"IFERROR(RTD(\"cqg.rtd\", ,\"ContractData\",Q50, \"PerCentNetLastTrade\",, \"T\")/100,\"\")","v":""},0]
[50,{"$f":"IFERROR(VLOOKUP(A51,Data!$H$2:$J$103,3,FALSE),\"\")","v":""},{"$f":"IFERROR(RTD(\"cqg.rtd\", ,\"ContractData\",B51, \"PerCentNetLastTrade\",, \"T\")/100,\"\")","v":""},{"$f":"IFERROR(RANK($C51,$C$2:C$103)+COUNTIF($C$2:C51,C51)-1,\"\")","v":""},"",50,"",{"$f":"IF(G51=\"\",\"\",RTD(\"cqg.rtd\", ,\"ContractData\",G51, \"LongDescription\",, \"T\"))","v":""},{"$f":"IFERROR(RTD(\"cqg.rtd\", ,\"ContractData\",G51, \"PerCentNetLastTrade\",, \"T\")/100,\"\")","v":""},0,50,{"$f":"IFERROR(VLOOKUP(A51,Data!$I$2:$J$103,2,FALSE),\"\")","v":""},{"$f":"IFERROR(RTD(\"cqg.rtd\", ,\"ContractData\",L51, \"PerCentNetLastTrade\",, \"T\")/100,\"\")","v":""},{"$f":"IFERROR(RANK($M51,$M$2:M$104)+COUNTIF($M$2:M51,M51)-1,\"\")","v":""},"",50,"",{"$f":"IF(Q51=\"\",\"\",RTD(\"cqg.rtd\", ,\"ContractData\",Q51, \"LongDescription\",, \"T\"))","v":""},{"$f":"IFERROR(RTD(\"cqg.rtd\", ,\"ContractData\",Q51, \"PerCentNetLastTrade\",, \"T\")/100,\"\")","v":""},0]
[51,{"$f":"IFERROR(VLOOKUP(A52,Data!$H$2:$J$103,3,FALSE),\"\")","v":""},{"$f":"IFERROR(RTD(\"cqg.rtd\", ,\"ContractData\",B52, \"PerCentNetLastTrade\",, \"T\")/100,\"\")","v":""},{"$f":"IFERROR(RANK($C52,$C$2:C$103)+COUNTIF($C$2:C52,C52)-1,\"\")","v":""},"",51,"",{"$f":"IF(G52=\"\",\"\",RTD(\"cqg.rtd\", ,\"ContractData\",G52, \"LongDescription\",, \"T\"))","v":""},{"$f":"IFERROR(RTD(\"cqg.rtd\", ,\"ContractData\",G52, \"PerCentNetLastTrade\",, \"T\")/100,\"\")","v":""},0,51,{"$f":"IFERROR(VLOOKUP(A52,Data!$I$2:$J$103,2,FALSE),\"\")","v":""},{"$f":"IFERROR(RTD(\"cqg.rtd\", ,\"ContractData\",L52, \"PerCentNetLastTrade\",, \"T\")/100,\"\")","v":""},{"$f":"IFERROR(RANK($M52,$M$2:M$104)+COUNTIF($M$2:M52,M52)-1,\"\")","v":""},"",51,"",{"$f":"IF(Q52=\"\",\"\",RTD(\"cqg.rtd\", ,\"ContractData\",Q52, \"LongDescription\",, \"T\"))","v":""},{"$f":"IFERROR(RTD(\"cqg.rtd\", ,\"ContractData\",Q52, \"PerCentNetLastTrade\",, \"T\")/100,\"\")","v":""},0]
[52,{"$f":"IFERROR(VLOOKUP(A53,Data!$H$2:$J$103,3,FALSE),\"\")","v":""},{"$f":"IFERROR(RTD(\"cqg.rtd\", ,\"ContractData\",B53, \"PerCentNetLastTrade\",, \"T\")/100,\"\")","v":""},{"$f":"IFERROR(RANK($C53,$C$2:C$103)+COUNTIF($C$2:C53,C53)-1,\"\")","v":""},"",52,"",{"$f":"IF(G53=\"\",\"\",RTD(\"cqg.rtd\", ,\"ContractData\",G53, \"LongDescription\",, \"T\"))","v":""},{"$f":"IFERROR(RTD(\"cqg.rtd\", ,\"ContractData\",G53, \"PerCentNetLastTrade\",, \"T\")/100,\"\")","v":""},0,52,{"$f":"IFERROR(VLOOKUP(A53,Data!$I$2:$J$103,2,FALSE),\"\")","v":""},{"$f":"IFERROR(RTD(\"cqg.rtd\", ,\"ContractData\",L53, \"PerCentNetLastTrade\",, \"T\")/100,\"\")","v":""},{"$f":"IFERROR(RANK($M53,$M$2:M$104)+COUNTIF($M$2:M53,M53)-1,\"\")","v":""},"",52,"",{"$f":"IF(Q53=\"\",\"\",RTD(\"cqg.rtd\", ,\"ContractData\",Q53, \"LongDescription\",, \"T\"))","v":""},{"$f":"IFERROR(RTD(\"cqg.rtd\", ,\"ContractData\",Q53, \"PerCentNetLastTrade\",, \"T\")/100,\"\")","v":""},0]
[53,{"$f":"IFERROR(VLOOKUP(A54,Data!$H$2:$J$103,3,FALSE),\"\")","v":""},{"$f":"IFERROR(RTD(\"cqg.rtd\", ,\"ContractData\",B54, \"PerCentNetLastTrade\",, \"T\")/100,\"\")","v":""},{"$f":"IFERROR(RANK($C54,$C$2:C$103)+COUNTIF($C$2:C54,C54)-1,\"\")","v":""},"",53,"",{"$f":"IF(G54=\"\",\"\",RTD(\"cqg.rtd\", ,\"ContractData\",G54, \"LongDescription\",, \"T\"))","v":""},{"$f":"IFERROR(RTD(\"cqg.rtd\", ,\"ContractData\",G54, \"PerCentNetLastTrade\",, \"T\")/100,\"\")","v":""},0,53,{"$f":"IFERROR(VLOOKUP(A54,Data!$I$2:$J$103,2,FALSE),\"\")","v":""},{"$f":"IFERROR(RTD(\"cqg.rtd\", ,\"ContractData\",L54, \"PerCentNetLastTrade\",, \"T\")/100,\"\")","v":""},{"$f":"IFERROR(RANK($M54,$M$2:M$104)+COUNTIF($M$2:M54,M54)-1,\"\")","v":""},"",53,"",{"$f":"IF(Q54=\"\",\"\",RTD(\"cqg.rtd\", ,\"ContractData\",Q54, \"LongDescription\",, \"T\"))","v":""},{"$f":"IFERROR(RTD(\"cqg.rtd\", ,\"ContractData\",Q54, \"PerCentNetLastTrade\",, \"T\")/100,\"\")","v":""},0]
[54,{"$f":"IFERROR(VLOOKUP(A55,Data!$H$2:$J$103,3,FALSE),\"\")","v":""},{"$f":"IFERROR(RTD(\"cqg.rtd\", ,\"ContractData\",B55, \"PerCentNetLastTrade\",, \"T\")/100,\"\")","v":""},{"$f":"IFERROR(RANK($C55,$C$2:C$103)+COUNTIF($C$2:C55,C55)-1,\"\")","v":""},"",54,"",{"$f":"IF(G55=\"\",\"\",RTD(\"cqg.rtd\", ,\"ContractData\",G55, \"LongDescription\",, \"T\"))","v":""},{"$f":"IFERROR(RTD(\"cqg.rtd\", ,\"ContractData\",G55, \"PerCentNetLastTrade\",, \"T\")/100,\"\")","v":""},0,54,{"$f":"IFERROR(VLOOKUP(A55,Data!$I$2:$J$103,2,FALSE),\"\")","v":""},{"$f":"IFERROR(RTD(\"cqg.rtd\", ,\"ContractData\",L55, \"PerCentNetLastTrade\",, \"T\")/100,\"\")","v":""},{"$f":"IFERROR(RANK($M55,$M$2:M$104)+COUNTIF($M$2:M55,M55)-1,\"\")","v":""},"",54,"",{"$f":"IF(Q55=\"\",\"\",RTD(\"cqg.rtd\", ,\"ContractData\",Q55, \"LongDescription\",, \"T\"))","v":""},{"$f":"IFERROR(RTD(\"cqg.rtd\", ,\"ContractData\",Q55, \"PerCentNetLastTrade\",, \"T\")/100,\"\")","v":""},0]
[55,{"$f":"IFERROR(VLOOKUP(A56,Data!$H$2:$J$103,3,FALSE),\"\")","v":""},{"$f":"IFERROR(RTD(\"cqg.rtd\", ,\"ContractData\",B56, \"PerCentNetLastTrade\",, \"T\")/100,\"\")","v":""},{"$f":"IFERROR(RANK($C56,$C$2:C$103)+COUNTIF($C$2:C56,C56)-1,\"\")","v":""},"",55,"",{"$f":"IF(G56=\"\",\"\",RTD(\"cqg.rtd\", ,\"ContractData\",G56, \"LongDescription\",, \"T\"))","v":""},{"$f":"IFERROR(RTD(\"cqg.rtd\", ,\"ContractData\",G56, \"PerCentNetLastTrade\",, \"T\")/100,\"\")","v":""},0,55,{"$f":"IFERROR(VLOOKUP(A56,Data!$I$2:$J$103,2,FALSE),\"\")","v":""},{"$f":"IFERROR(RTD(\"cqg.rtd\", ,\"ContractData\",L56, \"PerCentNetLastTrade\",, \"T\")/100,\"\")","v":""},{"$f":"IFERROR(RANK($M56,$M$2:M$104)+COUNTIF($M$2:M56,M56)-1,\"\")","v":""},"",55,"",{"$f":"IF(Q56=\"\",\"\",RTD(\"cqg.rtd\", ,\"ContractData\",Q56, \"LongDescription\",, \"T\"))","v":""},{"$f":"IFERROR(RTD(\"cqg.rtd\", ,\"ContractData\",Q56, \"PerCentNetLastTrade\",, \"T\")/100,\"\")","v":""},0]
[56,{"$f":"IFERROR(VLOOKUP(A57,Data!$H$2:$J$103,3,FALSE),\"\")","v":""},{"$f":"IFERROR(RTD(\"cqg.rtd\", ,\"ContractData\",B57, \"PerCentNetLastTrade\",, \"T\")/100,\"\")","v":""},{"$f":"IFERROR(RANK($C57,$C$2:C$103)+COUNTIF($C$2:C57,C57)-1,\"\")","v":""},"",56,"",{"$f":"IF(G57=\"\",\"\",RTD(\"cqg.rtd\", ,\"ContractData\",G57, \"LongDescription\",, \"T\"))","v":""},{"$f":"IFERROR(RTD(\"cqg.rtd\", ,\"ContractData\",G57, \"PerCentNetLastTrade\",, \"T\")/100,\"\")","v":""},0,56,{"$f":"IFERROR(VLOOKUP(A57,Data!$I$2:$J$103,2,FALSE),\"\")","v":""},{"$f":"IFERROR(RTD(\"cqg.rtd\", ,\"ContractData\",L57, \"PerCentNetLastTrade\",, \"T\")/100,\"\")","v":""},{"$f":"IFERROR(RANK($M57,$M$2:M$104)+COUNTIF($M$2:M57,M57)-1,\"\")","v":""},"",56,"",{"$f":"IF(Q57=\"\",\"\",RTD(\"cqg.rtd\", ,\"ContractData\",Q57, \"LongDescription\",, \"T\"))","v":""},{"$f":"IFERROR(RTD(\"cqg.rtd\", ,\"ContractData\",Q57, \"PerCentNetLastTrade\",, \"T\")/100,\"\")","v":""},0]
[57,{"$f":"IFERROR(VLOOKUP(A58,Data!$H$2:$J$103,3,FALSE),\"\")","v":""},{"$f":"IFERROR(RTD(\"cqg.rtd\", ,\"ContractData\",B58, \"PerCentNetLastTrade\",, \"T\")/100,\"\")","v":""},{"$f":"IFERROR(RANK($C58,$C$2:C$103)+COUNTIF($C$2:C58,C58)-1,\"\")","v":""},"",57,"",{"$f":"IF(G58=\"\",\"\",RTD(\"cqg.rtd\", ,\"ContractData\",G58, \"LongDescription\",, \"T\"))","v":""},{"$f":"IFERROR(RTD(\"cqg.rtd\", ,\"ContractData\",G58, \"PerCentNetLastTrade\",, \"T\")/100,\"\")","v":""},0,57,{"$f":"IFERROR(VLOOKUP(A58,Data!$I$2:$J$103,2,FALSE),\"\")","v":""},{"$f":"IFERROR(RTD(\"cqg.rtd\", ,\"ContractData\",L58, \"PerCentNetLastTrade\",, \"T\")/100,\"\")","v":""},{"$f":"IFERROR(RANK($M58,$M$2:M$104)+COUNTIF($M$2:M58,M58)-1,\"\")","v":""},"",57,"",{"$f":"IF(Q58=\"\",\"\",RTD(\"cqg.rtd\", ,\"ContractData\",Q58, \"LongDescription\",, \"T\"))","v":""},{"$f":"IFERROR(RTD(\"cqg.rtd\", ,\"ContractData\",Q58, \"PerCentNetLastTrade\",, \"T\")/100,\"\")","v":""},0]
[58,{"$f":"IFERROR(VLOOKUP(A59,Data!$H$2:$J$103,3,FALSE),\"\")","v":""},{"$f":"IFERROR(RTD(\"cqg.rtd\", ,\"ContractData\",B59, \"PerCentNetLastTrade\",, \"T\")/100,\"\")","v":""},{"$f":"IFERROR(RANK($C59,$C$2:C$103)+COUNTIF($C$2:C59,C59)-1,\"\")","v":""},"",58,"",{"$f":"IF(G59=\"\",\"\",RTD(\"cqg.rtd\", ,\"ContractData\",G59, \"LongDescription\",, \"T\"))","v":""},{"$f":"IFERROR(RTD(\"cqg.rtd\", ,\"ContractData\",G59, \"PerCentNetLastTrade\",, \"T\")/100,\"\")","v":""},0,58,{"$f":"IFERROR(VLOOKUP(A59,Data!$I$2:$J$103,2,FALSE),\"\")","v":""},{"$f":"IFERROR(RTD(\"cqg.rtd\", ,\"ContractData\",L59, \"PerCentNetLastTrade\",, \"T\")/100,\"\")","v":""},{"$f":"IFERROR(RANK($M59,$M$2:M$104)+COUNTIF($M$2:M59,M59)-1,\"\")","v":""},"",58,"",{"$f":"IF(Q59=\"\",\"\",RTD(\"cqg.rtd\", ,\"ContractData\",Q59, \"LongDescription\",, \"T\"))","v":""},{"$f":"IFERROR(RTD(\"cqg.rtd\", ,\"ContractData\",Q59, \"PerCentNetLastTrade\",, \"T\")/100,\"\")","v":""},0]
[59,{"$f":"IFERROR(VLOOKUP(A60,Data!$H$2:$J$103,3,FALSE),\"\")","v":""},{"$f":"IFERROR(RTD(\"cqg.rtd\", ,\"ContractData\",B60, \"PerCentNetLastTrade\",, \"T\")/100,\"\")","v":""},{"$f":"IFERROR(RANK($C60,$C$2:C$103)+COUNTIF($C$2:C60,C60)-1,\"\")","v":""},"",59,"",{"$f":"IF(G60=\"\",\"\",RTD(\"cqg.rtd\", ,\"ContractData\",G60, \"LongDescription\",, \"T\"))","v":""},{"$f":"IFERROR(RTD(\"cqg.rtd\", ,\"ContractData\",G60, \"PerCentNetLastTrade\",, \"T\")/100,\"\")","v":""},0,59,{"$f":"IFERROR(VLOOKUP(A60,Data!$I$2:$J$103,2,FALSE),\"\")","v":""},{"$f":"IFERROR(RTD(\"cqg.rtd\", ,\"ContractData\",L60, \"PerCentNetLastTrade\",, \"T\")/100,\"\")","v":""},{"$f":"IFERROR(RANK($M60,$M$2:M$104)+COUNTIF($M$2:M60,M60)-1,\"\")","v":""},"",59,"",{"$f":"IF(Q60=\"\",\"\",RTD(\"cqg.rtd\", ,\"ContractData\",Q60, \"LongDescription\",, \"T\"))","v":""},{"$f":"IFERROR(RTD(\"cqg.rtd\", ,\"ContractData\",Q60, \"PerCentNetLastTrade\",, \"T\")/100,\"\")","v":""},0]
[60,{"$f":"IFERROR(VLOOKUP(A61,Data!$H$2:$J$103,3,FALSE),\"\")","v":""},{"$f":"IFERROR(RTD(\"cqg.rtd\", ,\"ContractData\",B61, \"PerCentNetLastTrade\",, \"T\")/100,\"\")","v":""},{"$f":"IFERROR(RANK($C61,$C$2:C$103)+COUNTIF($C$2:C61,C61)-1,\"\")","v":""},"",60,"",{"$f":"IF(G61=\"\",\"\",RTD(\"cqg.rtd\", ,\"ContractData\",G61, \"LongDescription\",, \"T\"))","v":""},{"$f":"IFERROR(RTD(\"cqg.rtd\", ,\"ContractData\",G61, \"PerCentNetLastTrade\",, \"T\")/100,\"\")","v":""},0,60,{"$f":"IFERROR(VLOOKUP(A61,Data!$I$2:$J$103,2,FALSE),\"\")","v":""},{"$f":"IFERROR(RTD(\"cqg.rtd\", ,\"ContractData\",L61, \"PerCentNetLastTrade\",, \"T\")/100,\"\")","v":""},{"$f":"IFERROR(RANK($M61,$M$2:M$104)+COUNTIF($M$2:M61,M61)-1,\"\")","v":""},"",60,"",{"$f":"IF(Q61=\"\",\"\",RTD(\"cqg.rtd\", ,\"ContractData\",Q61, \"LongDescription\",, \"T\"))","v":""},{"$f":"IFERROR(RTD(\"cqg.rtd\", ,\"ContractData\",Q61, \"PerCentNetLastTrade\",, \"T\")/100,\"\")","v":""},0]
[61,{"$f":"IFERROR(VLOOKUP(A62,Data!$H$2:$J$103,3,FALSE),\"\")","v":""},{"$f":"IFERROR(RTD(\"cqg.rtd\", ,\"ContractData\",B62, \"PerCentNetLastTrade\",, \"T\")/100,\"\")","v":""},{"$f":"IFERROR(RANK($C62,$C$2:C$103)+COUNTIF($C$2:C62,C62)-1,\"\")","v":""},"",61,"",{"$f":"IF(G62=\"\",\"\",RTD(\"cqg.rtd\", ,\"ContractData\",G62, \"LongDescription\",, \"T\"))","v":""},{"$f":"IFERROR(RTD(\"cqg.rtd\", ,\"ContractData\",G62, \"PerCentNetLastTrade\",, \"T\")/100,\"\")","v":""},0,61,{"$f":"IFERROR(VLOOKUP(A62,Data!$I$2:$J$103,2,FALSE),\"\")","v":""},{"$f":"IFERROR(RTD(\"cqg.rtd\", ,\"ContractData\",L62, \"PerCentNetLastTrade\",, \"T\")/100,\"\")","v":""},{"$f":"IFERROR(RANK($M62,$M$2:M$104)+COUNTIF($M$2:M62,M62)-1,\"\")","v":""},"",61,"",{"$f":"IF(Q62=\"\",\"\",RTD(\"cqg.rtd\", ,\"ContractData\",Q62, \"LongDescription\",, \"T\"))","v":""},{"$f":"IFERROR(RTD(\"cqg.rtd\", ,\"ContractData\",Q62, \"PerCentNetLastTrade\",, \"T\")/100,\"\")","v":""},0]
[62,{"$f":"IFERROR(VLOOKUP(A63,Data!$H$2:$J$103,3,FALSE),\"\")","v":""},{"$f":"IFERROR(RTD(\"cqg.rtd\", ,\"ContractData\",B63, \"PerCentNetLastTrade\",, \"T\")/100,\"\")","v":""},{"$f":"IFERROR(RANK($C63,$C$2:C$103)+COUNTIF($C$2:C63,C63)-1,\"\")","v":""},"",62,"",{"$f":"IF(G63=\"\",\"\",RTD(\"cqg.rtd\", ,\"ContractData\",G63, \"LongDescription\",, \"T\"))","v":""},{"$f":"IFERROR(RTD(\"cqg.rtd\", ,\"ContractData\",G63, \"PerCentNetLastTrade\",, \"T\")/100,\"\")","v":""},0,62,{"$f":"IFERROR(VLOOKUP(A63,Data!$I$2:$J$103,2,FALSE),\"\")","v":""},{"$f":"IFERROR(RTD(\"cqg.rtd\", ,\"ContractData\",L63, \"PerCentNetLastTrade\",, \"T\")/100,\"\")","v":""},{"$f":"IFERROR(RANK($M63,$M$2:M$104)+COUNTIF($M$2:M63,M63)-1,\"\")","v":""},"",62,"",{"$f":"IF(Q63=\"\",\"\",RTD(\"cqg.rtd\", ,\"ContractData\",Q63, \"LongDescription\",, \"T\"))","v":""},{"$f":"IFERROR(RTD(\"cqg.rtd\", ,\"ContractData\",Q63, \"PerCentNetLastTrade\",, \"T\")/100,\"\")","v":""},0]
[63,{"$f":"IFERROR(VLOOKUP(A64,Data!$H$2:$J$103,3,FALSE),\"\")","v":""},{"$f":"IFERROR(RTD(\"cqg.rtd\", ,\"ContractData\",B64, \"PerCentNetLastTrade\",, \"T\")/100,\"\")","v":""},{"$f":"IFERROR(RANK($C64,$C$2:C$103)+COUNTIF($C$2:C64,C64)-1,\"\")","v":""},"",63,"",{"$f":"IF(G64=\"\",\"\",RTD(\"cqg.rtd\", ,\"ContractData\",G64, \"LongDescription\",, \"T\"))","v":""},{"$f":"IFERROR(RTD(\"cqg.rtd\", ,\"ContractData\",G64, \"PerCentNetLastTrade\",, \"T\")/100,\"\")","v":""},0,63,{"$f":"IFERROR(VLOOKUP(A64,Data!$I$2:$J$103,2,FALSE),\"\")","v":""},{"$f":"IFERROR(RTD(\"cqg.rtd\", ,\"ContractData\",L64, \"PerCentNetLastTrade\",, \"T\")/100,\"\")","v":""},{"$f":"IFERROR(RANK($M64,$M$2:M$104)+COUNTIF($M$2:M64,M64)-1,\"\")","v":""},"",63,"",{"$f":"IF(Q64=\"\",\"\",RTD(\"cqg.rtd\", ,\"ContractData\",Q64, \"LongDescription\",, \"T\"))","v":""},{"$f":"IFERROR(RTD(\"cqg.rtd\", ,\"ContractData\",Q64, \"PerCentNetLastTrade\",, \"T\")/100,\"\")","v":""},0]
[64,{"$f":"IFERROR(VLOOKUP(A65,Data!$H$2:$J$103,3,FALSE),\"\")","v":""},{"$f":"IFERROR(RTD(\"cqg.rtd\", ,\"ContractData\",B65, \"PerCentNetLastTrade\",, \"T\")/100,\"\")","v":""},{"$f":"IFERROR(RANK($C65,$C$2:C$103)+COUNTIF($C$2:C65,C65)-1,\"\")","v":""},"",64,"",{"$f":"IF(G65=\"\",\"\",RTD(\"cqg.rtd\", ,\"ContractData\",G65, \"LongDescription\",, \"T\"))","v":""},{"$f":"IFERROR(RTD(\"cqg.rtd\", ,\"ContractData\",G65, \"PerCentNetLastTrade\",, \"T\")/100,\"\")","v":""},0,64,{"$f":"IFERROR(VLOOKUP(A65,Data!$I$2:$J$103,2,FALSE),\"\")","v":""},{"$f":"IFERROR(RTD(\"cqg.rtd\", ,\"ContractData\",L65, \"PerCentNetLastTrade\",, \"T\")/100,\"\")","v":""},{"$f":"IFERROR(RANK($M65,$M$2:M$104)+COUNTIF($M$2:M65,M65)-1,\"\")","v":""},"",64,"",{"$f":"IF(Q65=\"\",\"\",RTD(\"cqg.rtd\", ,\"ContractData\",Q65, \"LongDescription\",, \"T\"))","v":""},{"$f":"IFERROR(RTD(\"cqg.rtd\", ,\"ContractData\",Q65, \"PerCentNetLastTrade\",, \"T\")/100,\"\")","v":""},0]
[65,{"$f":"IFERROR(VLOOKUP(A66,Data!$H$2:$J$103,3,FALSE),\"\")","v":""},{"$f":"IFERROR(RTD(\"cqg.rtd\", ,\"ContractData\",B66, \"PerCentNetLastTrade\",, \"T\")/100,\"\")","v":""},{"$f":"IFERROR(RANK($C66,$C$2:C$103)+COUNTIF($C$2:C66,C66)-1,\"\")","v":""},"",65,"",{"$f":"IF(G66=\"\",\"\",RTD(\"cqg.rtd\", ,\"ContractData\",G66, \"LongDescription\",, \"T\"))","v":""},{"$f":"IFERROR(RTD(\"cqg.rtd\", ,\"ContractData\",G66, \"PerCentNetLastTrade\",, \"T\")/100,\"\")","v":""},0,65,{"$f":"IFERROR(VLOOKUP(A66,Data!$I$2:$J$103,2,FALSE),\"\")","v":""},{"$f":"IFERROR(RTD(\"cqg.rtd\", ,\"ContractData\",L66, \"PerCentNetLastTrade\",, \"T\")/100,\"\")","v":""},{"$f":"IFERROR(RANK($M66,$M$2:M$104)+COUNTIF($M$2:M66,M66)-1,\"\")","v":""},"",65,"",{"$f":"IF(Q66=\"\",\"\",RTD(\"cqg.rtd\", ,\"ContractData\",Q66, \"LongDescription\",, \"T\"))","v":""},{"$f":"IFERROR(RTD(\"cqg.rtd\", ,\"ContractData\",Q66, \"PerCentNetLastTrade\",, \"T\")/100,\"\")","v":""},0]
[66,{"$f":"IFERROR(VLOOKUP(A67,Data!$H$2:$J$103,3,FALSE),\"\")","v":""},{"$f":"IFERROR(RTD(\"cqg.rtd\", ,\"ContractData\",B67, \"PerCentNetLastTrade\",, \"T\")/100,\"\")","v":""},{"$f":"IFERROR(RANK($C67,$C$2:C$103)+COUNTIF($C$2:C67,C67)-1,\"\")","v":""},{"$f":"IF(B67=\"\",\"\",B67)","v":""},66,{"$f":"IFERROR(VLOOKUP(F67,$D$2:$E$103,2,FALSE),\"\")","v":""},{"$f":"IF(G67=\"\",\"\",RTD(\"cqg.rtd\", ,\"ContractData\",G67, \"LongDescription\",, \"T\"))","v":""},{"$f":"IFERROR(RTD(\"cqg.rtd\", ,\"ContractData\",G67, \"PerCentNetLastTrade\",, \"T\")/100,\"\")","v":""},{"$f":"IF(I67<>\"\",1,0)","v":0},66,{"$f":"IFERROR(VLOOKUP(A67,Data!$I$2:$J$103,2,FALSE),\"\")","v":""},{"$f":"IFERROR(RTD(\"cqg.rtd\", ,\"ContractData\",L67, \"PerCentNetLastTrade\",, \"T\")/100,\"\")","v":""},{"$f":"IFERROR(RANK($M67,$M$2:M$104)+COUNTIF($M$2:M67,M67)-1,\"\")","v":""},{"$f":"IF(L67=\"\",\"\",L67)","v":""},66,{"$f":"IFERROR(VLOOKUP(P67,$N$2:$O$103,2,FALSE),\"\")","v":""},{"$f":"IF(Q67=\"\",\"\",RTD(\"cqg.rtd\", ,\"ContractData\",Q67, \"LongDescription\",, \"T\"))","v":""},{"$f":"IFERROR(RTD(\"cqg.rtd\", ,\"ContractData\",Q67, \"PerCentNetLastTrade\",, \"T\")/100,\"\")","v":""},{"$f":"IF(S67<>\"\",1,0)","v":0}]
[{"$f":"A67+1","v":67},{"$f":"IFERROR(VLOOKUP(A68,Data!$H$2:$J$103,3,FALSE),\"\")","v":""},{"$f":"IFERROR(RTD(\"cqg.rtd\", ,\"ContractData\",B68, \"PerCentNetLastTrade\",, \"T\")/100,\"\")","v":""},{"$f":"IFERROR(RANK($C68,$C$2:C$103)+COUNTIF($C$2:C68,C68)-1,\"\")","v":""},"",{"$f":"F67+1","v":67},"",{"$f":"IF(G68=\"\",\"\",RTD(\"cqg.rtd\", ,\"ContractData\",G68, \"LongDescription\",, \"T\"))","v":""},{"$f":"IFERROR(RTD(\"cqg.rtd\", ,\"ContractData\",G68, \"PerCentNetLastTrade\",, \"T\")/100,\"\")","v":""},0,{"$f":"K67+1","v":67},{"$f":"IFERROR(VLOOKUP(A68,Data!$I$2:$J$103,2,FALSE),\"\")","v":""},{"$f":"IFERROR(RTD(\"cqg.rtd\", ,\"ContractData\",L68, \"PerCentNetLastTrade\",, \"T\")/100,\"\")","v":""},{"$f":"IFERROR(RANK($M68,$M$2:M$104)+COUNTIF($M$2:M68,M68)-1,\"\")","v":""},"",{"$f":"P67+1","v":67},"",{"$f":"IF(Q68=\"\",\"\",RTD(\"cqg.rtd\", ,\"ContractData\",Q68, \"LongDescription\",, \"T\"))","v":""},{"$f":"IFERROR(RTD(\"cqg.rtd\", ,\"ContractData\",Q68, \"PerCentNetLastTrade\",, \"T\")/100,\"\")","v":""},0]
[68,{"$f":"IFERROR(VLOOKUP(A69,Data!$H$2:$J$103,3,FALSE),\"\")","v":""},{"$f":"IFERROR(RTD(\"cqg.rtd\", ,\"ContractData\",B69, \"PerCentNetLastTrade\",, \"T\")/100,\"\")","v":""},{"$f":"IFERROR(RANK($C69,$C$2:C$103)+COUNTIF($C$2:C69,C69)-1,\"\")","v":""},"",68,"",{"$f":"IF(G69=\"\",\"\",RTD(\"cqg.rtd\", ,\"ContractData\",G69, \"LongDescription\",, \"T\"))","v":""},{"$f":"IFERROR(RTD(\"cqg.rtd\", ,\"ContractData\",G69, \"PerCentNetLastTrade\",, \"T\")/100,\"\")","v":""},0,68,{"$f":"IFERROR(VLOOKUP(A69,Data!$I$2:$J$103,2,FALSE),\"\")","v":""},{"$f":"IFERROR(RTD(\"cqg.rtd\", ,\"ContractData\",L69, \"PerCentNetLastTrade\",, \"T\")/100,\"\")","v":""},{"$f":"IFERROR(RANK($M69,$M$2:M$104)+COUNTIF($M$2:M69,M69)-1,\"\")","v":""},"",68,"",{"$f":"IF(Q69=\"\",\"\",RTD(\"cqg.rtd\", ,\"ContractData\",Q69, \"LongDescription\",, \"T\"))","v":""},{"$f":"IFERROR(RTD(\"cqg.rtd\", ,\"ContractData\",Q69, \"PerCentNetLastTrade\",, \"T\")/100,\"\")","v":""},0]
[69,{"$f":"IFERROR(VLOOKUP(A70,Data!$H$2:$J$103,3,FALSE),\"\")","v":""},{"$f":"IFERROR(RTD(\"cqg.rtd\", ,\"ContractData\",B70, \"PerCentNetLastTrade\",, \"T\")/100,\"\")","v":""},{"$f":"IFERROR(RANK($C70,$C$2:C$103)+COUNTIF($C$2:C70,C70)-1,\"\")","v":""},"",69,"",{"$f":"IF(G70=\"\",\"\",RTD(\"cqg.rtd\", ,\"ContractData\",G70, \"LongDescription\",, \"T\"))","v":""},{"$f":"IFERROR(RTD(\"cqg.rtd\", ,\"ContractData\",G70, \"PerCentNetLastTrade\",, \"T\")/100,\"\")","v":""},0,69,{"$f":"IFERROR(VLOOKUP(A70,Data!$I$2:$J$103,2,FALSE),\"\")","v":""},{"$f":"IFERROR(RTD(\"cqg.rtd\", ,\"ContractData\",L70, \"PerCentNetLastTrade\",, \"T\")/100,\"\")","v":""},{"$f":"IFERROR(RANK($M70,$M$2:M$104)+COUNTIF($M$2:M70,M70)-1,\"\")","v":""},"",69,"",{"$f":"IF(Q70=\"\",\"\",RTD(\"cqg.rtd\", ,\"ContractData\",Q70, \"LongDescription\",, \"T\"))","v":""},{"$f":"IFERROR(RTD(\"cqg.rtd\", ,\"ContractData\",Q70, \"PerCentNetLastTrade\",, \"T\")/100,\"\")","v":""},0]
[70,{"$f":"IFERROR(VLOOKUP(A71,Data!$H$2:$J$103,3,FALSE),\"\")","v":""},{"$f":"IFERROR(RTD(\"cqg.rtd\", ,\"ContractData\",B71, \"PerCentNetLastTrade\",, \"T\")/100,\"\")","v":""},{"$f":"IFERROR(RANK($C71,$C$2:C$103)+COUNTIF($C$2:C71,C71)-1,\"\")","v":""},"",70,"",{"$f":"IF(G71=\"\",\"\",RTD(\"cqg.rtd\", ,\"ContractData\",G71, \"LongDescription\",, \"T\"))","v":""},{"$f":"IFERROR(RTD(\"cqg.rtd\", ,\"ContractData\",G71, \"PerCentNetLastTrade\",, \"T\")/100,\"\")","v":""},0,70,{"$f":"IFERROR(VLOOKUP(A71,Data!$I$2:$J$103,2,FALSE),\"\")","v":""},{"$f":"IFERROR(RTD(\"cqg.rtd\", ,\"ContractData\",L71, \"PerCentNetLastTrade\",, \"T\")/100,\"\")","v":""},{"$f":"IFERROR(RANK($M71,$M$2:M$104)+COUNTIF($M$2:M71,M71)-1,\"\")","v":""},"",70,"",{"$f":"IF(Q71=\"\",\"\",RTD(\"cqg.rtd\", ,\"ContractData\",Q71, \"LongDescription\",, \"T\"))","v":""},{"$f":"IFERROR(RTD(\"cqg.rtd\", ,\"ContractData\",Q71, \"PerCentNetLastTrade\",, \"T\")/100,\"\")","v":""},0]
[71,{"$f":"IFERROR(VLOOKUP(A72,Data!$H$2:$J$103,3,FALSE),\"\")","v":""},{"$f":"IFERROR(RTD(\"cqg.rtd\", ,\"ContractData\",B72, \"PerCentNetLastTrade\",, \"T\")/100,\"\")","v":""},{"$f":"IFERROR(RANK($C72,$C$2:C$103)+COUNTIF($C$2:C72,C72)-1,\"\")","v":""},"",71,"",{"$f":"IF(G72=\"\",\"\",RTD(\"cqg.rtd\", ,\"ContractData\",G72, \"LongDescription\",, \"T\"))","v":""},{"$f":"IFERROR(RTD(\"cqg.rtd\", ,\"ContractData\",G72, \"PerCentNetLastTrade\",, \"T\")/100,\"\")","v":""},0,71,{"$f":"IFERROR(VLOOKUP(A72,Data!$I$2:$J$103,2,FALSE),\"\")","v":""},{"$f":"IFERROR(RTD(\"cqg.rtd\", ,\"ContractData\",L72, \"PerCentNetLastTrade\",, \"T\")/100,\"\")","v":""},{"$f":"IFERROR(RANK($M72,$M$2:M$104)+COUNTIF($M$2:M72,M72)-1,\"\")","v":""},"",71,"",{"$f":"IF(Q72=\"\",\"\",RTD(\"cqg.rtd\", ,\"ContractData\",Q72, \"LongDescription\",, \"T\"))","v":""},{"$f":"IFERROR(RTD(\"cqg.rtd\", ,\"ContractData\",Q72, \"PerCentNetLastTrade\",, \"T\")/100,\"\")","v":""},0]
[72,{"$f":"IFERROR(VLOOKUP(A73,Data!$H$2:$J$103,3,FALSE),\"\")","v":""},{"$f":"IFERROR(RTD(\"cqg.rtd\", ,\"ContractData\",B73, \"PerCentNetLastTrade\",, \"T\")/100,\"\")","v":""},{"$f":"IFERROR(RANK($C73,$C$2:C$103)+COUNTIF($C$2:C73,C73)-1,\"\")","v":""},"",72,"",{"$f":"IF(G73=\"\",\"\",RTD(\"cqg.rtd\", ,\"ContractData\",G73, \"LongDescription\",, \"T\"))","v":""},{"$f":"IFERROR(RTD(\"cqg.rtd\", ,\"ContractData\",G73, \"PerCentNetLastTrade\",, \"T\")/100,\"\")","v":""},0,72,{"$f":"IFERROR(VLOOKUP(A73,Data!$I$2:$J$103,2,FALSE),\"\")","v":""},{"$f":"IFERROR(RTD(\"cqg.rtd\", ,\"ContractData\",L73, \"PerCentNetLastTrade\",, \"T\")/100,\"\")","v":""},{"$f":"IFERROR(RANK($M73,$M$2:M$104)+COUNTIF($M$2:M73,M73)-1,\"\")","v":""},"",72,"",{"$f":"IF(Q73=\"\",\"\",RTD(\"cqg.rtd\", ,\"ContractData\",Q73, \"LongDescription\",, \"T\"))","v":""},{"$f":"IFERROR(RTD(\"cqg.rtd\", ,\"ContractData\",Q73, \"PerCentNetLastTrade\",, \"T\")/100,\"\")","v":""},0]
[73,{"$f":"IFERROR(VLOOKUP(A74,Data!$H$2:$J$103,3,FALSE),\"\")","v":""},{"$f":"IFERROR(RTD(\"cqg.rtd\", ,\"ContractData\",B74, \"PerCentNetLastTrade\",, \"T\")/100,\"\")","v":""},{"$f":"IFERROR(RANK($C74,$C$2:C$103)+COUNTIF($C$2:C74,C74)-1,\"\")","v":""},"",73,"",{"$f":"IF(G74=\"\",\"\",RTD(\"cqg.rtd\", ,\"ContractData\",G74, \"LongDescription\",, \"T\"))","v":""},{"$f":"IFERROR(RTD(\"cqg.rtd\", ,\"ContractData\",G74, \"PerCentNetLastTrade\",, \"T\")/100,\"\")","v":""},0,73,{"$f":"IFERROR(VLOOKUP(A74,Data!$I$2:$J$103,2,FALSE),\"\")","v":""},{"$f":"IFERROR(RTD(\"cqg.rtd\", ,\"ContractData\",L74, \"PerCentNetLastTrade\",, \"T\")/100,\"\")","v":""},{"$f":"IFERROR(RANK($M74,$M$2:M$104)+COUNTIF($M$2:M74,M74)-1,\"\")","v":""},"",73,"",{"$f":"IF(Q74=\"\",\"\",RTD(\"cqg.rtd\", ,\"ContractData\",Q74, \"LongDescription\",, \"T\"))","v":""},{"$f":"IFERROR(RTD(\"cqg.rtd\", ,\"ContractData\",Q74, \"PerCentNetLastTrade\",, \"T\")/100,\"\")","v":""},0]
[74,{"$f":"IFERROR(VLOOKUP(A75,Data!$H$2:$J$103,3,FALSE),\"\")","v":""},{"$f":"IFERROR(RTD(\"cqg.rtd\", ,\"ContractData\",B75, \"PerCentNetLastTrade\",, \"T\")/100,\"\")","v":""},{"$f":"IFERROR(RANK($C75,$C$2:C$103)+COUNTIF($C$2:C75,C75)-1,\"\")","v":""},"",74,"",{"$f":"IF(G75=\"\",\"\",RTD(\"cqg.rtd\", ,\"ContractData\",G75, \"LongDescription\",, \"T\"))","v":""},{"$f":"IFERROR(RTD(\"cqg.rtd\", ,\"ContractData\",G75, \"PerCentNetLastTrade\",, \"T\")/100,\"\")","v":""},0,74,{"$f":"IFERROR(VLOOKUP(A75,Data!$I$2:$J$103,2,FALSE),\"\")","v":""},{"$f":"IFERROR(RTD(\"cqg.rtd\", ,\"ContractData\",L75, \"PerCentNetLastTrade\",, \"T\")/100,\"\")","v":""},{"$f":"IFERROR(RANK($M75,$M$2:M$104)+COUNTIF($M$2:M75,M75)-1,\"\")","v":""},"",74,"",{"$f":"IF(Q75=\"\",\"\",RTD(\"cqg.rtd\", ,\"ContractData\",Q75, \"LongDescription\",, \"T\"))","v":""},{"$f":"IFERROR(RTD(\"cqg.rtd\", ,\"ContractData\",Q75, \"PerCentNetLastTrade\",, \"T\")/100,\"\")","v":""},0]
[75,{"$f":"IFERROR(VLOOKUP(A76,Data!$H$2:$J$103,3,FALSE),\"\")","v":""},{"$f":"IFERROR(RTD(\"cqg.rtd\", ,\"ContractData\",B76, \"PerCentNetLastTrade\",, \"T\")/100,\"\")","v":""},{"$f":"IFERROR(RANK($C76,$C$2:C$103)+COUNTIF($C$2:C76,C76)-1,\"\")","v":""},"",75,"",{"$f":"IF(G76=\"\",\"\",RTD(\"cqg.rtd\", ,\"ContractData\",G76, \"LongDescription\",, \"T\"))","v":""},{"$f":"IFERROR(RTD(\"cqg.rtd\", ,\"ContractData\",G76, \"PerCentNetLastTrade\",, \"T\")/100,\"\")","v":""},0,75,{"$f":"IFERROR(VLOOKUP(A76,Data!$I$2:$J$103,2,FALSE),\"\")","v":""},{"$f":"IFERROR(RTD(\"cqg.rtd\", ,\"ContractData\",L76, \"PerCentNetLastTrade\",, \"T\")/100,\"\")","v":""},{"$f":"IFERROR(RANK($M76,$M$2:M$104)+COUNTIF($M$2:M76,M76)-1,\"\")","v":""},"",75,"",{"$f":"IF(Q76=\"\",\"\",RTD(\"cqg.rtd\", ,\"ContractData\",Q76, \"LongDescription\",, \"T\"))","v":""},{"$f":"IFERROR(RTD(\"cqg.rtd\", ,\"ContractData\",Q76, \"PerCentNetLastTrade\",, \"T\")/100,\"\")","v":""},0]
[76,{"$f":"IFERROR(VLOOKUP(A77,Data!$H$2:$J$103,3,FALSE),\"\")","v":""},{"$f":"IFERROR(RTD(\"cqg.rtd\", ,\"ContractData\",B77, \"PerCentNetLastTrade\",, \"T\")/100,\"\")","v":""},{"$f":"IFERROR(RANK($C77,$C$2:C$103)+COUNTIF($C$2:C77,C77)-1,\"\")","v":""},"",76,"",{"$f":"IF(G77=\"\",\"\",RTD(\"cqg.rtd\", ,\"ContractData\",G77, \"LongDescription\",, \"T\"))","v":""},{"$f":"IFERROR(RTD(\"cqg.rtd\", ,\"ContractData\",G77, \"PerCentNetLastTrade\",, \"T\")/100,\"\")","v":""},0,76,{"$f":"IFERROR(VLOOKUP(A77,Data!$I$2:$J$103,2,FALSE),\"\")","v":""},{"$f":"IFERROR(RTD(\"cqg.rtd\", ,\"ContractData\",L77, \"PerCentNetLastTrade\",, \"T\")/100,\"\")","v":""},{"$f":"IFERROR(RANK($M77,$M$2:M$104)+COUNTIF($M$2:M77,M77)-1,\"\")","v":""},"",76,"",{"$f":"IF(Q77=\"\",\"\",RTD(\"cqg.rtd\", ,\"ContractData\",Q77, \"LongDescription\",, \"T\"))","v":""},{"$f":"IFERROR(RTD(\"cqg.rtd\", ,\"ContractData\",Q77, \"PerCentNetLastTrade\",, \"T\")/100,\"\")","v":""},0]
[77,{"$f":"IFERROR(VLOOKUP(A78,Data!$H$2:$J$103,3,FALSE),\"\")","v":""},{"$f":"IFERROR(RTD(\"cqg.rtd\", ,\"ContractData\",B78, \"PerCentNetLastTrade\",, \"T\")/100,\"\")","v":""},{"$f":"IFERROR(RANK($C78,$C$2:C$103)+COUNTIF($C$2:C78,C78)-1,\"\")","v":""},"",77,"",{"$f":"IF(G78=\"\",\"\",RTD(\"cqg.rtd\", ,\"ContractData\",G78, \"LongDescription\",, \"T\"))","v":""},{"$f":"IFERROR(RTD(\"cqg.rtd\", ,\"ContractData\",G78, \"PerCentNetLastTrade\",, \"T\")/100,\"\")","v":""},0,77,{"$f":"IFERROR(VLOOKUP(A78,Data!$I$2:$J$103,2,FALSE),\"\")","v":""},{"$f":"IFERROR(RTD(\"cqg.rtd\", ,\"ContractData\",L78, \"PerCentNetLastTrade\",, \"T\")/100,\"\")","v":""},{"$f":"IFERROR(RANK($M78,$M$2:M$104)+COUNTIF($M$2:M78,M78)-1,\"\")","v":""},"",77,"",{"$f":"IF(Q78=\"\",\"\",RTD(\"cqg.rtd\", ,\"ContractData\",Q78, \"LongDescription\",, \"T\"))","v":""},{"$f":"IFERROR(RTD(\"cqg.rtd\", ,\"ContractData\",Q78, \"PerCentNetLastTrade\",, \"T\")/100,\"\")","v":""},0]
[78,{"$f":"IFERROR(VLOOKUP(A79,Data!$H$2:$J$103,3,FALSE),\"\")","v":""},{"$f":"IFERROR(RTD(\"cqg.rtd\", ,\"ContractData\",B79, \"PerCentNetLastTrade\",, \"T\")/100,\"\")","v":""},{"$f":"IFERROR(RANK($C79,$C$2:C$103)+COUNTIF($C$2:C79,C79)-1,\"\")","v":""},"",78,"",{"$f":"IF(G79=\"\",\"\",RTD(\"cqg.rtd\", ,\"ContractData\",G79, \"LongDescription\",, \"T\"))","v":""},{"$f":"IFERROR(RTD(\"cqg.rtd\", ,\"ContractData\",G79, \"PerCentNetLastTrade\",, \"T\")/100,\"\")","v":""},0,78,{"$f":"IFERROR(VLOOKUP(A79,Data!$I$2:$J$103,2,FALSE),\"\")","v":""},{"$f":"IFERROR(RTD(\"cqg.rtd\", ,\"ContractData\",L79, \"PerCentNetLastTrade\",, \"T\")/100,\"\")","v":""},{"$f":"IFERROR(RANK($M79,$M$2:M$104)+COUNTIF($M$2:M79,M79)-1,\"\")","v":""},"",78,"",{"$f":"IF(Q79=\"\",\"\",RTD(\"cqg.rtd\", ,\"ContractData\",Q79, \"LongDescription\",, \"T\"))","v":""},{"$f":"IFERROR(RTD(\"cqg.rtd\", ,\"ContractData\",Q79, \"PerCentNetLastTrade\",, \"T\")/100,\"\")","v":""},0]
[79,{"$f":"IFERROR(VLOOKUP(A80,Data!$H$2:$J$103,3,FALSE),\"\")","v":""},{"$f":"IFERROR(RTD(\"cqg.rtd\", ,\"ContractData\",B80, \"PerCentNetLastTrade\",, \"T\")/100,\"\")","v":""},{"$f":"IFERROR(RANK($C80,$C$2:C$103)+COUNTIF($C$2:C80,C80)-1,\"\")","v":""},"",79,"",{"$f":"IF(G80=\"\",\"\",RTD(\"cqg.rtd\", ,\"ContractData\",G80, \"LongDescription\",, \"T\"))","v":""},{"$f":"IFERROR(RTD(\"cqg.rtd\", ,\"ContractData\",G80, \"PerCentNetLastTrade\",, \"T\")/100,\"\")","v":""},0,79,{"$f":"IFERROR(VLOOKUP(A80,Data!$I$2:$J$103,2,FALSE),\"\")","v":""},{"$f":"IFERROR(RTD(\"cqg.rtd\", ,\"ContractData\",L80, \"PerCentNetLastTrade\",, \"T\")/100,\"\")","v":""},{"$f":"IFERROR(RANK($M80,$M$2:M$104)+COUNTIF($M$2:M80,M80)-1,\"\")","v":""},"",79,"",{"$f":"IF(Q80=\"\",\"\",RTD(\"cqg.rtd\", ,\"ContractData\",Q80, \"LongDescription\",, \"T\"))","v":""},{"$f":"IFERROR(RTD(\"cqg.rtd\", ,\"ContractData\",Q80, \"PerCentNetLastTrade\",, \"T\")/100,\"\")","v":""},0]
[80,{"$f":"IFERROR(VLOOKUP(A81,Data!$H$2:$J$103,3,FALSE),\"\")","v":""},{"$f":"IFERROR(RTD(\"cqg.rtd\", ,\"ContractData\",B81, \"PerCentNetLastTrade\",, \"T\")/100,\"\")","v":""},{"$f":"IFERROR(RANK($C81,$C$2:C$103)+COUNTIF($C$2:C81,C81)-1,\"\")","v":""},"",80,"",{"$f":"IF(G81=\"\",\"\",RTD(\"cqg.rtd\", ,\"ContractData\",G81, \"LongDescription\",, \"T\"))","v":""},{"$f":"IFERROR(RTD(\"cqg.rtd\", ,\"ContractData\",G81, \"PerCentNetLastTrade\",, \"T\")/100,\"\")","v":""},0,80,{"$f":"IFERROR(VLOOKUP(A81,Data!$I$2:$J$103,2,FALSE),\"\")","v":""},{"$f":"IFERROR(RTD(\"cqg.rtd\", ,\"ContractData\",L81, \"PerCentNetLastTrade\",, \"T\")/100,\"\")","v":""},{"$f":"IFERROR(RANK($M81,$M$2:M$104)+COUNTIF($M$2:M81,M81)-1,\"\")","v":""},"",80,"",{"$f":"IF(Q81=\"\",\"\",RTD(\"cqg.rtd\", ,\"ContractData\",Q81, \"LongDescription\",, \"T\"))","v":""},{"$f":"IFERROR(RTD(\"cqg.rtd\", ,\"ContractData\",Q81, \"PerCentNetLastTrade\",, \"T\")/100,\"\")","v":""},0]
[81,{"$f":"IFERROR(VLOOKUP(A82,Data!$H$2:$J$103,3,FALSE),\"\")","v":""},{"$f":"IFERROR(RTD(\"cqg.rtd\", ,\"ContractData\",B82, \"PerCentNetLastTrade\",, \"T\")/100,\"\")","v":""},{"$f":"IFERROR(RANK($C82,$C$2:C$103)+COUNTIF($C$2:C82,C82)-1,\"\")","v":""},"",81,"",{"$f":"IF(G82=\"\",\"\",RTD(\"cqg.rtd\", ,\"ContractData\",G82, \"LongDescription\",, \"T\"))","v":""},{"$f":"IFERROR(RTD(\"cqg.rtd\", ,\"ContractData\",G82, \"PerCentNetLastTrade\",, \"T\")/100,\"\")","v":""},0,81,{"$f":"IFERROR(VLOOKUP(A82,Data!$I$2:$J$103,2,FALSE),\"\")","v":""},{"$f":"IFERROR(RTD(\"cqg.rtd\", ,\"ContractData\",L82, \"PerCentNetLastTrade\",, \"T\")/100,\"\")","v":""},{"$f":"IFERROR(RANK($M82,$M$2:M$104)+COUNTIF($M$2:M82,M82)-1,\"\")","v":""},"",81,"",{"$f":"IF(Q82=\"\",\"\",RTD(\"cqg.rtd\", ,\"ContractData\",Q82, \"LongDescription\",, \"T\"))","v":""},{"$f":"IFERROR(RTD(\"cqg.rtd\", ,\"ContractData\",Q82, \"PerCentNetLastTrade\",, \"T\")/100,\"\")","v":""},0]
[82,{"$f":"IFERROR(VLOOKUP(A83,Data!$H$2:$J$103,3,FALSE),\"\")","v":""},{"$f":"IFERROR(RTD(\"cqg.rtd\", ,\"ContractData\",B83, \"PerCentNetLastTrade\",, \"T\")/100,\"\")","v":""},{"$f":"IFERROR(RANK($C83,$C$2:C$103)+COUNTIF($C$2:C83,C83)-1,\"\")","v":""},"",82,"",{"$f":"IF(G83=\"\",\"\",RTD(\"cqg.rtd\", ,\"ContractData\",G83, \"LongDescription\",, \"T\"))","v":""},{"$f":"IFERROR(RTD(\"cqg.rtd\", ,\"ContractData\",G83, \"PerCentNetLastTrade\",, \"T\")/100,\"\")","v":""},0,82,{"$f":"IFERROR(VLOOKUP(A83,Data!$I$2:$J$103,2,FALSE),\"\")","v":""},{"$f":"IFERROR(RTD(\"cqg.rtd\", ,\"ContractData\",L83, \"PerCentNetLastTrade\",, \"T\")/100,\"\")","v":""},{"$f":"IFERROR(RANK($M83,$M$2:M$104)+COUNTIF($M$2:M83,M83)-1,\"\")","v":""},"",82,"",{"$f":"IF(Q83=\"\",\"\",RTD(\"cqg.rtd\", ,\"ContractData\",Q83, \"LongDescription\",, \"T\"))","v":""},{"$f":"IFERROR(RTD(\"cqg.rtd\", ,\"ContractData\",Q83, \"PerCentNetLastTrade\",, \"T\")/100,\"\")","v":""},0]
[83,{"$f":"IFERROR(VLOOKUP(A84,Data!$H$2:$J$103,3,FALSE),\"\")","v":""},{"$f":"IFERROR(RTD(\"cqg.rtd\", ,\"ContractData\",B84, \"PerCentNetLastTrade\",, \"T\")/100,\"\")","v":""},{"$f":"IFERROR(RANK($C84,$C$2:C$103)+COUNTIF($C$2:C84,C84)-1,\"\")","v":""},"",83,"",{"$f":"IF(G84=\"\",\"\",RTD(\"cqg.rtd\", ,\"ContractData\",G84, \"LongDescription\",, \"T\"))","v":""},{"$f":"IFERROR(RTD(\"cqg.rtd\", ,\"ContractData\",G84, \"PerCentNetLastTrade\",, \"T\")/100,\"\")","v":""},0,83,{"$f":"IFERROR(VLOOKUP(A84,Data!$I$2:$J$103,2,FALSE),\"\")","v":""},{"$f":"IFERROR(RTD(\"cqg.rtd\", ,\"ContractData\",L84, \"PerCentNetLastTrade\",, \"T\")/100,\"\")","v":""},{"$f":"IFERROR(RANK($M84,$M$2:M$104)+COUNTIF($M$2:M84,M84)-1,\"\")","v":""},"",83,"",{"$f":"IF(Q84=\"\",\"\",RTD(\"cqg.rtd\", ,\"ContractData\",Q84, \"LongDescription\",, \"T\"))","v":""},{"$f":"IFERROR(RTD(\"cqg.rtd\", ,\"ContractData\",Q84, \"PerCentNetLastTrade\",, \"T\")/100,\"\")","v":""},0]
[84,{"$f":"IFERROR(VLOOKUP(A85,Data!$H$2:$J$103,3,FALSE),\"\")","v":""},{"$f":"IFERROR(RTD(\"cqg.rtd\", ,\"ContractData\",B85, \"PerCentNetLastTrade\",, \"T\")/100,\"\")","v":""},{"$f":"IFERROR(RANK($C85,$C$2:C$103)+COUNTIF($C$2:C85,C85)-1,\"\")","v":""},"",84,"",{"$f":"IF(G85=\"\",\"\",RTD(\"cqg.rtd\", ,\"ContractData\",G85, \"LongDescription\",, \"T\"))","v":""},{"$f":"IFERROR(RTD(\"cqg.rtd\", ,\"ContractData\",G85, \"PerCentNetLastTrade\",, \"T\")/100,\"\")","v":""},0,84,{"$f":"IFERROR(VLOOKUP(A85,Data!$I$2:$J$103,2,FALSE),\"\")","v":""},{"$f":"IFERROR(RTD(\"cqg.rtd\", ,\"ContractData\",L85, \"PerCentNetLastTrade\",, \"T\")/100,\"\")","v":""},{"$f":"IFERROR(RANK($M85,$M$2:M$104)+COUNTIF($M$2:M85,M85)-1,\"\")","v":""},"",84,"",{"$f":"IF(Q85=\"\",\"\",RTD(\"cqg.rtd\", ,\"ContractData\",Q85, \"LongDescription\",, \"T\"))","v":""},{"$f":"IFERROR(RTD(\"cqg.rtd\", ,\"ContractData\",Q85, \"PerCentNetLastTrade\",, \"T\")/100,\"\")","v":""},0]
[85,{"$f":"IFERROR(VLOOKUP(A86,Data!$H$2:$J$103,3,FALSE),\"\")","v":""},{"$f":"IFERROR(RTD(\"cqg.rtd\", ,\"ContractData\",B86, \"PerCentNetLastTrade\",, \"T\")/100,\"\")","v":""},{"$f":"IFERROR(RANK($C86,$C$2:C$103)+COUNTIF($C$2:C86,C86)-1,\"\")","v":""},"",85,"",{"$f":"IF(G86=\"\",\"\",RTD(\"cqg.rtd\", ,\"ContractData\",G86, \"LongDescription\",, \"T\"))","v":""},{"$f":"IFERROR(RTD(\"cqg.rtd\", ,\"ContractData\",G86, \"PerCentNetLastTrade\",, \"T\")/100,\"\")","v":""},0,85,{"$f":"IFERROR(VLOOKUP(A86,Data!$I$2:$J$103,2,FALSE),\"\")","v":""},{"$f":"IFERROR(RTD(\"cqg.rtd\", ,\"ContractData\",L86, \"PerCentNetLastTrade\",, \"T\")/100,\"\")","v":""},{"$f":"IFERROR(RANK($M86,$M$2:M$104)+COUNTIF($M$2:M86,M86)-1,\"\")","v":""},"",85,"",{"$f":"IF(Q86=\"\",\"\",RTD(\"cqg.rtd\", ,\"ContractData\",Q86, \"LongDescription\",, \"T\"))","v":""},{"$f":"IFERROR(RTD(\"cqg.rtd\", ,\"ContractData\",Q86, \"PerCentNetLastTrade\",, \"T\")/100,\"\")","v":""},0]
[86,{"$f":"IFERROR(VLOOKUP(A87,Data!$H$2:$J$103,3,FALSE),\"\")","v":""},{"$f":"IFERROR(RTD(\"cqg.rtd\", ,\"ContractData\",B87, \"PerCentNetLastTrade\",, \"T\")/100,\"\")","v":""},{"$f":"IFERROR(RANK($C87,$C$2:C$103)+COUNTIF($C$2:C87,C87)-1,\"\")","v":""},"",86,"",{"$f":"IF(G87=\"\",\"\",RTD(\"cqg.rtd\", ,\"ContractData\",G87, \"LongDescription\",, \"T\"))","v":""},{"$f":"IFERROR(RTD(\"cqg.rtd\", ,\"ContractData\",G87, \"PerCentNetLastTrade\",, \"T\")/100,\"\")","v":""},0,86,{"$f":"IFERROR(VLOOKUP(A87,Data!$I$2:$J$103,2,FALSE),\"\")","v":""},{"$f":"IFERROR(RTD(\"cqg.rtd\", ,\"ContractData\",L87, \"PerCentNetLastTrade\",, \"T\")/100,\"\")","v":""},{"$f":"IFERROR(RANK($M87,$M$2:M$104)+COUNTIF($M$2:M87,M87)-1,\"\")","v":""},"",86,"",{"$f":"IF(Q87=\"\",\"\",RTD(\"cqg.rtd\", ,\"ContractData\",Q87, \"LongDescription\",, \"T\"))","v":""},{"$f":"IFERROR(RTD(\"cqg.rtd\", ,\"ContractData\",Q87, \"PerCentNetLastTrade\",, \"T\")/100,\"\")","v":""},0]
[87,{"$f":"IFERROR(VLOOKUP(A88,Data!$H$2:$J$103,3,FALSE),\"\")","v":""},{"$f":"IFERROR(RTD(\"cqg.rtd\", ,\"ContractData\",B88, \"PerCentNetLastTrade\",, \"T\")/100,\"\")","v":""},{"$f":"IFERROR(RANK($C88,$C$2:C$103)+COUNTIF($C$2:C88,C88)-1,\"\")","v":""},"",87,"",{"$f":"IF(G88=\"\",\"\",RTD(\"cqg.rtd\", ,\"ContractData\",G88, \"LongDescription\",, \"T\"))","v":""},{"$f":"IFERROR(RTD(\"cqg.rtd\", ,\"ContractData\",G88, \"PerCentNetLastTrade\",, \"T\")/100,\"\")","v":""},0,87,{"$f":"IFERROR(VLOOKUP(A88,Data!$I$2:$J$103,2,FALSE),\"\")","v":""},{"$f":"IFERROR(RTD(\"cqg.rtd\", ,\"ContractData\",L88, \"PerCentNetLastTrade\",, \"T\")/100,\"\")","v":""},{"$f":"IFERROR(RANK($M88,$M$2:M$104)+COUNTIF($M$2:M88,M88)-1,\"\")","v":""},"",87,"",{"$f":"IF(Q88=\"\",\"\",RTD(\"cqg.rtd\", ,\"ContractData\",Q88, \"LongDescription\",, \"T\"))","v":""},{"$f":"IFERROR(RTD(\"cqg.rtd\", ,\"ContractData\",Q88, \"PerCentNetLastTrade\",, \"T\")/100,\"\")","v":""},0]
[88,{"$f":"IFERROR(VLOOKUP(A89,Data!$H$2:$J$103,3,FALSE),\"\")","v":""},{"$f":"IFERROR(RTD(\"cqg.rtd\", ,\"ContractData\",B89, \"PerCentNetLastTrade\",, \"T\")/100,\"\")","v":""},{"$f":"IFERROR(RANK($C89,$C$2:C$103)+COUNTIF($C$2:C89,C89)-1,\"\")","v":""},"",88,"",{"$f":"IF(G89=\"\",\"\",RTD(\"cqg.rtd\", ,\"ContractData\",G89, \"LongDescription\",, \"T\"))","v":""},{"$f":"IFERROR(RTD(\"cqg.rtd\", ,\"ContractData\",G89, \"PerCentNetLastTrade\",, \"T\")/100,\"\")","v":""},0,88,{"$f":"IFERROR(VLOOKUP(A89,Data!$I$2:$J$103,2,FALSE),\"\")","v":""},{"$f":"IFERROR(RTD(\"cqg.rtd\", ,\"ContractData\",L89, \"PerCentNetLastTrade\",, \"T\")/100,\"\")","v":""},{"$f":"IFERROR(RANK($M89,$M$2:M$104)+COUNTIF($M$2:M89,M89)-1,\"\")","v":""},"",88,"",{"$f":"IF(Q89=\"\",\"\",RTD(\"cqg.rtd\", ,\"ContractData\",Q89, \"LongDescription\",, \"T\"))","v":""},{"$f":"IFERROR(RTD(\"cqg.rtd\", ,\"ContractData\",Q89, \"PerCentNetLastTrade\",, \"T\")/100,\"\")","v":""},0]
[89,{"$f":"IFERROR(VLOOKUP(A90,Data!$H$2:$J$103,3,FALSE),\"\")","v":""},{"$f":"IFERROR(RTD(\"cqg.rtd\", ,\"ContractData\",B90, \"PerCentNetLastTrade\",, \"T\")/100,\"\")","v":""},{"$f":"IFERROR(RANK($C90,$C$2:C$103)+COUNTIF($C$2:C90,C90)-1,\"\")","v":""},"",89,"",{"$f":"IF(G90=\"\",\"\",RTD(\"cqg.rtd\", ,\"ContractData\",G90, \"LongDescription\",, \"T\"))","v":""},{"$f":"IFERROR(RTD(\"cqg.rtd\", ,\"ContractData\",G90, \"PerCentNetLastTrade\",, \"T\")/100,\"\")","v":""},0,89,{"$f":"IFERROR(VLOOKUP(A90,Data!$I$2:$J$103,2,FALSE),\"\")","v":""},{"$f":"IFERROR(RTD(\"cqg.rtd\", ,\"ContractData\",L90, \"PerCentNetLastTrade\",, \"T\")/100,\"\")","v":""},{"$f":"IFERROR(RANK($M90,$M$2:M$104)+COUNTIF($M$2:M90,M90)-1,\"\")","v":""},"",89,"",{"$f":"IF(Q90=\"\",\"\",RTD(\"cqg.rtd\", ,\"ContractData\",Q90, \"LongDescription\",, \"T\"))","v":""},{"$f":"IFERROR(RTD(\"cqg.rtd\", ,\"ContractData\",Q90, \"PerCentNetLastTrade\",, \"T\")/100,\"\")","v":""},0]
[90,{"$f":"IFERROR(VLOOKUP(A91,Data!$H$2:$J$103,3,FALSE),\"\")","v":""},{"$f":"IFERROR(RTD(\"cqg.rtd\", ,\"ContractData\",B91, \"PerCentNetLastTrade\",, \"T\")/100,\"\")","v":""},{"$f":"IFERROR(RANK($C91,$C$2:C$103)+COUNTIF($C$2:C91,C91)-1,\"\")","v":""},"",90,"",{"$f":"IF(G91=\"\",\"\",RTD(\"cqg.rtd\", ,\"ContractData\",G91, \"LongDescription\",, \"T\"))","v":""},{"$f":"IFERROR(RTD(\"cqg.rtd\", ,\"ContractData\",G91, \"PerCentNetLastTrade\",, \"T\")/100,\"\")","v":""},0,90,{"$f":"IFERROR(VLOOKUP(A91,Data!$I$2:$J$103,2,FALSE),\"\")","v":""},{"$f":"IFERROR(RTD(\"cqg.rtd\", ,\"ContractData\",L91, \"PerCentNetLastTrade\",, \"T\")/100,\"\")","v":""},{"$f":"IFERROR(RANK($M91,$M$2:M$104)+COUNTIF($M$2:M91,M91)-1,\"\")","v":""},"",90,"",{"$f":"IF(Q91=\"\",\"\",RTD(\"cqg.rtd\", ,\"ContractData\",Q91, \"LongDescription\",, \"T\"))","v":""},{"$f":"IFERROR(RTD(\"cqg.rtd\", ,\"ContractData\",Q91, \"PerCentNetLastTrade\",, \"T\")/100,\"\")","v":""},0]
[91,{"$f":"IFERROR(VLOOKUP(A92,Data!$H$2:$J$103,3,FALSE),\"\")","v":""},{"$f":"IFERROR(RTD(\"cqg.rtd\", ,\"ContractData\",B92, \"PerCentNetLastTrade\",, \"T\")/100,\"\")","v":""},{"$f":"IFERROR(RANK($C92,$C$2:C$103)+COUNTIF($C$2:C92,C92)-1,\"\")","v":""},"",91,"",{"$f":"IF(G92=\"\",\"\",RTD(\"cqg.rtd\", ,\"ContractData\",G92, \"LongDescription\",, \"T\"))","v":""},{"$f":"IFERROR(RTD(\"cqg.rtd\", ,\"ContractData\",G92, \"PerCentNetLastTrade\",, \"T\")/100,\"\")","v":""},0,91,{"$f":"IFERROR(VLOOKUP(A92,Data!$I$2:$J$103,2,FALSE),\"\")","v":""},{"$f":"IFERROR(RTD(\"cqg.rtd\", ,\"ContractData\",L92, \"PerCentNetLastTrade\",, \"T\")/100,\"\")","v":""},{"$f":"IFERROR(RANK($M92,$M$2:M$104)+COUNTIF($M$2:M92,M92)-1,\"\")","v":""},"",91,"",{"$f":"IF(Q92=\"\",\"\",RTD(\"cqg.rtd\", ,\"ContractData\",Q92, \"LongDescription\",, \"T\"))","v":""},{"$f":"IFERROR(RTD(\"cqg.rtd\", ,\"ContractData\",Q92, \"PerCentNetLastTrade\",, \"T\")/100,\"\")","v":""},0]
[92,{"$f":"IFERROR(VLOOKUP(A93,Data!$H$2:$J$103,3,FALSE),\"\")","v":""},{"$f":"IFERROR(RTD(\"cqg.rtd\", ,\"ContractData\",B93, \"PerCentNetLastTrade\",, \"T\")/100,\"\")","v":""},{"$f":"IFERROR(RANK($C93,$C$2:C$103)+COUNTIF($C$2:C93,C93)-1,\"\")","v":""},"",92,"",{"$f":"IF(G93=\"\",\"\",RTD(\"cqg.rtd\", ,\"ContractData\",G93, \"LongDescription\",, \"T\"))","v":""},{"$f":"IFERROR(RTD(\"cqg.rtd\", ,\"ContractData\",G93, \"PerCentNetLastTrade\",, \"T\")/100,\"\")","v":""},0,92,{"$f":"IFERROR(VLOOKUP(A93,Data!$I$2:$J$103,2,FALSE),\"\")","v":""},{"$f":"IFERROR(RTD(\"cqg.rtd\", ,\"ContractData\",L93, \"PerCentNetLastTrade\",, \"T\")/100,\"\")","v":""},{"$f":"IFERROR(RANK($M93,$M$2:M$104)+COUNTIF($M$2:M93,M93)-1,\"\")","v":""},"",92,"",{"$f":"IF(Q93=\"\",\"\",RTD(\"cqg.rtd\", ,\"ContractData\",Q93, \"LongDescription\",, \"T\"))","v":""},{"$f":"IFERROR(RTD(\"cqg.rtd\", ,\"ContractData\",Q93, \"PerCentNetLastTrade\",, \"T\")/100,\"\")","v":""},0]
[93,{"$f":"IFERROR(VLOOKUP(A94,Data!$H$2:$J$103,3,FALSE),\"\")","v":""},{"$f":"IFERROR(RTD(\"cqg.rtd\", ,\"ContractData\",B94, \"PerCentNetLastTrade\",, \"T\")/100,\"\")","v":""},{"$f":"IFERROR(RANK($C94,$C$2:C$103)+COUNTIF($C$2:C94,C94)-1,\"\")","v":""},"",93,"",{"$f":"IF(G94=\"\",\"\",RTD(\"cqg.rtd\", ,\"ContractData\",G94, \"LongDescription\",, \"T\"))","v":""},{"$f":"IFERROR(RTD(\"cqg.rtd\", ,\"ContractData\",G94, \"PerCentNetLastTrade\",, \"T\")/100,\"\")","v":""},0,93,{"$f":"IFERROR(VLOOKUP(A94,Data!$I$2:$J$103,2,FALSE),\"\")","v":""},{"$f":"IFERROR(RTD(\"cqg.rtd\", ,\"ContractData\",L94, \"PerCentNetLastTrade\",, \"T\")/100,\"\")","v":""},{"$f":"IFERROR(RANK($M94,$M$2:M$104)+COUNTIF($M$2:M94,M94)-1,\"\")","v":""},"",93,"",{"$f":"IF(Q94=\"\",\"\",RTD(\"cqg.rtd\", ,\"ContractData\",Q94, \"LongDescription\",, \"T\"))","v":""},{"$f":"IFERROR(RTD(\"cqg.rtd\", ,\"ContractData\",Q94, \"PerCentNetLastTrade\",, \"T\")/100,\"\")","v":""},0]
[94,{"$f":"IFERROR(VLOOKUP(A95,Data!$H$2:$J$103,3,FALSE),\"\")","v":""},{"$f":"IFERROR(RTD(\"cqg.rtd\", ,\"ContractData\",B95, \"PerCentNetLastTrade\",, \"T\")/100,\"\")","v":""},{"$f":"IFERROR(RANK($C95,$C$2:C$103)+COUNTIF($C$2:C95,C95)-1,\"\")","v":""},"",94,"",{"$f":"IF(G95=\"\",\"\",RTD(\"cqg.rtd\", ,\"ContractData\",G95, \"LongDescription\",, \"T\"))","v":""},{"$f":"IFERROR(RTD(\"cqg.rtd\", ,\"ContractData\",G95, \"PerCentNetLastTrade\",, \"T\")/100,\"\")","v":""},0,94,{"$f":"IFERROR(VLOOKUP(A95,Data!$I$2:$J$103,2,FALSE),\"\")","v":""},{"$f":"IFERROR(RTD(\"cqg.rtd\", ,\"ContractData\",L95, \"PerCentNetLastTrade\",, \"T\")/100,\"\")","v":""},{"$f":"IFERROR(RANK($M95,$M$2:M$104)+COUNTIF($M$2:M95,M95)-1,\"\")","v":""},"",94,"",{"$f":"IF(Q95=\"\",\"\",RTD(\"cqg.rtd\", ,\"ContractData\",Q95, \"LongDescription\",, \"T\"))","v":""},{"$f":"IFERROR(RTD(\"cqg.rtd\", ,\"ContractData\",Q95, \"PerCentNetLastTrade\",, \"T\")/100,\"\")","v":""},0]
[95,{"$f":"IFERROR(VLOOKUP(A96,Data!$H$2:$J$103,3,FALSE),\"\")","v":""},{"$f":"IFERROR(RTD(\"cqg.rtd\", ,\"ContractData\",B96, \"PerCentNetLastTrade\",, \"T\")/100,\"\")","v":""},{"$f":"IFERROR(RANK($C96,$C$2:C$103)+COUNTIF($C$2:C96,C96)-1,\"\")","v":""},"",95,"",{"$f":"IF(G96=\"\",\"\",RTD(\"cqg.rtd\", ,\"ContractData\",G96, \"LongDescription\",, \"T\"))","v":""},{"$f":"IFERROR(RTD(\"cqg.rtd\", ,\"ContractData\",G96, \"PerCentNetLastTrade\",, \"T\")/100,\"\")","v":""},0,95,{"$f":"IFERROR(VLOOKUP(A96,Data!$I$2:$J$103,2,FALSE),\"\")","v":""},{"$f":"IFERROR(RTD(\"cqg.rtd\", ,\"ContractData\",L96, \"PerCentNetLastTrade\",, \"T\")/100,\"\")","v":""},{"$f":"IFERROR(RANK($M96,$M$2:M$104)+COUNTIF($M$2:M96,M96)-1,\"\")","v":""},"",95,"",{"$f":"IF(Q96=\"\",\"\",RTD(\"cqg.rtd\", ,\"ContractData\",Q96, \"LongDescription\",, \"T\"))","v":""},{"$f":"IFERROR(RTD(\"cqg.rtd\", ,\"ContractData\",Q96, \"PerCentNetLastTrade\",, \"T\")/100,\"\")","v":""},0]
[96,{"$f":"IFERROR(VLOOKUP(A97,Data!$H$2:$J$103,3,FALSE),\"\")","v":""},{"$f":"IFERROR(RTD(\"cqg.rtd\", ,\"ContractData\",B97, \"PerCentNetLastTrade\",, \"T\")/100,\"\")","v":""},{"$f":"IFERROR(RANK($C97,$C$2:C$103)+COUNTIF($C$2:C97,C97)-1,\"\")","v":""},"",96,"",{"$f":"IF(G97=\"\",\"\",RTD(\"cqg.rtd\", ,\"ContractData\",G97, \"LongDescription\",, \"T\"))","v":""},{"$f":"IFERROR(RTD(\"cqg.rtd\", ,\"ContractData\",G97, \"PerCentNetLastTrade\",, \"T\")/100,\"\")","v":""},0,96,{"$f":"IFERROR(VLOOKUP(A97,Data!$I$2:$J$103,2,FALSE),\"\")","v":""},{"$f":"IFERROR(RTD(\"cqg.rtd\", ,\"ContractData\",L97, \"PerCentNetLastTrade\",, \"T\")/100,\"\")","v":""},{"$f":"IFERROR(RANK($M97,$M$2:M$104)+COUNTIF($M$2:M97,M97)-1,\"\")","v":""},"",96,"",{"$f":"IF(Q97=\"\",\"\",RTD(\"cqg.rtd\", ,\"ContractData\",Q97, \"LongDescription\",, \"T\"))","v":""},{"$f":"IFERROR(RTD(\"cqg.rtd\", ,\"ContractData\",Q97, \"PerCentNetLastTrade\",, \"T\")/100,\"\")","v":""},0]
[97,{"$f":"IFERROR(VLOOKUP(A98,Data!$H$2:$J$103,3,FALSE),\"\")","v":""},{"$f":"IFERROR(RTD(\"cqg.rtd\", ,\"ContractData\",B98, \"PerCentNetLastTrade\",, \"T\")/100,\"\")","v":""},{"$f":"IFERROR(RANK($C98,$C$2:C$103)+COUNTIF($C$2:C98,C98)-1,\"\")","v":""},"",97,"",{"$f":"IF(G98=\"\",\"\",RTD(\"cqg.rtd\", ,\"ContractData\",G98, \"LongDescription\",, \"T\"))","v":""},{"$f":"IFERROR(RTD(\"cqg.rtd\", ,\"ContractData\",G98, \"PerCentNetLastTrade\",, \"T\")/100,\"\")","v":""},0,97,{"$f":"IFERROR(VLOOKUP(A98,Data!$I$2:$J$103,2,FALSE),\"\")","v":""},{"$f":"IFERROR(RTD(\"cqg.rtd\", ,\"ContractData\",L98, \"PerCentNetLastTrade\",, \"T\")/100,\"\")","v":""},{"$f":"IFERROR(RANK($M98,$M$2:M$104)+COUNTIF($M$2:M98,M98)-1,\"\")","v":""},"",97,"",{"$f":"IF(Q98=\"\",\"\",RTD(\"cqg.rtd\", ,\"ContractData\",Q98, \"LongDescription\",, \"T\"))","v":""},{"$f":"IFERROR(RTD(\"cqg.rtd\", ,\"ContractData\",Q98, \"PerCentNetLastTrade\",, \"T\")/100,\"\")","v":""},0]
[98,{"$f":"IFERROR(VLOOKUP(A99,Data!$H$2:$J$103,3,FALSE),\"\")","v":""},{"$f":"IFERROR(RTD(\"cqg.rtd\", ,\"ContractData\",B99, \"PerCentNetLastTrade\",, \"T\")/100,\"\")","v":""},{"$f":"IFERROR(RANK($C99,$C$2:C$103)+COUNTIF($C$2:C99,C99)-1,\"\")","v":""},"",98,"",{"$f":"IF(G99=\"\",\"\",RTD(\"cqg.rtd\", ,\"ContractData\",G99, \"LongDescription\",, \"T\"))","v":""},{"$f":"IFERROR(RTD(\"cqg.rtd\", ,\"ContractData\",G99, \"PerCentNetLastTrade\",, \"T\")/100,\"\")","v":""},0,98,{"$f":"IFERROR(VLOOKUP(A99,Data!$I$2:$J$103,2,FALSE),\"\")","v":""},{"$f":"IFERROR(RTD(\"cqg.rtd\", ,\"ContractData\",L99, \"PerCentNetLastTrade\",, \"T\")/100,\"\")","v":""},{"$f":"IFERROR(RANK($M99,$M$2:M$104)+COUNTIF($M$2:M99,M99)-1,\"\")","v":""},"",98,"",{"$f":"IF(Q99=\"\",\"\",RTD(\"cqg.rtd\", ,\"ContractData\",Q99, \"LongDescription\",, \"T\"))","v":""},{"$f":"IFERROR(RTD(\"cqg.rtd\", ,\"ContractData\",Q99, \"PerCentNetLastTrade\",, \"T\")/100,\"\")","v":""},0]
[99,{"$f":"IFERROR(VLOOKUP(A100,Data!$H$2:$J$103,3,FALSE),\"\")","v":""},{"$f":"IFERROR(RTD(\"cqg.rtd\", ,\"ContractData\",B100, \"PerCentNetLastTrade\",, \"T\")/100,\"\")","v":""},{"$f":"IFERROR(RANK($C100,$C$2:C$103)+COUNTIF($C$2:C100,C100)-1,\"\")","v":""},"",99,"",{"$f":"IF(G100=\"\",\"\",RTD(\"cqg.rtd\", ,\"ContractData\",G100, \"LongDescription\",, \"T\"))","v":""},{"$f":"IFERROR(RTD(\"cqg.rtd\", ,\"ContractData\",G100, \"PerCentNetLastTrade\",, \"T\")/100,\"\")","v":""},0,99,{"$f":"IFERROR(VLOOKUP(A100,Data!$I$2:$J$103,2,FALSE),\"\")","v":""},{"$f":"IFERROR(RTD(\"cqg.rtd\", ,\"ContractData\",L100, \"PerCentNetLastTrade\",, \"T\")/100,\"\")","v":""},{"$f":"IFERROR(RANK($M100,$M$2:M$104)+COUNTIF($M$2:M100,M100)-1,\"\")","v":""},"",99,"",{"$f":"IF(Q100=\"\",\"\",RTD(\"cqg.rtd\", ,\"ContractData\",Q100, \"LongDescription\",, \"T\"))","v":""},{"$f":"IFERROR(RTD(\"cqg.rtd\", ,\"ContractData\",Q100, \"PerCentNetLastTrade\",, \"T\")/100,\"\")","v":""},0]
[100,{"$f":"IFERROR(VLOOKUP(A101,Data!$H$2:$J$103,3,FALSE),\"\")","v":""},{"$f":"IFERROR(RTD(\"cqg.rtd\", ,\"ContractData\",B101, \"PerCentNetLastTrade\",, \"T\")/100,\"\")","v":""},{"$f":"IFERROR(RANK($C101,$C$2:C$103)+COUNTIF($C$2:C101,C101)-1,\"\")","v":""},"",100,"",{"$f":"IF(G101=\"\",\"\",RTD(\"cqg.rtd\", ,\"ContractData\",G101, \"LongDescription\",, \"T\"))","v":""},{"$f":"IFERROR(RTD(\"cqg.rtd\", ,\"ContractData\",G101, \"PerCentNetLastTrade\",, \"T\")/100,\"\")","v":""},0,100,{"$f":"IFERROR(VLOOKUP(A101,Data!$I$2:$J$103,2,FALSE),\"\")","v":""},{"$f":"IFERROR(RTD(\"cqg.rtd\", ,\"ContractData\",L101, \"PerCentNetLastTrade\",, \"T\")/100,\"\")","v":""},{"$f":"IFERROR(RANK($M101,$M$2:M$104)+COUNTIF($M$2:M101,M101)-1,\"\")","v":""},"",100,"",{"$f":"IF(Q101=\"\",\"\",RTD(\"cqg.rtd\", ,\"ContractData\",Q101, \"LongDescription\",, \"T\"))","v":""},{"$f":"IFERROR(RTD(\"cqg.rtd\", ,\"ContractData\",Q101, \"PerCentNetLastTrade\",, \"T\")/100,\"\")","v":""},0]
[101,{"$f":"IFERROR(VLOOKUP(A102,Data!$H$2:$J$103,3,FALSE),\"\")","v":""},{"$f":"IFERROR(RTD(\"cqg.rtd\", ,\"ContractData\",B102, \"PerCentNetLastTrade\",, \"T\")/100,\"\")","v":""},{"$f":"IFERROR(RANK($C102,$C$2:C$103)+COUNTIF($C$2:C102,C102)-1,\"\")","v":""},"",101,"",{"$f":"IF(G102=\"\",\"\",RTD(\"cqg.rtd\", ,\"ContractData\",G102, \"LongDescription\",, \"T\"))","v":""},{"$f":"IFERROR(RTD(\"cqg.rtd\", ,\"ContractData\",G102, \"PerCentNetLastTrade\",, \"T\")/100,\"\")","v":""},0,101,{"$f":"IFERROR(VLOOKUP(A102,Data!$I$2:$J$103,2,FALSE),\"\")","v":""},{"$f":"IFERROR(RTD(\"cqg.rtd\", ,\"ContractData\",L102, \"PerCentNetLastTrade\",, \"T\")/100,\"\")","v":""},{"$f":"IFERROR(RANK($M102,$M$2:M$104)+COUNTIF($M$2:M102,M102)-1,\"\")","v":""},"",101,"",{"$f":"IF(Q102=\"\",\"\",RTD(\"cqg.rtd\", ,\"ContractData\",Q102, \"LongDescription\",, \"T\"))","v":""},{"$f":"IFERROR(RTD(\"cqg.rtd\", ,\"ContractData\",Q102, \"PerCentNetLastTrade\",, \"T\")/100,\"\")","v":""},0]
[102,{"$f":"IFERROR(VLOOKUP(A103,Data!$H$2:$J$103,3,FALSE),\"\")","v":""},{"$f":"IFERROR(RTD(\"cqg.rtd\", ,\"ContractData\",B103, \"PerCentNetLastTrade\",, \"T\")/100,\"\")","v":""},{"$f":"IFERROR(RANK($C103,$C$2:C$103)+COUNTIF($C$2:C103,C103)-1,\"\")","v":""},"",102,"",{"$f":"IF(G103=\"\",\"\",RTD(\"cqg.rtd\", ,\"ContractData\",G103, \"LongDescription\",, \"T\"))","v":""},{"$f":"IFERROR(RTD(\"cqg.rtd\", ,\"ContractData\",G103, \"PerCentNetLastTrade\",, \"T\")/100,\"\")","v":""},0,102,{"$f":"IFERROR(VLOOKUP(A103,Data!$I$2:$J$103,2,FALSE),\"\")","v":""},{"$f":"IFERROR(RTD(\"cqg.rtd\", ,\"ContractData\",L103, \"PerCentNetLastTrade\",, \"T\")/100,\"\")","v":""},{"$f":"IFERROR(RANK($M103,$M$2:M$104)+COUNTIF($M$2:M103,M103)-1,\"\")","v":""},"",102,"",{"$f":"IF(Q103=\"\",\"\",RTD(\"cqg.rtd\", ,\"ContractData\",Q103, \"LongDescription\",, \"T\"))","v":""},{"$f":"IFERROR(RTD(\"cqg.rtd\", ,\"ContractData\",Q103, \"PerCentNetLastTrade\",, \"T\")/100,\"\")","v":""},0]

{"sheet":"BarData","index":3,"n_rows":301,"n_cols":18,"rows_kept":301,"cut":false,"hidden":true,"merged":[]}
[{"$f":" RTD(\"cqg.rtd\",,\"StudyData\", $N$2, \"Bar\", \"\", \"Time\", $M$2, $F1,$R$2,$Q$2, \"\",\"False\")","v":44187.402777777781},{"$f":" IF(RTD(\"cqg.rtd\",,\"StudyData\", $N$2, \"Bar\", \"\", \"Open\", $M$2, $F1, $R$2,$Q$2,,$O$2,$P$2)=\"\",NA(),RTD(\"cqg.rtd\",,\"StudyData\", $N$2, \"Bar\", \"\", \"Open\", $M$2, $F1, $R$2,$Q$2,,$O$2,$P$2))","v":310.2},{"$f":" IF(RTD(\"cqg.rtd\",,\"StudyData\", $N$2, \"Bar\", \"\", \"High\", $M$2, $F1, $R$2,$Q$2,,$O$2,$P$2)=\"\",NA(),RTD(\"cqg.rtd\",,\"StudyData\", $N$2, \"Bar\", \"\", \"High\", $M$2, $F1, $R$2,$Q$2,,$O$2,$P$2))","v":310.27},{"$f":" IF(RTD(\"cqg.rtd\",,\"StudyData\", $N$2, \"Bar\", \"\", \"Low\", $M$2, $F1, $R$2,$Q$2,,$O$2,$P$2)=\"\",NA(),RTD(\"cqg.rtd\",,\"StudyData\", $N$2, \"Bar\", \"\", \"Low\", $M$2, $F1, $R$2,$Q$2,,$O$2,$P$2))","v":310.02},{"$f":" IF(RTD(\"cqg.rtd\",,\"StudyData\", $N$2, \"Bar\", \"\", \"Close\", $M$2, $F1, $R$2,$Q$2,,$O$2,$P$2)=\"\",NA(),RTD(\"cqg.rtd\",,\"StudyData\", $N$2, \"Bar\", \"\", \"Close\", $M$2, $F1, $R$2,$Q$2,,$O$2,$P$2))","v":310.19},0,null,{"$f":"A1","v":44187.402777777781},{"$f":"RTD(\"cqg.rtd\",,\"StudyData\",$N$2, \"Vol\", \"VolType=Auto,CoCType=Auto\", \"Vol\", $M$2, $F1, $R$2,$Q$2,,$O$2,$P$2)","v":92537},null,null,null,"Chart","Symbol","Continuation","Decimal=T, Tick=D","CustomSessionName","Type All or PrimaryOnly"]
[{"$f":" RTD(\"cqg.rtd\",,\"StudyData\", $N$2, \"Bar\", \"\", \"Time\", $M$2, $F2,$R$2,$Q$2, \"\",\"False\")","v":44187.399305555555},{"$f":" RTD(\"cqg.rtd\",,\"StudyData\", $N$2, \"Bar\", \"\", \"Open\", $M$2, $F2, $R$2,$Q$2,,$O$2,$P$2)","v":310.13},{"$f":" RTD(\"cqg.rtd\",,\"StudyData\", $N$2, \"Bar\", \"\", \"High\", $M$2, $F2, $R$2,$Q$2,,$O$2,$P$2)","v":310.26},{"$f":" RTD(\"cqg.rtd\",,\"StudyData\", $N$2, \"Bar\", \"\", \"Low\", $M$2, $F2, $R$2,$Q$2,,$O$2,$P$2)","v":310.06},{"$f":" RTD(\"cqg.rtd\",,\"StudyData\", $N$2, \"Bar\", \"\", \"Close\", $M$2, $F2, $R$2,$Q$2,,$O$2,$P$2)","v":310.20999999999998},{"$f":"F1-1","v":-1},null,{"$f":"A2","v":44187.399305555555},{"$f":"RTD(\"cqg.rtd\",,\"StudyData\",$N$2, \"Vol\", \"VolType=Auto,CoCType=Auto\", \"Vol\", $M$2, $F2, $R$2,$Q$2,,$O$2,$P$2)","v":117876},null,null,null,{"$f":"Main!U24","v":5},{"$f":"Main!R24","v":"S.QQQ"},true,"T",null,{"$f":"Main!W24","v":"All"}]
[{"$f":" RTD(\"cqg.rtd\",,\"StudyData\", $N$2, \"Bar\", \"\", \"Time\", $M$2, $F3,$R$2,$Q$2, \"\",\"False\")","v":44187.395833333336},{"$f":" RTD(\"cqg.rtd\",,\"StudyData\", $N$2, \"Bar\", \"\", \"Open\", $M$2, $F3, $R$2,$Q$2,,$O$2,$P$2)","v":309.57},{"$f":" RTD(\"cqg.rtd\",,\"StudyData\", $N$2, \"Bar\", \"\", \"High\", $M$2, $F3, $R$2,$Q$2,,$O$2,$P$2)","v":310.14},{"$f":" RTD(\"cqg.rtd\",,\"StudyData\", $N$2, \"Bar\", \"\", \"Low\", $M$2, $F3, $R$2,$Q$2,,$O$2,$P$2)","v":309.39999999999998},{"$f":" RTD(\"cqg.rtd\",,\"StudyData\", $N$2, \"Bar\", \"\", \"Close\", $M$2, $F3, $R$2,$Q$2,,$O$2,$P$2)","v":310.14},{"$f":"F2-1","v":-2},null,44187.395833333336,{"$f":"RTD(\"cqg.rtd\",,\"StudyData\",$N$2, \"Vol\", \"VolType=Auto,CoCType=Auto\", \"Vol\", $M$2, $F3, $R$2,$Q$2,,$O$2,$P$2)","v":288742}]
[{"$f":" RTD(\"cqg.rtd\",,\"StudyData\", $N$2, \"Bar\", \"\", \"Time\", $M$2, $F4,$R$2,$Q$2, \"\",\"False\")","v":44187.392361111109},{"$f":" RTD(\"cqg.rtd\",,\"StudyData\", $N$2, \"Bar\", \"\", \"Open\", $M$2, $F4, $R$2,$Q$2,,$O$2,$P$2)","v":309.49},{"$f":" RTD(\"cqg.rtd\",,\"StudyData\", $N$2, \"Bar\", \"\", \"High\", $M$2, $F4, $R$2,$Q$2,,$O$2,$P$2)","v":309.69},{"$f":" RTD(\"cqg.rtd\",,\"StudyData\", $N$2, \"Bar\", \"\", \"Low\", $M$2, $F4, $R$2,$Q$2,,$O$2,$P$2)","v":309.24},{"$f":" RTD(\"cqg.rtd\",,\"StudyData\", $N$2, \"Bar\", \"\", \"Close\", $M$2, $F4, $R$2,$Q$2,,$O$2,$P$2)","v":309.57},-3,null,44187.392361111109,{"$f":"RTD(\"cqg.rtd\",,\"StudyData\",$N$2, \"Vol\", \"VolType=Auto,CoCType=Auto\", \"Vol\", $M$2, $F4, $R$2,$Q$2,,$O$2,$P$2)","v":273803}]
[{"$f":" RTD(\"cqg.rtd\",,\"StudyData\", $N$2, \"Bar\", \"\", \"Time\", $M$2, $F5,$R$2,$Q$2, \"\",\"False\")","v":44187.388888888891},{"$f":" RTD(\"cqg.rtd\",,\"StudyData\", $N$2, \"Bar\", \"\", \"Open\", $M$2, $F5, $R$2,$Q$2,,$O$2,$P$2)","v":309.45999999999998},{"$f":" RTD(\"cqg.rtd\",,\"StudyData\", $N$2, \"Bar\", \"\", \"High\", $M$2, $F5, $R$2,$Q$2,,$O$2,$P$2)","v":309.63},{"$f":" RTD(\"cqg.rtd\",,\"StudyData\", $N$2, \"Bar\", \"\", \"Low\", $M$2, $F5, $R$2,$Q$2,,$O$2,$P$2)","v":309.19},{"$f":" RTD(\"cqg.rtd\",,\"StudyData\", $N$2, \"Bar\", \"\", \"Close\", $M$2, $F5, $R$2,$Q$2,,$O$2,$P$2)","v":309.48},-4,null,44187.388888888891,{"$f":"RTD(\"cqg.rtd\",,\"StudyData\",$N$2, \"Vol\", \"VolType=Auto,CoCType=Auto\", \"Vol\", $M$2, $F5, $R$2,$Q$2,,$O$2,$P$2)","v":306363}]
[{"$f":" RTD(\"cqg.rtd\",,\"StudyData\", $N$2, \"Bar\", \"\", \"Time\", $M$2, $F6,$R$2,$Q$2, \"\",\"False\")","v":44187.385416666664},{"$f":" RTD(\"cqg.rtd\",,\"StudyData\", $N$2, \"Bar\", \"\", \"Open\", $M$2, $F6, $R$2,$Q$2,,$O$2,$P$2)","v":309.27},{"$f":" RTD(\"cqg.rtd\",,\"StudyData\", $N$2, \"Bar\", \"\", \"High\", $M$2, $F6, $R$2,$Q$2,,$O$2,$P$2)","v":309.95999999999998},{"$f":" RTD(\"cqg.rtd\",,\"StudyData\", $N$2, \"Bar\", \"\", \"Low\", $M$2, $F6, $R$2,$Q$2,,$O$2,$P$2)","v":309.18},{"$f":" RTD(\"cqg.rtd\",,\"StudyData\", $N$2, \"Bar\", \"\", \"Close\", $M$2, $F6, $R$2,$Q$2,,$O$2,$P$2)","v":309.45999999999998},-5,null,44187.385416666664,{"$f":"RTD(\"cqg.rtd\",,\"StudyData\",$N$2, \"Vol\", \"VolType=Auto,CoCType=Auto\", \"Vol\", $M$2, $F6, $R$2,$Q$2,,$O$2,$P$2)","v":294667}]
[{"$f":" RTD(\"cqg.rtd\",,\"StudyData\", $N$2, \"Bar\", \"\", \"Time\", $M$2, $F7,$R$2,$Q$2, \"\",\"False\")","v":44187.381944444445},{"$f":" RTD(\"cqg.rtd\",,\"StudyData\", $N$2, \"Bar\", \"\", \"Open\", $M$2, $F7, $R$2,$Q$2,,$O$2,$P$2)","v":310.45},{"$f":" RTD(\"cqg.rtd\",,\"StudyData\", $N$2, \"Bar\", \"\", \"High\", $M$2, $F7, $R$2,$Q$2,,$O$2,$P$2)","v":310.49},{"$f":" RTD(\"cqg.rtd\",,\"StudyData\", $N$2, \"Bar\", \"\", \"Low\", $M$2, $F7, $R$2,$Q$2,,$O$2,$P$2)","v":309.14},{"$f":" RTD(\"cqg.rtd\",,\"StudyData\", $N$2, \"Bar\", \"\", \"Close\", $M$2, $F7, $R$2,$Q$2,,$O$2,$P$2)","v":309.27999999999997},-6,null,44187.381944444445,{"$f":"RTD(\"cqg.rtd\",,\"StudyData\",$N$2, \"Vol\", \"VolType=Auto,CoCType=Auto\", \"Vol\", $M$2, $F7, $R$2,$Q$2,,$O$2,$P$2)","v":602965}]
[{"$f":" RTD(\"cqg.rtd\",,\"StudyData\", $N$2, \"Bar\", \"\", \"Time\", $M$2, $F8,$R$2,$Q$2, \"\",\"False\")","v":44187.378472222219},{"$f":" RTD(\"cqg.rtd\",,\"StudyData\", $N$2, \"Bar\", \"\", \"Open\", $M$2, $F8, $R$2,$Q$2,,$O$2,$P$2)","v":310.02999999999997},{"$f":" RTD(\"cqg.rtd\",,\"StudyData\", $N$2, \"Bar\", \"\", \"High\", $M$2, $F8, $R$2,$Q$2,,$O$2,$P$2)","v":310.54000000000002},{"$f":" RTD(\"cqg.rtd\",,\"StudyData\", $N$2, \"Bar\", \"\", \"Low\", $M$2, $F8, $R$2,$Q$2,,$O$2,$P$2)","v":309.95999999999998},{"$f":" RTD(\"cqg.rtd\",,\"StudyData\", $N$2, \"Bar\", \"\", \"Close\", $M$2, $F8, $R$2,$Q$2,,$O$2,$P$2)","v":310.45},-7,null,44187.378472222219,{"$f":"RTD(\"cqg.rtd\",,\"StudyData\",$N$2, \"Vol\", \"VolType=Auto,CoCType=Auto\", \"Vol\", $M$2, $F8, $R$2,$Q$2,,$O$2,$P$2)","v":251895}]
[{"$f":" RTD(\"cqg.rtd\",,\"StudyData\", $N$2, \"Bar\", \"\", \"Time\", $M$2, $F9,$R$2,$Q$2, \"\",\"False\")","v":44187.375},{"$f":" RTD(\"cqg.rtd\",,\"StudyData\", $N$2, \"Bar\", \"\", \"Open\", $M$2, $F9, $R$2,$Q$2,,$O$2,$P$2)","v":310.60000000000002},{"$f":" RTD(\"cqg.rtd\",,\"StudyData\", $N$2, \"Bar\", \"\", \"High\", $M$2, $F9, $R$2,$Q$2,,$O$2,$P$2)","v":310.61},{"$f":" RTD(\"cqg.rtd\",,\"StudyData\", $N$2, \"Bar\", \"\", \"Low\", $M$2, $F9, $R$2,$Q$2,,$O$2,$P$2)","v":309.70999999999998},{"$f":" RTD(\"cqg.rtd\",,\"StudyData\", $N$2, \"Bar\", \"\", \"Close\", $M$2, $F9, $R$2,$Q$2,,$O$2,$P$2)","v":310.06},-8,null,44187.375,{"$f":"RTD(\"cqg.rtd\",,\"StudyData\",$N$2, \"Vol\", \"VolType=Auto,CoCType=Auto\", \"Vol\", $M$2, $F9, $R$2,$Q$2,,$O$2,$P$2)","v":421310}]
[{"$f":" RTD(\"cqg.rtd\",,\"StudyData\", $N$2, \"Bar\", \"\", \"Time\", $M$2, $F10,$R$2,$Q$2, \"\",\"False\")","v":44187.371527777781},{"$f":" RTD(\"cqg.rtd\",,\"StudyData\", $N$2, \"Bar\", \"\", \"Open\", $M$2, $F10, $R$2,$Q$2,,$O$2,$P$2)","v":310.41000000000003},{"$f":" RTD(\"cqg.rtd\",,\"StudyData\", $N$2, \"Bar\", \"\", \"High\", $M$2, $F10, $R$2,$Q$2,,$O$2,$P$2)","v":310.70999999999998},{"$f":" RTD(\"cqg.rtd\",,\"StudyData\", $N$2, \"Bar\", \"\", \"Low\", $M$2, $F10, $R$2,$Q$2,,$O$2,$P$2)","v":310.41000000000003},{"$f":" RTD(\"cqg.rtd\",,\"StudyData\", $N$2, \"Bar\", \"\", \"Close\", $M$2, $F10, $R$2,$Q$2,,$O$2,$P$2)","v":310.60000000000002},-9,null,44187.371527777781,{"$f":"RTD(\"cqg.rtd\",,\"StudyData\",$N$2, \"Vol\", \"VolType=Auto,CoCType=Auto\", \"Vol\", $M$2, $F10, $R$2,$Q$2,,$O$2,$P$2)","v":374543}]
[{"$f":" RTD(\"cqg.rtd\",,\"StudyData\", $N$2, \"Bar\", \"\", \"Time\", $M$2, $F11,$R$2,$Q$2, \"\",\"False\")","v":44187.368055555555},{"$f":" RTD(\"cqg.rtd\",,\"StudyData\", $N$2, \"Bar\", \"\", \"Open\", $M$2, $F11, $R$2,$Q$2,,$O$2,$P$2)","v":310.04000000000002},{"$f":" RTD(\"cqg.rtd\",,\"StudyData\", $N$2, \"Bar\", \"\", \"High\", $M$2, $F11, $R$2,$Q$2,,$O$2,$P$2)","v":310.42},{"$f":" RTD(\"cqg.rtd\",,\"StudyData\", $N$2, \"Bar\", \"\", \"Low\", $M$2, $F11, $R$2,$Q$2,,$O$2,$P$2)","v":309.79000000000002},{"$f":" RTD(\"cqg.rtd\",,\"StudyData\", $N$2, \"Bar\", \"\", \"Close\", $M$2, $F11, $R$2,$Q$2,,$O$2,$P$2)","v":310.39999999999998},-10,null,44187.368055555555,{"$f":"RTD(\"cqg.rtd\",,\"StudyData\",$N$2, \"Vol\", \"VolType=Auto,CoCType=Auto\", \"Vol\", $M$2, $F11, $R$2,$Q$2,,$O$2,$P$2)","v":385889}]
[{"$f":" RTD(\"cqg.rtd\",,\"StudyData\", $N$2, \"Bar\", \"\", \"Time\", $M$2, $F12,$R$2,$Q$2, \"\",\"False\")","v":44187.364583333336},{"$f":" RTD(\"cqg.rtd\",,\"StudyData\", $N$2, \"Bar\", \"\", \"Open\", $M$2, $F12, $R$2,$Q$2,,$O$2,$P$2)","v":309.75},{"$f":" RTD(\"cqg.rtd\",,\"StudyData\", $N$2, \"Bar\", \"\", \"High\", $M$2, $F12, $R$2,$Q$2,,$O$2,$P$2)","v":310.05},{"$f":" RTD(\"cqg.rtd\",,\"StudyData\", $N$2, \"Bar\", \"\", \"Low\", $M$2, $F12, $R$2,$Q$2,,$O$2,$P$2)","v":309.63},{"$f":" RTD(\"cqg.rtd\",,\"StudyData\", $N$2, \"Bar\", \"\", \"Close\", $M$2, $F12, $R$2,$Q$2,,$O$2,$P$2)","v":310.02999999999997},-11,null,44187.364583333336,{"$f":"RTD(\"cqg.rtd\",,\"StudyData\",$N$2, \"Vol\", \"VolType=Auto,CoCType=Auto\", \"Vol\", $M$2, $F12, $R$2,$Q$2,,$O$2,$P$2)","v":369700}]
[{"$f":" RTD(\"cqg.rtd\",,\"StudyData\", $N$2, \"Bar\", \"\", \"Time\", $M$2, $F13,$R$2,$Q$2, \"\",\"False\")","v":44187.361111111109},{"$f":" RTD(\"cqg.rtd\",,\"StudyData\", $N$2, \"Bar\", \"\", \"Open\", $M$2, $F13, $R$2,$Q$2,,$O$2,$P$2)","v":309.52},{"$f":" RTD(\"cqg.rtd\",,\"StudyData\", $N$2, \"Bar\", \"\", \"High\", $M$2, $F13, $R$2,$Q$2,,$O$2,$P$2)","v":309.79000000000002},{"$f":" RTD(\"cqg.rtd\",,\"StudyData\", $N$2, \"Bar\", \"\", \"Low\", $M$2, $F13, $R$2,$Q$2,,$O$2,$P$2)","v":309.27},{"$f":" RTD(\"cqg.rtd\",,\"StudyData\", $N$2, \"Bar\", \"\", \"Close\", $M$2, $F13, $R$2,$Q$2,,$O$2,$P$2)","v":309.76},-12,null,44187.361111111109,{"$f":"RTD(\"cqg.rtd\",,\"StudyData\",$N$2, \"Vol\", \"VolType=Auto,CoCType=Auto\", \"Vol\", $M$2, $F13, $R$2,$Q$2,,$O$2,$P$2)","v":350794}]
[{"$f":" RTD(\"cqg.rtd\",,\"StudyData\", $N$2, \"Bar\", \"\", \"Time\", $M$2, $F14,$R$2,$Q$2, \"\",\"False\")","v":44187.357638888891},{"$f":" RTD(\"cqg.rtd\",,\"StudyData\", $N$2, \"Bar\", \"\", \"Open\", $M$2, $F14, $R$2,$Q$2,,$O$2,$P$2)","v":309.07},{"$f":" RTD(\"cqg.rtd\",,\"StudyData\", $N$2, \"Bar\", \"\", \"High\", $M$2, $F14, $R$2,$Q$2,,$O$2,$P$2)","v":309.58999999999997},{"$f":" RTD(\"cqg.rtd\",,\"StudyData\", $N$2, \"Bar\", \"\", \"Low\", $M$2, $F14, $R$2,$Q$2,,$O$2,$P$2)","v":308.88},{"$f":" RTD(\"cqg.rtd\",,\"StudyData\", $N$2, \"Bar\", \"\", \"Close\", $M$2, $F14, $R$2,$Q$2,,$O$2,$P$2)","v":309.51},-13,null,44187.357638888891,{"$f":"RTD(\"cqg.rtd\",,\"StudyData\",$N$2, \"Vol\", \"VolType=Auto,CoCType=Auto\", \"Vol\", $M$2, $F14, $R$2,$Q$2,,$O$2,$P$2)","v":345416}]
[{"$f":" RTD(\"cqg.rtd\",,\"StudyData\", $N$2, \"Bar\", \"\", \"Time\", $M$2, $F15,$R$2,$Q$2, \"\",\"False\")","v":44187.354166666664},{"$f":" RTD(\"cqg.rtd\",,\"StudyData\", $N$2, \"Bar\", \"\", \"Open\", $M$2, $F15, $R$2,$Q$2,,$O$2,$P$2)","v":309.85000000000002},{"$f":" RTD(\"cqg.rtd\",,\"StudyData\", $N$2, \"Bar\", \"\", \"High\", $M$2, $F15, $R$2,$Q$2,,$O$2,$P$2)","v":309.89999999999998},{"$f":" RTD(\"cqg.rtd\",,\"StudyData\", $N$2, \"Bar\", \"\", \"Low\", $M$2, $F15, $R$2,$Q$2,,$O$2,$P$2)","v":309.02},{"$f":" RTD(\"cqg.rtd\",,\"StudyData\", $N$2, \"Bar\", \"\", \"Close\", $M$2, $F15, $R$2,$Q$2,,$O$2,$P$2)","v":309.06},-14,null,44187.354166666664,{"$f":"RTD(\"cqg.rtd\",,\"StudyData\",$N$2, \"Vol\", \"VolType=Auto,CoCType=Auto\", \"Vol\", $M$2, $F15, $R$2,$Q$2,,$O$2,$P$2)","v":748324}]
[{"$f":" RTD(\"cqg.rtd\",,\"StudyData\", $N$2, \"Bar\", \"\", \"Time\", $M$2, $F16,$R$2,$Q$2, \"\",\"False\")","v":44186.631944444445},{"$f":" RTD(\"cqg.rtd\",,\"StudyData\", $N$2, \"Bar\", \"\", \"Open\", $M$2, $F16, $R$2,$Q$2,,$O$2,$P$2)","v":309.05},{"$f":" RTD(\"cqg.rtd\",,\"StudyData\", $N$2, \"Bar\", \"\", \"High\", $M$2, $F16, $R$2,$Q$2,,$O$2,$P$2)","v":309.12},{"$f":" RTD(\"cqg.rtd\",,\"StudyData\", $N$2, \"Bar\", \"\", \"Low\", $M$2, $F16, $R$2,$Q$2,,$O$2,$P$2)","v":308.91000000000003},{"$f":" RTD(\"cqg.rtd\",,\"StudyData\", $N$2, \"Bar\", \"\", \"Close\", $M$2, $F16, $R$2,$Q$2,,$O$2,$P$2)","v":309.12},-15,null,44186.631944444445,{"$f":"RTD(\"cqg.rtd\",,\"StudyData\",$N$2, \"Vol\", \"VolType=Auto,CoCType=Auto\", \"Vol\", $M$2, $F16, $R$2,$Q$2,,$O$2,$P$2)","v":181713}]
[{"$f":" RTD(\"cqg.rtd\",,\"StudyData\", $N$2, \"Bar\", \"\", \"Time\", $M$2, $F17,$R$2,$Q$2, \"\",\"False\")","v":44186.628472222219},{"$f":" RTD(\"cqg.rtd\",,\"StudyData\", $N$2, \"Bar\", \"\", \"Open\", $M$2, $F17, $R$2,$Q$2,,$O$2,$P$2)","v":308.95999999999998},{"$f":" RTD(\"cqg.rtd\",,\"StudyData\", $N$2, \"Bar\", \"\", \"High\", $M$2, $F17, $R$2,$Q$2,,$O$2,$P$2)","v":309.07},{"$f":" RTD(\"cqg.rtd\",,\"StudyData\", $N$2, \"Bar\", \"\", \"Low\", $M$2, $F17, $R$2,$Q$2,,$O$2,$P$2)","v":308.77},{"$f":" RTD(\"cqg.rtd\",,\"StudyData\", $N$2, \"Bar\", \"\", \"Close\", $M$2, $F17, $R$2,$Q$2,,$O$2,$P$2)","v":309.04000000000002},-16,null,44186.628472222219,{"$f":"RTD(\"cqg.rtd\",,\"StudyData\",$N$2, \"Vol\", \"VolType=Auto,CoCType=Auto\", \"Vol\", $M$2, $F17, $R$2,$Q$2,,$O$2,$P$2)","v":447894}]
[{"$f":" RTD(\"cqg.rtd\",,\"StudyData\", $N$2, \"Bar\", \"\", \"Time\", $M$2, $F18,$R$2,$Q$2, \"\",\"False\")","v":44186.625},{"$f":" RTD(\"cqg.rtd\",,\"StudyData\", $N$2, \"Bar\", \"\", \"Open\", $M$2, $F18, $R$2,$Q$2,,$O$2,$P$2)","v":309},{"$f":" RTD(\"cqg.rtd\",,\"StudyData\", $N$2, \"Bar\", \"\", \"High\", $M$2, $F18, $R$2,$Q$2,,$O$2,$P$2)","v":309.02},{"$f":" RTD(\"cqg.rtd\",,\"StudyData\", $N$2, \"Bar\", \"\", \"Low\", $M$2, $F18, $R$2,$Q$2,,$O$2,$P$2)","v":308.58},{"$f":" RTD(\"cqg.rtd\",,\"StudyData\", $N$2, \"Bar\", \"\", \"Close\", $M$2, $F18, $R$2,$Q$2,,$O$2,$P$2)","v":308.89999999999998},-17,null,44186.625,{"$f":"RTD(\"cqg.rtd\",,\"StudyData\",$N$2, \"Vol\", \"VolType=Auto,CoCType=Auto\", \"Vol\", $M$2, $F18, $R$2,$Q$2,,$O$2,$P$2)","v":557256}]
[{"$f":" RTD(\"cqg.rtd\",,\"StudyData\", $N$2, \"Bar\", \"\", \"Time\", $M$2, $F19,$R$2,$Q$2, \"\",\"False\")","v":44186.621527777781},{"$f":" RTD(\"cqg.rtd\",,\"StudyData\", $N$2, \"Bar\", \"\", \"Open\", $M$2, $F19, $R$2,$Q$2,,$O$2,$P$2)","v":308.51},{"$f":" RTD(\"cqg.rtd\",,\"StudyData\", $N$2, \"Bar\", \"\", \"High\", $M$2, $F19, $R$2,$Q$2,,$O$2,$P$2)","v":309.12},{"$f":" RTD(\"cqg.rtd\",,\"StudyData\", $N$2, \"Bar\", \"\", \"Low\", $M$2, $F19, $R$2,$Q$2,,$O$2,$P$2)","v":308.48},{"$f":" RTD(\"cqg.rtd\",,\"StudyData\", $N$2, \"Bar\", \"\", \"Close\", $M$2, $F19, $R$2,$Q$2,,$O$2,$P$2)","v":308.92},-18,null,44186.621527777781,{"$f":"RTD(\"cqg.rtd\",,\"StudyData\",$N$2, \"Vol\", \"VolType=Auto,CoCType=Auto\", \"Vol\", $M$2, $F19, $R$2,$Q$2,,$O$2,$P$2)","v":1372965}]
[{"$f":" RTD(\"cqg.rtd\",,\"StudyData\", $N$2, \"Bar\", \"\", \"Time\", $M$2, $F20,$R$2,$Q$2, \"\",\"False\")","v":44186.618055555555},{"$f":" RTD(\"cqg.rtd\",,\"StudyData\", $N$2, \"Bar\", \"\", \"Open\", $M$2, $F20, $R$2,$Q$2,,$O$2,$P$2)","v":308.38},{"$f":" RTD(\"cqg.rtd\",,\"StudyData\", $N$2, \"Bar\", \"\", \"High\", $M$2, $F20, $R$2,$Q$2,,$O$2,$P$2)","v":308.51},{"$f":" RTD(\"cqg.rtd\",,\"StudyData\", $N$2, \"Bar\", \"\", \"Low\", $M$2, $F20, $R$2,$Q$2,,$O$2,$P$2)","v":307.85000000000002},{"$f":" RTD(\"cqg.rtd\",,\"StudyData\", $N$2, \"Bar\", \"\", \"Close\", $M$2, $F20, $R$2,$Q$2,,$O$2,$P$2)","v":308.5},-19,null,44186.618055555555,{"$f":"RTD(\"cqg.rtd\",,\"StudyData\",$N$2, \"Vol\", \"VolType=Auto,CoCType=Auto\", \"Vol\", $M$2, $F20, $R$2,$Q$2,,$O$2,$P$2)","v":562553}]
[{"$f":" RTD(\"cqg.rtd\",,\"StudyData\", $N$2, \"Bar\", \"\", \"Time\", $M$2, $F21,$R$2,$Q$2, \"\",\"False\")","v":44186.614583333336},{"$f":" RTD(\"cqg.rtd\",,\"StudyData\", $N$2, \"Bar\", \"\", \"Open\", $M$2, $F21, $R$2,$Q$2,,$O$2,$P$2)","v":308.3},{"$f":" RTD(\"cqg.rtd\",,\"StudyData\", $N$2, \"Bar\", \"\", \"High\", $M$2, $F21, $R$2,$Q$2,,$O$2,$P$2)","v":308.57},{"$f":" RTD(\"cqg.rtd\",,\"StudyData\", $N$2, \"Bar\", \"\", \"Low\", $M$2, $F21, $R$2,$Q$2,,$O$2,$P$2)","v":308.23},{"$f":" RTD(\"cqg.rtd\",,\"StudyData\", $N$2, \"Bar\", \"\", \"Close\", $M$2, $F21, $R$2,$Q$2,,$O$2,$P$2)","v":308.37},-20,null,44186.614583333336,{"$f":"RTD(\"cqg.rtd\",,\"StudyData\",$N$2, \"Vol\", \"VolType=Auto,CoCType=Auto\", \"Vol\", $M$2, $F21, $R$2,$Q$2,,$O$2,$P$2)","v":281531}]
[{"$f":" RTD(\"cqg.rtd\",,\"StudyData\", $N$2, \"Bar\", \"\", \"Time\", $M$2, $F22,$R$2,$Q$2, \"\",\"False\")","v":44186.611111111109},{"$f":" RTD(\"cqg.rtd\",,\"StudyData\", $N$2, \"Bar\", \"\", \"Open\", $M$2, $F22, $R$2,$Q$2,,$O$2,$P$2)","v":308.55},{"$f":" RTD(\"cqg.rtd\",,\"StudyData\", $N$2, \"Bar\", \"\", \"High\", $M$2, $F22, $R$2,$Q$2,,$O$2,$P$2)","v":308.64999999999998},{"$f":" RTD(\"cqg.rtd\",,\"StudyData\", $N$2, \"Bar\", \"\", \"Low\", $M$2, $F22, $R$2,$Q$2,,$O$2,$P$2)","v":308.24},{"$f":" RTD(\"cqg.rtd\",,\"StudyData\", $N$2, \"Bar\", \"\", \"Close\", $M$2, $F22, $R$2,$Q$2,,$O$2,$P$2)","v":308.31},-21,null,44186.611111111109,{"$f":"RTD(\"cqg.rtd\",,\"StudyData\",$N$2, \"Vol\", \"VolType=Auto,CoCType=Auto\", \"Vol\", $M$2, $F22, $R$2,$Q$2,,$O$2,$P$2)","v":558190}]
[{"$f":" RTD(\"cqg.rtd\",,\"StudyData\", $N$2, \"Bar\", \"\", \"Time\", $M$2, $F23,$R$2,$Q$2, \"\",\"False\")","v":44186.607638888891},{"$f":" RTD(\"cqg.rtd\",,\"StudyData\", $N$2, \"Bar\", \"\", \"Open\", $M$2, $F23, $R$2,$Q$2,,$O$2,$P$2)","v":307.98},{"$f":" RTD(\"cqg.rtd\",,\"StudyData\", $N$2, \"Bar\", \"\", \"High\", $M$2, $F23, $R$2,$Q$2,,$O$2,$P$2)","v":308.57},{"$f":" RTD(\"cqg.rtd\",,\"StudyData\", $N$2, \"Bar\", \"\", \"Low\", $M$2, $F23, $R$2,$Q$2,,$O$2,$P$2)","v":307.95},{"$f":" RTD(\"cqg.rtd\",,\"StudyData\", $N$2, \"Bar\", \"\", \"Close\", $M$2, $F23, $R$2,$Q$2,,$O$2,$P$2)","v":308.56},-22,null,44186.607638888891,{"$f":"RTD(\"cqg.rtd\",,\"StudyData\",$N$2, \"Vol\", \"VolType=Auto,CoCType=Auto\", \"Vol\", $M$2, $F23, $R$2,$Q$2,,$O$2,$P$2)","v":420178}]
[{"$f":" RTD(\"cqg.rtd\",,\"StudyData\", $N$2, \"Bar\", \"\", \"Time\", $M$2, $F24,$R$2,$Q$2, \"\",\"False\")","v":44186.604166666664},{"$f":" RTD(\"cqg.rtd\",,\"StudyData\", $N$2, \"Bar\", \"\", \"Open\", $M$2, $F24, $R$2,$Q$2,,$O$2,$P$2)","v":308.57},{"$f":" RTD(\"cqg.rtd\",,\"StudyData\", $N$2, \"Bar\", \"\", \"High\", $M$2, $F24, $R$2,$Q$2,,$O$2,$P$2)","v":308.60000000000002},{"$f":" RTD(\"cqg.rtd\",,\"StudyData\", $N$2, \"Bar\", \"\", \"Low\", $M$2, $F24, $R$2,$Q$2,,$O$2,$P$2)","v":307.95},{"$f":" RTD(\"cqg.rtd\",,\"StudyData\", $N$2, \"Bar\", \"\", \"Close\", $M$2, $F24, $R$2,$Q$2,,$O$2,$P$2)","v":307.98},-23,null,44186.604166666664,{"$f":"RTD(\"cqg.rtd\",,\"StudyData\",$N$2, \"Vol\", \"VolType=Auto,CoCType=Auto\", \"Vol\", $M$2, $F24, $R$2,$Q$2,,$O$2,$P$2)","v":355370}]
[{"$f":" RTD(\"cqg.rtd\",,\"StudyData\", $N$2, \"Bar\", \"\", \"Time\", $M$2, $F25,$R$2,$Q$2, \"\",\"False\")","v":44186.600694444445},{"$f":" RTD(\"cqg.rtd\",,\"StudyData\", $N$2, \"Bar\", \"\", \"Open\", $M$2, $F25, $R$2,$Q$2,,$O$2,$P$2)","v":308.63},{"$f":" RTD(\"cqg.rtd\",,\"StudyData\", $N$2, \"Bar\", \"\", \"High\", $M$2, $F25, $R$2,$Q$2,,$O$2,$P$2)","v":308.73},{"$f":" RTD(\"cqg.rtd\",,\"StudyData\", $N$2, \"Bar\", \"\", \"Low\", $M$2, $F25, $R$2,$Q$2,,$O$2,$P$2)","v":308.55},{"$f":" RTD(\"cqg.rtd\",,\"StudyData\", $N$2, \"Bar\", \"\", \"Close\", $M$2, $F25, $R$2,$Q$2,,$O$2,$P$2)","v":308.58},-24,null,44186.600694444445,{"$f":"RTD(\"cqg.rtd\",,\"StudyData\",$N$2, \"Vol\", \"VolType=Auto,CoCType=Auto\", \"Vol\", $M$2, $F25, $R$2,$Q$2,,$O$2,$P$2)","v":136670}]
[{"$f":" RTD(\"cqg.rtd\",,\"StudyData\", $N$2, \"Bar\", \"\", \"Time\", $M$2, $F26,$R$2,$Q$2, \"\",\"False\")","v":44186.597222222219},{"$f":" RTD(\"cqg.rtd\",,\"StudyData\", $N$2, \"Bar\", \"\", \"Open\", $M$2, $F26, $R$2,$Q$2,,$O$2,$P$2)","v":308.56},{"$f":" RTD(\"cqg.rtd\",,\"StudyData\", $N$2, \"Bar\", \"\", \"High\", $M$2, $F26, $R$2,$Q$2,,$O$2,$P$2)","v":308.68},{"$f":" RTD(\"cqg.rtd\",,\"StudyData\", $N$2, \"Bar\", \"\", \"Low\", $M$2, $F26, $R$2,$Q$2,,$O$2,$P$2)","v":308.49},{"$f":" RTD(\"cqg.rtd\",,\"StudyData\", $N$2, \"Bar\", \"\", \"Close\", $M$2, $F26, $R$2,$Q$2,,$O$2,$P$2)","v":308.63},-25,null,44186.597222222219,{"$f":"RTD(\"cqg.rtd\",,\"StudyData\",$N$2, \"Vol\", \"VolType=Auto,CoCType=Auto\", \"Vol\", $M$2, $F26, $R$2,$Q$2,,$O$2,$P$2)","v":83743}]
[{"$f":" RTD(\"cqg.rtd\",,\"StudyData\", $N$2, \"Bar\", \"\", \"Time\", $M$2, $F27,$R$2,$Q$2, \"\",\"False\")","v":44186.59375},{"$f":" RTD(\"cqg.rtd\",,\"StudyData\", $N$2, \"Bar\", \"\", \"Open\", $M$2, $F27, $R$2,$Q$2,,$O$2,$P$2)","v":308.7},{"$f":" RTD(\"cqg.rtd\",,\"StudyData\", $N$2, \"Bar\", \"\", \"High\", $M$2, $F27, $R$2,$Q$2,,$O$2,$P$2)","v":308.7},{"$f":" RTD(\"cqg.rtd\",,\"StudyData\", $N$2, \"Bar\", \"\", \"Low\", $M$2, $F27, $R$2,$Q$2,,$O$2,$P$2)","v":308.43},{"$f":" RTD(\"cqg.rtd\",,\"StudyData\", $N$2, \"Bar\", \"\", \"Close\", $M$2, $F27, $R$2,$Q$2,,$O$2,$P$2)","v":308.57},-26,null,44186.59375,{"$f":"RTD(\"cqg.rtd\",,\"StudyData\",$N$2, \"Vol\", \"VolType=Auto,CoCType=Auto\", \"Vol\", $M$2, $F27, $R$2,$Q$2,,$O$2,$P$2)","v":155333}]
[{"$f":" RTD(\"cqg.rtd\",,\"StudyData\", $N$2, \"Bar\", \"\", \"Time\", $M$2, $F28,$R$2,$Q$2, \"\",\"False\")","v":44186.590277777781},{"$f":" RTD(\"cqg.rtd\",,\"StudyData\", $N$2, \"Bar\", \"\", \"Open\", $M$2, $F28, $R$2,$Q$2,,$O$2,$P$2)","v":308.52999999999997},{"$f":" RTD(\"cqg.rtd\",,\"StudyData\", $N$2, \"Bar\", \"\", \"High\", $M$2, $F28, $R$2,$Q$2,,$O$2,$P$2)","v":308.75},{"$f":" RTD(\"cqg.rtd\",,\"StudyData\", $N$2, \"Bar\", \"\", \"Low\", $M$2, $F28, $R$2,$Q$2,,$O$2,$P$2)","v":308.37},{"$f":" RTD(\"cqg.rtd\",,\"StudyData\", $N$2, \"Bar\", \"\", \"Close\", $M$2, $F28, $R$2,$Q$2,,$O$2,$P$2)","v":308.70999999999998},-27,null,44186.590277777781,{"$f":"RTD(\"cqg.rtd\",,\"StudyData\",$N$2, \"Vol\", \"VolType=Auto,CoCType=Auto\", \"Vol\", $M$2, $F28, $R$2,$Q$2,,$O$2,$P$2)","v":202645}]
[{"$f":" RTD(\"cqg.rtd\",,\"StudyData\", $N$2, \"Bar\", \"\", \"Time\", $M$2, $F29,$R$2,$Q$2, \"\",\"False\")","v":44186.586805555555},{"$f":" RTD(\"cqg.rtd\",,\"StudyData\", $N$2, \"Bar\", \"\", \"Open\", $M$2, $F29, $R$2,$Q$2,,$O$2,$P$2)","v":308.94},{"$f":" RTD(\"cqg.rtd\",,\"StudyData\", $N$2, \"Bar\", \"\", \"High\", $M$2, $F29, $R$2,$Q$2,,$O$2,$P$2)","v":309.01},{"$f":" RTD(\"cqg.rtd\",,\"StudyData\", $N$2, \"Bar\", \"\", \"Low\", $M$2, $F29, $R$2,$Q$2,,$O$2,$P$2)","v":308.48},{"$f":" RTD(\"cqg.rtd\",,\"StudyData\", $N$2, \"Bar\", \"\", \"Close\", $M$2, $F29, $R$2,$Q$2,,$O$2,$P$2)","v":308.54000000000002},-28,null,44186.586805555555,{"$f":"RTD(\"cqg.rtd\",,\"StudyData\",$N$2, \"Vol\", \"VolType=Auto,CoCType=Auto\", \"Vol\", $M$2, $F29, $R$2,$Q$2,,$O$2,$P$2)","v":217465}]
[{"$f":" RTD(\"cqg.rtd\",,\"StudyData\", $N$2, \"Bar\", \"\", \"Time\", $M$2, $F30,$R$2,$Q$2, \"\",\"False\")","v":44186.583333333336},{"$f":" RTD(\"cqg.rtd\",,\"StudyData\", $N$2, \"Bar\", \"\", \"Open\", $M$2, $F30, $R$2,$Q$2,,$O$2,$P$2)","v":308.95999999999998},{"$f":" RTD(\"cqg.rtd\",,\"StudyData\", $N$2, \"Bar\", \"\", \"High\", $M$2, $F30, $R$2,$Q$2,,$O$2,$P$2)","v":309.10000000000002},{"$f":" RTD(\"cqg.rtd\",,\"StudyData\", $N$2, \"Bar\", \"\", \"Low\", $M$2, $F30, $R$2,$Q$2,,$O$2,$P$2)","v":308.85000000000002},{"$f":" RTD(\"cqg.rtd\",,\"StudyData\", $N$2, \"Bar\", \"\", \"Close\", $M$2, $F30, $R$2,$Q$2,,$O$2,$P$2)","v":308.95},-29,null,44186.583333333336,{"$f":"RTD(\"cqg.rtd\",,\"StudyData\",$N$2, \"Vol\", \"VolType=Auto,CoCType=Auto\", \"Vol\", $M$2, $F30, $R$2,$Q$2,,$O$2,$P$2)","v":140677}]
[{"$f":" RTD(\"cqg.rtd\",,\"StudyData\", $N$2, \"Bar\", \"\", \"Time\", $M$2, $F31,$R$2,$Q$2, \"\",\"False\")","v":44186.579861111109},{"$f":" RTD(\"cqg.rtd\",,\"StudyData\", $N$2, \"Bar\", \"\", \"Open\", $M$2, $F31, $R$2,$Q$2,,$O$2,$P$2)","v":309.12},{"$f":" RTD(\"cqg.rtd\",,\"StudyData\", $N$2, \"Bar\", \"\", \"High\", $M$2, $F31, $R$2,$Q$2,,$O$2,$P$2)","v":309.25},{"$f":" RTD(\"cqg.rtd\",,\"StudyData\", $N$2, \"Bar\", \"\", \"Low\", $M$2, $F31, $R$2,$Q$2,,$O$2,$P$2)","v":308.89},{"$f":" RTD(\"cqg.rtd\",,\"StudyData\", $N$2, \"Bar\", \"\", \"Close\", $M$2, $F31, $R$2,$Q$2,,$O$2,$P$2)","v":308.94},-30,null,44186.579861111109,{"$f":"RTD(\"cqg.rtd\",,\"StudyData\",$N$2, \"Vol\", \"VolType=Auto,CoCType=Auto\", \"Vol\", $M$2, $F31, $R$2,$Q$2,,$O$2,$P$2)","v":143970}]
[{"$f":" RTD(\"cqg.rtd\",,\"StudyData\", $N$2, \"Bar\", \"\", \"Time\", $M$2, $F32,$R$2,$Q$2, \"\",\"False\")","v":44186.576388888891},{"$f":" RTD(\"cqg.rtd\",,\"StudyData\", $N$2, \"Bar\", \"\", \"Open\", $M$2, $F32, $R$2,$Q$2,,$O$2,$P$2)","v":309.08},{"$f":" RTD(\"cqg.rtd\",,\"StudyData\", $N$2, \"Bar\", \"\", \"High\", $M$2, $F32, $R$2,$Q$2,,$O$2,$P$2)","v":309.22000000000003},{"$f":" RTD(\"cqg.rtd\",,\"StudyData\", $N$2, \"Bar\", \"\", \"Low\", $M$2, $F32, $R$2,$Q$2,,$O$2,$P$2)","v":309.01},{"$f":" RTD(\"cqg.rtd\",,\"StudyData\", $N$2, \"Bar\", \"\", \"Close\", $M$2, $F32, $R$2,$Q$2,,$O$2,$P$2)","v":309.13},-31,null,44186.576388888891,{"$f":"RTD(\"cqg.rtd\",,\"StudyData\",$N$2, \"Vol\", \"VolType=Auto,CoCType=Auto\", \"Vol\", $M$2, $F32, $R$2,$Q$2,,$O$2,$P$2)","v":122107}]
[{"$f":" RTD(\"cqg.rtd\",,\"StudyData\", $N$2, \"Bar\", \"\", \"Time\", $M$2, $F33,$R$2,$Q$2, \"\",\"False\")","v":44186.572916666664},{"$f":" RTD(\"cqg.rtd\",,\"StudyData\", $N$2, \"Bar\", \"\", \"Open\", $M$2, $F33, $R$2,$Q$2,,$O$2,$P$2)","v":309.14},{"$f":" RTD(\"cqg.rtd\",,\"StudyData\", $N$2, \"Bar\", \"\", \"High\", $M$2, $F33, $R$2,$Q$2,,$O$2,$P$2)","v":309.27},{"$f":" RTD(\"cqg.rtd\",,\"StudyData\", $N$2, \"Bar\", \"\", \"Low\", $M$2, $F33, $R$2,$Q$2,,$O$2,$P$2)","v":309.05},{"$f":" RTD(\"cqg.rtd\",,\"StudyData\", $N$2, \"Bar\", \"\", \"Close\", $M$2, $F33, $R$2,$Q$2,,$O$2,$P$2)","v":309.07},-32,null,44186.572916666664,{"$f":"RTD(\"cqg.rtd\",,\"StudyData\",$N$2, \"Vol\", \"VolType=Auto,CoCType=Auto\", \"Vol\", $M$2, $F33, $R$2,$Q$2,,$O$2,$P$2)","v":122728}]
[{"$f":" RTD(\"cqg.rtd\",,\"StudyData\", $N$2, \"Bar\", \"\", \"Time\", $M$2, $F34,$R$2,$Q$2, \"\",\"False\")","v":44186.569444444445},{"$f":" RTD(\"cqg.rtd\",,\"StudyData\", $N$2, \"Bar\", \"\", \"Open\", $M$2, $F34, $R$2,$Q$2,,$O$2,$P$2)","v":309.13},{"$f":" RTD(\"cqg.rtd\",,\"StudyData\", $N$2, \"Bar\", \"\", \"High\", $M$2, $F34, $R$2,$Q$2,,$O$2,$P$2)","v":309.27},{"$f":" RTD(\"cqg.rtd\",,\"StudyData\", $N$2, \"Bar\", \"\", \"Low\", $M$2, $F34, $R$2,$Q$2,,$O$2,$P$2)","v":308.97000000000003},{"$f":" RTD(\"cqg.rtd\",,\"StudyData\", $N$2, \"Bar\", \"\", \"Close\", $M$2, $F34, $R$2,$Q$2,,$O$2,$P$2)","v":309.16000000000003},-33,null,44186.569444444445,{"$f":"RTD(\"cqg.rtd\",,\"StudyData\",$N$2, \"Vol\", \"VolType=Auto,CoCType=Auto\", \"Vol\", $M$2, $F34, $R$2,$Q$2,,$O$2,$P$2)","v":215889}]
[{"$f":" RTD(\"cqg.rtd\",,\"StudyData\", $N$2, \"Bar\", \"\", \"Time\", $M$2, $F35,$R$2,$Q$2, \"\",\"False\")","v":44186.565972222219},{"$f":" RTD(\"cqg.rtd\",,\"StudyData\", $N$2, \"Bar\", \"\", \"Open\", $M$2, $F35, $R$2,$Q$2,,$O$2,$P$2)","v":309.20999999999998},{"$f":" RTD(\"cqg.rtd\",,\"StudyData\", $N$2, \"Bar\", \"\", \"High\", $M$2, $F35, $R$2,$Q$2,,$O$2,$P$2)","v":309.47000000000003},{"$f":" RTD(\"cqg.rtd\",,\"StudyData\", $N$2, \"Bar\", \"\", \"Low\", $M$2, $F35, $R$2,$Q$2,,$O$2,$P$2)","v":309.05},{"$f":" RTD(\"cqg.rtd\",,\"StudyData\", $N$2, \"Bar\", \"\", \"Close\", $M$2, $F35, $R$2,$Q$2,,$O$2,$P$2)","v":309.11},-34,null,44186.565972222219,{"$f":"RTD(\"cqg.rtd\",,\"StudyData\",$N$2, \"Vol\", \"VolType=Auto,CoCType=Auto\", \"Vol\", $M$2, $F35, $R$2,$Q$2,,$O$2,$P$2)","v":198863}]
[{"$f":" RTD(\"cqg.rtd\",,\"StudyData\", $N$2, \"Bar\", \"\", \"Time\", $M$2, $F36,$R$2,$Q$2, \"\",\"False\")","v":44186.5625},{"$f":" RTD(\"cqg.rtd\",,\"StudyData\", $N$2, \"Bar\", \"\", \"Open\", $M$2, $F36, $R$2,$Q$2,,$O$2,$P$2)","v":309.11},{"$f":" RTD(\"cqg.rtd\",,\"StudyData\", $N$2, \"Bar\", \"\", \"High\", $M$2, $F36, $R$2,$Q$2,,$O$2,$P$2)","v":309.33999999999997},{"$f":" RTD(\"cqg.rtd\",,\"StudyData\", $N$2, \"Bar\", \"\", \"Low\", $M$2, $F36, $R$2,$Q$2,,$O$2,$P$2)","v":309.08},{"$f":" RTD(\"cqg.rtd\",,\"StudyData\", $N$2, \"Bar\", \"\", \"Close\", $M$2, $F36, $R$2,$Q$2,,$O$2,$P$2)","v":309.20999999999998},-35,null,44186.5625,{"$f":"RTD(\"cqg.rtd\",,\"StudyData\",$N$2, \"Vol\", \"VolType=Auto,CoCType=Auto\", \"Vol\", $M$2, $F36, $R$2,$Q$2,,$O$2,$P$2)","v":128383}]
[{"$f":" RTD(\"cqg.rtd\",,\"StudyData\", $N$2, \"Bar\", \"\", \"Time\", $M$2, $F37,$R$2,$Q$2, \"\",\"False\")","v":44186.559027777781},{"$f":" RTD(\"cqg.rtd\",,\"StudyData\", $N$2, \"Bar\", \"\", \"Open\", $M$2, $F37, $R$2,$Q$2,,$O$2,$P$2)","v":308.85000000000002},{"$f":" RTD(\"cqg.rtd\",,\"StudyData\", $N$2, \"Bar\", \"\", \"High\", $M$2, $F37, $R$2,$Q$2,,$O$2,$P$2)","v":309.17},{"$f":" RTD(\"cqg.rtd\",,\"StudyData\", $N$2, \"Bar\", \"\", \"Low\", $M$2, $F37, $R$2,$Q$2,,$O$2,$P$2)","v":308.79000000000002},{"$f":" RTD(\"cqg.rtd\",,\"StudyData\", $N$2, \"Bar\", \"\", \"Close\", $M$2, $F37, $R$2,$Q$2,,$O$2,$P$2)","v":309.13},-36,null,44186.559027777781,{"$f":"RTD(\"cqg.rtd\",,\"StudyData\",$N$2, \"Vol\", \"VolType=Auto,CoCType=Auto\", \"Vol\", $M$2, $F37, $R$2,$Q$2,,$O$2,$P$2)","v":101443}]
[{"$f":" RTD(\"cqg.rtd\",,\"StudyData\", $N$2, \"Bar\", \"\", \"Time\", $M$2, $F38,$R$2,$Q$2, \"\",\"False\")","v":44186.555555555555},{"$f":" RTD(\"cqg.rtd\",,\"StudyData\", $N$2, \"Bar\", \"\", \"Open\", $M$2, $F38, $R$2,$Q$2,,$O$2,$P$2)","v":308.89999999999998},{"$f":" RTD(\"cqg.rtd\",,\"StudyData\", $N$2, \"Bar\", \"\", \"High\", $M$2, $F38, $R$2,$Q$2,,$O$2,$P$2)","v":308.94},{"$f":" RTD(\"cqg.rtd\",,\"StudyData\", $N$2, \"Bar\", \"\", \"Low\", $M$2, $F38, $R$2,$Q$2,,$O$2,$P$2)","v":308.7},{"$f":" RTD(\"cqg.rtd\",,\"StudyData\", $N$2, \"Bar\", \"\", \"Close\", $M$2, $F38, $R$2,$Q$2,,$O$2,$P$2)","v":308.83},-37,null,44186.555555555555,{"$f":"RTD(\"cqg.rtd\",,\"StudyData\",$N$2, \"Vol\", \"VolType=Auto,CoCType=Auto\", \"Vol\", $M$2, $F38, $R$2,$Q$2,,$O$2,$P$2)","v":166478}]
[{"$f":" RTD(\"cqg.rtd\",,\"StudyData\", $N$2, \"Bar\", \"\", \"Time\", $M$2, $F39,$R$2,$Q$2, \"\",\"False\")","v":44186.552083333336},{"$f":" RTD(\"cqg.rtd\",,\"StudyData\", $N$2, \"Bar\", \"\", \"Open\", $M$2, $F39, $R$2,$Q$2,,$O$2,$P$2)","v":309},{"$f":" RTD(\"cqg.rtd\",,\"StudyData\", $N$2, \"Bar\", \"\", \"High\", $M$2, $F39, $R$2,$Q$2,,$O$2,$P$2)","v":309.06},{"$f":" RTD(\"cqg.rtd\",,\"StudyData\", $N$2, \"Bar\", \"\", \"Low\", $M$2, $F39, $R$2,$Q$2,,$O$2,$P$2)","v":308.85000000000002},{"$f":" RTD(\"cqg.rtd\",,\"StudyData\", $N$2, \"Bar\", \"\", \"Close\", $M$2, $F39, $R$2,$Q$2,,$O$2,$P$2)","v":308.91000000000003},-38,null,44186.552083333336,{"$f":"RTD(\"cqg.rtd\",,\"StudyData\",$N$2, \"Vol\", \"VolType=Auto,CoCType=Auto\", \"Vol\", $M$2, $F39, $R$2,$Q$2,,$O$2,$P$2)","v":112014}]
[{"$f":" RTD(\"cqg.rtd\",,\"StudyData\", $N$2, \"Bar\", \"\", \"Time\", $M$2, $F40,$R$2,$Q$2, \"\",\"False\")","v":44186.548611111109},{"$f":" RTD(\"cqg.rtd\",,\"StudyData\", $N$2, \"Bar\", \"\", \"Open\", $M$2, $F40, $R$2,$Q$2,,$O$2,$P$2)","v":308.8},{"$f":" RTD(\"cqg.rtd\",,\"StudyData\", $N$2, \"Bar\", \"\", \"High\", $M$2, $F40, $R$2,$Q$2,,$O$2,$P$2)","v":309.04000000000002},{"$f":" RTD(\"cqg.rtd\",,\"StudyData\", $N$2, \"Bar\", \"\", \"Low\", $M$2, $F40, $R$2,$Q$2,,$O$2,$P$2)","v":308.64999999999998},{"$f":" RTD(\"cqg.rtd\",,\"StudyData\", $N$2, \"Bar\", \"\", \"Close\", $M$2, $F40, $R$2,$Q$2,,$O$2,$P$2)","v":308.98},-39,null,44186.548611111109,{"$f":"RTD(\"cqg.rtd\",,\"StudyData\",$N$2, \"Vol\", \"VolType=Auto,CoCType=Auto\", \"Vol\", $M$2, $F40, $R$2,$Q$2,,$O$2,$P$2)","v":158538}]
[{"$f":" RTD(\"cqg.rtd\",,\"StudyData\", $N$2, \"Bar\", \"\", \"Time\", $M$2, $F41,$R$2,$Q$2, \"\",\"False\")","v":44186.545138888891},{"$f":" RTD(\"cqg.rtd\",,\"StudyData\", $N$2, \"Bar\", \"\", \"Open\", $M$2, $F41, $R$2,$Q$2,,$O$2,$P$2)","v":309.04000000000002},{"$f":" RTD(\"cqg.rtd\",,\"StudyData\", $N$2, \"Bar\", \"\", \"High\", $M$2, $F41, $R$2,$Q$2,,$O$2,$P$2)","v":309.11},{"$f":" RTD(\"cqg.rtd\",,\"StudyData\", $N$2, \"Bar\", \"\", \"Low\", $M$2, $F41, $R$2,$Q$2,,$O$2,$P$2)","v":308.79000000000002},{"$f":" RTD(\"cqg.rtd\",,\"StudyData\", $N$2, \"Bar\", \"\", \"Close\", $M$2, $F41, $R$2,$Q$2,,$O$2,$P$2)","v":308.8},-40,null,44186.545138888891,{"$f":"RTD(\"cqg.rtd\",,\"StudyData\",$N$2, \"Vol\", \"VolType=Auto,CoCType=Auto\", \"Vol\", $M$2, $F41, $R$2,$Q$2,,$O$2,$P$2)","v":124110}]
[{"$f":" RTD(\"cqg.rtd\",,\"StudyData\", $N$2, \"Bar\", \"\", \"Time\", $M$2, $F42,$R$2,$Q$2, \"\",\"False\")","v":44186.541666666664},{"$f":" RTD(\"cqg.rtd\",,\"StudyData\", $N$2, \"Bar\", \"\", \"Open\", $M$2, $F42, $R$2,$Q$2,,$O$2,$P$2)","v":309.12},{"$f":" RTD(\"cqg.rtd\",,\"StudyData\", $N$2, \"Bar\", \"\", \"High\", $M$2, $F42, $R$2,$Q$2,,$O$2,$P$2)","v":309.17},{"$f":" RTD(\"cqg.rtd\",,\"StudyData\", $N$2, \"Bar\", \"\", \"Low\", $M$2, $F42, $R$2,$Q$2,,$O$2,$P$2)","v":308.95999999999998},{"$f":" RTD(\"cqg.rtd\",,\"StudyData\", $N$2, \"Bar\", \"\", \"Close\", $M$2, $F42, $R$2,$Q$2,,$O$2,$P$2)","v":309.06},-41,null,44186.541666666664,{"$f":"RTD(\"cqg.rtd\",,\"StudyData\",$N$2, \"Vol\", \"VolType=Auto,CoCType=Auto\", \"Vol\", $M$2, $F42, $R$2,$Q$2,,$O$2,$P$2)","v":152350}]
[{"$f":" RTD(\"cqg.rtd\",,\"StudyData\", $N$2, \"Bar\", \"\", \"Time\", $M$2, $F43,$R$2,$Q$2, \"\",\"False\")","v":44186.538194444445},{"$f":" RTD(\"cqg.rtd\",,\"StudyData\", $N$2, \"Bar\", \"\", \"Open\", $M$2, $F43, $R$2,$Q$2,,$O$2,$P$2)","v":309.29000000000002},{"$f":" RTD(\"cqg.rtd\",,\"StudyData\", $N$2, \"Bar\", \"\", \"High\", $M$2, $F43, $R$2,$Q$2,,$O$2,$P$2)","v":309.39999999999998},{"$f":" RTD(\"cqg.rtd\",,\"StudyData\", $N$2, \"Bar\", \"\", \"Low\", $M$2, $F43, $R$2,$Q$2,,$O$2,$P$2)","v":309.10000000000002},{"$f":" RTD(\"cqg.rtd\",,\"StudyData\", $N$2, \"Bar\", \"\", \"Close\", $M$2, $F43, $R$2,$Q$2,,$O$2,$P$2)","v":309.11},-42,null,44186.538194444445,{"$f":"RTD(\"cqg.rtd\",,\"StudyData\",$N$2, \"Vol\", \"VolType=Auto,CoCType=Auto\", \"Vol\", $M$2, $F43, $R$2,$Q$2,,$O$2,$P$2)","v":140971},null,null,null,null,{"$f":"76+6","v":82}]
[{"$f":" RTD(\"cqg.rtd\",,\"StudyData\", $N$2, \"Bar\", \"\", \"Time\", $M$2, $F44,$R$2,$Q$2, \"\",\"False\")","v":44186.534722222219},{"$f":" RTD(\"cqg.rtd\",,\"StudyData\", $N$2, \"Bar\", \"\", \"Open\", $M$2, $F44, $R$2,$Q$2,,$O$2,$P$2)","v":308.95999999999998},{"$f":" RTD(\"cqg.rtd\",,\"StudyData\", $N$2, \"Bar\", \"\", \"High\", $M$2, $F44, $R$2,$Q$2,,$O$2,$P$2)","v":309.31},{"$f":" RTD(\"cqg.rtd\",,\"StudyData\", $N$2, \"Bar\", \"\", \"Low\", $M$2, $F44, $R$2,$Q$2,,$O$2,$P$2)","v":308.95999999999998},{"$f":" RTD(\"cqg.rtd\",,\"StudyData\", $N$2, \"Bar\", \"\", \"Close\", $M$2, $F44, $R$2,$Q$2,,$O$2,$P$2)","v":309.31},-43,null,44186.534722222219,{"$f":"RTD(\"cqg.rtd\",,\"StudyData\",$N$2, \"Vol\", \"VolType=Auto,CoCType=Auto\", \"Vol\", $M$2, $F44, $R$2,$Q$2,,$O$2,$P$2)","v":194443},null,null,null,null,{"$f":"N43*5","v":410}]
[{"$f":" RTD(\"cqg.rtd\",,\"StudyData\", $N$2, \"Bar\", \"\", \"Time\", $M$2, $F45,$R$2,$Q$2, \"\",\"False\")","v":44186.53125},{"$f":" RTD(\"cqg.rtd\",,\"StudyData\", $N$2, \"Bar\", \"\", \"Open\", $M$2, $F45, $R$2,$Q$2,,$O$2,$P$2)","v":309.14999999999998},{"$f":" RTD(\"cqg.rtd\",,\"StudyData\", $N$2, \"Bar\", \"\", \"High\", $M$2, $F45, $R$2,$Q$2,,$O$2,$P$2)","v":309.14999999999998},{"$f":" RTD(\"cqg.rtd\",,\"StudyData\", $N$2, \"Bar\", \"\", \"Low\", $M$2, $F45, $R$2,$Q$2,,$O$2,$P$2)","v":308.66000000000003},{"$f":" RTD(\"cqg.rtd\",,\"StudyData\", $N$2, \"Bar\", \"\", \"Close\", $M$2, $F45, $R$2,$Q$2,,$O$2,$P$2)","v":308.95999999999998},-44,null,44186.53125,{"$f":"RTD(\"cqg.rtd\",,\"StudyData\",$N$2, \"Vol\", \"VolType=Auto,CoCType=Auto\", \"Vol\", $M$2, $F45, $R$2,$Q$2,,$O$2,$P$2)","v":352661}]
[{"$f":" RTD(\"cqg.rtd\",,\"StudyData\", $N$2, \"Bar\", \"\", \"Time\", $M$2, $F46,$R$2,$Q$2, \"\",\"False\")","v":44186.527777777781},{"$f":" RTD(\"cqg.rtd\",,\"StudyData\", $N$2, \"Bar\", \"\", \"Open\", $M$2, $F46, $R$2,$Q$2,,$O$2,$P$2)","v":308.89999999999998},{"$f":" RTD(\"cqg.rtd\",,\"StudyData\", $N$2, \"Bar\", \"\", \"High\", $M$2, $F46, $R$2,$Q$2,,$O$2,$P$2)","v":309.2},{"$f":" RTD(\"cqg.rtd\",,\"StudyData\", $N$2, \"Bar\", \"\", \"Low\", $M$2, $F46, $R$2,$Q$2,,$O$2,$P$2)","v":308.89999999999998},{"$f":" RTD(\"cqg.rtd\",,\"StudyData\", $N$2, \"Bar\", \"\", \"Close\", $M$2, $F46, $R$2,$Q$2,,$O$2,$P$2)","v":309.14999999999998},-45,null,44186.527777777781,{"$f":"RTD(\"cqg.rtd\",,\"StudyData\",$N$2, \"Vol\", \"VolType=Auto,CoCType=Auto\", \"Vol\", $M$2, $F46, $R$2,$Q$2,,$O$2,$P$2)","v":113655}]
[{"$f":" RTD(\"cqg.rtd\",,\"StudyData\", $N$2, \"Bar\", \"\", \"Time\", $M$2, $F47,$R$2,$Q$2, \"\",\"False\")","v":44186.524305555555},{"$f":" RTD(\"cqg.rtd\",,\"StudyData\", $N$2, \"Bar\", \"\", \"Open\", $M$2, $F47, $R$2,$Q$2,,$O$2,$P$2)","v":308.95},{"$f":" RTD(\"cqg.rtd\",,\"StudyData\", $N$2, \"Bar\", \"\", \"High\", $M$2, $F47, $R$2,$Q$2,,$O$2,$P$2)","v":309.02999999999997},{"$f":" RTD(\"cqg.rtd\",,\"StudyData\", $N$2, \"Bar\", \"\", \"Low\", $M$2, $F47, $R$2,$Q$2,,$O$2,$P$2)","v":308.82},{"$f":" RTD(\"cqg.rtd\",,\"StudyData\", $N$2, \"Bar\", \"\", \"Close\", $M$2, $F47, $R$2,$Q$2,,$O$2,$P$2)","v":308.91000000000003},-46,null,44186.524305555555,{"$f":"RTD(\"cqg.rtd\",,\"StudyData\",$N$2, \"Vol\", \"VolType=Auto,CoCType=Auto\", \"Vol\", $M$2, $F47, $R$2,$Q$2,,$O$2,$P$2)","v":151475}]
[{"$f":" RTD(\"cqg.rtd\",,\"StudyData\", $N$2, \"Bar\", \"\", \"Time\", $M$2, $F48,$R$2,$Q$2, \"\",\"False\")","v":44186.520833333336},{"$f":" RTD(\"cqg.rtd\",,\"StudyData\", $N$2, \"Bar\", \"\", \"Open\", $M$2, $F48, $R$2,$Q$2,,$O$2,$P$2)","v":308.69},{"$f":" RTD(\"cqg.rtd\",,\"StudyData\", $N$2, \"Bar\", \"\", \"High\", $M$2, $F48, $R$2,$Q$2,,$O$2,$P$2)","v":309.01},{"$f":" RTD(\"cqg.rtd\",,\"StudyData\", $N$2, \"Bar\", \"\", \"Low\", $M$2, $F48, $R$2,$Q$2,,$O$2,$P$2)","v":308.68},{"$f":" RTD(\"cqg.rtd\",,\"StudyData\", $N$2, \"Bar\", \"\", \"Close\", $M$2, $F48, $R$2,$Q$2,,$O$2,$P$2)","v":308.95},-47,null,44186.520833333336,{"$f":"RTD(\"cqg.rtd\",,\"StudyData\",$N$2, \"Vol\", \"VolType=Auto,CoCType=Auto\", \"Vol\", $M$2, $F48, $R$2,$Q$2,,$O$2,$P$2)","v":181839}]
[{"$f":" RTD(\"cqg.rtd\",,\"StudyData\", $N$2, \"Bar\", \"\", \"Time\", $M$2, $F49,$R$2,$Q$2, \"\",\"False\")","v":44186.517361111109},{"$f":" RTD(\"cqg.rtd\",,\"StudyData\", $N$2, \"Bar\", \"\", \"Open\", $M$2, $F49, $R$2,$Q$2,,$O$2,$P$2)","v":308.70999999999998},{"$f":" RTD(\"cqg.rtd\",,\"StudyData\", $N$2, \"Bar\", \"\", \"High\", $M$2, $F49, $R$2,$Q$2,,$O$2,$P$2)","v":308.86},{"$f":" RTD(\"cqg.rtd\",,\"StudyData\", $N$2, \"Bar\", \"\", \"Low\", $M$2, $F49, $R$2,$Q$2,,$O$2,$P$2)","v":308.57},{"$f":" RTD(\"cqg.rtd\",,\"StudyData\", $N$2, \"Bar\", \"\", \"Close\", $M$2, $F49, $R$2,$Q$2,,$O$2,$P$2)","v":308.7},-48,null,44186.517361111109,{"$f":"RTD(\"cqg.rtd\",,\"StudyData\",$N$2, \"Vol\", \"VolType=Auto,CoCType=Auto\", \"Vol\", $M$2, $F49, $R$2,$Q$2,,$O$2,$P$2)","v":208975}]
[{"$f":" RTD(\"cqg.rtd\",,\"StudyData\", $N$2, \"Bar\", \"\", \"Time\", $M$2, $F50,$R$2,$Q$2, \"\",\"False\")","v":44186.513888888891},{"$f":" RTD(\"cqg.rtd\",,\"StudyData\", $N$2, \"Bar\", \"\", \"Open\", $M$2, $F50, $R$2,$Q$2,,$O$2,$P$2)","v":308.82},{"$f":" RTD(\"cqg.rtd\",,\"StudyData\", $N$2, \"Bar\", \"\", \"High\", $M$2, $F50, $R$2,$Q$2,,$O$2,$P$2)","v":308.86},{"$f":" RTD(\"cqg.rtd\",,\"StudyData\", $N$2, \"Bar\", \"\", \"Low\", $M$2, $F50, $R$2,$Q$2,,$O$2,$P$2)","v":308.58},{"$f":" RTD(\"cqg.rtd\",,\"StudyData\", $N$2, \"Bar\", \"\", \"Close\", $M$2, $F50, $R$2,$Q$2,,$O$2,$P$2)","v":308.72000000000003},-49,null,44186.513888888891,{"$f":"RTD(\"cqg.rtd\",,\"StudyData\",$N$2, \"Vol\", \"VolType=Auto,CoCType=Auto\", \"Vol\", $M$2, $F50, $R$2,$Q$2,,$O$2,$P$2)","v":134074}]
[{"$f":" RTD(\"cqg.rtd\",,\"StudyData\", $N$2, \"Bar\", \"\", \"Time\", $M$2, $F51,$R$2,$Q$2, \"\",\"False\")","v":44186.510416666664},{"$f":" RTD(\"cqg.rtd\",,\"StudyData\", $N$2, \"Bar\", \"\", \"Open\", $M$2, $F51, $R$2,$Q$2,,$O$2,$P$2)","v":308.83},{"$f":" RTD(\"cqg.rtd\",,\"StudyData\", $N$2, \"Bar\", \"\", \"High\", $M$2, $F51, $R$2,$Q$2,,$O$2,$P$2)","v":308.89},{"$f":" RTD(\"cqg.rtd\",,\"StudyData\", $N$2, \"Bar\", \"\", \"Low\", $M$2, $F51, $R$2,$Q$2,,$O$2,$P$2)","v":308.72000000000003},{"$f":" RTD(\"cqg.rtd\",,\"StudyData\", $N$2, \"Bar\", \"\", \"Close\", $M$2, $F51, $R$2,$Q$2,,$O$2,$P$2)","v":308.81},-50,null,44186.510416666664,{"$f":"RTD(\"cqg.rtd\",,\"StudyData\",$N$2, \"Vol\", \"VolType=Auto,CoCType=Auto\", \"Vol\", $M$2, $F51, $R$2,$Q$2,,$O$2,$P$2)","v":153169}]
[{"$f":" RTD(\"cqg.rtd\",,\"StudyData\", $N$2, \"Bar\", \"\", \"Time\", $M$2, $F52,$R$2,$Q$2, \"\",\"False\")","v":44186.506944444445},{"$f":" RTD(\"cqg.rtd\",,\"StudyData\", $N$2, \"Bar\", \"\", \"Open\", $M$2, $F52, $R$2,$Q$2,,$O$2,$P$2)","v":308.44},{"$f":" RTD(\"cqg.rtd\",,\"StudyData\", $N$2, \"Bar\", \"\", \"High\", $M$2, $F52, $R$2,$Q$2,,$O$2,$P$2)","v":308.81},{"$f":" RTD(\"cqg.rtd\",,\"StudyData\", $N$2, \"Bar\", \"\", \"Low\", $M$2, $F52, $R$2,$Q$2,,$O$2,$P$2)","v":308.37},{"$f":" RTD(\"cqg.rtd\",,\"StudyData\", $N$2, \"Bar\", \"\", \"Close\", $M$2, $F52, $R$2,$Q$2,,$O$2,$P$2)","v":308.81},-51,null,44186.506944444445,{"$f":"RTD(\"cqg.rtd\",,\"StudyData\",$N$2, \"Vol\", \"VolType=Auto,CoCType=Auto\", \"Vol\", $M$2, $F52, $R$2,$Q$2,,$O$2,$P$2)","v":206563}]
[{"$f":" RTD(\"cqg.rtd\",,\"StudyData\", $N$2, \"Bar\", \"\", \"Time\", $M$2, $F53,$R$2,$Q$2, \"\",\"False\")","v":44186.503472222219},{"$f":" RTD(\"cqg.rtd\",,\"StudyData\", $N$2, \"Bar\", \"\", \"Open\", $M$2, $F53, $R$2,$Q$2,,$O$2,$P$2)","v":308.06},{"$f":" RTD(\"cqg.rtd\",,\"StudyData\", $N$2, \"Bar\", \"\", \"High\", $M$2, $F53, $R$2,$Q$2,,$O$2,$P$2)","v":308.51},{"$f":" RTD(\"cqg.rtd\",,\"StudyData\", $N$2, \"Bar\", \"\", \"Low\", $M$2, $F53, $R$2,$Q$2,,$O$2,$P$2)","v":308.02},{"$f":" RTD(\"cqg.rtd\",,\"StudyData\", $N$2, \"Bar\", \"\", \"Close\", $M$2, $F53, $R$2,$Q$2,,$O$2,$P$2)","v":308.45999999999998},-52,null,44186.503472222219,{"$f":"RTD(\"cqg.rtd\",,\"StudyData\",$N$2, \"Vol\", \"VolType=Auto,CoCType=Auto\", \"Vol\", $M$2, $F53, $R$2,$Q$2,,$O$2,$P$2)","v":204734}]
[{"$f":" RTD(\"cqg.rtd\",,\"StudyData\", $N$2, \"Bar\", \"\", \"Time\", $M$2, $F54,$R$2,$Q$2, \"\",\"False\")","v":44186.5},{"$f":" RTD(\"cqg.rtd\",,\"StudyData\", $N$2, \"Bar\", \"\", \"Open\", $M$2, $F54, $R$2,$Q$2,,$O$2,$P$2)","v":308.17},{"$f":" RTD(\"cqg.rtd\",,\"StudyData\", $N$2, \"Bar\", \"\", \"High\", $M$2, $F54, $R$2,$Q$2,,$O$2,$P$2)","v":308.24},{"$f":" RTD(\"cqg.rtd\",,\"StudyData\", $N$2, \"Bar\", \"\", \"Low\", $M$2, $F54, $R$2,$Q$2,,$O$2,$P$2)","v":307.98},{"$f":" RTD(\"cqg.rtd\",,\"StudyData\", $N$2, \"Bar\", \"\", \"Close\", $M$2, $F54, $R$2,$Q$2,,$O$2,$P$2)","v":308.06},-53,null,44186.5,{"$f":"RTD(\"cqg.rtd\",,\"StudyData\",$N$2, \"Vol\", \"VolType=Auto,CoCType=Auto\", \"Vol\", $M$2, $F54, $R$2,$Q$2,,$O$2,$P$2)","v":233468}]
[{"$f":" RTD(\"cqg.rtd\",,\"StudyData\", $N$2, \"Bar\", \"\", \"Time\", $M$2, $F55,$R$2,$Q$2, \"\",\"False\")","v":44186.496527777781},{"$f":" RTD(\"cqg.rtd\",,\"StudyData\", $N$2, \"Bar\", \"\", \"Open\", $M$2, $F55, $R$2,$Q$2,,$O$2,$P$2)","v":308.13},{"$f":" RTD(\"cqg.rtd\",,\"StudyData\", $N$2, \"Bar\", \"\", \"High\", $M$2, $F55, $R$2,$Q$2,,$O$2,$P$2)","v":308.24},{"$f":" RTD(\"cqg.rtd\",,\"StudyData\", $N$2, \"Bar\", \"\", \"Low\", $M$2, $F55, $R$2,$Q$2,,$O$2,$P$2)","v":308.02999999999997},{"$f":" RTD(\"cqg.rtd\",,\"StudyData\", $N$2, \"Bar\", \"\", \"Close\", $M$2, $F55, $R$2,$Q$2,,$O$2,$P$2)","v":308.17},-54,null,44186.496527777781,{"$f":"RTD(\"cqg.rtd\",,\"StudyData\",$N$2, \"Vol\", \"VolType=Auto,CoCType=Auto\", \"Vol\", $M$2, $F55, $R$2,$Q$2,,$O$2,$P$2)","v":261709}]
[{"$f":" RTD(\"cqg.rtd\",,\"StudyData\", $N$2, \"Bar\", \"\", \"Time\", $M$2, $F56,$R$2,$Q$2, \"\",\"False\")","v":44186.493055555555},{"$f":" RTD(\"cqg.rtd\",,\"StudyData\", $N$2, \"Bar\", \"\", \"Open\", $M$2, $F56, $R$2,$Q$2,,$O$2,$P$2)","v":307.75},{"$f":" RTD(\"cqg.rtd\",,\"StudyData\", $N$2, \"Bar\", \"\", \"High\", $M$2, $F56, $R$2,$Q$2,,$O$2,$P$2)","v":308.37},{"$f":" RTD(\"cqg.rtd\",,\"StudyData\", $N$2, \"Bar\", \"\", \"Low\", $M$2, $F56, $R$2,$Q$2,,$O$2,$P$2)","v":307.72000000000003},{"$f":" RTD(\"cqg.rtd\",,\"StudyData\", $N$2, \"Bar\", \"\", \"Close\", $M$2, $F56, $R$2,$Q$2,,$O$2,$P$2)","v":308.10000000000002},-55,null,44186.493055555555,{"$f":"RTD(\"cqg.rtd\",,\"StudyData\",$N$2, \"Vol\", \"VolType=Auto,CoCType=Auto\", \"Vol\", $M$2, $F56, $R$2,$Q$2,,$O$2,$P$2)","v":366913}]
[{"$f":" RTD(\"cqg.rtd\",,\"StudyData\", $N$2, \"Bar\", \"\", \"Time\", $M$2, $F57,$R$2,$Q$2, \"\",\"False\")","v":44186.489583333336},{"$f":" RTD(\"cqg.rtd\",,\"StudyData\", $N$2, \"Bar\", \"\", \"Open\", $M$2, $F57, $R$2,$Q$2,,$O$2,$P$2)","v":307.77999999999997},{"$f":" RTD(\"cqg.rtd\",,\"StudyData\", $N$2, \"Bar\", \"\", \"High\", $M$2, $F57, $R$2,$Q$2,,$O$2,$P$2)","v":307.83},{"$f":" RTD(\"cqg.rtd\",,\"StudyData\", $N$2, \"Bar\", \"\", \"Low\", $M$2, $F57, $R$2,$Q$2,,$O$2,$P$2)","v":307.58999999999997},{"$f":" RTD(\"cqg.rtd\",,\"StudyData\", $N$2, \"Bar\", \"\", \"Close\", $M$2, $F57, $R$2,$Q$2,,$O$2,$P$2)","v":307.75},-56,null,44186.489583333336,{"$f":"RTD(\"cqg.rtd\",,\"StudyData\",$N$2, \"Vol\", \"VolType=Auto,CoCType=Auto\", \"Vol\", $M$2, $F57, $R$2,$Q$2,,$O$2,$P$2)","v":143919}]
[{"$f":" RTD(\"cqg.rtd\",,\"StudyData\", $N$2, \"Bar\", \"\", \"Time\", $M$2, $F58,$R$2,$Q$2, \"\",\"False\")","v":44186.486111111109},{"$f":" RTD(\"cqg.rtd\",,\"StudyData\", $N$2, \"Bar\", \"\", \"Open\", $M$2, $F58, $R$2,$Q$2,,$O$2,$P$2)","v":307.82},{"$f":" RTD(\"cqg.rtd\",,\"StudyData\", $N$2, \"Bar\", \"\", \"High\", $M$2, $F58, $R$2,$Q$2,,$O$2,$P$2)","v":307.89},{"$f":" RTD(\"cqg.rtd\",,\"StudyData\", $N$2, \"Bar\", \"\", \"Low\", $M$2, $F58, $R$2,$Q$2,,$O$2,$P$2)","v":307.60000000000002},{"$f":" RTD(\"cqg.rtd\",,\"StudyData\", $N$2, \"Bar\", \"\", \"Close\", $M$2, $F58, $R$2,$Q$2,,$O$2,$P$2)","v":307.76},-57,null,44186.486111111109,{"$f":"RTD(\"cqg.rtd\",,\"StudyData\",$N$2, \"Vol\", \"VolType=Auto,CoCType=Auto\", \"Vol\", $M$2, $F58, $R$2,$Q$2,,$O$2,$P$2)","v":223076}]
[{"$f":" RTD(\"cqg.rtd\",,\"StudyData\", $N$2, \"Bar\", \"\", \"Time\", $M$2, $F59,$R$2,$Q$2, \"\",\"False\")","v":44186.482638888891},{"$f":" RTD(\"cqg.rtd\",,\"StudyData\", $N$2, \"Bar\", \"\", \"Open\", $M$2, $F59, $R$2,$Q$2,,$O$2,$P$2)","v":307.74},{"$f":" RTD(\"cqg.rtd\",,\"StudyData\", $N$2, \"Bar\", \"\", \"High\", $M$2, $F59, $R$2,$Q$2,,$O$2,$P$2)","v":307.92},{"$f":" RTD(\"cqg.rtd\",,\"StudyData\", $N$2, \"Bar\", \"\", \"Low\", $M$2, $F59, $R$2,$Q$2,,$O$2,$P$2)","v":307.67},{"$f":" RTD(\"cqg.rtd\",,\"StudyData\", $N$2, \"Bar\", \"\", \"Close\", $M$2, $F59, $R$2,$Q$2,,$O$2,$P$2)","v":307.82},-58,null,44186.482638888891,{"$f":"RTD(\"cqg.rtd\",,\"StudyData\",$N$2, \"Vol\", \"VolType=Auto,CoCType=Auto\", \"Vol\", $M$2, $F59, $R$2,$Q$2,,$O$2,$P$2)","v":118705}]
[{"$f":" RTD(\"cqg.rtd\",,\"StudyData\", $N$2, \"Bar\", \"\", \"Time\", $M$2, $F60,$R$2,$Q$2, \"\",\"False\")","v":44186.479166666664},{"$f":" RTD(\"cqg.rtd\",,\"StudyData\", $N$2, \"Bar\", \"\", \"Open\", $M$2, $F60, $R$2,$Q$2,,$O$2,$P$2)","v":307.57},{"$f":" RTD(\"cqg.rtd\",,\"StudyData\", $N$2, \"Bar\", \"\", \"High\", $M$2, $F60, $R$2,$Q$2,,$O$2,$P$2)","v":307.82},{"$f":" RTD(\"cqg.rtd\",,\"StudyData\", $N$2, \"Bar\", \"\", \"Low\", $M$2, $F60, $R$2,$Q$2,,$O$2,$P$2)","v":307.57},{"$f":" RTD(\"cqg.rtd\",,\"StudyData\", $N$2, \"Bar\", \"\", \"Close\", $M$2, $F60, $R$2,$Q$2,,$O$2,$P$2)","v":307.75},-59,null,44186.479166666664,{"$f":"RTD(\"cqg.rtd\",,\"StudyData\",$N$2, \"Vol\", \"VolType=Auto,CoCType=Auto\", \"Vol\", $M$2, $F60, $R$2,$Q$2,,$O$2,$P$2)","v":157480}]
[{"$f":" RTD(\"cqg.rtd\",,\"StudyData\", $N$2, \"Bar\", \"\", \"Time\", $M$2, $F61,$R$2,$Q$2, \"\",\"False\")","v":44186.475694444445},{"$f":" RTD(\"cqg.rtd\",,\"StudyData\", $N$2, \"Bar\", \"\", \"Open\", $M$2, $F61, $R$2,$Q$2,,$O$2,$P$2)","v":307.3},{"$f":" RTD(\"cqg.rtd\",,\"StudyData\", $N$2, \"Bar\", \"\", \"High\", $M$2, $F61, $R$2,$Q$2,,$O$2,$P$2)","v":307.61},{"$f":" RTD(\"cqg.rtd\",,\"StudyData\", $N$2, \"Bar\", \"\", \"Low\", $M$2, $F61, $R$2,$Q$2,,$O$2,$P$2)","v":307.26},{"$f":" RTD(\"cqg.rtd\",,\"StudyData\", $N$2, \"Bar\", \"\", \"Close\", $M$2, $F61, $R$2,$Q$2,,$O$2,$P$2)","v":307.58},-60,null,44186.475694444445,{"$f":"RTD(\"cqg.rtd\",,\"StudyData\",$N$2, \"Vol\", \"VolType=Auto,CoCType=Auto\", \"Vol\", $M$2, $F61, $R$2,$Q$2,,$O$2,$P$2)","v":215758}]
[{"$f":" RTD(\"cqg.rtd\",,\"StudyData\", $N$2, \"Bar\", \"\", \"Time\", $M$2, $F62,$R$2,$Q$2, \"\",\"False\")","v":44186.472222222219},{"$f":" RTD(\"cqg.rtd\",,\"StudyData\", $N$2, \"Bar\", \"\", \"Open\", $M$2, $F62, $R$2,$Q$2,,$O$2,$P$2)","v":306.63},{"$f":" RTD(\"cqg.rtd\",,\"StudyData\", $N$2, \"Bar\", \"\", \"High\", $M$2, $F62, $R$2,$Q$2,,$O$2,$P$2)","v":307.31},{"$f":" RTD(\"cqg.rtd\",,\"StudyData\", $N$2, \"Bar\", \"\", \"Low\", $M$2, $F62, $R$2,$Q$2,,$O$2,$P$2)","v":306.61},{"$f":" RTD(\"cqg.rtd\",,\"StudyData\", $N$2, \"Bar\", \"\", \"Close\", $M$2, $F62, $R$2,$Q$2,,$O$2,$P$2)","v":307.31},-61,null,44186.472222222219,{"$f":"RTD(\"cqg.rtd\",,\"StudyData\",$N$2, \"Vol\", \"VolType=Auto,CoCType=Auto\", \"Vol\", $M$2, $F62, $R$2,$Q$2,,$O$2,$P$2)","v":121596}]
[{"$f":" RTD(\"cqg.rtd\",,\"StudyData\", $N$2, \"Bar\", \"\", \"Time\", $M$2, $F63,$R$2,$Q$2, \"\",\"False\")","v":44186.46875},{"$f":" RTD(\"cqg.rtd\",,\"StudyData\", $N$2, \"Bar\", \"\", \"Open\", $M$2, $F63, $R$2,$Q$2,,$O$2,$P$2)","v":306.67},{"$f":" RTD(\"cqg.rtd\",,\"StudyData\", $N$2, \"Bar\", \"\", \"High\", $M$2, $F63, $R$2,$Q$2,,$O$2,$P$2)","v":306.86},{"$f":" RTD(\"cqg.rtd\",,\"StudyData\", $N$2, \"Bar\", \"\", \"Low\", $M$2, $F63, $R$2,$Q$2,,$O$2,$P$2)","v":306.56},{"$f":" RTD(\"cqg.rtd\",,\"StudyData\", $N$2, \"Bar\", \"\", \"Close\", $M$2, $F63, $R$2,$Q$2,,$O$2,$P$2)","v":306.58999999999997},-62,null,44186.46875,{"$f":"RTD(\"cqg.rtd\",,\"StudyData\",$N$2, \"Vol\", \"VolType=Auto,CoCType=Auto\", \"Vol\", $M$2, $F63, $R$2,$Q$2,,$O$2,$P$2)","v":102702}]
[{"$f":" RTD(\"cqg.rtd\",,\"StudyData\", $N$2, \"Bar\", \"\", \"Time\", $M$2, $F64,$R$2,$Q$2, \"\",\"False\")","v":44186.465277777781},{"$f":" RTD(\"cqg.rtd\",,\"StudyData\", $N$2, \"Bar\", \"\", \"Open\", $M$2, $F64, $R$2,$Q$2,,$O$2,$P$2)","v":306.89999999999998},{"$f":" RTD(\"cqg.rtd\",,\"StudyData\", $N$2, \"Bar\", \"\", \"High\", $M$2, $F64, $R$2,$Q$2,,$O$2,$P$2)","v":306.97000000000003},{"$f":" RTD(\"cqg.rtd\",,\"StudyData\", $N$2, \"Bar\", \"\", \"Low\", $M$2, $F64, $R$2,$Q$2,,$O$2,$P$2)","v":306.63},{"$f":" RTD(\"cqg.rtd\",,\"StudyData\", $N$2, \"Bar\", \"\", \"Close\", $M$2, $F64, $R$2,$Q$2,,$O$2,$P$2)","v":306.66000000000003},-63,null,44186.465277777781,{"$f":"RTD(\"cqg.rtd\",,\"StudyData\",$N$2, \"Vol\", \"VolType=Auto,CoCType=Auto\", \"Vol\", $M$2, $F64, $R$2,$Q$2,,$O$2,$P$2)","v":105739}]
[{"$f":" RTD(\"cqg.rtd\",,\"StudyData\", $N$2, \"Bar\", \"\", \"Time\", $M$2, $F65,$R$2,$Q$2, \"\",\"False\")","v":44186.461805555555},{"$f":" RTD(\"cqg.rtd\",,\"StudyData\", $N$2, \"Bar\", \"\", \"Open\", $M$2, $F65, $R$2,$Q$2,,$O$2,$P$2)","v":306.86},{"$f":" RTD(\"cqg.rtd\",,\"StudyData\", $N$2, \"Bar\", \"\", \"High\", $M$2, $F65, $R$2,$Q$2,,$O$2,$P$2)","v":306.98},{"$f":" RTD(\"cqg.rtd\",,\"StudyData\", $N$2, \"Bar\", \"\", \"Low\", $M$2, $F65, $R$2,$Q$2,,$O$2,$P$2)","v":306.74},{"$f":" RTD(\"cqg.rtd\",,\"StudyData\", $N$2, \"Bar\", \"\", \"Close\", $M$2, $F65, $R$2,$Q$2,,$O$2,$P$2)","v":306.91000000000003},-64,null,44186.461805555555,{"$f":"RTD(\"cqg.rtd\",,\"StudyData\",$N$2, \"Vol\", \"VolType=Auto,CoCType=Auto\", \"Vol\", $M$2, $F65, $R$2,$Q$2,,$O$2,$P$2)","v":99794}]
[{"$f":" RTD(\"cqg.rtd\",,\"StudyData\", $N$2, \"Bar\", \"\", \"Time\", $M$2, $F66,$R$2,$Q$2, \"\",\"False\")","v":44186.458333333336},{"$f":" RTD(\"cqg.rtd\",,\"StudyData\", $N$2, \"Bar\", \"\", \"Open\", $M$2, $F66, $R$2,$Q$2,,$O$2,$P$2)","v":306.54000000000002},{"$f":" RTD(\"cqg.rtd\",,\"StudyData\", $N$2, \"Bar\", \"\", \"High\", $M$2, $F66, $R$2,$Q$2,,$O$2,$P$2)","v":306.89999999999998},{"$f":" RTD(\"cqg.rtd\",,\"StudyData\", $N$2, \"Bar\", \"\", \"Low\", $M$2, $F66, $R$2,$Q$2,,$O$2,$P$2)","v":306.54000000000002},{"$f":" RTD(\"cqg.rtd\",,\"StudyData\", $N$2, \"Bar\", \"\", \"Close\", $M$2, $F66, $R$2,$Q$2,,$O$2,$P$2)","v":306.87},-65,null,{"$f":"A66","v":44186.458333333336},{"$f":"RTD(\"cqg.rtd\",,\"StudyData\",$N$2, \"Vol\", \"VolType=Auto,CoCType=Auto\", \"Vol\", $M$2, $F66, $R$2,$Q$2,,$O$2,$P$2)","v":138103}]
[{"$f":" RTD(\"cqg.rtd\",,\"StudyData\", $N$2, \"Bar\", \"\", \"Time\", $M$2, $F67,$R$2,$Q$2, \"\",\"False\")","v":44186.454861111109},{"$f":" RTD(\"cqg.rtd\",,\"StudyData\", $N$2, \"Bar\", \"\", \"Open\", $M$2, $F67, $R$2,$Q$2,,$O$2,$P$2)","v":306.63},{"$f":" RTD(\"cqg.rtd\",,\"StudyData\", $N$2, \"Bar\", \"\", \"High\", $M$2, $F67, $R$2,$Q$2,,$O$2,$P$2)","v":306.67},{"$f":" RTD(\"cqg.rtd\",,\"StudyData\", $N$2, \"Bar\", \"\", \"Low\", $M$2, $F67, $R$2,$Q$2,,$O$2,$P$2)","v":306.45999999999998},{"$f":" RTD(\"cqg.rtd\",,\"StudyData\", $N$2, \"Bar\", \"\", \"Close\", $M$2, $F67, $R$2,$Q$2,,$O$2,$P$2)","v":306.54000000000002},{"$f":"F66-1","v":-66},null,44186.454861111109,{"$f":"RTD(\"cqg.rtd\",,\"StudyData\",$N$2, \"Vol\", \"VolType=Auto,CoCType=Auto\", \"Vol\", $M$2, $F67, $R$2,$Q$2,,$O$2,$P$2)","v":124458}]
[{"$f":" RTD(\"cqg.rtd\",,\"StudyData\", $N$2, \"Bar\", \"\", \"Time\", $M$2, $F68,$R$2,$Q$2, \"\",\"False\")","v":44186.451388888891},{"$f":" RTD(\"cqg.rtd\",,\"StudyData\", $N$2, \"Bar\", \"\", \"Open\", $M$2, $F68, $R$2,$Q$2,,$O$2,$P$2)","v":306.8},{"$f":" RTD(\"cqg.rtd\",,\"StudyData\", $N$2, \"Bar\", \"\", \"High\", $M$2, $F68, $R$2,$Q$2,,$O$2,$P$2)","v":306.95},{"$f":" RTD(\"cqg.rtd\",,\"StudyData\", $N$2, \"Bar\", \"\", \"Low\", $M$2, $F68, $R$2,$Q$2,,$O$2,$P$2)","v":306.58999999999997},{"$f":" RTD(\"cqg.rtd\",,\"StudyData\", $N$2, \"Bar\", \"\", \"Close\", $M$2, $F68, $R$2,$Q$2,,$O$2,$P$2)","v":306.63},-67,null,44186.451388888891,{"$f":"RTD(\"cqg.rtd\",,\"StudyData\",$N$2, \"Vol\", \"VolType=Auto,CoCType=Auto\", \"Vol\", $M$2, $F68, $R$2,$Q$2,,$O$2,$P$2)","v":144648}]
[{"$f":" RTD(\"cqg.rtd\",,\"StudyData\", $N$2, \"Bar\", \"\", \"Time\", $M$2, $F69,$R$2,$Q$2, \"\",\"False\")","v":44186.447916666664},{"$f":" RTD(\"cqg.rtd\",,\"StudyData\", $N$2, \"Bar\", \"\", \"Open\", $M$2, $F69, $R$2,$Q$2,,$O$2,$P$2)","v":306.57},{"$f":" RTD(\"cqg.rtd\",,\"StudyData\", $N$2, \"Bar\", \"\", \"High\", $M$2, $F69, $R$2,$Q$2,,$O$2,$P$2)","v":306.86},{"$f":" RTD(\"cqg.rtd\",,\"StudyData\", $N$2, \"Bar\", \"\", \"Low\", $M$2, $F69, $R$2,$Q$2,,$O$2,$P$2)","v":306.51},{"$f":" RTD(\"cqg.rtd\",,\"StudyData\", $N$2, \"Bar\", \"\", \"Close\", $M$2, $F69, $R$2,$Q$2,,$O$2,$P$2)","v":306.8},-68,null,44186.447916666664,{"$f":"RTD(\"cqg.rtd\",,\"StudyData\",$N$2, \"Vol\", \"VolType=Auto,CoCType=Auto\", \"Vol\", $M$2, $F69, $R$2,$Q$2,,$O$2,$P$2)","v":212874}]
[{"$f":" RTD(\"cqg.rtd\",,\"StudyData\", $N$2, \"Bar\", \"\", \"Time\", $M$2, $F70,$R$2,$Q$2, \"\",\"False\")","v":44186.444444444445},{"$f":" RTD(\"cqg.rtd\",,\"StudyData\", $N$2, \"Bar\", \"\", \"Open\", $M$2, $F70, $R$2,$Q$2,,$O$2,$P$2)","v":306.38},{"$f":" RTD(\"cqg.rtd\",,\"StudyData\", $N$2, \"Bar\", \"\", \"High\", $M$2, $F70, $R$2,$Q$2,,$O$2,$P$2)","v":306.68},{"$f":" RTD(\"cqg.rtd\",,\"StudyData\", $N$2, \"Bar\", \"\", \"Low\", $M$2, $F70, $R$2,$Q$2,,$O$2,$P$2)","v":306.38},{"$f":" RTD(\"cqg.rtd\",,\"StudyData\", $N$2, \"Bar\", \"\", \"Close\", $M$2, $F70, $R$2,$Q$2,,$O$2,$P$2)","v":306.58},-69,null,44186.444444444445,{"$f":"RTD(\"cqg.rtd\",,\"StudyData\",$N$2, \"Vol\", \"VolType=Auto,CoCType=Auto\", \"Vol\", $M$2, $F70, $R$2,$Q$2,,$O$2,$P$2)","v":240439}]
[{"$f":" RTD(\"cqg.rtd\",,\"StudyData\", $N$2, \"Bar\", \"\", \"Time\", $M$2, $F71,$R$2,$Q$2, \"\",\"False\")","v":44186.440972222219},{"$f":" RTD(\"cqg.rtd\",,\"StudyData\", $N$2, \"Bar\", \"\", \"Open\", $M$2, $F71, $R$2,$Q$2,,$O$2,$P$2)","v":305.92},{"$f":" RTD(\"cqg.rtd\",,\"StudyData\", $N$2, \"Bar\", \"\", \"High\", $M$2, $F71, $R$2,$Q$2,,$O$2,$P$2)","v":306.52},{"$f":" RTD(\"cqg.rtd\",,\"StudyData\", $N$2, \"Bar\", \"\", \"Low\", $M$2, $F71, $R$2,$Q$2,,$O$2,$P$2)","v":305.91000000000003},{"$f":" RTD(\"cqg.rtd\",,\"StudyData\", $N$2, \"Bar\", \"\", \"Close\", $M$2, $F71, $R$2,$Q$2,,$O$2,$P$2)","v":306.38},-70,null,44186.440972222219,{"$f":"RTD(\"cqg.rtd\",,\"StudyData\",$N$2, \"Vol\", \"VolType=Auto,CoCType=Auto\", \"Vol\", $M$2, $F71, $R$2,$Q$2,,$O$2,$P$2)","v":341606}]
[{"$f":" RTD(\"cqg.rtd\",,\"StudyData\", $N$2, \"Bar\", \"\", \"Time\", $M$2, $F72,$R$2,$Q$2, \"\",\"False\")","v":44186.4375},{"$f":" RTD(\"cqg.rtd\",,\"StudyData\", $N$2, \"Bar\", \"\", \"Open\", $M$2, $F72, $R$2,$Q$2,,$O$2,$P$2)","v":305.63},{"$f":" RTD(\"cqg.rtd\",,\"StudyData\", $N$2, \"Bar\", \"\", \"High\", $M$2, $F72, $R$2,$Q$2,,$O$2,$P$2)","v":306.08},{"$f":" RTD(\"cqg.rtd\",,\"StudyData\", $N$2, \"Bar\", \"\", \"Low\", $M$2, $F72, $R$2,$Q$2,,$O$2,$P$2)","v":305.62},{"$f":" RTD(\"cqg.rtd\",,\"StudyData\", $N$2, \"Bar\", \"\", \"Close\", $M$2, $F72, $R$2,$Q$2,,$O$2,$P$2)","v":305.91000000000003},-71,null,44186.4375,{"$f":"RTD(\"cqg.rtd\",,\"StudyData\",$N$2, \"Vol\", \"VolType=Auto,CoCType=Auto\", \"Vol\", $M$2, $F72, $R$2,$Q$2,,$O$2,$P$2)","v":405834}]
[{"$f":" RTD(\"cqg.rtd\",,\"StudyData\", $N$2, \"Bar\", \"\", \"Time\", $M$2, $F73,$R$2,$Q$2, \"\",\"False\")","v":44186.434027777781},{"$f":" RTD(\"cqg.rtd\",,\"StudyData\", $N$2, \"Bar\", \"\", \"Open\", $M$2, $F73, $R$2,$Q$2,,$O$2,$P$2)","v":305.58999999999997},{"$f":" RTD(\"cqg.rtd\",,\"StudyData\", $N$2, \"Bar\", \"\", \"High\", $M$2, $F73, $R$2,$Q$2,,$O$2,$P$2)","v":305.67},{"$f":" RTD(\"cqg.rtd\",,\"StudyData\", $N$2, \"Bar\", \"\", \"Low\", $M$2, $F73, $R$2,$Q$2,,$O$2,$P$2)","v":305.49},{"$f":" RTD(\"cqg.rtd\",,\"StudyData\", $N$2, \"Bar\", \"\", \"Close\", $M$2, $F73, $R$2,$Q$2,,$O$2,$P$2)","v":305.63},-72,null,44186.434027777781,{"$f":"RTD(\"cqg.rtd\",,\"StudyData\",$N$2, \"Vol\", \"VolType=Auto,CoCType=Auto\", \"Vol\", $M$2, $F73, $R$2,$Q$2,,$O$2,$P$2)","v":283421}]
[{"$f":" RTD(\"cqg.rtd\",,\"StudyData\", $N$2, \"Bar\", \"\", \"Time\", $M$2, $F74,$R$2,$Q$2, \"\",\"False\")","v":44186.430555555555},{"$f":" RTD(\"cqg.rtd\",,\"StudyData\", $N$2, \"Bar\", \"\", \"Open\", $M$2, $F74, $R$2,$Q$2,,$O$2,$P$2)","v":305.02},{"$f":" RTD(\"cqg.rtd\",,\"StudyData\", $N$2, \"Bar\", \"\", \"High\", $M$2, $F74, $R$2,$Q$2,,$O$2,$P$2)","v":305.61},{"$f":" RTD(\"cqg.rtd\",,\"StudyData\", $N$2, \"Bar\", \"\", \"Low\", $M$2, $F74, $R$2,$Q$2,,$O$2,$P$2)","v":304.93},{"$f":" RTD(\"cqg.rtd\",,\"StudyData\", $N$2, \"Bar\", \"\", \"Close\", $M$2, $F74, $R$2,$Q$2,,$O$2,$P$2)","v":305.60000000000002},-73,null,44186.430555555555,{"$f":"RTD(\"cqg.rtd\",,\"StudyData\",$N$2, \"Vol\", \"VolType=Auto,CoCType=Auto\", \"Vol\", $M$2, $F74, $R$2,$Q$2,,$O$2,$P$2)","v":312838}]
[{"$f":" RTD(\"cqg.rtd\",,\"StudyData\", $N$2, \"Bar\", \"\", \"Time\", $M$2, $F75,$R$2,$Q$2, \"\",\"False\")","v":44186.427083333336},{"$f":" RTD(\"cqg.rtd\",,\"StudyData\", $N$2, \"Bar\", \"\", \"Open\", $M$2, $F75, $R$2,$Q$2,,$O$2,$P$2)","v":305.02999999999997},{"$f":" RTD(\"cqg.rtd\",,\"StudyData\", $N$2, \"Bar\", \"\", \"High\", $M$2, $F75, $R$2,$Q$2,,$O$2,$P$2)","v":305.14},{"$f":" RTD(\"cqg.rtd\",,\"StudyData\", $N$2, \"Bar\", \"\", \"Low\", $M$2, $F75, $R$2,$Q$2,,$O$2,$P$2)","v":304.72000000000003},{"$f":" RTD(\"cqg.rtd\",,\"StudyData\", $N$2, \"Bar\", \"\", \"Close\", $M$2, $F75, $R$2,$Q$2,,$O$2,$P$2)","v":305.02999999999997},-74,null,44186.427083333336,{"$f":"RTD(\"cqg.rtd\",,\"StudyData\",$N$2, \"Vol\", \"VolType=Auto,CoCType=Auto\", \"Vol\", $M$2, $F75, $R$2,$Q$2,,$O$2,$P$2)","v":249292}]
[{"$f":" RTD(\"cqg.rtd\",,\"StudyData\", $N$2, \"Bar\", \"\", \"Time\", $M$2, $F76,$R$2,$Q$2, \"\",\"False\")","v":44186.423611111109},{"$f":" RTD(\"cqg.rtd\",,\"StudyData\", $N$2, \"Bar\", \"\", \"Open\", $M$2, $F76, $R$2,$Q$2,,$O$2,$P$2)","v":304.82},{"$f":" RTD(\"cqg.rtd\",,\"StudyData\", $N$2, \"Bar\", \"\", \"High\", $M$2, $F76, $R$2,$Q$2,,$O$2,$P$2)","v":305.05},{"$f":" RTD(\"cqg.rtd\",,\"StudyData\", $N$2, \"Bar\", \"\", \"Low\", $M$2, $F76, $R$2,$Q$2,,$O$2,$P$2)","v":304.58},{"$f":" RTD(\"cqg.rtd\",,\"StudyData\", $N$2, \"Bar\", \"\", \"Close\", $M$2, $F76, $R$2,$Q$2,,$O$2,$P$2)","v":305.02999999999997},-75,null,44186.423611111109,{"$f":"RTD(\"cqg.rtd\",,\"StudyData\",$N$2, \"Vol\", \"VolType=Auto,CoCType=Auto\", \"Vol\", $M$2, $F76, $R$2,$Q$2,,$O$2,$P$2)","v":324337}]
[{"$f":" RTD(\"cqg.rtd\",,\"StudyData\", $N$2, \"Bar\", \"\", \"Time\", $M$2, $F77,$R$2,$Q$2, \"\",\"False\")","v":44186.420138888891},{"$f":" RTD(\"cqg.rtd\",,\"StudyData\", $N$2, \"Bar\", \"\", \"Open\", $M$2, $F77, $R$2,$Q$2,,$O$2,$P$2)","v":304.95},{"$f":" RTD(\"cqg.rtd\",,\"StudyData\", $N$2, \"Bar\", \"\", \"High\", $M$2, $F77, $R$2,$Q$2,,$O$2,$P$2)","v":305.05},{"$f":" RTD(\"cqg.rtd\",,\"StudyData\", $N$2, \"Bar\", \"\", \"Low\", $M$2, $F77, $R$2,$Q$2,,$O$2,$P$2)","v":304.58},{"$f":" RTD(\"cqg.rtd\",,\"StudyData\", $N$2, \"Bar\", \"\", \"Close\", $M$2, $F77, $R$2,$Q$2,,$O$2,$P$2)","v":304.85000000000002},-76,null,44186.420138888891,{"$f":"RTD(\"cqg.rtd\",,\"StudyData\",$N$2, \"Vol\", \"VolType=Auto,CoCType=Auto\", \"Vol\", $M$2, $F77, $R$2,$Q$2,,$O$2,$P$2)","v":369152}]
[{"$f":" RTD(\"cqg.rtd\",,\"StudyData\", $N$2, \"Bar\", \"\", \"Time\", $M$2, $F78,$R$2,$Q$2, \"\",\"False\")","v":44186.416666666664},{"$f":" RTD(\"cqg.rtd\",,\"StudyData\", $N$2, \"Bar\", \"\", \"Open\", $M$2, $F78, $R$2,$Q$2,,$O$2,$P$2)","v":304.41000000000003},{"$f":" RTD(\"cqg.rtd\",,\"StudyData\", $N$2, \"Bar\", \"\", \"High\", $M$2, $F78, $R$2,$Q$2,,$O$2,$P$2)","v":305.02},{"$f":" RTD(\"cqg.rtd\",,\"StudyData\", $N$2, \"Bar\", \"\", \"Low\", $M$2, $F78, $R$2,$Q$2,,$O$2,$P$2)","v":304.32},{"$f":" RTD(\"cqg.rtd\",,\"StudyData\", $N$2, \"Bar\", \"\", \"Close\", $M$2, $F78, $R$2,$Q$2,,$O$2,$P$2)","v":304.95},-77,null,44186.416666666664,{"$f":"RTD(\"cqg.rtd\",,\"StudyData\",$N$2, \"Vol\", \"VolType=Auto,CoCType=Auto\", \"Vol\", $M$2, $F78, $R$2,$Q$2,,$O$2,$P$2)","v":366226}]
[{"$f":" RTD(\"cqg.rtd\",,\"StudyData\", $N$2, \"Bar\", \"\", \"Time\", $M$2, $F79,$R$2,$Q$2, \"\",\"False\")","v":44186.413194444445},{"$f":" RTD(\"cqg.rtd\",,\"StudyData\", $N$2, \"Bar\", \"\", \"Open\", $M$2, $F79, $R$2,$Q$2,,$O$2,$P$2)","v":304.08},{"$f":" RTD(\"cqg.rtd\",,\"StudyData\", $N$2, \"Bar\", \"\", \"High\", $M$2, $F79, $R$2,$Q$2,,$O$2,$P$2)","v":304.64999999999998},{"$f":" RTD(\"cqg.rtd\",,\"StudyData\", $N$2, \"Bar\", \"\", \"Low\", $M$2, $F79, $R$2,$Q$2,,$O$2,$P$2)","v":303.98},{"$f":" RTD(\"cqg.rtd\",,\"StudyData\", $N$2, \"Bar\", \"\", \"Close\", $M$2, $F79, $R$2,$Q$2,,$O$2,$P$2)","v":304.39},-78,null,44186.413194444445,{"$f":"RTD(\"cqg.rtd\",,\"StudyData\",$N$2, \"Vol\", \"VolType=Auto,CoCType=Auto\", \"Vol\", $M$2, $F79, $R$2,$Q$2,,$O$2,$P$2)","v":464680}]
[{"$f":" RTD(\"cqg.rtd\",,\"StudyData\", $N$2, \"Bar\", \"\", \"Time\", $M$2, $F80,$R$2,$Q$2, \"\",\"False\")","v":44186.409722222219},{"$f":" RTD(\"cqg.rtd\",,\"StudyData\", $N$2, \"Bar\", \"\", \"Open\", $M$2, $F80, $R$2,$Q$2,,$O$2,$P$2)","v":303.91000000000003},{"$f":" RTD(\"cqg.rtd\",,\"StudyData\", $N$2, \"Bar\", \"\", \"High\", $M$2, $F80, $R$2,$Q$2,,$O$2,$P$2)","v":304.27},{"$f":" RTD(\"cqg.rtd\",,\"StudyData\", $N$2, \"Bar\", \"\", \"Low\", $M$2, $F80, $R$2,$Q$2,,$O$2,$P$2)","v":303.63},{"$f":" RTD(\"cqg.rtd\",,\"StudyData\", $N$2, \"Bar\", \"\", \"Close\", $M$2, $F80, $R$2,$Q$2,,$O$2,$P$2)","v":304.06},-79,null,44186.409722222219,{"$f":"RTD(\"cqg.rtd\",,\"StudyData\",$N$2, \"Vol\", \"VolType=Auto,CoCType=Auto\", \"Vol\", $M$2, $F80, $R$2,$Q$2,,$O$2,$P$2)","v":419873}]
[{"$f":" RTD(\"cqg.rtd\",,\"StudyData\", $N$2, \"Bar\", \"\", \"Time\", $M$2, $F81,$R$2,$Q$2, \"\",\"False\")","v":44186.40625},{"$f":" RTD(\"cqg.rtd\",,\"StudyData\", $N$2, \"Bar\", \"\", \"Open\", $M$2, $F81, $R$2,$Q$2,,$O$2,$P$2)","v":304.39},{"$f":" RTD(\"cqg.rtd\",,\"StudyData\", $N$2, \"Bar\", \"\", \"High\", $M$2, $F81, $R$2,$Q$2,,$O$2,$P$2)","v":304.39},{"$f":" RTD(\"cqg.rtd\",,\"StudyData\", $N$2, \"Bar\", \"\", \"Low\", $M$2, $F81, $R$2,$Q$2,,$O$2,$P$2)","v":303.60000000000002},{"$f":" RTD(\"cqg.rtd\",,\"StudyData\", $N$2, \"Bar\", \"\", \"Close\", $M$2, $F81, $R$2,$Q$2,,$O$2,$P$2)","v":303.89999999999998},-80,null,44186.40625,{"$f":"RTD(\"cqg.rtd\",,\"StudyData\",$N$2, \"Vol\", \"VolType=Auto,CoCType=Auto\", \"Vol\", $M$2, $F81, $R$2,$Q$2,,$O$2,$P$2)","v":478001}]
[{"$f":" RTD(\"cqg.rtd\",,\"StudyData\", $N$2, \"Bar\", \"\", \"Time\", $M$2, $F82,$R$2,$Q$2, \"\",\"False\")","v":44186.402777777781},{"$f":" RTD(\"cqg.rtd\",,\"StudyData\", $N$2, \"Bar\", \"\", \"Open\", $M$2, $F82, $R$2,$Q$2,,$O$2,$P$2)","v":304.41000000000003},{"$f":" RTD(\"cqg.rtd\",,\"StudyData\", $N$2, \"Bar\", \"\", \"High\", $M$2, $F82, $R$2,$Q$2,,$O$2,$P$2)","v":304.51},{"$f":" RTD(\"cqg.rtd\",,\"StudyData\", $N$2, \"Bar\", \"\", \"Low\", $M$2, $F82, $R$2,$Q$2,,$O$2,$P$2)","v":303.99},{"$f":" RTD(\"cqg.rtd\",,\"StudyData\", $N$2, \"Bar\", \"\", \"Close\", $M$2, $F82, $R$2,$Q$2,,$O$2,$P$2)","v":304.39999999999998},-81,null,44186.402777777781,{"$f":"RTD(\"cqg.rtd\",,\"StudyData\",$N$2, \"Vol\", \"VolType=Auto,CoCType=Auto\", \"Vol\", $M$2, $F82, $R$2,$Q$2,,$O$2,$P$2)","v":443406}]
[{"$f":" RTD(\"cqg.rtd\",,\"StudyData\", $N$2, \"Bar\", \"\", \"Time\", $M$2, $F83,$R$2,$Q$2, \"\",\"False\")","v":44186.399305555555},{"$f":" RTD(\"cqg.rtd\",,\"StudyData\", $N$2, \"Bar\", \"\", \"Open\", $M$2, $F83, $R$2,$Q$2,,$O$2,$P$2)","v":304.52999999999997},{"$f":" RTD(\"cqg.rtd\",,\"StudyData\", $N$2, \"Bar\", \"\", \"High\", $M$2, $F83, $R$2,$Q$2,,$O$2,$P$2)","v":304.75},{"$f":" RTD(\"cqg.rtd\",,\"StudyData\", $N$2, \"Bar\", \"\", \"Low\", $M$2, $F83, $R$2,$Q$2,,$O$2,$P$2)","v":303.77999999999997},{"$f":" RTD(\"cqg.rtd\",,\"StudyData\", $N$2, \"Bar\", \"\", \"Close\", $M$2, $F83, $R$2,$Q$2,,$O$2,$P$2)","v":304.44},-82,null,44186.399305555555,{"$f":"RTD(\"cqg.rtd\",,\"StudyData\",$N$2, \"Vol\", \"VolType=Auto,CoCType=Auto\", \"Vol\", $M$2, $F83, $R$2,$Q$2,,$O$2,$P$2)","v":559482}]
[{"$f":" RTD(\"cqg.rtd\",,\"StudyData\", $N$2, \"Bar\", \"\", \"Time\", $M$2, $F84,$R$2,$Q$2, \"\",\"False\")","v":44186.395833333336},{"$f":" RTD(\"cqg.rtd\",,\"StudyData\", $N$2, \"Bar\", \"\", \"Open\", $M$2, $F84, $R$2,$Q$2,,$O$2,$P$2)","v":304.67},{"$f":" RTD(\"cqg.rtd\",,\"StudyData\", $N$2, \"Bar\", \"\", \"High\", $M$2, $F84, $R$2,$Q$2,,$O$2,$P$2)","v":304.85000000000002},{"$f":" RTD(\"cqg.rtd\",,\"StudyData\", $N$2, \"Bar\", \"\", \"Low\", $M$2, $F84, $R$2,$Q$2,,$O$2,$P$2)","v":304.12},{"$f":" RTD(\"cqg.rtd\",,\"StudyData\", $N$2, \"Bar\", \"\", \"Close\", $M$2, $F84, $R$2,$Q$2,,$O$2,$P$2)","v":304.52},-83,null,44186.395833333336,{"$f":"RTD(\"cqg.rtd\",,\"StudyData\",$N$2, \"Vol\", \"VolType=Auto,CoCType=Auto\", \"Vol\", $M$2, $F84, $R$2,$Q$2,,$O$2,$P$2)","v":310985}]
[{"$f":" RTD(\"cqg.rtd\",,\"StudyData\", $N$2, \"Bar\", \"\", \"Time\", $M$2, $F85,$R$2,$Q$2, \"\",\"False\")","v":44186.392361111109},{"$f":" RTD(\"cqg.rtd\",,\"StudyData\", $N$2, \"Bar\", \"\", \"Open\", $M$2, $F85, $R$2,$Q$2,,$O$2,$P$2)","v":304.77},{"$f":" RTD(\"cqg.rtd\",,\"StudyData\", $N$2, \"Bar\", \"\", \"High\", $M$2, $F85, $R$2,$Q$2,,$O$2,$P$2)","v":304.93},{"$f":" RTD(\"cqg.rtd\",,\"StudyData\", $N$2, \"Bar\", \"\", \"Low\", $M$2, $F85, $R$2,$Q$2,,$O$2,$P$2)","v":304.37},{"$f":" RTD(\"cqg.rtd\",,\"StudyData\", $N$2, \"Bar\", \"\", \"Close\", $M$2, $F85, $R$2,$Q$2,,$O$2,$P$2)","v":304.68},-84,null,44186.392361111109,{"$f":"RTD(\"cqg.rtd\",,\"StudyData\",$N$2, \"Vol\", \"VolType=Auto,CoCType=Auto\", \"Vol\", $M$2, $F85, $R$2,$Q$2,,$O$2,$P$2)","v":289917}]
[{"$f":" RTD(\"cqg.rtd\",,\"StudyData\", $N$2, \"Bar\", \"\", \"Time\", $M$2, $F86,$R$2,$Q$2, \"\",\"False\")","v":44186.388888888891},{"$f":" RTD(\"cqg.rtd\",,\"StudyData\", $N$2, \"Bar\", \"\", \"Open\", $M$2, $F86, $R$2,$Q$2,,$O$2,$P$2)","v":304.17},{"$f":" RTD(\"cqg.rtd\",,\"StudyData\", $N$2, \"Bar\", \"\", \"High\", $M$2, $F86, $R$2,$Q$2,,$O$2,$P$2)","v":304.89999999999998},{"$f":" RTD(\"cqg.rtd\",,\"StudyData\", $N$2, \"Bar\", \"\", \"Low\", $M$2, $F86, $R$2,$Q$2,,$O$2,$P$2)","v":304.04000000000002},{"$f":" RTD(\"cqg.rtd\",,\"StudyData\", $N$2, \"Bar\", \"\", \"Close\", $M$2, $F86, $R$2,$Q$2,,$O$2,$P$2)","v":304.77999999999997},-85,null,44186.388888888891,{"$f":"RTD(\"cqg.rtd\",,\"StudyData\",$N$2, \"Vol\", \"VolType=Auto,CoCType=Auto\", \"Vol\", $M$2, $F86, $R$2,$Q$2,,$O$2,$P$2)","v":391113}]
[{"$f":" RTD(\"cqg.rtd\",,\"StudyData\", $N$2, \"Bar\", \"\", \"Time\", $M$2, $F87,$R$2,$Q$2, \"\",\"False\")","v":44186.385416666664},{"$f":" RTD(\"cqg.rtd\",,\"StudyData\", $N$2, \"Bar\", \"\", \"Open\", $M$2, $F87, $R$2,$Q$2,,$O$2,$P$2)","v":304.5},{"$f":" RTD(\"cqg.rtd\",,\"StudyData\", $N$2, \"Bar\", \"\", \"High\", $M$2, $F87, $R$2,$Q$2,,$O$2,$P$2)","v":305.06},{"$f":" RTD(\"cqg.rtd\",,\"StudyData\", $N$2, \"Bar\", \"\", \"Low\", $M$2, $F87, $R$2,$Q$2,,$O$2,$P$2)","v":304.02999999999997},{"$f":" RTD(\"cqg.rtd\",,\"StudyData\", $N$2, \"Bar\", \"\", \"Close\", $M$2, $F87, $R$2,$Q$2,,$O$2,$P$2)","v":304.16000000000003},-86,null,44186.385416666664,{"$f":"RTD(\"cqg.rtd\",,\"StudyData\",$N$2, \"Vol\", \"VolType=Auto,CoCType=Auto\", \"Vol\", $M$2, $F87, $R$2,$Q$2,,$O$2,$P$2)","v":464723}]
[{"$f":" RTD(\"cqg.rtd\",,\"StudyData\", $N$2, \"Bar\", \"\", \"Time\", $M$2, $F88,$R$2,$Q$2, \"\",\"False\")","v":44186.381944444445},{"$f":" RTD(\"cqg.rtd\",,\"StudyData\", $N$2, \"Bar\", \"\", \"Open\", $M$2, $F88, $R$2,$Q$2,,$O$2,$P$2)","v":305.08999999999997},{"$f":" RTD(\"cqg.rtd\",,\"StudyData\", $N$2, \"Bar\", \"\", \"High\", $M$2, $F88, $R$2,$Q$2,,$O$2,$P$2)","v":305.33},{"$f":" RTD(\"cqg.rtd\",,\"StudyData\", $N$2, \"Bar\", \"\", \"Low\", $M$2, $F88, $R$2,$Q$2,,$O$2,$P$2)","v":304.45999999999998},{"$f":" RTD(\"cqg.rtd\",,\"StudyData\", $N$2, \"Bar\", \"\", \"Close\", $M$2, $F88, $R$2,$Q$2,,$O$2,$P$2)","v":304.55},-87,null,44186.381944444445,{"$f":"RTD(\"cqg.rtd\",,\"StudyData\",$N$2, \"Vol\", \"VolType=Auto,CoCType=Auto\", \"Vol\", $M$2, $F88, $R$2,$Q$2,,$O$2,$P$2)","v":331972}]
[{"$f":" RTD(\"cqg.rtd\",,\"StudyData\", $N$2, \"Bar\", \"\", \"Time\", $M$2, $F89,$R$2,$Q$2, \"\",\"False\")","v":44186.378472222219},{"$f":" RTD(\"cqg.rtd\",,\"StudyData\", $N$2, \"Bar\", \"\", \"Open\", $M$2, $F89, $R$2,$Q$2,,$O$2,$P$2)","v":305.33999999999997},{"$f":" RTD(\"cqg.rtd\",,\"StudyData\", $N$2, \"Bar\", \"\", \"High\", $M$2, $F89, $R$2,$Q$2,,$O$2,$P$2)","v":305.44},{"$f":" RTD(\"cqg.rtd\",,\"StudyData\", $N$2, \"Bar\", \"\", \"Low\", $M$2, $F89, $R$2,$Q$2,,$O$2,$P$2)","v":304.58},{"$f":" RTD(\"cqg.rtd\",,\"StudyData\", $N$2, \"Bar\", \"\", \"Close\", $M$2, $F89, $R$2,$Q$2,,$O$2,$P$2)","v":305.06},-88,null,44186.378472222219,{"$f":"RTD(\"cqg.rtd\",,\"StudyData\",$N$2, \"Vol\", \"VolType=Auto,CoCType=Auto\", \"Vol\", $M$2, $F89, $R$2,$Q$2,,$O$2,$P$2)","v":669164}]
[{"$f":" RTD(\"cqg.rtd\",,\"StudyData\", $N$2, \"Bar\", \"\", \"Time\", $M$2, $F90,$R$2,$Q$2, \"\",\"False\")","v":44186.375},{"$f":" RTD(\"cqg.rtd\",,\"StudyData\", $N$2, \"Bar\", \"\", \"Open\", $M$2, $F90, $R$2,$Q$2,,$O$2,$P$2)","v":306.43},{"$f":" RTD(\"cqg.rtd\",,\"StudyData\", $N$2, \"Bar\", \"\", \"High\", $M$2, $F90, $R$2,$Q$2,,$O$2,$P$2)","v":306.77999999999997},{"$f":" RTD(\"cqg.rtd\",,\"StudyData\", $N$2, \"Bar\", \"\", \"Low\", $M$2, $F90, $R$2,$Q$2,,$O$2,$P$2)","v":305.11},{"$f":" RTD(\"cqg.rtd\",,\"StudyData\", $N$2, \"Bar\", \"\", \"Close\", $M$2, $F90, $R$2,$Q$2,,$O$2,$P$2)","v":305.33},-89,null,44186.375,{"$f":"RTD(\"cqg.rtd\",,\"StudyData\",$N$2, \"Vol\", \"VolType=Auto,CoCType=Auto\", \"Vol\", $M$2, $F90, $R$2,$Q$2,,$O$2,$P$2)","v":570312}]
[{"$f":" RTD(\"cqg.rtd\",,\"StudyData\", $N$2, \"Bar\", \"\", \"Time\", $M$2, $F91,$R$2,$Q$2, \"\",\"False\")","v":44186.371527777781},{"$f":" RTD(\"cqg.rtd\",,\"StudyData\", $N$2, \"Bar\", \"\", \"Open\", $M$2, $F91, $R$2,$Q$2,,$O$2,$P$2)","v":306.57},{"$f":" RTD(\"cqg.rtd\",,\"StudyData\", $N$2, \"Bar\", \"\", \"High\", $M$2, $F91, $R$2,$Q$2,,$O$2,$P$2)","v":307.13},{"$f":" RTD(\"cqg.rtd\",,\"StudyData\", $N$2, \"Bar\", \"\", \"Low\", $M$2, $F91, $R$2,$Q$2,,$O$2,$P$2)","v":306.35000000000002},{"$f":" RTD(\"cqg.rtd\",,\"StudyData\", $N$2, \"Bar\", \"\", \"Close\", $M$2, $F91, $R$2,$Q$2,,$O$2,$P$2)","v":306.49},-90,null,44186.371527777781,{"$f":"RTD(\"cqg.rtd\",,\"StudyData\",$N$2, \"Vol\", \"VolType=Auto,CoCType=Auto\", \"Vol\", $M$2, $F91, $R$2,$Q$2,,$O$2,$P$2)","v":605900}]
[{"$f":" RTD(\"cqg.rtd\",,\"StudyData\", $N$2, \"Bar\", \"\", \"Time\", $M$2, $F92,$R$2,$Q$2, \"\",\"False\")","v":44186.368055555555},{"$f":" RTD(\"cqg.rtd\",,\"StudyData\", $N$2, \"Bar\", \"\", \"Open\", $M$2, $F92, $R$2,$Q$2,,$O$2,$P$2)","v":306.27999999999997},{"$f":" RTD(\"cqg.rtd\",,\"StudyData\", $N$2, \"Bar\", \"\", \"High\", $M$2, $F92, $R$2,$Q$2,,$O$2,$P$2)","v":306.72000000000003},{"$f":" RTD(\"cqg.rtd\",,\"StudyData\", $N$2, \"Bar\", \"\", \"Low\", $M$2, $F92, $R$2,$Q$2,,$O$2,$P$2)","v":306.07},{"$f":" RTD(\"cqg.rtd\",,\"StudyData\", $N$2, \"Bar\", \"\", \"Close\", $M$2, $F92, $R$2,$Q$2,,$O$2,$P$2)","v":306.57},-91,null,44186.368055555555,{"$f":"RTD(\"cqg.rtd\",,\"StudyData\",$N$2, \"Vol\", \"VolType=Auto,CoCType=Auto\", \"Vol\", $M$2, $F92, $R$2,$Q$2,,$O$2,$P$2)","v":553911}]
[{"$f":" RTD(\"cqg.rtd\",,\"StudyData\", $N$2, \"Bar\", \"\", \"Time\", $M$2, $F93,$R$2,$Q$2, \"\",\"False\")","v":44186.364583333336},{"$f":" RTD(\"cqg.rtd\",,\"StudyData\", $N$2, \"Bar\", \"\", \"Open\", $M$2, $F93, $R$2,$Q$2,,$O$2,$P$2)","v":307.10000000000002},{"$f":" RTD(\"cqg.rtd\",,\"StudyData\", $N$2, \"Bar\", \"\", \"High\", $M$2, $F93, $R$2,$Q$2,,$O$2,$P$2)","v":307.31},{"$f":" RTD(\"cqg.rtd\",,\"StudyData\", $N$2, \"Bar\", \"\", \"Low\", $M$2, $F93, $R$2,$Q$2,,$O$2,$P$2)","v":306.10000000000002},{"$f":" RTD(\"cqg.rtd\",,\"StudyData\", $N$2, \"Bar\", \"\", \"Close\", $M$2, $F93, $R$2,$Q$2,,$O$2,$P$2)","v":306.29000000000002},-92,null,44186.364583333336,{"$f":"RTD(\"cqg.rtd\",,\"StudyData\",$N$2, \"Vol\", \"VolType=Auto,CoCType=Auto\", \"Vol\", $M$2, $F93, $R$2,$Q$2,,$O$2,$P$2)","v":531538}]
[{"$f":" RTD(\"cqg.rtd\",,\"StudyData\", $N$2, \"Bar\", \"\", \"Time\", $M$2, $F94,$R$2,$Q$2, \"\",\"False\")","v":44186.361111111109},{"$f":" RTD(\"cqg.rtd\",,\"StudyData\", $N$2, \"Bar\", \"\", \"Open\", $M$2, $F94, $R$2,$Q$2,,$O$2,$P$2)","v":307.89},{"$f":" RTD(\"cqg.rtd\",,\"StudyData\", $N$2, \"Bar\", \"\", \"High\", $M$2, $F94, $R$2,$Q$2,,$O$2,$P$2)","v":307.99},{"$f":" RTD(\"cqg.rtd\",,\"StudyData\", $N$2, \"Bar\", \"\", \"Low\", $M$2, $F94, $R$2,$Q$2,,$O$2,$P$2)","v":306.98},{"$f":" RTD(\"cqg.rtd\",,\"StudyData\", $N$2, \"Bar\", \"\", \"Close\", $M$2, $F94, $R$2,$Q$2,,$O$2,$P$2)","v":307.08},-93,null,44186.361111111109,{"$f":"RTD(\"cqg.rtd\",,\"StudyData\",$N$2, \"Vol\", \"VolType=Auto,CoCType=Auto\", \"Vol\", $M$2, $F94, $R$2,$Q$2,,$O$2,$P$2)","v":640865}]
[{"$f":" RTD(\"cqg.rtd\",,\"StudyData\", $N$2, \"Bar\", \"\", \"Time\", $M$2, $F95,$R$2,$Q$2, \"\",\"False\")","v":44186.357638888891},{"$f":" RTD(\"cqg.rtd\",,\"StudyData\", $N$2, \"Bar\", \"\", \"Open\", $M$2, $F95, $R$2,$Q$2,,$O$2,$P$2)","v":307.62},{"$f":" RTD(\"cqg.rtd\",,\"StudyData\", $N$2, \"Bar\", \"\", \"High\", $M$2, $F95, $R$2,$Q$2,,$O$2,$P$2)","v":308.14},{"$f":" RTD(\"cqg.rtd\",,\"StudyData\", $N$2, \"Bar\", \"\", \"Low\", $M$2, $F95, $R$2,$Q$2,,$O$2,$P$2)","v":307.33999999999997},{"$f":" RTD(\"cqg.rtd\",,\"StudyData\", $N$2, \"Bar\", \"\", \"Close\", $M$2, $F95, $R$2,$Q$2,,$O$2,$P$2)","v":307.91000000000003},-94,null,44186.357638888891,{"$f":"RTD(\"cqg.rtd\",,\"StudyData\",$N$2, \"Vol\", \"VolType=Auto,CoCType=Auto\", \"Vol\", $M$2, $F95, $R$2,$Q$2,,$O$2,$P$2)","v":545553}]
[{"$f":" RTD(\"cqg.rtd\",,\"StudyData\", $N$2, \"Bar\", \"\", \"Time\", $M$2, $F96,$R$2,$Q$2, \"\",\"False\")","v":44186.354166666664},{"$f":" RTD(\"cqg.rtd\",,\"StudyData\", $N$2, \"Bar\", \"\", \"Open\", $M$2, $F96, $R$2,$Q$2,,$O$2,$P$2)","v":306.45999999999998},{"$f":" RTD(\"cqg.rtd\",,\"StudyData\", $N$2, \"Bar\", \"\", \"High\", $M$2, $F96, $R$2,$Q$2,,$O$2,$P$2)","v":307.85000000000002},{"$f":" RTD(\"cqg.rtd\",,\"StudyData\", $N$2, \"Bar\", \"\", \"Low\", $M$2, $F96, $R$2,$Q$2,,$O$2,$P$2)","v":306.17},{"$f":" RTD(\"cqg.rtd\",,\"StudyData\", $N$2, \"Bar\", \"\", \"Close\", $M$2, $F96, $R$2,$Q$2,,$O$2,$P$2)","v":307.62},-95,null,44186.354166666664,{"$f":"RTD(\"cqg.rtd\",,\"StudyData\",$N$2, \"Vol\", \"VolType=Auto,CoCType=Auto\", \"Vol\", $M$2, $F96, $R$2,$Q$2,,$O$2,$P$2)","v":1177481}]
[{"$f":" RTD(\"cqg.rtd\",,\"StudyData\", $N$2, \"Bar\", \"\", \"Time\", $M$2, $F97,$R$2,$Q$2, \"\",\"False\")","v":44183.631944444445},{"$f":" RTD(\"cqg.rtd\",,\"StudyData\", $N$2, \"Bar\", \"\", \"Open\", $M$2, $F97, $R$2,$Q$2,,$O$2,$P$2)","v":310.69},{"$f":" RTD(\"cqg.rtd\",,\"StudyData\", $N$2, \"Bar\", \"\", \"High\", $M$2, $F97, $R$2,$Q$2,,$O$2,$P$2)","v":310.88},{"$f":" RTD(\"cqg.rtd\",,\"StudyData\", $N$2, \"Bar\", \"\", \"Low\", $M$2, $F97, $R$2,$Q$2,,$O$2,$P$2)","v":310.64999999999998},{"$f":" RTD(\"cqg.rtd\",,\"StudyData\", $N$2, \"Bar\", \"\", \"Close\", $M$2, $F97, $R$2,$Q$2,,$O$2,$P$2)","v":310.8},-96,null,44183.631944444445,{"$f":"RTD(\"cqg.rtd\",,\"StudyData\",$N$2, \"Vol\", \"VolType=Auto,CoCType=Auto\", \"Vol\", $M$2, $F97, $R$2,$Q$2,,$O$2,$P$2)","v":153952}]
[{"$f":" RTD(\"cqg.rtd\",,\"StudyData\", $N$2, \"Bar\", \"\", \"Time\", $M$2, $F98,$R$2,$Q$2, \"\",\"False\")","v":44183.628472222219},{"$f":" RTD(\"cqg.rtd\",,\"StudyData\", $N$2, \"Bar\", \"\", \"Open\", $M$2, $F98, $R$2,$Q$2,,$O$2,$P$2)","v":310.77},{"$f":" RTD(\"cqg.rtd\",,\"StudyData\", $N$2, \"Bar\", \"\", \"High\", $M$2, $F98, $R$2,$Q$2,,$O$2,$P$2)","v":310.92},{"$f":" RTD(\"cqg.rtd\",,\"StudyData\", $N$2, \"Bar\", \"\", \"Low\", $M$2, $F98, $R$2,$Q$2,,$O$2,$P$2)","v":309.36},{"$f":" RTD(\"cqg.rtd\",,\"StudyData\", $N$2, \"Bar\", \"\", \"Close\", $M$2, $F98, $R$2,$Q$2,,$O$2,$P$2)","v":310.67},-97,null,44183.628472222219,{"$f":"RTD(\"cqg.rtd\",,\"StudyData\",$N$2, \"Vol\", \"VolType=Auto,CoCType=Auto\", \"Vol\", $M$2, $F98, $R$2,$Q$2,,$O$2,$P$2)","v":186214}]
[{"$f":" RTD(\"cqg.rtd\",,\"StudyData\", $N$2, \"Bar\", \"\", \"Time\", $M$2, $F99,$R$2,$Q$2, \"\",\"False\")","v":44183.625},{"$f":" RTD(\"cqg.rtd\",,\"StudyData\", $N$2, \"Bar\", \"\", \"Open\", $M$2, $F99, $R$2,$Q$2,,$O$2,$P$2)","v":309.87},{"$f":" RTD(\"cqg.rtd\",,\"StudyData\", $N$2, \"Bar\", \"\", \"High\", $M$2, $F99, $R$2,$Q$2,,$O$2,$P$2)","v":310.81},{"$f":" RTD(\"cqg.rtd\",,\"StudyData\", $N$2, \"Bar\", \"\", \"Low\", $M$2, $F99, $R$2,$Q$2,,$O$2,$P$2)","v":309.83999999999997},{"$f":" RTD(\"cqg.rtd\",,\"StudyData\", $N$2, \"Bar\", \"\", \"Close\", $M$2, $F99, $R$2,$Q$2,,$O$2,$P$2)","v":310.77},-98,null,44183.625,{"$f":"RTD(\"cqg.rtd\",,\"StudyData\",$N$2, \"Vol\", \"VolType=Auto,CoCType=Auto\", \"Vol\", $M$2, $F99, $R$2,$Q$2,,$O$2,$P$2)","v":763025}]
[{"$f":" RTD(\"cqg.rtd\",,\"StudyData\", $N$2, \"Bar\", \"\", \"Time\", $M$2, $F100,$R$2,$Q$2, \"\",\"False\")","v":44183.621527777781},{"$f":" RTD(\"cqg.rtd\",,\"StudyData\", $N$2, \"Bar\", \"\", \"Open\", $M$2, $F100, $R$2,$Q$2,,$O$2,$P$2)","v":309.58},{"$f":" RTD(\"cqg.rtd\",,\"StudyData\", $N$2, \"Bar\", \"\", \"High\", $M$2, $F100, $R$2,$Q$2,,$O$2,$P$2)","v":310.35000000000002},{"$f":" RTD(\"cqg.rtd\",,\"StudyData\", $N$2, \"Bar\", \"\", \"Low\", $M$2, $F100, $R$2,$Q$2,,$O$2,$P$2)","v":309.33},{"$f":" RTD(\"cqg.rtd\",,\"StudyData\", $N$2, \"Bar\", \"\", \"Close\", $M$2, $F100, $R$2,$Q$2,,$O$2,$P$2)","v":310.06},-99,null,44183.621527777781,{"$f":"RTD(\"cqg.rtd\",,\"StudyData\",$N$2, \"Vol\", \"VolType=Auto,CoCType=Auto\", \"Vol\", $M$2, $F100, $R$2,$Q$2,,$O$2,$P$2)","v":2661252}]
[{"$f":" RTD(\"cqg.rtd\",,\"StudyData\", $N$2, \"Bar\", \"\", \"Time\", $M$2, $F101,$R$2,$Q$2, \"\",\"False\")","v":44183.618055555555},{"$f":" RTD(\"cqg.rtd\",,\"StudyData\", $N$2, \"Bar\", \"\", \"Open\", $M$2, $F101, $R$2,$Q$2,,$O$2,$P$2)","v":308.33},{"$f":" RTD(\"cqg.rtd\",,\"StudyData\", $N$2, \"Bar\", \"\", \"High\", $M$2, $F101, $R$2,$Q$2,,$O$2,$P$2)","v":309.86},{"$f":" RTD(\"cqg.rtd\",,\"StudyData\", $N$2, \"Bar\", \"\", \"Low\", $M$2, $F101, $R$2,$Q$2,,$O$2,$P$2)","v":308.08},{"$f":" RTD(\"cqg.rtd\",,\"StudyData\", $N$2, \"Bar\", \"\", \"Close\", $M$2, $F101, $R$2,$Q$2,,$O$2,$P$2)","v":309.57},-100,null,44183.618055555555,{"$f":"RTD(\"cqg.rtd\",,\"StudyData\",$N$2, \"Vol\", \"VolType=Auto,CoCType=Auto\", \"Vol\", $M$2, $F101, $R$2,$Q$2,,$O$2,$P$2)","v":1856516}]
[{"$f":" RTD(\"cqg.rtd\",,\"StudyData\", $N$2, \"Bar\", \"\", \"Time\", $M$2, $F102,$R$2,$Q$2, \"\",\"False\")","v":44183.614583333336},{"$f":" RTD(\"cqg.rtd\",,\"StudyData\", $N$2, \"Bar\", \"\", \"Open\", $M$2, $F102, $R$2,$Q$2,,$O$2,$P$2)","v":308.29000000000002},{"$f":" RTD(\"cqg.rtd\",,\"StudyData\", $N$2, \"Bar\", \"\", \"High\", $M$2, $F102, $R$2,$Q$2,,$O$2,$P$2)","v":308.51},{"$f":" RTD(\"cqg.rtd\",,\"StudyData\", $N$2, \"Bar\", \"\", \"Low\", $M$2, $F102, $R$2,$Q$2,,$O$2,$P$2)","v":308.02999999999997},{"$f":" RTD(\"cqg.rtd\",,\"StudyData\", $N$2, \"Bar\", \"\", \"Close\", $M$2, $F102, $R$2,$Q$2,,$O$2,$P$2)","v":308.35000000000002},-101,null,44183.614583333336,{"$f":"RTD(\"cqg.rtd\",,\"StudyData\",$N$2, \"Vol\", \"VolType=Auto,CoCType=Auto\", \"Vol\", $M$2, $F102, $R$2,$Q$2,,$O$2,$P$2)","v":588611}]
[{"$f":" RTD(\"cqg.rtd\",,\"StudyData\", $N$2, \"Bar\", \"\", \"Time\", $M$2, $F103,$R$2,$Q$2, \"\",\"False\")","v":44183.611111111109},{"$f":" RTD(\"cqg.rtd\",,\"StudyData\", $N$2, \"Bar\", \"\", \"Open\", $M$2, $F103, $R$2,$Q$2,,$O$2,$P$2)","v":307.8},{"$f":" RTD(\"cqg.rtd\",,\"StudyData\", $N$2, \"Bar\", \"\", \"High\", $M$2, $F103, $R$2,$Q$2,,$O$2,$P$2)","v":308.33999999999997},{"$f":" RTD(\"cqg.rtd\",,\"StudyData\", $N$2, \"Bar\", \"\", \"Low\", $M$2, $F103, $R$2,$Q$2,,$O$2,$P$2)","v":307.61},{"$f":" RTD(\"cqg.rtd\",,\"StudyData\", $N$2, \"Bar\", \"\", \"Close\", $M$2, $F103, $R$2,$Q$2,,$O$2,$P$2)","v":308.27},-102,null,44183.611111111109,{"$f":"RTD(\"cqg.rtd\",,\"StudyData\",$N$2, \"Vol\", \"VolType=Auto,CoCType=Auto\", \"Vol\", $M$2, $F103, $R$2,$Q$2,,$O$2,$P$2)","v":923112}]
[{"$f":" RTD(\"cqg.rtd\",,\"StudyData\", $N$2, \"Bar\", \"\", \"Time\", $M$2, $F104,$R$2,$Q$2, \"\",\"False\")","v":44183.607638888891},{"$f":" RTD(\"cqg.rtd\",,\"StudyData\", $N$2, \"Bar\", \"\", \"Open\", $M$2, $F104, $R$2,$Q$2,,$O$2,$P$2)","v":308.37},{"$f":" RTD(\"cqg.rtd\",,\"StudyData\", $N$2, \"Bar\", \"\", \"High\", $M$2, $F104, $R$2,$Q$2,,$O$2,$P$2)","v":308.44},{"$f":" RTD(\"cqg.rtd\",,\"StudyData\", $N$2, \"Bar\", \"\", \"Low\", $M$2, $F104, $R$2,$Q$2,,$O$2,$P$2)","v":307.7},{"$f":" RTD(\"cqg.rtd\",,\"StudyData\", $N$2, \"Bar\", \"\", \"Close\", $M$2, $F104, $R$2,$Q$2,,$O$2,$P$2)","v":307.8},-103,null,44183.607638888891,{"$f":"RTD(\"cqg.rtd\",,\"StudyData\",$N$2, \"Vol\", \"VolType=Auto,CoCType=Auto\", \"Vol\", $M$2, $F104, $R$2,$Q$2,,$O$2,$P$2)","v":892151}]
[{"$f":" RTD(\"cqg.rtd\",,\"StudyData\", $N$2, \"Bar\", \"\", \"Time\", $M$2, $F105,$R$2,$Q$2, \"\",\"False\")","v":44183.604166666664},{"$f":" RTD(\"cqg.rtd\",,\"StudyData\", $N$2, \"Bar\", \"\", \"Open\", $M$2, $F105, $R$2,$Q$2,,$O$2,$P$2)","v":308.26},{"$f":" RTD(\"cqg.rtd\",,\"StudyData\", $N$2, \"Bar\", \"\", \"High\", $M$2, $F105, $R$2,$Q$2,,$O$2,$P$2)","v":308.62},{"$f":" RTD(\"cqg.rtd\",,\"StudyData\", $N$2, \"Bar\", \"\", \"Low\", $M$2, $F105, $R$2,$Q$2,,$O$2,$P$2)","v":307.99},{"$f":" RTD(\"cqg.rtd\",,\"StudyData\", $N$2, \"Bar\", \"\", \"Close\", $M$2, $F105, $R$2,$Q$2,,$O$2,$P$2)","v":308.36},-104,null,44183.604166666664,{"$f":"RTD(\"cqg.rtd\",,\"StudyData\",$N$2, \"Vol\", \"VolType=Auto,CoCType=Auto\", \"Vol\", $M$2, $F105, $R$2,$Q$2,,$O$2,$P$2)","v":595166}]
[{"$f":" RTD(\"cqg.rtd\",,\"StudyData\", $N$2, \"Bar\", \"\", \"Time\", $M$2, $F106,$R$2,$Q$2, \"\",\"False\")","v":44183.600694444445},{"$f":" RTD(\"cqg.rtd\",,\"StudyData\", $N$2, \"Bar\", \"\", \"Open\", $M$2, $F106, $R$2,$Q$2,,$O$2,$P$2)","v":308.3},{"$f":" RTD(\"cqg.rtd\",,\"StudyData\", $N$2, \"Bar\", \"\", \"High\", $M$2, $F106, $R$2,$Q$2,,$O$2,$P$2)","v":308.36},{"$f":" RTD(\"cqg.rtd\",,\"StudyData\", $N$2, \"Bar\", \"\", \"Low\", $M$2, $F106, $R$2,$Q$2,,$O$2,$P$2)","v":307.82},{"$f":" RTD(\"cqg.rtd\",,\"StudyData\", $N$2, \"Bar\", \"\", \"Close\", $M$2, $F106, $R$2,$Q$2,,$O$2,$P$2)","v":308.25},-105,null,44183.600694444445,{"$f":"RTD(\"cqg.rtd\",,\"StudyData\",$N$2, \"Vol\", \"VolType=Auto,CoCType=Auto\", \"Vol\", $M$2, $F106, $R$2,$Q$2,,$O$2,$P$2)","v":459407}]
[{"$f":" RTD(\"cqg.rtd\",,\"StudyData\", $N$2, \"Bar\", \"\", \"Time\", $M$2, $F107,$R$2,$Q$2, \"\",\"False\")","v":44183.597222222219},{"$f":" RTD(\"cqg.rtd\",,\"StudyData\", $N$2, \"Bar\", \"\", \"Open\", $M$2, $F107, $R$2,$Q$2,,$O$2,$P$2)","v":308.67},{"$f":" RTD(\"cqg.rtd\",,\"StudyData\", $N$2, \"Bar\", \"\", \"High\", $M$2, $F107, $R$2,$Q$2,,$O$2,$P$2)","v":308.7},{"$f":" RTD(\"cqg.rtd\",,\"StudyData\", $N$2, \"Bar\", \"\", \"Low\", $M$2, $F107, $R$2,$Q$2,,$O$2,$P$2)","v":308.12},{"$f":" RTD(\"cqg.rtd\",,\"StudyData\", $N$2, \"Bar\", \"\", \"Close\", $M$2, $F107, $R$2,$Q$2,,$O$2,$P$2)","v":308.27},-106,null,44183.597222222219,{"$f":"RTD(\"cqg.rtd\",,\"StudyData\",$N$2, \"Vol\", \"VolType=Auto,CoCType=Auto\", \"Vol\", $M$2, $F107, $R$2,$Q$2,,$O$2,$P$2)","v":332117}]
[{"$f":" RTD(\"cqg.rtd\",,\"StudyData\", $N$2, \"Bar\", \"\", \"Time\", $M$2, $F108,$R$2,$Q$2, \"\",\"False\")","v":44183.59375},{"$f":" RTD(\"cqg.rtd\",,\"StudyData\", $N$2, \"Bar\", \"\", \"Open\", $M$2, $F108, $R$2,$Q$2,,$O$2,$P$2)","v":308.66000000000003},{"$f":" RTD(\"cqg.rtd\",,\"StudyData\", $N$2, \"Bar\", \"\", \"High\", $M$2, $F108, $R$2,$Q$2,,$O$2,$P$2)","v":308.93},{"$f":" RTD(\"cqg.rtd\",,\"StudyData\", $N$2, \"Bar\", \"\", \"Low\", $M$2, $F108, $R$2,$Q$2,,$O$2,$P$2)","v":308.52},{"$f":" RTD(\"cqg.rtd\",,\"StudyData\", $N$2, \"Bar\", \"\", \"Close\", $M$2, $F108, $R$2,$Q$2,,$O$2,$P$2)","v":308.68},-107,null,44183.59375,{"$f":"RTD(\"cqg.rtd\",,\"StudyData\",$N$2, \"Vol\", \"VolType=Auto,CoCType=Auto\", \"Vol\", $M$2, $F108, $R$2,$Q$2,,$O$2,$P$2)","v":204217}]
[{"$f":" RTD(\"cqg.rtd\",,\"StudyData\", $N$2, \"Bar\", \"\", \"Time\", $M$2, $F109,$R$2,$Q$2, \"\",\"False\")","v":44183.590277777781},{"$f":" RTD(\"cqg.rtd\",,\"StudyData\", $N$2, \"Bar\", \"\", \"Open\", $M$2, $F109, $R$2,$Q$2,,$O$2,$P$2)","v":308.68},{"$f":" RTD(\"cqg.rtd\",,\"StudyData\", $N$2, \"Bar\", \"\", \"High\", $M$2, $F109, $R$2,$Q$2,,$O$2,$P$2)","v":308.72000000000003},{"$f":" RTD(\"cqg.rtd\",,\"StudyData\", $N$2, \"Bar\", \"\", \"Low\", $M$2, $F109, $R$2,$Q$2,,$O$2,$P$2)","v":308.43},{"$f":" RTD(\"cqg.rtd\",,\"StudyData\", $N$2, \"Bar\", \"\", \"Close\", $M$2, $F109, $R$2,$Q$2,,$O$2,$P$2)","v":308.64999999999998},-108,null,44183.590277777781,{"$f":"RTD(\"cqg.rtd\",,\"StudyData\",$N$2, \"Vol\", \"VolType=Auto,CoCType=Auto\", \"Vol\", $M$2, $F109, $R$2,$Q$2,,$O$2,$P$2)","v":180020}]
[{"$f":" RTD(\"cqg.rtd\",,\"StudyData\", $N$2, \"Bar\", \"\", \"Time\", $M$2, $F110,$R$2,$Q$2, \"\",\"False\")","v":44183.586805555555},{"$f":" RTD(\"cqg.rtd\",,\"StudyData\", $N$2, \"Bar\", \"\", \"Open\", $M$2, $F110, $R$2,$Q$2,,$O$2,$P$2)","v":308.51},{"$f":" RTD(\"cqg.rtd\",,\"StudyData\", $N$2, \"Bar\", \"\", \"High\", $M$2, $F110, $R$2,$Q$2,,$O$2,$P$2)","v":308.87},{"$f":" RTD(\"cqg.rtd\",,\"StudyData\", $N$2, \"Bar\", \"\", \"Low\", $M$2, $F110, $R$2,$Q$2,,$O$2,$P$2)","v":308.48},{"$f":" RTD(\"cqg.rtd\",,\"StudyData\", $N$2, \"Bar\", \"\", \"Close\", $M$2, $F110, $R$2,$Q$2,,$O$2,$P$2)","v":308.69},-109,null,44183.586805555555,{"$f":"RTD(\"cqg.rtd\",,\"StudyData\",$N$2, \"Vol\", \"VolType=Auto,CoCType=Auto\", \"Vol\", $M$2, $F110, $R$2,$Q$2,,$O$2,$P$2)","v":307654}]
[{"$f":" RTD(\"cqg.rtd\",,\"StudyData\", $N$2, \"Bar\", \"\", \"Time\", $M$2, $F111,$R$2,$Q$2, \"\",\"False\")","v":44183.583333333336},{"$f":" RTD(\"cqg.rtd\",,\"StudyData\", $N$2, \"Bar\", \"\", \"Open\", $M$2, $F111, $R$2,$Q$2,,$O$2,$P$2)","v":308.91000000000003},{"$f":" RTD(\"cqg.rtd\",,\"StudyData\", $N$2, \"Bar\", \"\", \"High\", $M$2, $F111, $R$2,$Q$2,,$O$2,$P$2)","v":309.07},{"$f":" RTD(\"cqg.rtd\",,\"StudyData\", $N$2, \"Bar\", \"\", \"Low\", $M$2, $F111, $R$2,$Q$2,,$O$2,$P$2)","v":308.45999999999998},{"$f":" RTD(\"cqg.rtd\",,\"StudyData\", $N$2, \"Bar\", \"\", \"Close\", $M$2, $F111, $R$2,$Q$2,,$O$2,$P$2)","v":308.52},-110,null,44183.583333333336,{"$f":"RTD(\"cqg.rtd\",,\"StudyData\",$N$2, \"Vol\", \"VolType=Auto,CoCType=Auto\", \"Vol\", $M$2, $F111, $R$2,$Q$2,,$O$2,$P$2)","v":221576}]
[{"$f":" RTD(\"cqg.rtd\",,\"StudyData\", $N$2, \"Bar\", \"\", \"Time\", $M$2, $F112,$R$2,$Q$2, \"\",\"False\")","v":44183.579861111109},{"$f":" RTD(\"cqg.rtd\",,\"StudyData\", $N$2, \"Bar\", \"\", \"Open\", $M$2, $F112, $R$2,$Q$2,,$O$2,$P$2)","v":309.23},{"$f":" RTD(\"cqg.rtd\",,\"StudyData\", $N$2, \"Bar\", \"\", \"High\", $M$2, $F112, $R$2,$Q$2,,$O$2,$P$2)","v":309.27},{"$f":" RTD(\"cqg.rtd\",,\"StudyData\", $N$2, \"Bar\", \"\", \"Low\", $M$2, $F112, $R$2,$Q$2,,$O$2,$P$2)","v":308.64},{"$f":" RTD(\"cqg.rtd\",,\"StudyData\", $N$2, \"Bar\", \"\", \"Close\", $M$2, $F112, $R$2,$Q$2,,$O$2,$P$2)","v":308.91000000000003},-111,null,44183.579861111109,{"$f":"RTD(\"cqg.rtd\",,\"StudyData\",$N$2, \"Vol\", \"VolType=Auto,CoCType=Auto\", \"Vol\", $M$2, $F112, $R$2,$Q$2,,$O$2,$P$2)","v":292010}]
[{"$f":" RTD(\"cqg.rtd\",,\"StudyData\", $N$2, \"Bar\", \"\", \"Time\", $M$2, $F113,$R$2,$Q$2, \"\",\"False\")","v":44183.576388888891},{"$f":" RTD(\"cqg.rtd\",,\"StudyData\", $N$2, \"Bar\", \"\", \"Open\", $M$2, $F113, $R$2,$Q$2,,$O$2,$P$2)","v":309.49},{"$f":" RTD(\"cqg.rtd\",,\"StudyData\", $N$2, \"Bar\", \"\", \"High\", $M$2, $F113, $R$2,$Q$2,,$O$2,$P$2)","v":309.51},{"$f":" RTD(\"cqg.rtd\",,\"StudyData\", $N$2, \"Bar\", \"\", \"Low\", $M$2, $F113, $R$2,$Q$2,,$O$2,$P$2)","v":309.17},{"$f":" RTD(\"cqg.rtd\",,\"StudyData\", $N$2, \"Bar\", \"\", \"Close\", $M$2, $F113, $R$2,$Q$2,,$O$2,$P$2)","v":309.20999999999998},-112,null,44183.576388888891,{"$f":"RTD(\"cqg.rtd\",,\"StudyData\",$N$2, \"Vol\", \"VolType=Auto,CoCType=Auto\", \"Vol\", $M$2, $F113, $R$2,$Q$2,,$O$2,$P$2)","v":235478}]
[{"$f":" RTD(\"cqg.rtd\",,\"StudyData\", $N$2, \"Bar\", \"\", \"Time\", $M$2, $F114,$R$2,$Q$2, \"\",\"False\")","v":44183.572916666664},{"$f":" RTD(\"cqg.rtd\",,\"StudyData\", $N$2, \"Bar\", \"\", \"Open\", $M$2, $F114, $R$2,$Q$2,,$O$2,$P$2)","v":309.47000000000003},{"$f":" RTD(\"cqg.rtd\",,\"StudyData\", $N$2, \"Bar\", \"\", \"High\", $M$2, $F114, $R$2,$Q$2,,$O$2,$P$2)","v":309.55},{"$f":" RTD(\"cqg.rtd\",,\"StudyData\", $N$2, \"Bar\", \"\", \"Low\", $M$2, $F114, $R$2,$Q$2,,$O$2,$P$2)","v":309.31},{"$f":" RTD(\"cqg.rtd\",,\"StudyData\", $N$2, \"Bar\", \"\", \"Close\", $M$2, $F114, $R$2,$Q$2,,$O$2,$P$2)","v":309.51},-113,null,44183.572916666664,{"$f":"RTD(\"cqg.rtd\",,\"StudyData\",$N$2, \"Vol\", \"VolType=Auto,CoCType=Auto\", \"Vol\", $M$2, $F114, $R$2,$Q$2,,$O$2,$P$2)","v":201511}]
[{"$f":" RTD(\"cqg.rtd\",,\"StudyData\", $N$2, \"Bar\", \"\", \"Time\", $M$2, $F115,$R$2,$Q$2, \"\",\"False\")","v":44183.569444444445},{"$f":" RTD(\"cqg.rtd\",,\"StudyData\", $N$2, \"Bar\", \"\", \"Open\", $M$2, $F115, $R$2,$Q$2,,$O$2,$P$2)","v":309.51},{"$f":" RTD(\"cqg.rtd\",,\"StudyData\", $N$2, \"Bar\", \"\", \"High\", $M$2, $F115, $R$2,$Q$2,,$O$2,$P$2)","v":309.58999999999997},{"$f":" RTD(\"cqg.rtd\",,\"StudyData\", $N$2, \"Bar\", \"\", \"Low\", $M$2, $F115, $R$2,$Q$2,,$O$2,$P$2)","v":309.37},{"$f":" RTD(\"cqg.rtd\",,\"StudyData\", $N$2, \"Bar\", \"\", \"Close\", $M$2, $F115, $R$2,$Q$2,,$O$2,$P$2)","v":309.48},-114,null,44183.569444444445,{"$f":"RTD(\"cqg.rtd\",,\"StudyData\",$N$2, \"Vol\", \"VolType=Auto,CoCType=Auto\", \"Vol\", $M$2, $F115, $R$2,$Q$2,,$O$2,$P$2)","v":76086}]
[{"$f":" RTD(\"cqg.rtd\",,\"StudyData\", $N$2, \"Bar\", \"\", \"Time\", $M$2, $F116,$R$2,$Q$2, \"\",\"False\")","v":44183.565972222219},{"$f":" RTD(\"cqg.rtd\",,\"StudyData\", $N$2, \"Bar\", \"\", \"Open\", $M$2, $F116, $R$2,$Q$2,,$O$2,$P$2)","v":309.45999999999998},{"$f":" RTD(\"cqg.rtd\",,\"StudyData\", $N$2, \"Bar\", \"\", \"High\", $M$2, $F116, $R$2,$Q$2,,$O$2,$P$2)","v":309.67},{"$f":" RTD(\"cqg.rtd\",,\"StudyData\", $N$2, \"Bar\", \"\", \"Low\", $M$2, $F116, $R$2,$Q$2,,$O$2,$P$2)","v":309.45},{"$f":" RTD(\"cqg.rtd\",,\"StudyData\", $N$2, \"Bar\", \"\", \"Close\", $M$2, $F116, $R$2,$Q$2,,$O$2,$P$2)","v":309.51},-115,null,44183.565972222219,{"$f":"RTD(\"cqg.rtd\",,\"StudyData\",$N$2, \"Vol\", \"VolType=Auto,CoCType=Auto\", \"Vol\", $M$2, $F116, $R$2,$Q$2,,$O$2,$P$2)","v":128400}]
[{"$f":" RTD(\"cqg.rtd\",,\"StudyData\", $N$2, \"Bar\", \"\", \"Time\", $M$2, $F117,$R$2,$Q$2, \"\",\"False\")","v":44183.5625},{"$f":" RTD(\"cqg.rtd\",,\"StudyData\", $N$2, \"Bar\", \"\", \"Open\", $M$2, $F117, $R$2,$Q$2,,$O$2,$P$2)","v":309.20999999999998},{"$f":" RTD(\"cqg.rtd\",,\"StudyData\", $N$2, \"Bar\", \"\", \"High\", $M$2, $F117, $R$2,$Q$2,,$O$2,$P$2)","v":309.47000000000003},{"$f":" RTD(\"cqg.rtd\",,\"StudyData\", $N$2, \"Bar\", \"\", \"Low\", $M$2, $F117, $R$2,$Q$2,,$O$2,$P$2)","v":309.18},{"$f":" RTD(\"cqg.rtd\",,\"StudyData\", $N$2, \"Bar\", \"\", \"Close\", $M$2, $F117, $R$2,$Q$2,,$O$2,$P$2)","v":309.47000000000003},-116,null,44183.5625,{"$f":"RTD(\"cqg.rtd\",,\"StudyData\",$N$2, \"Vol\", \"VolType=Auto,CoCType=Auto\", \"Vol\", $M$2, $F117, $R$2,$Q$2,,$O$2,$P$2)","v":118172}]
[{"$f":" RTD(\"cqg.rtd\",,\"StudyData\", $N$2, \"Bar\", \"\", \"Time\", $M$2, $F118,$R$2,$Q$2, \"\",\"False\")","v":44183.559027777781},{"$f":" RTD(\"cqg.rtd\",,\"StudyData\", $N$2, \"Bar\", \"\", \"Open\", $M$2, $F118, $R$2,$Q$2,,$O$2,$P$2)","v":309.14},{"$f":" RTD(\"cqg.rtd\",,\"StudyData\", $N$2, \"Bar\", \"\", \"High\", $M$2, $F118, $R$2,$Q$2,,$O$2,$P$2)","v":309.25},{"$f":" RTD(\"cqg.rtd\",,\"StudyData\", $N$2, \"Bar\", \"\", \"Low\", $M$2, $F118, $R$2,$Q$2,,$O$2,$P$2)","v":309.07},{"$f":" RTD(\"cqg.rtd\",,\"StudyData\", $N$2, \"Bar\", \"\", \"Close\", $M$2, $F118, $R$2,$Q$2,,$O$2,$P$2)","v":309.2},-117,null,44183.559027777781,{"$f":"RTD(\"cqg.rtd\",,\"StudyData\",$N$2, \"Vol\", \"VolType=Auto,CoCType=Auto\", \"Vol\", $M$2, $F118, $R$2,$Q$2,,$O$2,$P$2)","v":52398}]
[{"$f":" RTD(\"cqg.rtd\",,\"StudyData\", $N$2, \"Bar\", \"\", \"Time\", $M$2, $F119,$R$2,$Q$2, \"\",\"False\")","v":44183.555555555555},{"$f":" RTD(\"cqg.rtd\",,\"StudyData\", $N$2, \"Bar\", \"\", \"Open\", $M$2, $F119, $R$2,$Q$2,,$O$2,$P$2)","v":309.06},{"$f":" RTD(\"cqg.rtd\",,\"StudyData\", $N$2, \"Bar\", \"\", \"High\", $M$2, $F119, $R$2,$Q$2,,$O$2,$P$2)","v":309.29000000000002},{"$f":" RTD(\"cqg.rtd\",,\"StudyData\", $N$2, \"Bar\", \"\", \"Low\", $M$2, $F119, $R$2,$Q$2,,$O$2,$P$2)","v":309.06},{"$f":" RTD(\"cqg.rtd\",,\"StudyData\", $N$2, \"Bar\", \"\", \"Close\", $M$2, $F119, $R$2,$Q$2,,$O$2,$P$2)","v":309.13},-118,null,44183.555555555555,{"$f":"RTD(\"cqg.rtd\",,\"StudyData\",$N$2, \"Vol\", \"VolType=Auto,CoCType=Auto\", \"Vol\", $M$2, $F119, $R$2,$Q$2,,$O$2,$P$2)","v":123676}]
[{"$f":" RTD(\"cqg.rtd\",,\"StudyData\", $N$2, \"Bar\", \"\", \"Time\", $M$2, $F120,$R$2,$Q$2, \"\",\"False\")","v":44183.552083333336},{"$f":" RTD(\"cqg.rtd\",,\"StudyData\", $N$2, \"Bar\", \"\", \"Open\", $M$2, $F120, $R$2,$Q$2,,$O$2,$P$2)","v":309.19},{"$f":" RTD(\"cqg.rtd\",,\"StudyData\", $N$2, \"Bar\", \"\", \"High\", $M$2, $F120, $R$2,$Q$2,,$O$2,$P$2)","v":309.2},{"$f":" RTD(\"cqg.rtd\",,\"StudyData\", $N$2, \"Bar\", \"\", \"Low\", $M$2, $F120, $R$2,$Q$2,,$O$2,$P$2)","v":308.89999999999998},{"$f":" RTD(\"cqg.rtd\",,\"StudyData\", $N$2, \"Bar\", \"\", \"Close\", $M$2, $F120, $R$2,$Q$2,,$O$2,$P$2)","v":309.05},-119,null,44183.552083333336,{"$f":"RTD(\"cqg.rtd\",,\"StudyData\",$N$2, \"Vol\", \"VolType=Auto,CoCType=Auto\", \"Vol\", $M$2, $F120, $R$2,$Q$2,,$O$2,$P$2)","v":202653}]
[{"$f":" RTD(\"cqg.rtd\",,\"StudyData\", $N$2, \"Bar\", \"\", \"Time\", $M$2, $F121,$R$2,$Q$2, \"\",\"False\")","v":44183.548611111109},{"$f":" RTD(\"cqg.rtd\",,\"StudyData\", $N$2, \"Bar\", \"\", \"Open\", $M$2, $F121, $R$2,$Q$2,,$O$2,$P$2)","v":309.33},{"$f":" RTD(\"cqg.rtd\",,\"StudyData\", $N$2, \"Bar\", \"\", \"High\", $M$2, $F121, $R$2,$Q$2,,$O$2,$P$2)","v":309.33999999999997},{"$f":" RTD(\"cqg.rtd\",,\"StudyData\", $N$2, \"Bar\", \"\", \"Low\", $M$2, $F121, $R$2,$Q$2,,$O$2,$P$2)","v":309.05},{"$f":" RTD(\"cqg.rtd\",,\"StudyData\", $N$2, \"Bar\", \"\", \"Close\", $M$2, $F121, $R$2,$Q$2,,$O$2,$P$2)","v":309.2},-120,null,44183.548611111109,{"$f":"RTD(\"cqg.rtd\",,\"StudyData\",$N$2, \"Vol\", \"VolType=Auto,CoCType=Auto\", \"Vol\", $M$2, $F121, $R$2,$Q$2,,$O$2,$P$2)","v":117462}]
[{"$f":" RTD(\"cqg.rtd\",,\"StudyData\", $N$2, \"Bar\", \"\", \"Time\", $M$2, $F122,$R$2,$Q$2, \"\",\"False\")","v":44183.545138888891},{"$f":" RTD(\"cqg.rtd\",,\"StudyData\", $N$2, \"Bar\", \"\", \"Open\", $M$2, $F122, $R$2,$Q$2,,$O$2,$P$2)","v":309.2},{"$f":" RTD(\"cqg.rtd\",,\"StudyData\", $N$2, \"Bar\", \"\", \"High\", $M$2, $F122, $R$2,$Q$2,,$O$2,$P$2)","v":309.43},{"$f":" RTD(\"cqg.rtd\",,\"StudyData\", $N$2, \"Bar\", \"\", \"Low\", $M$2, $F122, $R$2,$Q$2,,$O$2,$P$2)","v":309.19},{"$f":" RTD(\"cqg.rtd\",,\"StudyData\", $N$2, \"Bar\", \"\", \"Close\", $M$2, $F122, $R$2,$Q$2,,$O$2,$P$2)","v":309.31},-121,null,44183.545138888891,{"$f":"RTD(\"cqg.rtd\",,\"StudyData\",$N$2, \"Vol\", \"VolType=Auto,CoCType=Auto\", \"Vol\", $M$2, $F122, $R$2,$Q$2,,$O$2,$P$2)","v":133478}]
[{"$f":" RTD(\"cqg.rtd\",,\"StudyData\", $N$2, \"Bar\", \"\", \"Time\", $M$2, $F123,$R$2,$Q$2, \"\",\"False\")","v":44183.541666666664},{"$f":" RTD(\"cqg.rtd\",,\"StudyData\", $N$2, \"Bar\", \"\", \"Open\", $M$2, $F123, $R$2,$Q$2,,$O$2,$P$2)","v":309.60000000000002},{"$f":" RTD(\"cqg.rtd\",,\"StudyData\", $N$2, \"Bar\", \"\", \"High\", $M$2, $F123, $R$2,$Q$2,,$O$2,$P$2)","v":309.64},{"$f":" RTD(\"cqg.rtd\",,\"StudyData\", $N$2, \"Bar\", \"\", \"Low\", $M$2, $F123, $R$2,$Q$2,,$O$2,$P$2)","v":309.14},{"$f":" RTD(\"cqg.rtd\",,\"StudyData\", $N$2, \"Bar\", \"\", \"Close\", $M$2, $F123, $R$2,$Q$2,,$O$2,$P$2)","v":309.2},-122,null,44183.541666666664,{"$f":"RTD(\"cqg.rtd\",,\"StudyData\",$N$2, \"Vol\", \"VolType=Auto,CoCType=Auto\", \"Vol\", $M$2, $F123, $R$2,$Q$2,,$O$2,$P$2)","v":128290}]
[{"$f":" RTD(\"cqg.rtd\",,\"StudyData\", $N$2, \"Bar\", \"\", \"Time\", $M$2, $F124,$R$2,$Q$2, \"\",\"False\")","v":44183.538194444445},{"$f":" RTD(\"cqg.rtd\",,\"StudyData\", $N$2, \"Bar\", \"\", \"Open\", $M$2, $F124, $R$2,$Q$2,,$O$2,$P$2)","v":309.44},{"$f":" RTD(\"cqg.rtd\",,\"StudyData\", $N$2, \"Bar\", \"\", \"High\", $M$2, $F124, $R$2,$Q$2,,$O$2,$P$2)","v":309.64},{"$f":" RTD(\"cqg.rtd\",,\"StudyData\", $N$2, \"Bar\", \"\", \"Low\", $M$2, $F124, $R$2,$Q$2,,$O$2,$P$2)","v":309.38},{"$f":" RTD(\"cqg.rtd\",,\"StudyData\", $N$2, \"Bar\", \"\", \"Close\", $M$2, $F124, $R$2,$Q$2,,$O$2,$P$2)","v":309.63},-123,null,44183.538194444445,{"$f":"RTD(\"cqg.rtd\",,\"StudyData\",$N$2, \"Vol\", \"VolType=Auto,CoCType=Auto\", \"Vol\", $M$2, $F124, $R$2,$Q$2,,$O$2,$P$2)","v":107069}]
[{"$f":" RTD(\"cqg.rtd\",,\"StudyData\", $N$2, \"Bar\", \"\", \"Time\", $M$2, $F125,$R$2,$Q$2, \"\",\"False\")","v":44183.534722222219},{"$f":" RTD(\"cqg.rtd\",,\"StudyData\", $N$2, \"Bar\", \"\", \"Open\", $M$2, $F125, $R$2,$Q$2,,$O$2,$P$2)","v":309.48},{"$f":" RTD(\"cqg.rtd\",,\"StudyData\", $N$2, \"Bar\", \"\", \"High\", $M$2, $F125, $R$2,$Q$2,,$O$2,$P$2)","v":309.54000000000002},{"$f":" RTD(\"cqg.rtd\",,\"StudyData\", $N$2, \"Bar\", \"\", \"Low\", $M$2, $F125, $R$2,$Q$2,,$O$2,$P$2)","v":309.39},{"$f":" RTD(\"cqg.rtd\",,\"StudyData\", $N$2, \"Bar\", \"\", \"Close\", $M$2, $F125, $R$2,$Q$2,,$O$2,$P$2)","v":309.45999999999998},-124,null,44183.534722222219,{"$f":"RTD(\"cqg.rtd\",,\"StudyData\",$N$2, \"Vol\", \"VolType=Auto,CoCType=Auto\", \"Vol\", $M$2, $F125, $R$2,$Q$2,,$O$2,$P$2)","v":79066}]
[{"$f":" RTD(\"cqg.rtd\",,\"StudyData\", $N$2, \"Bar\", \"\", \"Time\", $M$2, $F126,$R$2,$Q$2, \"\",\"False\")","v":44183.53125},{"$f":" RTD(\"cqg.rtd\",,\"StudyData\", $N$2, \"Bar\", \"\", \"Open\", $M$2, $F126, $R$2,$Q$2,,$O$2,$P$2)","v":309.49},{"$f":" RTD(\"cqg.rtd\",,\"StudyData\", $N$2, \"Bar\", \"\", \"High\", $M$2, $F126, $R$2,$Q$2,,$O$2,$P$2)","v":309.60000000000002},{"$f":" RTD(\"cqg.rtd\",,\"StudyData\", $N$2, \"Bar\", \"\", \"Low\", $M$2, $F126, $R$2,$Q$2,,$O$2,$P$2)","v":309.43},{"$f":" RTD(\"cqg.rtd\",,\"StudyData\", $N$2, \"Bar\", \"\", \"Close\", $M$2, $F126, $R$2,$Q$2,,$O$2,$P$2)","v":309.49},-125,null,44183.53125,{"$f":"RTD(\"cqg.rtd\",,\"StudyData\",$N$2, \"Vol\", \"VolType=Auto,CoCType=Auto\", \"Vol\", $M$2, $F126, $R$2,$Q$2,,$O$2,$P$2)","v":101443}]
[{"$f":" RTD(\"cqg.rtd\",,\"StudyData\", $N$2, \"Bar\", \"\", \"Time\", $M$2, $F127,$R$2,$Q$2, \"\",\"False\")","v":44183.527777777781},{"$f":" RTD(\"cqg.rtd\",,\"StudyData\", $N$2, \"Bar\", \"\", \"Open\", $M$2, $F127, $R$2,$Q$2,,$O$2,$P$2)","v":309.26},{"$f":" RTD(\"cqg.rtd\",,\"StudyData\", $N$2, \"Bar\", \"\", \"High\", $M$2, $F127, $R$2,$Q$2,,$O$2,$P$2)","v":309.55},{"$f":" RTD(\"cqg.rtd\",,\"StudyData\", $N$2, \"Bar\", \"\", \"Low\", $M$2, $F127, $R$2,$Q$2,,$O$2,$P$2)","v":309.24},{"$f":" RTD(\"cqg.rtd\",,\"StudyData\", $N$2, \"Bar\", \"\", \"Close\", $M$2, $F127, $R$2,$Q$2,,$O$2,$P$2)","v":309.49},-126,null,44183.527777777781,{"$f":"RTD(\"cqg.rtd\",,\"StudyData\",$N$2, \"Vol\", \"VolType=Auto,CoCType=Auto\", \"Vol\", $M$2, $F127, $R$2,$Q$2,,$O$2,$P$2)","v":164035}]
[{"$f":" RTD(\"cqg.rtd\",,\"StudyData\", $N$2, \"Bar\", \"\", \"Time\", $M$2, $F128,$R$2,$Q$2, \"\",\"False\")","v":44183.524305555555},{"$f":" RTD(\"cqg.rtd\",,\"StudyData\", $N$2, \"Bar\", \"\", \"Open\", $M$2, $F128, $R$2,$Q$2,,$O$2,$P$2)","v":309.67},{"$f":" RTD(\"cqg.rtd\",,\"StudyData\", $N$2, \"Bar\", \"\", \"High\", $M$2, $F128, $R$2,$Q$2,,$O$2,$P$2)","v":309.79000000000002},{"$f":" RTD(\"cqg.rtd\",,\"StudyData\", $N$2, \"Bar\", \"\", \"Low\", $M$2, $F128, $R$2,$Q$2,,$O$2,$P$2)","v":309.26},{"$f":" RTD(\"cqg.rtd\",,\"StudyData\", $N$2, \"Bar\", \"\", \"Close\", $M$2, $F128, $R$2,$Q$2,,$O$2,$P$2)","v":309.27},-127,null,44183.524305555555,{"$f":"RTD(\"cqg.rtd\",,\"StudyData\",$N$2, \"Vol\", \"VolType=Auto,CoCType=Auto\", \"Vol\", $M$2, $F128, $R$2,$Q$2,,$O$2,$P$2)","v":148596}]
[{"$f":" RTD(\"cqg.rtd\",,\"StudyData\", $N$2, \"Bar\", \"\", \"Time\", $M$2, $F129,$R$2,$Q$2, \"\",\"False\")","v":44183.520833333336},{"$f":" RTD(\"cqg.rtd\",,\"StudyData\", $N$2, \"Bar\", \"\", \"Open\", $M$2, $F129, $R$2,$Q$2,,$O$2,$P$2)","v":309.85000000000002},{"$f":" RTD(\"cqg.rtd\",,\"StudyData\", $N$2, \"Bar\", \"\", \"High\", $M$2, $F129, $R$2,$Q$2,,$O$2,$P$2)","v":309.85000000000002},{"$f":" RTD(\"cqg.rtd\",,\"StudyData\", $N$2, \"Bar\", \"\", \"Low\", $M$2, $F129, $R$2,$Q$2,,$O$2,$P$2)","v":309.5},{"$f":" RTD(\"cqg.rtd\",,\"StudyData\", $N$2, \"Bar\", \"\", \"Close\", $M$2, $F129, $R$2,$Q$2,,$O$2,$P$2)","v":309.66000000000003},-128,null,44183.520833333336,{"$f":"RTD(\"cqg.rtd\",,\"StudyData\",$N$2, \"Vol\", \"VolType=Auto,CoCType=Auto\", \"Vol\", $M$2, $F129, $R$2,$Q$2,,$O$2,$P$2)","v":130104}]
[{"$f":" RTD(\"cqg.rtd\",,\"StudyData\", $N$2, \"Bar\", \"\", \"Time\", $M$2, $F130,$R$2,$Q$2, \"\",\"False\")","v":44183.517361111109},{"$f":" RTD(\"cqg.rtd\",,\"StudyData\", $N$2, \"Bar\", \"\", \"Open\", $M$2, $F130, $R$2,$Q$2,,$O$2,$P$2)","v":309.7},{"$f":" RTD(\"cqg.rtd\",,\"StudyData\", $N$2, \"Bar\", \"\", \"High\", $M$2, $F130, $R$2,$Q$2,,$O$2,$P$2)","v":309.89999999999998},{"$f":" RTD(\"cqg.rtd\",,\"StudyData\", $N$2, \"Bar\", \"\", \"Low\", $M$2, $F130, $R$2,$Q$2,,$O$2,$P$2)","v":309.64999999999998},{"$f":" RTD(\"cqg.rtd\",,\"StudyData\", $N$2, \"Bar\", \"\", \"Close\", $M$2, $F130, $R$2,$Q$2,,$O$2,$P$2)","v":309.83999999999997},-129,null,{"$f":"A130","v":44183.517361111109},{"$f":"RTD(\"cqg.rtd\",,\"StudyData\",$N$2, \"Vol\", \"VolType=Auto,CoCType=Auto\", \"Vol\", $M$2, $F130, $R$2,$Q$2,,$O$2,$P$2)","v":78780}]
[{"$f":" RTD(\"cqg.rtd\",,\"StudyData\", $N$2, \"Bar\", \"\", \"Time\", $M$2, $F131,$R$2,$Q$2, \"\",\"False\")","v":44183.513888888891},{"$f":" RTD(\"cqg.rtd\",,\"StudyData\", $N$2, \"Bar\", \"\", \"Open\", $M$2, $F131, $R$2,$Q$2,,$O$2,$P$2)","v":310.17},{"$f":" RTD(\"cqg.rtd\",,\"StudyData\", $N$2, \"Bar\", \"\", \"High\", $M$2, $F131, $R$2,$Q$2,,$O$2,$P$2)","v":310.17},{"$f":" RTD(\"cqg.rtd\",,\"StudyData\", $N$2, \"Bar\", \"\", \"Low\", $M$2, $F131, $R$2,$Q$2,,$O$2,$P$2)","v":309.60000000000002},{"$f":" RTD(\"cqg.rtd\",,\"StudyData\", $N$2, \"Bar\", \"\", \"Close\", $M$2, $F131, $R$2,$Q$2,,$O$2,$P$2)","v":309.70999999999998},{"$f":"F130-1","v":-130},null,44183.513888888891,{"$f":"RTD(\"cqg.rtd\",,\"StudyData\",$N$2, \"Vol\", \"VolType=Auto,CoCType=Auto\", \"Vol\", $M$2, $F131, $R$2,$Q$2,,$O$2,$P$2)","v":143628}]
[{"$f":" RTD(\"cqg.rtd\",,\"StudyData\", $N$2, \"Bar\", \"\", \"Time\", $M$2, $F132,$R$2,$Q$2, \"\",\"False\")","v":44183.510416666664},{"$f":" RTD(\"cqg.rtd\",,\"StudyData\", $N$2, \"Bar\", \"\", \"Open\", $M$2, $F132, $R$2,$Q$2,,$O$2,$P$2)","v":310.26},{"$f":" RTD(\"cqg.rtd\",,\"StudyData\", $N$2, \"Bar\", \"\", \"High\", $M$2, $F132, $R$2,$Q$2,,$O$2,$P$2)","v":310.26},{"$f":" RTD(\"cqg.rtd\",,\"StudyData\", $N$2, \"Bar\", \"\", \"Low\", $M$2, $F132, $R$2,$Q$2,,$O$2,$P$2)","v":310.08999999999997},{"$f":" RTD(\"cqg.rtd\",,\"StudyData\", $N$2, \"Bar\", \"\", \"Close\", $M$2, $F132, $R$2,$Q$2,,$O$2,$P$2)","v":310.17},-131,null,44183.510416666664,{"$f":"RTD(\"cqg.rtd\",,\"StudyData\",$N$2, \"Vol\", \"VolType=Auto,CoCType=Auto\", \"Vol\", $M$2, $F132, $R$2,$Q$2,,$O$2,$P$2)","v":56121}]
[{"$f":" RTD(\"cqg.rtd\",,\"StudyData\", $N$2, \"Bar\", \"\", \"Time\", $M$2, $F133,$R$2,$Q$2, \"\",\"False\")","v":44183.506944444445},{"$f":" RTD(\"cqg.rtd\",,\"StudyData\", $N$2, \"Bar\", \"\", \"Open\", $M$2, $F133, $R$2,$Q$2,,$O$2,$P$2)","v":310.16000000000003},{"$f":" RTD(\"cqg.rtd\",,\"StudyData\", $N$2, \"Bar\", \"\", \"High\", $M$2, $F133, $R$2,$Q$2,,$O$2,$P$2)","v":310.27999999999997},{"$f":" RTD(\"cqg.rtd\",,\"StudyData\", $N$2, \"Bar\", \"\", \"Low\", $M$2, $F133, $R$2,$Q$2,,$O$2,$P$2)","v":310.13},{"$f":" RTD(\"cqg.rtd\",,\"StudyData\", $N$2, \"Bar\", \"\", \"Close\", $M$2, $F133, $R$2,$Q$2,,$O$2,$P$2)","v":310.25},-132,null,44183.506944444445,{"$f":"RTD(\"cqg.rtd\",,\"StudyData\",$N$2, \"Vol\", \"VolType=Auto,CoCType=Auto\", \"Vol\", $M$2, $F133, $R$2,$Q$2,,$O$2,$P$2)","v":71769}]
[{"$f":" RTD(\"cqg.rtd\",,\"StudyData\", $N$2, \"Bar\", \"\", \"Time\", $M$2, $F134,$R$2,$Q$2, \"\",\"False\")","v":44183.503472222219},{"$f":" RTD(\"cqg.rtd\",,\"StudyData\", $N$2, \"Bar\", \"\", \"Open\", $M$2, $F134, $R$2,$Q$2,,$O$2,$P$2)","v":310.08999999999997},{"$f":" RTD(\"cqg.rtd\",,\"StudyData\", $N$2, \"Bar\", \"\", \"High\", $M$2, $F134, $R$2,$Q$2,,$O$2,$P$2)","v":310.22000000000003},{"$f":" RTD(\"cqg.rtd\",,\"StudyData\", $N$2, \"Bar\", \"\", \"Low\", $M$2, $F134, $R$2,$Q$2,,$O$2,$P$2)","v":310.05},{"$f":" RTD(\"cqg.rtd\",,\"StudyData\", $N$2, \"Bar\", \"\", \"Close\", $M$2, $F134, $R$2,$Q$2,,$O$2,$P$2)","v":310.13},-133,null,44183.503472222219,{"$f":"RTD(\"cqg.rtd\",,\"StudyData\",$N$2, \"Vol\", \"VolType=Auto,CoCType=Auto\", \"Vol\", $M$2, $F134, $R$2,$Q$2,,$O$2,$P$2)","v":92178}]
[{"$f":" RTD(\"cqg.rtd\",,\"StudyData\", $N$2, \"Bar\", \"\", \"Time\", $M$2, $F135,$R$2,$Q$2, \"\",\"False\")","v":44183.5},{"$f":" RTD(\"cqg.rtd\",,\"StudyData\", $N$2, \"Bar\", \"\", \"Open\", $M$2, $F135, $R$2,$Q$2,,$O$2,$P$2)","v":310.10000000000002},{"$f":" RTD(\"cqg.rtd\",,\"StudyData\", $N$2, \"Bar\", \"\", \"High\", $M$2, $F135, $R$2,$Q$2,,$O$2,$P$2)","v":310.12},{"$f":" RTD(\"cqg.rtd\",,\"StudyData\", $N$2, \"Bar\", \"\", \"Low\", $M$2, $F135, $R$2,$Q$2,,$O$2,$P$2)","v":309.95999999999998},{"$f":" RTD(\"cqg.rtd\",,\"StudyData\", $N$2, \"Bar\", \"\", \"Close\", $M$2, $F135, $R$2,$Q$2,,$O$2,$P$2)","v":310.08},-134,null,44183.5,{"$f":"RTD(\"cqg.rtd\",,\"StudyData\",$N$2, \"Vol\", \"VolType=Auto,CoCType=Auto\", \"Vol\", $M$2, $F135, $R$2,$Q$2,,$O$2,$P$2)","v":83055}]
[{"$f":" RTD(\"cqg.rtd\",,\"StudyData\", $N$2, \"Bar\", \"\", \"Time\", $M$2, $F136,$R$2,$Q$2, \"\",\"False\")","v":44183.496527777781},{"$f":" RTD(\"cqg.rtd\",,\"StudyData\", $N$2, \"Bar\", \"\", \"Open\", $M$2, $F136, $R$2,$Q$2,,$O$2,$P$2)","v":310.13},{"$f":" RTD(\"cqg.rtd\",,\"StudyData\", $N$2, \"Bar\", \"\", \"High\", $M$2, $F136, $R$2,$Q$2,,$O$2,$P$2)","v":310.2},{"$f":" RTD(\"cqg.rtd\",,\"StudyData\", $N$2, \"Bar\", \"\", \"Low\", $M$2, $F136, $R$2,$Q$2,,$O$2,$P$2)","v":310},{"$f":" RTD(\"cqg.rtd\",,\"StudyData\", $N$2, \"Bar\", \"\", \"Close\", $M$2, $F136, $R$2,$Q$2,,$O$2,$P$2)","v":310.10000000000002},-135,null,44183.496527777781,{"$f":"RTD(\"cqg.rtd\",,\"StudyData\",$N$2, \"Vol\", \"VolType=Auto,CoCType=Auto\", \"Vol\", $M$2, $F136, $R$2,$Q$2,,$O$2,$P$2)","v":61705}]
[{"$f":" RTD(\"cqg.rtd\",,\"StudyData\", $N$2, \"Bar\", \"\", \"Time\", $M$2, $F137,$R$2,$Q$2, \"\",\"False\")","v":44183.493055555555},{"$f":" RTD(\"cqg.rtd\",,\"StudyData\", $N$2, \"Bar\", \"\", \"Open\", $M$2, $F137, $R$2,$Q$2,,$O$2,$P$2)","v":310.16000000000003},{"$f":" RTD(\"cqg.rtd\",,\"StudyData\", $N$2, \"Bar\", \"\", \"High\", $M$2, $F137, $R$2,$Q$2,,$O$2,$P$2)","v":310.20999999999998},{"$f":" RTD(\"cqg.rtd\",,\"StudyData\", $N$2, \"Bar\", \"\", \"Low\", $M$2, $F137, $R$2,$Q$2,,$O$2,$P$2)","v":310.06},{"$f":" RTD(\"cqg.rtd\",,\"StudyData\", $N$2, \"Bar\", \"\", \"Close\", $M$2, $F137, $R$2,$Q$2,,$O$2,$P$2)","v":310.14},-136,null,44183.493055555555,{"$f":"RTD(\"cqg.rtd\",,\"StudyData\",$N$2, \"Vol\", \"VolType=Auto,CoCType=Auto\", \"Vol\", $M$2, $F137, $R$2,$Q$2,,$O$2,$P$2)","v":101870}]
[{"$f":" RTD(\"cqg.rtd\",,\"StudyData\", $N$2, \"Bar\", \"\", \"Time\", $M$2, $F138,$R$2,$Q$2, \"\",\"False\")","v":44183.489583333336},{"$f":" RTD(\"cqg.rtd\",,\"StudyData\", $N$2, \"Bar\", \"\", \"Open\", $M$2, $F138, $R$2,$Q$2,,$O$2,$P$2)","v":310.33},{"$f":" RTD(\"cqg.rtd\",,\"StudyData\", $N$2, \"Bar\", \"\", \"High\", $M$2, $F138, $R$2,$Q$2,,$O$2,$P$2)","v":310.33},{"$f":" RTD(\"cqg.rtd\",,\"StudyData\", $N$2, \"Bar\", \"\", \"Low\", $M$2, $F138, $R$2,$Q$2,,$O$2,$P$2)","v":310.12},{"$f":" RTD(\"cqg.rtd\",,\"StudyData\", $N$2, \"Bar\", \"\", \"Close\", $M$2, $F138, $R$2,$Q$2,,$O$2,$P$2)","v":310.14999999999998},-137,null,44183.489583333336,{"$f":"RTD(\"cqg.rtd\",,\"StudyData\",$N$2, \"Vol\", \"VolType=Auto,CoCType=Auto\", \"Vol\", $M$2, $F138, $R$2,$Q$2,,$O$2,$P$2)","v":129991}]
[{"$f":" RTD(\"cqg.rtd\",,\"StudyData\", $N$2, \"Bar\", \"\", \"Time\", $M$2, $F139,$R$2,$Q$2, \"\",\"False\")","v":44183.486111111109},{"$f":" RTD(\"cqg.rtd\",,\"StudyData\", $N$2, \"Bar\", \"\", \"Open\", $M$2, $F139, $R$2,$Q$2,,$O$2,$P$2)","v":310.33999999999997},{"$f":" RTD(\"cqg.rtd\",,\"StudyData\", $N$2, \"Bar\", \"\", \"High\", $M$2, $F139, $R$2,$Q$2,,$O$2,$P$2)","v":310.43},{"$f":" RTD(\"cqg.rtd\",,\"StudyData\", $N$2, \"Bar\", \"\", \"Low\", $M$2, $F139, $R$2,$Q$2,,$O$2,$P$2)","v":310.3},{"$f":" RTD(\"cqg.rtd\",,\"StudyData\", $N$2, \"Bar\", \"\", \"Close\", $M$2, $F139, $R$2,$Q$2,,$O$2,$P$2)","v":310.32},-138,null,44183.486111111109,{"$f":"RTD(\"cqg.rtd\",,\"StudyData\",$N$2, \"Vol\", \"VolType=Auto,CoCType=Auto\", \"Vol\", $M$2, $F139, $R$2,$Q$2,,$O$2,$P$2)","v":125459}]
[{"$f":" RTD(\"cqg.rtd\",,\"StudyData\", $N$2, \"Bar\", \"\", \"Time\", $M$2, $F140,$R$2,$Q$2, \"\",\"False\")","v":44183.482638888891},{"$f":" RTD(\"cqg.rtd\",,\"StudyData\", $N$2, \"Bar\", \"\", \"Open\", $M$2, $F140, $R$2,$Q$2,,$O$2,$P$2)","v":310.23},{"$f":" RTD(\"cqg.rtd\",,\"StudyData\", $N$2, \"Bar\", \"\", \"High\", $M$2, $F140, $R$2,$Q$2,,$O$2,$P$2)","v":310.38},{"$f":" RTD(\"cqg.rtd\",,\"StudyData\", $N$2, \"Bar\", \"\", \"Low\", $M$2, $F140, $R$2,$Q$2,,$O$2,$P$2)","v":310.14},{"$f":" RTD(\"cqg.rtd\",,\"StudyData\", $N$2, \"Bar\", \"\", \"Close\", $M$2, $F140, $R$2,$Q$2,,$O$2,$P$2)","v":310.35000000000002},-139,null,44183.482638888891,{"$f":"RTD(\"cqg.rtd\",,\"StudyData\",$N$2, \"Vol\", \"VolType=Auto,CoCType=Auto\", \"Vol\", $M$2, $F140, $R$2,$Q$2,,$O$2,$P$2)","v":135108}]
[{"$f":" RTD(\"cqg.rtd\",,\"StudyData\", $N$2, \"Bar\", \"\", \"Time\", $M$2, $F141,$R$2,$Q$2, \"\",\"False\")","v":44183.479166666664},{"$f":" RTD(\"cqg.rtd\",,\"StudyData\", $N$2, \"Bar\", \"\", \"Open\", $M$2, $F141, $R$2,$Q$2,,$O$2,$P$2)","v":310.14999999999998},{"$f":" RTD(\"cqg.rtd\",,\"StudyData\", $N$2, \"Bar\", \"\", \"High\", $M$2, $F141, $R$2,$Q$2,,$O$2,$P$2)","v":310.27},{"$f":" RTD(\"cqg.rtd\",,\"StudyData\", $N$2, \"Bar\", \"\", \"Low\", $M$2, $F141, $R$2,$Q$2,,$O$2,$P$2)","v":309.99},{"$f":" RTD(\"cqg.rtd\",,\"StudyData\", $N$2, \"Bar\", \"\", \"Close\", $M$2, $F141, $R$2,$Q$2,,$O$2,$P$2)","v":310.23},-140,null,44183.479166666664,{"$f":"RTD(\"cqg.rtd\",,\"StudyData\",$N$2, \"Vol\", \"VolType=Auto,CoCType=Auto\", \"Vol\", $M$2, $F141, $R$2,$Q$2,,$O$2,$P$2)","v":148950}]
[{"$f":" RTD(\"cqg.rtd\",,\"StudyData\", $N$2, \"Bar\", \"\", \"Time\", $M$2, $F142,$R$2,$Q$2, \"\",\"False\")","v":44183.475694444445},{"$f":" RTD(\"cqg.rtd\",,\"StudyData\", $N$2, \"Bar\", \"\", \"Open\", $M$2, $F142, $R$2,$Q$2,,$O$2,$P$2)","v":310.05},{"$f":" RTD(\"cqg.rtd\",,\"StudyData\", $N$2, \"Bar\", \"\", \"High\", $M$2, $F142, $R$2,$Q$2,,$O$2,$P$2)","v":310.18},{"$f":" RTD(\"cqg.rtd\",,\"StudyData\", $N$2, \"Bar\", \"\", \"Low\", $M$2, $F142, $R$2,$Q$2,,$O$2,$P$2)","v":309.99},{"$f":" RTD(\"cqg.rtd\",,\"StudyData\", $N$2, \"Bar\", \"\", \"Close\", $M$2, $F142, $R$2,$Q$2,,$O$2,$P$2)","v":310.14999999999998},-141,null,44183.475694444445,{"$f":"RTD(\"cqg.rtd\",,\"StudyData\",$N$2, \"Vol\", \"VolType=Auto,CoCType=Auto\", \"Vol\", $M$2, $F142, $R$2,$Q$2,,$O$2,$P$2)","v":71361}]
[{"$f":" RTD(\"cqg.rtd\",,\"StudyData\", $N$2, \"Bar\", \"\", \"Time\", $M$2, $F143,$R$2,$Q$2, \"\",\"False\")","v":44183.472222222219},{"$f":" RTD(\"cqg.rtd\",,\"StudyData\", $N$2, \"Bar\", \"\", \"Open\", $M$2, $F143, $R$2,$Q$2,,$O$2,$P$2)","v":310},{"$f":" RTD(\"cqg.rtd\",,\"StudyData\", $N$2, \"Bar\", \"\", \"High\", $M$2, $F143, $R$2,$Q$2,,$O$2,$P$2)","v":310.08999999999997},{"$f":" RTD(\"cqg.rtd\",,\"StudyData\", $N$2, \"Bar\", \"\", \"Low\", $M$2, $F143, $R$2,$Q$2,,$O$2,$P$2)","v":309.95},{"$f":" RTD(\"cqg.rtd\",,\"StudyData\", $N$2, \"Bar\", \"\", \"Close\", $M$2, $F143, $R$2,$Q$2,,$O$2,$P$2)","v":310.05},-142,null,44183.472222222219,{"$f":"RTD(\"cqg.rtd\",,\"StudyData\",$N$2, \"Vol\", \"VolType=Auto,CoCType=Auto\", \"Vol\", $M$2, $F143, $R$2,$Q$2,,$O$2,$P$2)","v":77449}]
[{"$f":" RTD(\"cqg.rtd\",,\"StudyData\", $N$2, \"Bar\", \"\", \"Time\", $M$2, $F144,$R$2,$Q$2, \"\",\"False\")","v":44183.46875},{"$f":" RTD(\"cqg.rtd\",,\"StudyData\", $N$2, \"Bar\", \"\", \"Open\", $M$2, $F144, $R$2,$Q$2,,$O$2,$P$2)","v":310.05},{"$f":" RTD(\"cqg.rtd\",,\"StudyData\", $N$2, \"Bar\", \"\", \"High\", $M$2, $F144, $R$2,$Q$2,,$O$2,$P$2)","v":310.14},{"$f":" RTD(\"cqg.rtd\",,\"StudyData\", $N$2, \"Bar\", \"\", \"Low\", $M$2, $F144, $R$2,$Q$2,,$O$2,$P$2)","v":310},{"$f":" RTD(\"cqg.rtd\",,\"StudyData\", $N$2, \"Bar\", \"\", \"Close\", $M$2, $F144, $R$2,$Q$2,,$O$2,$P$2)","v":310.01},-143,null,44183.46875,{"$f":"RTD(\"cqg.rtd\",,\"StudyData\",$N$2, \"Vol\", \"VolType=Auto,CoCType=Auto\", \"Vol\", $M$2, $F144, $R$2,$Q$2,,$O$2,$P$2)","v":114361}]
[{"$f":" RTD(\"cqg.rtd\",,\"StudyData\", $N$2, \"Bar\", \"\", \"Time\", $M$2, $F145,$R$2,$Q$2, \"\",\"False\")","v":44183.465277777781},{"$f":" RTD(\"cqg.rtd\",,\"StudyData\", $N$2, \"Bar\", \"\", \"Open\", $M$2, $F145, $R$2,$Q$2,,$O$2,$P$2)","v":309.79000000000002},{"$f":" RTD(\"cqg.rtd\",,\"StudyData\", $N$2, \"Bar\", \"\", \"High\", $M$2, $F145, $R$2,$Q$2,,$O$2,$P$2)","v":310.08999999999997},{"$f":" RTD(\"cqg.rtd\",,\"StudyData\", $N$2, \"Bar\", \"\", \"Low\", $M$2, $F145, $R$2,$Q$2,,$O$2,$P$2)","v":309.70999999999998},{"$f":" RTD(\"cqg.rtd\",,\"StudyData\", $N$2, \"Bar\", \"\", \"Close\", $M$2, $F145, $R$2,$Q$2,,$O$2,$P$2)","v":310.05},-144,null,44183.465277777781,{"$f":"RTD(\"cqg.rtd\",,\"StudyData\",$N$2, \"Vol\", \"VolType=Auto,CoCType=Auto\", \"Vol\", $M$2, $F145, $R$2,$Q$2,,$O$2,$P$2)","v":130146}]
[{"$f":" RTD(\"cqg.rtd\",,\"StudyData\", $N$2, \"Bar\", \"\", \"Time\", $M$2, $F146,$R$2,$Q$2, \"\",\"False\")","v":44183.461805555555},{"$f":" RTD(\"cqg.rtd\",,\"StudyData\", $N$2, \"Bar\", \"\", \"Open\", $M$2, $F146, $R$2,$Q$2,,$O$2,$P$2)","v":309.77},{"$f":" RTD(\"cqg.rtd\",,\"StudyData\", $N$2, \"Bar\", \"\", \"High\", $M$2, $F146, $R$2,$Q$2,,$O$2,$P$2)","v":309.94},{"$f":" RTD(\"cqg.rtd\",,\"StudyData\", $N$2, \"Bar\", \"\", \"Low\", $M$2, $F146, $R$2,$Q$2,,$O$2,$P$2)","v":309.74},{"$f":" RTD(\"cqg.rtd\",,\"StudyData\", $N$2, \"Bar\", \"\", \"Close\", $M$2, $F146, $R$2,$Q$2,,$O$2,$P$2)","v":309.79000000000002},-145,null,44183.461805555555,{"$f":"RTD(\"cqg.rtd\",,\"StudyData\",$N$2, \"Vol\", \"VolType=Auto,CoCType=Auto\", \"Vol\", $M$2, $F146, $R$2,$Q$2,,$O$2,$P$2)","v":89563}]
[{"$f":" RTD(\"cqg.rtd\",,\"StudyData\", $N$2, \"Bar\", \"\", \"Time\", $M$2, $F147,$R$2,$Q$2, \"\",\"False\")","v":44183.458333333336},{"$f":" RTD(\"cqg.rtd\",,\"StudyData\", $N$2, \"Bar\", \"\", \"Open\", $M$2, $F147, $R$2,$Q$2,,$O$2,$P$2)","v":309.64},{"$f":" RTD(\"cqg.rtd\",,\"StudyData\", $N$2, \"Bar\", \"\", \"High\", $M$2, $F147, $R$2,$Q$2,,$O$2,$P$2)","v":309.83},{"$f":" RTD(\"cqg.rtd\",,\"StudyData\", $N$2, \"Bar\", \"\", \"Low\", $M$2, $F147, $R$2,$Q$2,,$O$2,$P$2)","v":309.47000000000003},{"$f":" RTD(\"cqg.rtd\",,\"StudyData\", $N$2, \"Bar\", \"\", \"Close\", $M$2, $F147, $R$2,$Q$2,,$O$2,$P$2)","v":309.77999999999997},-146,null,44183.458333333336,{"$f":"RTD(\"cqg.rtd\",,\"StudyData\",$N$2, \"Vol\", \"VolType=Auto,CoCType=Auto\", \"Vol\", $M$2, $F147, $R$2,$Q$2,,$O$2,$P$2)","v":104099}]
[{"$f":" RTD(\"cqg.rtd\",,\"StudyData\", $N$2, \"Bar\", \"\", \"Time\", $M$2, $F148,$R$2,$Q$2, \"\",\"False\")","v":44183.454861111109},{"$f":" RTD(\"cqg.rtd\",,\"StudyData\", $N$2, \"Bar\", \"\", \"Open\", $M$2, $F148, $R$2,$Q$2,,$O$2,$P$2)","v":309.77999999999997},{"$f":" RTD(\"cqg.rtd\",,\"StudyData\", $N$2, \"Bar\", \"\", \"High\", $M$2, $F148, $R$2,$Q$2,,$O$2,$P$2)","v":309.82},{"$f":" RTD(\"cqg.rtd\",,\"StudyData\", $N$2, \"Bar\", \"\", \"Low\", $M$2, $F148, $R$2,$Q$2,,$O$2,$P$2)","v":309.63},{"$f":" RTD(\"cqg.rtd\",,\"StudyData\", $N$2, \"Bar\", \"\", \"Close\", $M$2, $F148, $R$2,$Q$2,,$O$2,$P$2)","v":309.66000000000003},-147,null,44183.454861111109,{"$f":"RTD(\"cqg.rtd\",,\"StudyData\",$N$2, \"Vol\", \"VolType=Auto,CoCType=Auto\", \"Vol\", $M$2, $F148, $R$2,$Q$2,,$O$2,$P$2)","v":76851}]
[{"$f":" RTD(\"cqg.rtd\",,\"StudyData\", $N$2, \"Bar\", \"\", \"Time\", $M$2, $F149,$R$2,$Q$2, \"\",\"False\")","v":44183.451388888891},{"$f":" RTD(\"cqg.rtd\",,\"StudyData\", $N$2, \"Bar\", \"\", \"Open\", $M$2, $F149, $R$2,$Q$2,,$O$2,$P$2)","v":309.77},{"$f":" RTD(\"cqg.rtd\",,\"StudyData\", $N$2, \"Bar\", \"\", \"High\", $M$2, $F149, $R$2,$Q$2,,$O$2,$P$2)","v":309.93},{"$f":" RTD(\"cqg.rtd\",,\"StudyData\", $N$2, \"Bar\", \"\", \"Low\", $M$2, $F149, $R$2,$Q$2,,$O$2,$P$2)","v":309.75},{"$f":" RTD(\"cqg.rtd\",,\"StudyData\", $N$2, \"Bar\", \"\", \"Close\", $M$2, $F149, $R$2,$Q$2,,$O$2,$P$2)","v":309.77},-148,null,44183.451388888891,{"$f":"RTD(\"cqg.rtd\",,\"StudyData\",$N$2, \"Vol\", \"VolType=Auto,CoCType=Auto\", \"Vol\", $M$2, $F149, $R$2,$Q$2,,$O$2,$P$2)","v":122809}]
[{"$f":" RTD(\"cqg.rtd\",,\"StudyData\", $N$2, \"Bar\", \"\", \"Time\", $M$2, $F150,$R$2,$Q$2, \"\",\"False\")","v":44183.447916666664},{"$f":" RTD(\"cqg.rtd\",,\"StudyData\", $N$2, \"Bar\", \"\", \"Open\", $M$2, $F150, $R$2,$Q$2,,$O$2,$P$2)","v":309.77},{"$f":" RTD(\"cqg.rtd\",,\"StudyData\", $N$2, \"Bar\", \"\", \"High\", $M$2, $F150, $R$2,$Q$2,,$O$2,$P$2)","v":309.88},{"$f":" RTD(\"cqg.rtd\",,\"StudyData\", $N$2, \"Bar\", \"\", \"Low\", $M$2, $F150, $R$2,$Q$2,,$O$2,$P$2)","v":309.68},{"$f":" RTD(\"cqg.rtd\",,\"StudyData\", $N$2, \"Bar\", \"\", \"Close\", $M$2, $F150, $R$2,$Q$2,,$O$2,$P$2)","v":309.77},-149,null,44183.447916666664,{"$f":"RTD(\"cqg.rtd\",,\"StudyData\",$N$2, \"Vol\", \"VolType=Auto,CoCType=Auto\", \"Vol\", $M$2, $F150, $R$2,$Q$2,,$O$2,$P$2)","v":120890}]
[{"$f":" RTD(\"cqg.rtd\",,\"StudyData\", $N$2, \"Bar\", \"\", \"Time\", $M$2, $F151,$R$2,$Q$2, \"\",\"False\")","v":44183.444444444445},{"$f":" RTD(\"cqg.rtd\",,\"StudyData\", $N$2, \"Bar\", \"\", \"Open\", $M$2, $F151, $R$2,$Q$2,,$O$2,$P$2)","v":309.63},{"$f":" RTD(\"cqg.rtd\",,\"StudyData\", $N$2, \"Bar\", \"\", \"High\", $M$2, $F151, $R$2,$Q$2,,$O$2,$P$2)","v":309.83},{"$f":" RTD(\"cqg.rtd\",,\"StudyData\", $N$2, \"Bar\", \"\", \"Low\", $M$2, $F151, $R$2,$Q$2,,$O$2,$P$2)","v":309.44},{"$f":" RTD(\"cqg.rtd\",,\"StudyData\", $N$2, \"Bar\", \"\", \"Close\", $M$2, $F151, $R$2,$Q$2,,$O$2,$P$2)","v":309.77999999999997},-150,null,44183.444444444445,{"$f":"RTD(\"cqg.rtd\",,\"StudyData\",$N$2, \"Vol\", \"VolType=Auto,CoCType=Auto\", \"Vol\", $M$2, $F151, $R$2,$Q$2,,$O$2,$P$2)","v":119550}]
[{"$f":" RTD(\"cqg.rtd\",,\"StudyData\", $N$2, \"Bar\", \"\", \"Time\", $M$2, $F152,$R$2,$Q$2, \"\",\"False\")","v":44183.440972222219},{"$f":" RTD(\"cqg.rtd\",,\"StudyData\", $N$2, \"Bar\", \"\", \"Open\", $M$2, $F152, $R$2,$Q$2,,$O$2,$P$2)","v":309.67},{"$f":" RTD(\"cqg.rtd\",,\"StudyData\", $N$2, \"Bar\", \"\", \"High\", $M$2, $F152, $R$2,$Q$2,,$O$2,$P$2)","v":309.7},{"$f":" RTD(\"cqg.rtd\",,\"StudyData\", $N$2, \"Bar\", \"\", \"Low\", $M$2, $F152, $R$2,$Q$2,,$O$2,$P$2)","v":309.5},{"$f":" RTD(\"cqg.rtd\",,\"StudyData\", $N$2, \"Bar\", \"\", \"Close\", $M$2, $F152, $R$2,$Q$2,,$O$2,$P$2)","v":309.64999999999998},-151,null,44183.440972222219,{"$f":"RTD(\"cqg.rtd\",,\"StudyData\",$N$2, \"Vol\", \"VolType=Auto,CoCType=Auto\", \"Vol\", $M$2, $F152, $R$2,$Q$2,,$O$2,$P$2)","v":90766}]
[{"$f":" RTD(\"cqg.rtd\",,\"StudyData\", $N$2, \"Bar\", \"\", \"Time\", $M$2, $F153,$R$2,$Q$2, \"\",\"False\")","v":44183.4375},{"$f":" RTD(\"cqg.rtd\",,\"StudyData\", $N$2, \"Bar\", \"\", \"Open\", $M$2, $F153, $R$2,$Q$2,,$O$2,$P$2)","v":309.52},{"$f":" RTD(\"cqg.rtd\",,\"StudyData\", $N$2, \"Bar\", \"\", \"High\", $M$2, $F153, $R$2,$Q$2,,$O$2,$P$2)","v":309.72000000000003},{"$f":" RTD(\"cqg.rtd\",,\"StudyData\", $N$2, \"Bar\", \"\", \"Low\", $M$2, $F153, $R$2,$Q$2,,$O$2,$P$2)","v":309.39},{"$f":" RTD(\"cqg.rtd\",,\"StudyData\", $N$2, \"Bar\", \"\", \"Close\", $M$2, $F153, $R$2,$Q$2,,$O$2,$P$2)","v":309.67},-152,null,44183.4375,{"$f":"RTD(\"cqg.rtd\",,\"StudyData\",$N$2, \"Vol\", \"VolType=Auto,CoCType=Auto\", \"Vol\", $M$2, $F153, $R$2,$Q$2,,$O$2,$P$2)","v":125156}]
[{"$f":" RTD(\"cqg.rtd\",,\"StudyData\", $N$2, \"Bar\", \"\", \"Time\", $M$2, $F154,$R$2,$Q$2, \"\",\"False\")","v":44183.434027777781},{"$f":" RTD(\"cqg.rtd\",,\"StudyData\", $N$2, \"Bar\", \"\", \"Open\", $M$2, $F154, $R$2,$Q$2,,$O$2,$P$2)","v":309.58999999999997},{"$f":" RTD(\"cqg.rtd\",,\"StudyData\", $N$2, \"Bar\", \"\", \"High\", $M$2, $F154, $R$2,$Q$2,,$O$2,$P$2)","v":309.72000000000003},{"$f":" RTD(\"cqg.rtd\",,\"StudyData\", $N$2, \"Bar\", \"\", \"Low\", $M$2, $F154, $R$2,$Q$2,,$O$2,$P$2)","v":309.52},{"$f":" RTD(\"cqg.rtd\",,\"StudyData\", $N$2, \"Bar\", \"\", \"Close\", $M$2, $F154, $R$2,$Q$2,,$O$2,$P$2)","v":309.56},-153,null,44183.434027777781,{"$f":"RTD(\"cqg.rtd\",,\"StudyData\",$N$2, \"Vol\", \"VolType=Auto,CoCType=Auto\", \"Vol\", $M$2, $F154, $R$2,$Q$2,,$O$2,$P$2)","v":121575}]
[{"$f":" RTD(\"cqg.rtd\",,\"StudyData\", $N$2, \"Bar\", \"\", \"Time\", $M$2, $F155,$R$2,$Q$2, \"\",\"False\")","v":44183.430555555555},{"$f":" RTD(\"cqg.rtd\",,\"StudyData\", $N$2, \"Bar\", \"\", \"Open\", $M$2, $F155, $R$2,$Q$2,,$O$2,$P$2)","v":309.25},{"$f":" RTD(\"cqg.rtd\",,\"StudyData\", $N$2, \"Bar\", \"\", \"High\", $M$2, $F155, $R$2,$Q$2,,$O$2,$P$2)","v":309.58999999999997},{"$f":" RTD(\"cqg.rtd\",,\"StudyData\", $N$2, \"Bar\", \"\", \"Low\", $M$2, $F155, $R$2,$Q$2,,$O$2,$P$2)","v":309.08},{"$f":" RTD(\"cqg.rtd\",,\"StudyData\", $N$2, \"Bar\", \"\", \"Close\", $M$2, $F155, $R$2,$Q$2,,$O$2,$P$2)","v":309.58},-154,null,44183.430555555555,{"$f":"RTD(\"cqg.rtd\",,\"StudyData\",$N$2, \"Vol\", \"VolType=Auto,CoCType=Auto\", \"Vol\", $M$2, $F155, $R$2,$Q$2,,$O$2,$P$2)","v":169601}]
[{"$f":" RTD(\"cqg.rtd\",,\"StudyData\", $N$2, \"Bar\", \"\", \"Time\", $M$2, $F156,$R$2,$Q$2, \"\",\"False\")","v":44183.427083333336},{"$f":" RTD(\"cqg.rtd\",,\"StudyData\", $N$2, \"Bar\", \"\", \"Open\", $M$2, $F156, $R$2,$Q$2,,$O$2,$P$2)","v":309.3},{"$f":" RTD(\"cqg.rtd\",,\"StudyData\", $N$2, \"Bar\", \"\", \"High\", $M$2, $F156, $R$2,$Q$2,,$O$2,$P$2)","v":309.31},{"$f":" RTD(\"cqg.rtd\",,\"StudyData\", $N$2, \"Bar\", \"\", \"Low\", $M$2, $F156, $R$2,$Q$2,,$O$2,$P$2)","v":308.83999999999997},{"$f":" RTD(\"cqg.rtd\",,\"StudyData\", $N$2, \"Bar\", \"\", \"Close\", $M$2, $F156, $R$2,$Q$2,,$O$2,$P$2)","v":309.26},-155,null,44183.427083333336,{"$f":"RTD(\"cqg.rtd\",,\"StudyData\",$N$2, \"Vol\", \"VolType=Auto,CoCType=Auto\", \"Vol\", $M$2, $F156, $R$2,$Q$2,,$O$2,$P$2)","v":274393}]
[{"$f":" RTD(\"cqg.rtd\",,\"StudyData\", $N$2, \"Bar\", \"\", \"Time\", $M$2, $F157,$R$2,$Q$2, \"\",\"False\")","v":44183.423611111109},{"$f":" RTD(\"cqg.rtd\",,\"StudyData\", $N$2, \"Bar\", \"\", \"Open\", $M$2, $F157, $R$2,$Q$2,,$O$2,$P$2)","v":310.05},{"$f":" RTD(\"cqg.rtd\",,\"StudyData\", $N$2, \"Bar\", \"\", \"High\", $M$2, $F157, $R$2,$Q$2,,$O$2,$P$2)","v":310.08},{"$f":" RTD(\"cqg.rtd\",,\"StudyData\", $N$2, \"Bar\", \"\", \"Low\", $M$2, $F157, $R$2,$Q$2,,$O$2,$P$2)","v":309.07},{"$f":" RTD(\"cqg.rtd\",,\"StudyData\", $N$2, \"Bar\", \"\", \"Close\", $M$2, $F157, $R$2,$Q$2,,$O$2,$P$2)","v":309.29000000000002},-156,null,44183.423611111109,{"$f":"RTD(\"cqg.rtd\",,\"StudyData\",$N$2, \"Vol\", \"VolType=Auto,CoCType=Auto\", \"Vol\", $M$2, $F157, $R$2,$Q$2,,$O$2,$P$2)","v":308993}]
[{"$f":" RTD(\"cqg.rtd\",,\"StudyData\", $N$2, \"Bar\", \"\", \"Time\", $M$2, $F158,$R$2,$Q$2, \"\",\"False\")","v":44183.420138888891},{"$f":" RTD(\"cqg.rtd\",,\"StudyData\", $N$2, \"Bar\", \"\", \"Open\", $M$2, $F158, $R$2,$Q$2,,$O$2,$P$2)","v":310.38},{"$f":" RTD(\"cqg.rtd\",,\"StudyData\", $N$2, \"Bar\", \"\", \"High\", $M$2, $F158, $R$2,$Q$2,,$O$2,$P$2)","v":310.38},{"$f":" RTD(\"cqg.rtd\",,\"StudyData\", $N$2, \"Bar\", \"\", \"Low\", $M$2, $F158, $R$2,$Q$2,,$O$2,$P$2)","v":309.83999999999997},{"$f":" RTD(\"cqg.rtd\",,\"StudyData\", $N$2, \"Bar\", \"\", \"Close\", $M$2, $F158, $R$2,$Q$2,,$O$2,$P$2)","v":310.05},-157,null,44183.420138888891,{"$f":"RTD(\"cqg.rtd\",,\"StudyData\",$N$2, \"Vol\", \"VolType=Auto,CoCType=Auto\", \"Vol\", $M$2, $F158, $R$2,$Q$2,,$O$2,$P$2)","v":151463}]
[{"$f":" RTD(\"cqg.rtd\",,\"StudyData\", $N$2, \"Bar\", \"\", \"Time\", $M$2, $F159,$R$2,$Q$2, \"\",\"False\")","v":44183.416666666664},{"$f":" RTD(\"cqg.rtd\",,\"StudyData\", $N$2, \"Bar\", \"\", \"Open\", $M$2, $F159, $R$2,$Q$2,,$O$2,$P$2)","v":310.25},{"$f":" RTD(\"cqg.rtd\",,\"StudyData\", $N$2, \"Bar\", \"\", \"High\", $M$2, $F159, $R$2,$Q$2,,$O$2,$P$2)","v":310.48},{"$f":" RTD(\"cqg.rtd\",,\"StudyData\", $N$2, \"Bar\", \"\", \"Low\", $M$2, $F159, $R$2,$Q$2,,$O$2,$P$2)","v":310.19},{"$f":" RTD(\"cqg.rtd\",,\"StudyData\", $N$2, \"Bar\", \"\", \"Close\", $M$2, $F159, $R$2,$Q$2,,$O$2,$P$2)","v":310.38},-158,null,44183.416666666664,{"$f":"RTD(\"cqg.rtd\",,\"StudyData\",$N$2, \"Vol\", \"VolType=Auto,CoCType=Auto\", \"Vol\", $M$2, $F159, $R$2,$Q$2,,$O$2,$P$2)","v":142107}]
[{"$f":" RTD(\"cqg.rtd\",,\"StudyData\", $N$2, \"Bar\", \"\", \"Time\", $M$2, $F160,$R$2,$Q$2, \"\",\"False\")","v":44183.413194444445},{"$f":" RTD(\"cqg.rtd\",,\"StudyData\", $N$2, \"Bar\", \"\", \"Open\", $M$2, $F160, $R$2,$Q$2,,$O$2,$P$2)","v":310.04000000000002},{"$f":" RTD(\"cqg.rtd\",,\"StudyData\", $N$2, \"Bar\", \"\", \"High\", $M$2, $F160, $R$2,$Q$2,,$O$2,$P$2)","v":310.45999999999998},{"$f":" RTD(\"cqg.rtd\",,\"StudyData\", $N$2, \"Bar\", \"\", \"Low\", $M$2, $F160, $R$2,$Q$2,,$O$2,$P$2)","v":310.04000000000002},{"$f":" RTD(\"cqg.rtd\",,\"StudyData\", $N$2, \"Bar\", \"\", \"Close\", $M$2, $F160, $R$2,$Q$2,,$O$2,$P$2)","v":310.25},-159,null,44183.413194444445,{"$f":"RTD(\"cqg.rtd\",,\"StudyData\",$N$2, \"Vol\", \"VolType=Auto,CoCType=Auto\", \"Vol\", $M$2, $F160, $R$2,$Q$2,,$O$2,$P$2)","v":193364}]
[{"$f":" RTD(\"cqg.rtd\",,\"StudyData\", $N$2, \"Bar\", \"\", \"Time\", $M$2, $F161,$R$2,$Q$2, \"\",\"False\")","v":44183.409722222219},{"$f":" RTD(\"cqg.rtd\",,\"StudyData\", $N$2, \"Bar\", \"\", \"Open\", $M$2, $F161, $R$2,$Q$2,,$O$2,$P$2)","v":310.16000000000003},{"$f":" RTD(\"cqg.rtd\",,\"StudyData\", $N$2, \"Bar\", \"\", \"High\", $M$2, $F161, $R$2,$Q$2,,$O$2,$P$2)","v":310.20999999999998},{"$f":" RTD(\"cqg.rtd\",,\"StudyData\", $N$2, \"Bar\", \"\", \"Low\", $M$2, $F161, $R$2,$Q$2,,$O$2,$P$2)","v":309.87},{"$f":" RTD(\"cqg.rtd\",,\"StudyData\", $N$2, \"Bar\", \"\", \"Close\", $M$2, $F161, $R$2,$Q$2,,$O$2,$P$2)","v":310.05},-160,null,44183.409722222219,{"$f":"RTD(\"cqg.rtd\",,\"StudyData\",$N$2, \"Vol\", \"VolType=Auto,CoCType=Auto\", \"Vol\", $M$2, $F161, $R$2,$Q$2,,$O$2,$P$2)","v":124192}]
[{"$f":" RTD(\"cqg.rtd\",,\"StudyData\", $N$2, \"Bar\", \"\", \"Time\", $M$2, $F162,$R$2,$Q$2, \"\",\"False\")","v":44183.40625},{"$f":" RTD(\"cqg.rtd\",,\"StudyData\", $N$2, \"Bar\", \"\", \"Open\", $M$2, $F162, $R$2,$Q$2,,$O$2,$P$2)","v":310.20999999999998},{"$f":" RTD(\"cqg.rtd\",,\"StudyData\", $N$2, \"Bar\", \"\", \"High\", $M$2, $F162, $R$2,$Q$2,,$O$2,$P$2)","v":310.23},{"$f":" RTD(\"cqg.rtd\",,\"StudyData\", $N$2, \"Bar\", \"\", \"Low\", $M$2, $F162, $R$2,$Q$2,,$O$2,$P$2)","v":309.95999999999998},{"$f":" RTD(\"cqg.rtd\",,\"StudyData\", $N$2, \"Bar\", \"\", \"Close\", $M$2, $F162, $R$2,$Q$2,,$O$2,$P$2)","v":310.13},-161,null,44183.40625,{"$f":"RTD(\"cqg.rtd\",,\"StudyData\",$N$2, \"Vol\", \"VolType=Auto,CoCType=Auto\", \"Vol\", $M$2, $F162, $R$2,$Q$2,,$O$2,$P$2)","v":153613}]
[{"$f":" RTD(\"cqg.rtd\",,\"StudyData\", $N$2, \"Bar\", \"\", \"Time\", $M$2, $F163,$R$2,$Q$2, \"\",\"False\")","v":44183.402777777781},{"$f":" RTD(\"cqg.rtd\",,\"StudyData\", $N$2, \"Bar\", \"\", \"Open\", $M$2, $F163, $R$2,$Q$2,,$O$2,$P$2)","v":309.97000000000003},{"$f":" RTD(\"cqg.rtd\",,\"StudyData\", $N$2, \"Bar\", \"\", \"High\", $M$2, $F163, $R$2,$Q$2,,$O$2,$P$2)","v":310.31},{"$f":" RTD(\"cqg.rtd\",,\"StudyData\", $N$2, \"Bar\", \"\", \"Low\", $M$2, $F163, $R$2,$Q$2,,$O$2,$P$2)","v":309.92},{"$f":" RTD(\"cqg.rtd\",,\"StudyData\", $N$2, \"Bar\", \"\", \"Close\", $M$2, $F163, $R$2,$Q$2,,$O$2,$P$2)","v":310.20999999999998},-162,null,44183.402777777781,{"$f":"RTD(\"cqg.rtd\",,\"StudyData\",$N$2, \"Vol\", \"VolType=Auto,CoCType=Auto\", \"Vol\", $M$2, $F163, $R$2,$Q$2,,$O$2,$P$2)","v":237575}]
[{"$f":" RTD(\"cqg.rtd\",,\"StudyData\", $N$2, \"Bar\", \"\", \"Time\", $M$2, $F164,$R$2,$Q$2, \"\",\"False\")","v":44183.399305555555},{"$f":" RTD(\"cqg.rtd\",,\"StudyData\", $N$2, \"Bar\", \"\", \"Open\", $M$2, $F164, $R$2,$Q$2,,$O$2,$P$2)","v":310.11},{"$f":" RTD(\"cqg.rtd\",,\"StudyData\", $N$2, \"Bar\", \"\", \"High\", $M$2, $F164, $R$2,$Q$2,,$O$2,$P$2)","v":310.23},{"$f":" RTD(\"cqg.rtd\",,\"StudyData\", $N$2, \"Bar\", \"\", \"Low\", $M$2, $F164, $R$2,$Q$2,,$O$2,$P$2)","v":309.74},{"$f":" RTD(\"cqg.rtd\",,\"StudyData\", $N$2, \"Bar\", \"\", \"Close\", $M$2, $F164, $R$2,$Q$2,,$O$2,$P$2)","v":309.98},-163,null,44183.399305555555,{"$f":"RTD(\"cqg.rtd\",,\"StudyData\",$N$2, \"Vol\", \"VolType=Auto,CoCType=Auto\", \"Vol\", $M$2, $F164, $R$2,$Q$2,,$O$2,$P$2)","v":262348}]
[{"$f":" RTD(\"cqg.rtd\",,\"StudyData\", $N$2, \"Bar\", \"\", \"Time\", $M$2, $F165,$R$2,$Q$2, \"\",\"False\")","v":44183.395833333336},{"$f":" RTD(\"cqg.rtd\",,\"StudyData\", $N$2, \"Bar\", \"\", \"Open\", $M$2, $F165, $R$2,$Q$2,,$O$2,$P$2)","v":310.14},{"$f":" RTD(\"cqg.rtd\",,\"StudyData\", $N$2, \"Bar\", \"\", \"High\", $M$2, $F165, $R$2,$Q$2,,$O$2,$P$2)","v":310.41000000000003},{"$f":" RTD(\"cqg.rtd\",,\"StudyData\", $N$2, \"Bar\", \"\", \"Low\", $M$2, $F165, $R$2,$Q$2,,$O$2,$P$2)","v":310.02},{"$f":" RTD(\"cqg.rtd\",,\"StudyData\", $N$2, \"Bar\", \"\", \"Close\", $M$2, $F165, $R$2,$Q$2,,$O$2,$P$2)","v":310.10000000000002},-164,null,44183.395833333336,{"$f":"RTD(\"cqg.rtd\",,\"StudyData\",$N$2, \"Vol\", \"VolType=Auto,CoCType=Auto\", \"Vol\", $M$2, $F165, $R$2,$Q$2,,$O$2,$P$2)","v":218252}]
[{"$f":" RTD(\"cqg.rtd\",,\"StudyData\", $N$2, \"Bar\", \"\", \"Time\", $M$2, $F166,$R$2,$Q$2, \"\",\"False\")","v":44183.392361111109},{"$f":" RTD(\"cqg.rtd\",,\"StudyData\", $N$2, \"Bar\", \"\", \"Open\", $M$2, $F166, $R$2,$Q$2,,$O$2,$P$2)","v":310.17},{"$f":" RTD(\"cqg.rtd\",,\"StudyData\", $N$2, \"Bar\", \"\", \"High\", $M$2, $F166, $R$2,$Q$2,,$O$2,$P$2)","v":310.39999999999998},{"$f":" RTD(\"cqg.rtd\",,\"StudyData\", $N$2, \"Bar\", \"\", \"Low\", $M$2, $F166, $R$2,$Q$2,,$O$2,$P$2)","v":309.85000000000002},{"$f":" RTD(\"cqg.rtd\",,\"StudyData\", $N$2, \"Bar\", \"\", \"Close\", $M$2, $F166, $R$2,$Q$2,,$O$2,$P$2)","v":310.13},-165,null,44183.392361111109,{"$f":"RTD(\"cqg.rtd\",,\"StudyData\",$N$2, \"Vol\", \"VolType=Auto,CoCType=Auto\", \"Vol\", $M$2, $F166, $R$2,$Q$2,,$O$2,$P$2)","v":324665}]
[{"$f":" RTD(\"cqg.rtd\",,\"StudyData\", $N$2, \"Bar\", \"\", \"Time\", $M$2, $F167,$R$2,$Q$2, \"\",\"False\")","v":44183.388888888891},{"$f":" RTD(\"cqg.rtd\",,\"StudyData\", $N$2, \"Bar\", \"\", \"Open\", $M$2, $F167, $R$2,$Q$2,,$O$2,$P$2)","v":310.47000000000003},{"$f":" RTD(\"cqg.rtd\",,\"StudyData\", $N$2, \"Bar\", \"\", \"High\", $M$2, $F167, $R$2,$Q$2,,$O$2,$P$2)","v":310.47000000000003},{"$f":" RTD(\"cqg.rtd\",,\"StudyData\", $N$2, \"Bar\", \"\", \"Low\", $M$2, $F167, $R$2,$Q$2,,$O$2,$P$2)","v":309.89},{"$f":" RTD(\"cqg.rtd\",,\"StudyData\", $N$2, \"Bar\", \"\", \"Close\", $M$2, $F167, $R$2,$Q$2,,$O$2,$P$2)","v":310.18},-166,null,44183.388888888891,{"$f":"RTD(\"cqg.rtd\",,\"StudyData\",$N$2, \"Vol\", \"VolType=Auto,CoCType=Auto\", \"Vol\", $M$2, $F167, $R$2,$Q$2,,$O$2,$P$2)","v":245670}]
[{"$f":" RTD(\"cqg.rtd\",,\"StudyData\", $N$2, \"Bar\", \"\", \"Time\", $M$2, $F168,$R$2,$Q$2, \"\",\"False\")","v":44183.385416666664},{"$f":" RTD(\"cqg.rtd\",,\"StudyData\", $N$2, \"Bar\", \"\", \"Open\", $M$2, $F168, $R$2,$Q$2,,$O$2,$P$2)","v":310.23},{"$f":" RTD(\"cqg.rtd\",,\"StudyData\", $N$2, \"Bar\", \"\", \"High\", $M$2, $F168, $R$2,$Q$2,,$O$2,$P$2)","v":310.55},{"$f":" RTD(\"cqg.rtd\",,\"StudyData\", $N$2, \"Bar\", \"\", \"Low\", $M$2, $F168, $R$2,$Q$2,,$O$2,$P$2)","v":310.02999999999997},{"$f":" RTD(\"cqg.rtd\",,\"StudyData\", $N$2, \"Bar\", \"\", \"Close\", $M$2, $F168, $R$2,$Q$2,,$O$2,$P$2)","v":310.45999999999998},-167,null,44183.385416666664,{"$f":"RTD(\"cqg.rtd\",,\"StudyData\",$N$2, \"Vol\", \"VolType=Auto,CoCType=Auto\", \"Vol\", $M$2, $F168, $R$2,$Q$2,,$O$2,$P$2)","v":305046}]
[{"$f":" RTD(\"cqg.rtd\",,\"StudyData\", $N$2, \"Bar\", \"\", \"Time\", $M$2, $F169,$R$2,$Q$2, \"\",\"False\")","v":44183.381944444445},{"$f":" RTD(\"cqg.rtd\",,\"StudyData\", $N$2, \"Bar\", \"\", \"Open\", $M$2, $F169, $R$2,$Q$2,,$O$2,$P$2)","v":309.99},{"$f":" RTD(\"cqg.rtd\",,\"StudyData\", $N$2, \"Bar\", \"\", \"High\", $M$2, $F169, $R$2,$Q$2,,$O$2,$P$2)","v":310.3},{"$f":" RTD(\"cqg.rtd\",,\"StudyData\", $N$2, \"Bar\", \"\", \"Low\", $M$2, $F169, $R$2,$Q$2,,$O$2,$P$2)","v":309.81},{"$f":" RTD(\"cqg.rtd\",,\"StudyData\", $N$2, \"Bar\", \"\", \"Close\", $M$2, $F169, $R$2,$Q$2,,$O$2,$P$2)","v":310.23},-168,null,44183.381944444445,{"$f":"RTD(\"cqg.rtd\",,\"StudyData\",$N$2, \"Vol\", \"VolType=Auto,CoCType=Auto\", \"Vol\", $M$2, $F169, $R$2,$Q$2,,$O$2,$P$2)","v":371030}]
[{"$f":" RTD(\"cqg.rtd\",,\"StudyData\", $N$2, \"Bar\", \"\", \"Time\", $M$2, $F170,$R$2,$Q$2, \"\",\"False\")","v":44183.378472222219},{"$f":" RTD(\"cqg.rtd\",,\"StudyData\", $N$2, \"Bar\", \"\", \"Open\", $M$2, $F170, $R$2,$Q$2,,$O$2,$P$2)","v":309.58999999999997},{"$f":" RTD(\"cqg.rtd\",,\"StudyData\", $N$2, \"Bar\", \"\", \"High\", $M$2, $F170, $R$2,$Q$2,,$O$2,$P$2)","v":310.05},{"$f":" RTD(\"cqg.rtd\",,\"StudyData\", $N$2, \"Bar\", \"\", \"Low\", $M$2, $F170, $R$2,$Q$2,,$O$2,$P$2)","v":309.51},{"$f":" RTD(\"cqg.rtd\",,\"StudyData\", $N$2, \"Bar\", \"\", \"Close\", $M$2, $F170, $R$2,$Q$2,,$O$2,$P$2)","v":310},-169,null,44183.378472222219,{"$f":"RTD(\"cqg.rtd\",,\"StudyData\",$N$2, \"Vol\", \"VolType=Auto,CoCType=Auto\", \"Vol\", $M$2, $F170, $R$2,$Q$2,,$O$2,$P$2)","v":503092}]
[{"$f":" RTD(\"cqg.rtd\",,\"StudyData\", $N$2, \"Bar\", \"\", \"Time\", $M$2, $F171,$R$2,$Q$2, \"\",\"False\")","v":44183.375},{"$f":" RTD(\"cqg.rtd\",,\"StudyData\", $N$2, \"Bar\", \"\", \"Open\", $M$2, $F171, $R$2,$Q$2,,$O$2,$P$2)","v":310.43},{"$f":" RTD(\"cqg.rtd\",,\"StudyData\", $N$2, \"Bar\", \"\", \"High\", $M$2, $F171, $R$2,$Q$2,,$O$2,$P$2)","v":310.43},{"$f":" RTD(\"cqg.rtd\",,\"StudyData\", $N$2, \"Bar\", \"\", \"Low\", $M$2, $F171, $R$2,$Q$2,,$O$2,$P$2)","v":309.41000000000003},{"$f":" RTD(\"cqg.rtd\",,\"StudyData\", $N$2, \"Bar\", \"\", \"Close\", $M$2, $F171, $R$2,$Q$2,,$O$2,$P$2)","v":309.57},-170,null,44183.375,{"$f":"RTD(\"cqg.rtd\",,\"StudyData\",$N$2, \"Vol\", \"VolType=Auto,CoCType=Auto\", \"Vol\", $M$2, $F171, $R$2,$Q$2,,$O$2,$P$2)","v":517844}]
[{"$f":" RTD(\"cqg.rtd\",,\"StudyData\", $N$2, \"Bar\", \"\", \"Time\", $M$2, $F172,$R$2,$Q$2, \"\",\"False\")","v":44183.371527777781},{"$f":" RTD(\"cqg.rtd\",,\"StudyData\", $N$2, \"Bar\", \"\", \"Open\", $M$2, $F172, $R$2,$Q$2,,$O$2,$P$2)","v":310.55},{"$f":" RTD(\"cqg.rtd\",,\"StudyData\", $N$2, \"Bar\", \"\", \"High\", $M$2, $F172, $R$2,$Q$2,,$O$2,$P$2)","v":310.64},{"$f":" RTD(\"cqg.rtd\",,\"StudyData\", $N$2, \"Bar\", \"\", \"Low\", $M$2, $F172, $R$2,$Q$2,,$O$2,$P$2)","v":310.33999999999997},{"$f":" RTD(\"cqg.rtd\",,\"StudyData\", $N$2, \"Bar\", \"\", \"Close\", $M$2, $F172, $R$2,$Q$2,,$O$2,$P$2)","v":310.45},-171,null,44183.371527777781,{"$f":"RTD(\"cqg.rtd\",,\"StudyData\",$N$2, \"Vol\", \"VolType=Auto,CoCType=Auto\", \"Vol\", $M$2, $F172, $R$2,$Q$2,,$O$2,$P$2)","v":316632}]
[{"$f":" RTD(\"cqg.rtd\",,\"StudyData\", $N$2, \"Bar\", \"\", \"Time\", $M$2, $F173,$R$2,$Q$2, \"\",\"False\")","v":44183.368055555555},{"$f":" RTD(\"cqg.rtd\",,\"StudyData\", $N$2, \"Bar\", \"\", \"Open\", $M$2, $F173, $R$2,$Q$2,,$O$2,$P$2)","v":310.76},{"$f":" RTD(\"cqg.rtd\",,\"StudyData\", $N$2, \"Bar\", \"\", \"High\", $M$2, $F173, $R$2,$Q$2,,$O$2,$P$2)","v":310.86},{"$f":" RTD(\"cqg.rtd\",,\"StudyData\", $N$2, \"Bar\", \"\", \"Low\", $M$2, $F173, $R$2,$Q$2,,$O$2,$P$2)","v":310.17},{"$f":" RTD(\"cqg.rtd\",,\"StudyData\", $N$2, \"Bar\", \"\", \"Close\", $M$2, $F173, $R$2,$Q$2,,$O$2,$P$2)","v":310.54000000000002},-172,null,44183.368055555555,{"$f":"RTD(\"cqg.rtd\",,\"StudyData\",$N$2, \"Vol\", \"VolType=Auto,CoCType=Auto\", \"Vol\", $M$2, $F173, $R$2,$Q$2,,$O$2,$P$2)","v":382035}]
[{"$f":" RTD(\"cqg.rtd\",,\"StudyData\", $N$2, \"Bar\", \"\", \"Time\", $M$2, $F174,$R$2,$Q$2, \"\",\"False\")","v":44183.364583333336},{"$f":" RTD(\"cqg.rtd\",,\"StudyData\", $N$2, \"Bar\", \"\", \"Open\", $M$2, $F174, $R$2,$Q$2,,$O$2,$P$2)","v":310.89999999999998},{"$f":" RTD(\"cqg.rtd\",,\"StudyData\", $N$2, \"Bar\", \"\", \"High\", $M$2, $F174, $R$2,$Q$2,,$O$2,$P$2)","v":310.95999999999998},{"$f":" RTD(\"cqg.rtd\",,\"StudyData\", $N$2, \"Bar\", \"\", \"Low\", $M$2, $F174, $R$2,$Q$2,,$O$2,$P$2)","v":310.52},{"$f":" RTD(\"cqg.rtd\",,\"StudyData\", $N$2, \"Bar\", \"\", \"Close\", $M$2, $F174, $R$2,$Q$2,,$O$2,$P$2)","v":310.75},-173,null,44183.364583333336,{"$f":"RTD(\"cqg.rtd\",,\"StudyData\",$N$2, \"Vol\", \"VolType=Auto,CoCType=Auto\", \"Vol\", $M$2, $F174, $R$2,$Q$2,,$O$2,$P$2)","v":403848}]
[{"$f":" RTD(\"cqg.rtd\",,\"StudyData\", $N$2, \"Bar\", \"\", \"Time\", $M$2, $F175,$R$2,$Q$2, \"\",\"False\")","v":44183.361111111109},{"$f":" RTD(\"cqg.rtd\",,\"StudyData\", $N$2, \"Bar\", \"\", \"Open\", $M$2, $F175, $R$2,$Q$2,,$O$2,$P$2)","v":311.31},{"$f":" RTD(\"cqg.rtd\",,\"StudyData\", $N$2, \"Bar\", \"\", \"High\", $M$2, $F175, $R$2,$Q$2,,$O$2,$P$2)","v":311.42},{"$f":" RTD(\"cqg.rtd\",,\"StudyData\", $N$2, \"Bar\", \"\", \"Low\", $M$2, $F175, $R$2,$Q$2,,$O$2,$P$2)","v":310.88},{"$f":" RTD(\"cqg.rtd\",,\"StudyData\", $N$2, \"Bar\", \"\", \"Close\", $M$2, $F175, $R$2,$Q$2,,$O$2,$P$2)","v":310.89999999999998},-174,null,44183.361111111109,{"$f":"RTD(\"cqg.rtd\",,\"StudyData\",$N$2, \"Vol\", \"VolType=Auto,CoCType=Auto\", \"Vol\", $M$2, $F175, $R$2,$Q$2,,$O$2,$P$2)","v":524558}]
[{"$f":" RTD(\"cqg.rtd\",,\"StudyData\", $N$2, \"Bar\", \"\", \"Time\", $M$2, $F176,$R$2,$Q$2, \"\",\"False\")","v":44183.357638888891},{"$f":" RTD(\"cqg.rtd\",,\"StudyData\", $N$2, \"Bar\", \"\", \"Open\", $M$2, $F176, $R$2,$Q$2,,$O$2,$P$2)","v":311.20999999999998},{"$f":" RTD(\"cqg.rtd\",,\"StudyData\", $N$2, \"Bar\", \"\", \"High\", $M$2, $F176, $R$2,$Q$2,,$O$2,$P$2)","v":311.32},{"$f":" RTD(\"cqg.rtd\",,\"StudyData\", $N$2, \"Bar\", \"\", \"Low\", $M$2, $F176, $R$2,$Q$2,,$O$2,$P$2)","v":311.05},{"$f":" RTD(\"cqg.rtd\",,\"StudyData\", $N$2, \"Bar\", \"\", \"Close\", $M$2, $F176, $R$2,$Q$2,,$O$2,$P$2)","v":311.3},-175,null,44183.357638888891,{"$f":"RTD(\"cqg.rtd\",,\"StudyData\",$N$2, \"Vol\", \"VolType=Auto,CoCType=Auto\", \"Vol\", $M$2, $F176, $R$2,$Q$2,,$O$2,$P$2)","v":483264}]
[{"$f":" RTD(\"cqg.rtd\",,\"StudyData\", $N$2, \"Bar\", \"\", \"Time\", $M$2, $F177,$R$2,$Q$2, \"\",\"False\")","v":44183.354166666664},{"$f":" RTD(\"cqg.rtd\",,\"StudyData\", $N$2, \"Bar\", \"\", \"Open\", $M$2, $F177, $R$2,$Q$2,,$O$2,$P$2)","v":311.66000000000003},{"$f":" RTD(\"cqg.rtd\",,\"StudyData\", $N$2, \"Bar\", \"\", \"High\", $M$2, $F177, $R$2,$Q$2,,$O$2,$P$2)","v":311.98},{"$f":" RTD(\"cqg.rtd\",,\"StudyData\", $N$2, \"Bar\", \"\", \"Low\", $M$2, $F177, $R$2,$Q$2,,$O$2,$P$2)","v":311.14999999999998},{"$f":" RTD(\"cqg.rtd\",,\"StudyData\", $N$2, \"Bar\", \"\", \"Close\", $M$2, $F177, $R$2,$Q$2,,$O$2,$P$2)","v":311.20999999999998},-176,null,44183.354166666664,{"$f":"RTD(\"cqg.rtd\",,\"StudyData\",$N$2, \"Vol\", \"VolType=Auto,CoCType=Auto\", \"Vol\", $M$2, $F177, $R$2,$Q$2,,$O$2,$P$2)","v":1134902}]
[{"$f":" RTD(\"cqg.rtd\",,\"StudyData\", $N$2, \"Bar\", \"\", \"Time\", $M$2, $F178,$R$2,$Q$2, \"\",\"False\")","v":44182.631944444445},{"$f":" RTD(\"cqg.rtd\",,\"StudyData\", $N$2, \"Bar\", \"\", \"Open\", $M$2, $F178, $R$2,$Q$2,,$O$2,$P$2)","v":311.2},{"$f":" RTD(\"cqg.rtd\",,\"StudyData\", $N$2, \"Bar\", \"\", \"High\", $M$2, $F178, $R$2,$Q$2,,$O$2,$P$2)","v":311.2},{"$f":" RTD(\"cqg.rtd\",,\"StudyData\", $N$2, \"Bar\", \"\", \"Low\", $M$2, $F178, $R$2,$Q$2,,$O$2,$P$2)","v":310.94},{"$f":" RTD(\"cqg.rtd\",,\"StudyData\", $N$2, \"Bar\", \"\", \"Close\", $M$2, $F178, $R$2,$Q$2,,$O$2,$P$2)","v":310.97000000000003},-177,null,44182.631944444445,{"$f":"RTD(\"cqg.rtd\",,\"StudyData\",$N$2, \"Vol\", \"VolType=Auto,CoCType=Auto\", \"Vol\", $M$2, $F178, $R$2,$Q$2,,$O$2,$P$2)","v":1670846}]
[{"$f":" RTD(\"cqg.rtd\",,\"StudyData\", $N$2, \"Bar\", \"\", \"Time\", $M$2, $F179,$R$2,$Q$2, \"\",\"False\")","v":44182.628472222219},{"$f":" RTD(\"cqg.rtd\",,\"StudyData\", $N$2, \"Bar\", \"\", \"Open\", $M$2, $F179, $R$2,$Q$2,,$O$2,$P$2)","v":311.2},{"$f":" RTD(\"cqg.rtd\",,\"StudyData\", $N$2, \"Bar\", \"\", \"High\", $M$2, $F179, $R$2,$Q$2,,$O$2,$P$2)","v":311.27},{"$f":" RTD(\"cqg.rtd\",,\"StudyData\", $N$2, \"Bar\", \"\", \"Low\", $M$2, $F179, $R$2,$Q$2,,$O$2,$P$2)","v":311.08999999999997},{"$f":" RTD(\"cqg.rtd\",,\"StudyData\", $N$2, \"Bar\", \"\", \"Close\", $M$2, $F179, $R$2,$Q$2,,$O$2,$P$2)","v":311.13},-178,null,44182.628472222219,{"$f":"RTD(\"cqg.rtd\",,\"StudyData\",$N$2, \"Vol\", \"VolType=Auto,CoCType=Auto\", \"Vol\", $M$2, $F179, $R$2,$Q$2,,$O$2,$P$2)","v":214440}]
[{"$f":" RTD(\"cqg.rtd\",,\"StudyData\", $N$2, \"Bar\", \"\", \"Time\", $M$2, $F180,$R$2,$Q$2, \"\",\"False\")","v":44182.625},{"$f":" RTD(\"cqg.rtd\",,\"StudyData\", $N$2, \"Bar\", \"\", \"Open\", $M$2, $F180, $R$2,$Q$2,,$O$2,$P$2)","v":310.99},{"$f":" RTD(\"cqg.rtd\",,\"StudyData\", $N$2, \"Bar\", \"\", \"High\", $M$2, $F180, $R$2,$Q$2,,$O$2,$P$2)","v":311.38},{"$f":" RTD(\"cqg.rtd\",,\"StudyData\", $N$2, \"Bar\", \"\", \"Low\", $M$2, $F180, $R$2,$Q$2,,$O$2,$P$2)","v":310.95999999999998},{"$f":" RTD(\"cqg.rtd\",,\"StudyData\", $N$2, \"Bar\", \"\", \"Close\", $M$2, $F180, $R$2,$Q$2,,$O$2,$P$2)","v":311.19},-179,null,44182.625,{"$f":"RTD(\"cqg.rtd\",,\"StudyData\",$N$2, \"Vol\", \"VolType=Auto,CoCType=Auto\", \"Vol\", $M$2, $F180, $R$2,$Q$2,,$O$2,$P$2)","v":576762}]
[{"$f":" RTD(\"cqg.rtd\",,\"StudyData\", $N$2, \"Bar\", \"\", \"Time\", $M$2, $F181,$R$2,$Q$2, \"\",\"False\")","v":44182.621527777781},{"$f":" RTD(\"cqg.rtd\",,\"StudyData\", $N$2, \"Bar\", \"\", \"Open\", $M$2, $F181, $R$2,$Q$2,,$O$2,$P$2)","v":311.07},{"$f":" RTD(\"cqg.rtd\",,\"StudyData\", $N$2, \"Bar\", \"\", \"High\", $M$2, $F181, $R$2,$Q$2,,$O$2,$P$2)","v":311.10000000000002},{"$f":" RTD(\"cqg.rtd\",,\"StudyData\", $N$2, \"Bar\", \"\", \"Low\", $M$2, $F181, $R$2,$Q$2,,$O$2,$P$2)","v":310.85000000000002},{"$f":" RTD(\"cqg.rtd\",,\"StudyData\", $N$2, \"Bar\", \"\", \"Close\", $M$2, $F181, $R$2,$Q$2,,$O$2,$P$2)","v":311},-180,null,44182.621527777781,{"$f":"RTD(\"cqg.rtd\",,\"StudyData\",$N$2, \"Vol\", \"VolType=Auto,CoCType=Auto\", \"Vol\", $M$2, $F181, $R$2,$Q$2,,$O$2,$P$2)","v":1160954}]
[{"$f":" RTD(\"cqg.rtd\",,\"StudyData\", $N$2, \"Bar\", \"\", \"Time\", $M$2, $F182,$R$2,$Q$2, \"\",\"False\")","v":44182.618055555555},{"$f":" RTD(\"cqg.rtd\",,\"StudyData\", $N$2, \"Bar\", \"\", \"Open\", $M$2, $F182, $R$2,$Q$2,,$O$2,$P$2)","v":310.52},{"$f":" RTD(\"cqg.rtd\",,\"StudyData\", $N$2, \"Bar\", \"\", \"High\", $M$2, $F182, $R$2,$Q$2,,$O$2,$P$2)","v":311.08999999999997},{"$f":" RTD(\"cqg.rtd\",,\"StudyData\", $N$2, \"Bar\", \"\", \"Low\", $M$2, $F182, $R$2,$Q$2,,$O$2,$P$2)","v":310.5},{"$f":" RTD(\"cqg.rtd\",,\"StudyData\", $N$2, \"Bar\", \"\", \"Close\", $M$2, $F182, $R$2,$Q$2,,$O$2,$P$2)","v":311.08},-181,null,44182.618055555555,{"$f":"RTD(\"cqg.rtd\",,\"StudyData\",$N$2, \"Vol\", \"VolType=Auto,CoCType=Auto\", \"Vol\", $M$2, $F182, $R$2,$Q$2,,$O$2,$P$2)","v":491487}]
[{"$f":" RTD(\"cqg.rtd\",,\"StudyData\", $N$2, \"Bar\", \"\", \"Time\", $M$2, $F183,$R$2,$Q$2, \"\",\"False\")","v":44182.614583333336},{"$f":" RTD(\"cqg.rtd\",,\"StudyData\", $N$2, \"Bar\", \"\", \"Open\", $M$2, $F183, $R$2,$Q$2,,$O$2,$P$2)","v":310.49},{"$f":" RTD(\"cqg.rtd\",,\"StudyData\", $N$2, \"Bar\", \"\", \"High\", $M$2, $F183, $R$2,$Q$2,,$O$2,$P$2)","v":310.55},{"$f":" RTD(\"cqg.rtd\",,\"StudyData\", $N$2, \"Bar\", \"\", \"Low\", $M$2, $F183, $R$2,$Q$2,,$O$2,$P$2)","v":310.37},{"$f":" RTD(\"cqg.rtd\",,\"StudyData\", $N$2, \"Bar\", \"\", \"Close\", $M$2, $F183, $R$2,$Q$2,,$O$2,$P$2)","v":310.52},-182,null,44182.614583333336,{"$f":"RTD(\"cqg.rtd\",,\"StudyData\",$N$2, \"Vol\", \"VolType=Auto,CoCType=Auto\", \"Vol\", $M$2, $F183, $R$2,$Q$2,,$O$2,$P$2)","v":310150}]
[{"$f":" RTD(\"cqg.rtd\",,\"StudyData\", $N$2, \"Bar\", \"\", \"Time\", $M$2, $F184,$R$2,$Q$2, \"\",\"False\")","v":44182.611111111109},{"$f":" RTD(\"cqg.rtd\",,\"StudyData\", $N$2, \"Bar\", \"\", \"Open\", $M$2, $F184, $R$2,$Q$2,,$O$2,$P$2)","v":310.39999999999998},{"$f":" RTD(\"cqg.rtd\",,\"StudyData\", $N$2, \"Bar\", \"\", \"High\", $M$2, $F184, $R$2,$Q$2,,$O$2,$P$2)","v":310.52999999999997},{"$f":" RTD(\"cqg.rtd\",,\"StudyData\", $N$2, \"Bar\", \"\", \"Low\", $M$2, $F184, $R$2,$Q$2,,$O$2,$P$2)","v":310.36},{"$f":" RTD(\"cqg.rtd\",,\"StudyData\", $N$2, \"Bar\", \"\", \"Close\", $M$2, $F184, $R$2,$Q$2,,$O$2,$P$2)","v":310.49},-183,null,44182.611111111109,{"$f":"RTD(\"cqg.rtd\",,\"StudyData\",$N$2, \"Vol\", \"VolType=Auto,CoCType=Auto\", \"Vol\", $M$2, $F184, $R$2,$Q$2,,$O$2,$P$2)","v":256048}]
[{"$f":" RTD(\"cqg.rtd\",,\"StudyData\", $N$2, \"Bar\", \"\", \"Time\", $M$2, $F185,$R$2,$Q$2, \"\",\"False\")","v":44182.607638888891},{"$f":" RTD(\"cqg.rtd\",,\"StudyData\", $N$2, \"Bar\", \"\", \"Open\", $M$2, $F185, $R$2,$Q$2,,$O$2,$P$2)","v":310.17},{"$f":" RTD(\"cqg.rtd\",,\"StudyData\", $N$2, \"Bar\", \"\", \"High\", $M$2, $F185, $R$2,$Q$2,,$O$2,$P$2)","v":310.5},{"$f":" RTD(\"cqg.rtd\",,\"StudyData\", $N$2, \"Bar\", \"\", \"Low\", $M$2, $F185, $R$2,$Q$2,,$O$2,$P$2)","v":310.12},{"$f":" RTD(\"cqg.rtd\",,\"StudyData\", $N$2, \"Bar\", \"\", \"Close\", $M$2, $F185, $R$2,$Q$2,,$O$2,$P$2)","v":310.41000000000003},-184,null,44182.607638888891,{"$f":"RTD(\"cqg.rtd\",,\"StudyData\",$N$2, \"Vol\", \"VolType=Auto,CoCType=Auto\", \"Vol\", $M$2, $F185, $R$2,$Q$2,,$O$2,$P$2)","v":195893}]
[{"$f":" RTD(\"cqg.rtd\",,\"StudyData\", $N$2, \"Bar\", \"\", \"Time\", $M$2, $F186,$R$2,$Q$2, \"\",\"False\")","v":44182.604166666664},{"$f":" RTD(\"cqg.rtd\",,\"StudyData\", $N$2, \"Bar\", \"\", \"Open\", $M$2, $F186, $R$2,$Q$2,,$O$2,$P$2)","v":310.19},{"$f":" RTD(\"cqg.rtd\",,\"StudyData\", $N$2, \"Bar\", \"\", \"High\", $M$2, $F186, $R$2,$Q$2,,$O$2,$P$2)","v":310.23},{"$f":" RTD(\"cqg.rtd\",,\"StudyData\", $N$2, \"Bar\", \"\", \"Low\", $M$2, $F186, $R$2,$Q$2,,$O$2,$P$2)","v":309.95},{"$f":" RTD(\"cqg.rtd\",,\"StudyData\", $N$2, \"Bar\", \"\", \"Close\", $M$2, $F186, $R$2,$Q$2,,$O$2,$P$2)","v":310.16000000000003},-185,null,44182.604166666664,{"$f":"RTD(\"cqg.rtd\",,\"StudyData\",$N$2, \"Vol\", \"VolType=Auto,CoCType=Auto\", \"Vol\", $M$2, $F186, $R$2,$Q$2,,$O$2,$P$2)","v":235004}]
[{"$f":" RTD(\"cqg.rtd\",,\"StudyData\", $N$2, \"Bar\", \"\", \"Time\", $M$2, $F187,$R$2,$Q$2, \"\",\"False\")","v":44182.600694444445},{"$f":" RTD(\"cqg.rtd\",,\"StudyData\", $N$2, \"Bar\", \"\", \"Open\", $M$2, $F187, $R$2,$Q$2,,$O$2,$P$2)","v":310.52999999999997},{"$f":" RTD(\"cqg.rtd\",,\"StudyData\", $N$2, \"Bar\", \"\", \"High\", $M$2, $F187, $R$2,$Q$2,,$O$2,$P$2)","v":310.52999999999997},{"$f":" RTD(\"cqg.rtd\",,\"StudyData\", $N$2, \"Bar\", \"\", \"Low\", $M$2, $F187, $R$2,$Q$2,,$O$2,$P$2)","v":310.19},{"$f":" RTD(\"cqg.rtd\",,\"StudyData\", $N$2, \"Bar\", \"\", \"Close\", $M$2, $F187, $R$2,$Q$2,,$O$2,$P$2)","v":310.19},-186,null,44182.600694444445,{"$f":"RTD(\"cqg.rtd\",,\"StudyData\",$N$2, \"Vol\", \"VolType=Auto,CoCType=Auto\", \"Vol\", $M$2, $F187, $R$2,$Q$2,,$O$2,$P$2)","v":76713}]
[{"$f":" RTD(\"cqg.rtd\",,\"StudyData\", $N$2, \"Bar\", \"\", \"Time\", $M$2, $F188,$R$2,$Q$2, \"\",\"False\")","v":44182.597222222219},{"$f":" RTD(\"cqg.rtd\",,\"StudyData\", $N$2, \"Bar\", \"\", \"Open\", $M$2, $F188, $R$2,$Q$2,,$O$2,$P$2)","v":310.41000000000003},{"$f":" RTD(\"cqg.rtd\",,\"StudyData\", $N$2, \"Bar\", \"\", \"High\", $M$2, $F188, $R$2,$Q$2,,$O$2,$P$2)","v":310.55},{"$f":" RTD(\"cqg.rtd\",,\"StudyData\", $N$2, \"Bar\", \"\", \"Low\", $M$2, $F188, $R$2,$Q$2,,$O$2,$P$2)","v":310.38},{"$f":" RTD(\"cqg.rtd\",,\"StudyData\", $N$2, \"Bar\", \"\", \"Close\", $M$2, $F188, $R$2,$Q$2,,$O$2,$P$2)","v":310.52},-187,null,44182.597222222219,{"$f":"RTD(\"cqg.rtd\",,\"StudyData\",$N$2, \"Vol\", \"VolType=Auto,CoCType=Auto\", \"Vol\", $M$2, $F188, $R$2,$Q$2,,$O$2,$P$2)","v":114687}]
[{"$f":" RTD(\"cqg.rtd\",,\"StudyData\", $N$2, \"Bar\", \"\", \"Time\", $M$2, $F189,$R$2,$Q$2, \"\",\"False\")","v":44182.59375},{"$f":" RTD(\"cqg.rtd\",,\"StudyData\", $N$2, \"Bar\", \"\", \"Open\", $M$2, $F189, $R$2,$Q$2,,$O$2,$P$2)","v":310.3},{"$f":" RTD(\"cqg.rtd\",,\"StudyData\", $N$2, \"Bar\", \"\", \"High\", $M$2, $F189, $R$2,$Q$2,,$O$2,$P$2)","v":310.52},{"$f":" RTD(\"cqg.rtd\",,\"StudyData\", $N$2, \"Bar\", \"\", \"Low\", $M$2, $F189, $R$2,$Q$2,,$O$2,$P$2)","v":310.29000000000002},{"$f":" RTD(\"cqg.rtd\",,\"StudyData\", $N$2, \"Bar\", \"\", \"Close\", $M$2, $F189, $R$2,$Q$2,,$O$2,$P$2)","v":310.41000000000003},-188,null,44182.59375,{"$f":"RTD(\"cqg.rtd\",,\"StudyData\",$N$2, \"Vol\", \"VolType=Auto,CoCType=Auto\", \"Vol\", $M$2, $F189, $R$2,$Q$2,,$O$2,$P$2)","v":101850}]
[{"$f":" RTD(\"cqg.rtd\",,\"StudyData\", $N$2, \"Bar\", \"\", \"Time\", $M$2, $F190,$R$2,$Q$2, \"\",\"False\")","v":44182.590277777781},{"$f":" RTD(\"cqg.rtd\",,\"StudyData\", $N$2, \"Bar\", \"\", \"Open\", $M$2, $F190, $R$2,$Q$2,,$O$2,$P$2)","v":310.31},{"$f":" RTD(\"cqg.rtd\",,\"StudyData\", $N$2, \"Bar\", \"\", \"High\", $M$2, $F190, $R$2,$Q$2,,$O$2,$P$2)","v":310.41000000000003},{"$f":" RTD(\"cqg.rtd\",,\"StudyData\", $N$2, \"Bar\", \"\", \"Low\", $M$2, $F190, $R$2,$Q$2,,$O$2,$P$2)","v":310.22000000000003},{"$f":" RTD(\"cqg.rtd\",,\"StudyData\", $N$2, \"Bar\", \"\", \"Close\", $M$2, $F190, $R$2,$Q$2,,$O$2,$P$2)","v":310.31},-189,null,44182.590277777781,{"$f":"RTD(\"cqg.rtd\",,\"StudyData\",$N$2, \"Vol\", \"VolType=Auto,CoCType=Auto\", \"Vol\", $M$2, $F190, $R$2,$Q$2,,$O$2,$P$2)","v":95115}]
[{"$f":" RTD(\"cqg.rtd\",,\"StudyData\", $N$2, \"Bar\", \"\", \"Time\", $M$2, $F191,$R$2,$Q$2, \"\",\"False\")","v":44182.586805555555},{"$f":" RTD(\"cqg.rtd\",,\"StudyData\", $N$2, \"Bar\", \"\", \"Open\", $M$2, $F191, $R$2,$Q$2,,$O$2,$P$2)","v":310.31},{"$f":" RTD(\"cqg.rtd\",,\"StudyData\", $N$2, \"Bar\", \"\", \"High\", $M$2, $F191, $R$2,$Q$2,,$O$2,$P$2)","v":310.36},{"$f":" RTD(\"cqg.rtd\",,\"StudyData\", $N$2, \"Bar\", \"\", \"Low\", $M$2, $F191, $R$2,$Q$2,,$O$2,$P$2)","v":310.17},{"$f":" RTD(\"cqg.rtd\",,\"StudyData\", $N$2, \"Bar\", \"\", \"Close\", $M$2, $F191, $R$2,$Q$2,,$O$2,$P$2)","v":310.31},-190,null,44182.586805555555,{"$f":"RTD(\"cqg.rtd\",,\"StudyData\",$N$2, \"Vol\", \"VolType=Auto,CoCType=Auto\", \"Vol\", $M$2, $F191, $R$2,$Q$2,,$O$2,$P$2)","v":107303}]
[{"$f":" RTD(\"cqg.rtd\",,\"StudyData\", $N$2, \"Bar\", \"\", \"Time\", $M$2, $F192,$R$2,$Q$2, \"\",\"False\")","v":44182.583333333336},{"$f":" RTD(\"cqg.rtd\",,\"StudyData\", $N$2, \"Bar\", \"\", \"Open\", $M$2, $F192, $R$2,$Q$2,,$O$2,$P$2)","v":310.52999999999997},{"$f":" RTD(\"cqg.rtd\",,\"StudyData\", $N$2, \"Bar\", \"\", \"High\", $M$2, $F192, $R$2,$Q$2,,$O$2,$P$2)","v":310.60000000000002},{"$f":" RTD(\"cqg.rtd\",,\"StudyData\", $N$2, \"Bar\", \"\", \"Low\", $M$2, $F192, $R$2,$Q$2,,$O$2,$P$2)","v":310.20999999999998},{"$f":" RTD(\"cqg.rtd\",,\"StudyData\", $N$2, \"Bar\", \"\", \"Close\", $M$2, $F192, $R$2,$Q$2,,$O$2,$P$2)","v":310.32},-191,null,44182.583333333336,{"$f":"RTD(\"cqg.rtd\",,\"StudyData\",$N$2, \"Vol\", \"VolType=Auto,CoCType=Auto\", \"Vol\", $M$2, $F192, $R$2,$Q$2,,$O$2,$P$2)","v":126427}]
[{"$f":" RTD(\"cqg.rtd\",,\"StudyData\", $N$2, \"Bar\", \"\", \"Time\", $M$2, $F193,$R$2,$Q$2, \"\",\"False\")","v":44182.579861111109},{"$f":" RTD(\"cqg.rtd\",,\"StudyData\", $N$2, \"Bar\", \"\", \"Open\", $M$2, $F193, $R$2,$Q$2,,$O$2,$P$2)","v":310.57},{"$f":" RTD(\"cqg.rtd\",,\"StudyData\", $N$2, \"Bar\", \"\", \"High\", $M$2, $F193, $R$2,$Q$2,,$O$2,$P$2)","v":310.64999999999998},{"$f":" RTD(\"cqg.rtd\",,\"StudyData\", $N$2, \"Bar\", \"\", \"Low\", $M$2, $F193, $R$2,$Q$2,,$O$2,$P$2)","v":310.49},{"$f":" RTD(\"cqg.rtd\",,\"StudyData\", $N$2, \"Bar\", \"\", \"Close\", $M$2, $F193, $R$2,$Q$2,,$O$2,$P$2)","v":310.51},-192,null,44182.579861111109,{"$f":"RTD(\"cqg.rtd\",,\"StudyData\",$N$2, \"Vol\", \"VolType=Auto,CoCType=Auto\", \"Vol\", $M$2, $F193, $R$2,$Q$2,,$O$2,$P$2)","v":84922}]
[{"$f":" RTD(\"cqg.rtd\",,\"StudyData\", $N$2, \"Bar\", \"\", \"Time\", $M$2, $F194,$R$2,$Q$2, \"\",\"False\")","v":44182.576388888891},{"$f":" RTD(\"cqg.rtd\",,\"StudyData\", $N$2, \"Bar\", \"\", \"Open\", $M$2, $F194, $R$2,$Q$2,,$O$2,$P$2)","v":310.56},{"$f":" RTD(\"cqg.rtd\",,\"StudyData\", $N$2, \"Bar\", \"\", \"High\", $M$2, $F194, $R$2,$Q$2,,$O$2,$P$2)","v":310.63},{"$f":" RTD(\"cqg.rtd\",,\"StudyData\", $N$2, \"Bar\", \"\", \"Low\", $M$2, $F194, $R$2,$Q$2,,$O$2,$P$2)","v":310.52999999999997},{"$f":" RTD(\"cqg.rtd\",,\"StudyData\", $N$2, \"Bar\", \"\", \"Close\", $M$2, $F194, $R$2,$Q$2,,$O$2,$P$2)","v":310.57},-193,null,{"$f":"A194","v":44182.576388888891},{"$f":"RTD(\"cqg.rtd\",,\"StudyData\",$N$2, \"Vol\", \"VolType=Auto,CoCType=Auto\", \"Vol\", $M$2, $F194, $R$2,$Q$2,,$O$2,$P$2)","v":84183}]
[{"$f":" RTD(\"cqg.rtd\",,\"StudyData\", $N$2, \"Bar\", \"\", \"Time\", $M$2, $F195,$R$2,$Q$2, \"\",\"False\")","v":44182.572916666664},{"$f":" RTD(\"cqg.rtd\",,\"StudyData\", $N$2, \"Bar\", \"\", \"Open\", $M$2, $F195, $R$2,$Q$2,,$O$2,$P$2)","v":310.38},{"$f":" RTD(\"cqg.rtd\",,\"StudyData\", $N$2, \"Bar\", \"\", \"High\", $M$2, $F195, $R$2,$Q$2,,$O$2,$P$2)","v":310.60000000000002},{"$f":" RTD(\"cqg.rtd\",,\"StudyData\", $N$2, \"Bar\", \"\", \"Low\", $M$2, $F195, $R$2,$Q$2,,$O$2,$P$2)","v":310.35000000000002},{"$f":" RTD(\"cqg.rtd\",,\"StudyData\", $N$2, \"Bar\", \"\", \"Close\", $M$2, $F195, $R$2,$Q$2,,$O$2,$P$2)","v":310.56},{"$f":"F194-1","v":-194},null,44182.572916666664,{"$f":"RTD(\"cqg.rtd\",,\"StudyData\",$N$2, \"Vol\", \"VolType=Auto,CoCType=Auto\", \"Vol\", $M$2, $F195, $R$2,$Q$2,,$O$2,$P$2)","v":115409}]
[{"$f":" RTD(\"cqg.rtd\",,\"StudyData\", $N$2, \"Bar\", \"\", \"Time\", $M$2, $F196,$R$2,$Q$2, \"\",\"False\")","v":44182.569444444445},{"$f":" RTD(\"cqg.rtd\",,\"StudyData\", $N$2, \"Bar\", \"\", \"Open\", $M$2, $F196, $R$2,$Q$2,,$O$2,$P$2)","v":310.41000000000003},{"$f":" RTD(\"cqg.rtd\",,\"StudyData\", $N$2, \"Bar\", \"\", \"High\", $M$2, $F196, $R$2,$Q$2,,$O$2,$P$2)","v":310.43},{"$f":" RTD(\"cqg.rtd\",,\"StudyData\", $N$2, \"Bar\", \"\", \"Low\", $M$2, $F196, $R$2,$Q$2,,$O$2,$P$2)","v":310.19},{"$f":" RTD(\"cqg.rtd\",,\"StudyData\", $N$2, \"Bar\", \"\", \"Close\", $M$2, $F196, $R$2,$Q$2,,$O$2,$P$2)","v":310.37},-195,null,44182.569444444445,{"$f":"RTD(\"cqg.rtd\",,\"StudyData\",$N$2, \"Vol\", \"VolType=Auto,CoCType=Auto\", \"Vol\", $M$2, $F196, $R$2,$Q$2,,$O$2,$P$2)","v":106295}]
[{"$f":" RTD(\"cqg.rtd\",,\"StudyData\", $N$2, \"Bar\", \"\", \"Time\", $M$2, $F197,$R$2,$Q$2, \"\",\"False\")","v":44182.565972222219},{"$f":" RTD(\"cqg.rtd\",,\"StudyData\", $N$2, \"Bar\", \"\", \"Open\", $M$2, $F197, $R$2,$Q$2,,$O$2,$P$2)","v":310.48},{"$f":" RTD(\"cqg.rtd\",,\"StudyData\", $N$2, \"Bar\", \"\", \"High\", $M$2, $F197, $R$2,$Q$2,,$O$2,$P$2)","v":310.51},{"$f":" RTD(\"cqg.rtd\",,\"StudyData\", $N$2, \"Bar\", \"\", \"Low\", $M$2, $F197, $R$2,$Q$2,,$O$2,$P$2)","v":310.25},{"$f":" RTD(\"cqg.rtd\",,\"StudyData\", $N$2, \"Bar\", \"\", \"Close\", $M$2, $F197, $R$2,$Q$2,,$O$2,$P$2)","v":310.41000000000003},-196,null,44182.565972222219,{"$f":"RTD(\"cqg.rtd\",,\"StudyData\",$N$2, \"Vol\", \"VolType=Auto,CoCType=Auto\", \"Vol\", $M$2, $F197, $R$2,$Q$2,,$O$2,$P$2)","v":91027}]
[{"$f":" RTD(\"cqg.rtd\",,\"StudyData\", $N$2, \"Bar\", \"\", \"Time\", $M$2, $F198,$R$2,$Q$2, \"\",\"False\")","v":44182.5625},{"$f":" RTD(\"cqg.rtd\",,\"StudyData\", $N$2, \"Bar\", \"\", \"Open\", $M$2, $F198, $R$2,$Q$2,,$O$2,$P$2)","v":310.49},{"$f":" RTD(\"cqg.rtd\",,\"StudyData\", $N$2, \"Bar\", \"\", \"High\", $M$2, $F198, $R$2,$Q$2,,$O$2,$P$2)","v":310.64},{"$f":" RTD(\"cqg.rtd\",,\"StudyData\", $N$2, \"Bar\", \"\", \"Low\", $M$2, $F198, $R$2,$Q$2,,$O$2,$P$2)","v":310.45},{"$f":" RTD(\"cqg.rtd\",,\"StudyData\", $N$2, \"Bar\", \"\", \"Close\", $M$2, $F198, $R$2,$Q$2,,$O$2,$P$2)","v":310.47000000000003},-197,null,44182.5625,{"$f":"RTD(\"cqg.rtd\",,\"StudyData\",$N$2, \"Vol\", \"VolType=Auto,CoCType=Auto\", \"Vol\", $M$2, $F198, $R$2,$Q$2,,$O$2,$P$2)","v":112543}]
[{"$f":" RTD(\"cqg.rtd\",,\"StudyData\", $N$2, \"Bar\", \"\", \"Time\", $M$2, $F199,$R$2,$Q$2, \"\",\"False\")","v":44182.559027777781},{"$f":" RTD(\"cqg.rtd\",,\"StudyData\", $N$2, \"Bar\", \"\", \"Open\", $M$2, $F199, $R$2,$Q$2,,$O$2,$P$2)","v":310.64},{"$f":" RTD(\"cqg.rtd\",,\"StudyData\", $N$2, \"Bar\", \"\", \"High\", $M$2, $F199, $R$2,$Q$2,,$O$2,$P$2)","v":310.66000000000003},{"$f":" RTD(\"cqg.rtd\",,\"StudyData\", $N$2, \"Bar\", \"\", \"Low\", $M$2, $F199, $R$2,$Q$2,,$O$2,$P$2)","v":310.43},{"$f":" RTD(\"cqg.rtd\",,\"StudyData\", $N$2, \"Bar\", \"\", \"Close\", $M$2, $F199, $R$2,$Q$2,,$O$2,$P$2)","v":310.47000000000003},-198,null,44182.559027777781,{"$f":"RTD(\"cqg.rtd\",,\"StudyData\",$N$2, \"Vol\", \"VolType=Auto,CoCType=Auto\", \"Vol\", $M$2, $F199, $R$2,$Q$2,,$O$2,$P$2)","v":104878}]
[{"$f":" RTD(\"cqg.rtd\",,\"StudyData\", $N$2, \"Bar\", \"\", \"Time\", $M$2, $F200,$R$2,$Q$2, \"\",\"False\")","v":44182.555555555555},{"$f":" RTD(\"cqg.rtd\",,\"StudyData\", $N$2, \"Bar\", \"\", \"Open\", $M$2, $F200, $R$2,$Q$2,,$O$2,$P$2)","v":310.7},{"$f":" RTD(\"cqg.rtd\",,\"StudyData\", $N$2, \"Bar\", \"\", \"High\", $M$2, $F200, $R$2,$Q$2,,$O$2,$P$2)","v":310.7},{"$f":" RTD(\"cqg.rtd\",,\"StudyData\", $N$2, \"Bar\", \"\", \"Low\", $M$2, $F200, $R$2,$Q$2,,$O$2,$P$2)","v":310.60000000000002},{"$f":" RTD(\"cqg.rtd\",,\"StudyData\", $N$2, \"Bar\", \"\", \"Close\", $M$2, $F200, $R$2,$Q$2,,$O$2,$P$2)","v":310.63},-199,null,44182.555555555555,{"$f":"RTD(\"cqg.rtd\",,\"StudyData\",$N$2, \"Vol\", \"VolType=Auto,CoCType=Auto\", \"Vol\", $M$2, $F200, $R$2,$Q$2,,$O$2,$P$2)","v":50812}]
[{"$f":" RTD(\"cqg.rtd\",,\"StudyData\", $N$2, \"Bar\", \"\", \"Time\", $M$2, $F201,$R$2,$Q$2, \"\",\"False\")","v":44182.552083333336},{"$f":" RTD(\"cqg.rtd\",,\"StudyData\", $N$2, \"Bar\", \"\", \"Open\", $M$2, $F201, $R$2,$Q$2,,$O$2,$P$2)","v":310.58},{"$f":" RTD(\"cqg.rtd\",,\"StudyData\", $N$2, \"Bar\", \"\", \"High\", $M$2, $F201, $R$2,$Q$2,,$O$2,$P$2)","v":310.74},{"$f":" RTD(\"cqg.rtd\",,\"StudyData\", $N$2, \"Bar\", \"\", \"Low\", $M$2, $F201, $R$2,$Q$2,,$O$2,$P$2)","v":310.58},{"$f":" RTD(\"cqg.rtd\",,\"StudyData\", $N$2, \"Bar\", \"\", \"Close\", $M$2, $F201, $R$2,$Q$2,,$O$2,$P$2)","v":310.7},-200,null,44182.552083333336,{"$f":"RTD(\"cqg.rtd\",,\"StudyData\",$N$2, \"Vol\", \"VolType=Auto,CoCType=Auto\", \"Vol\", $M$2, $F201, $R$2,$Q$2,,$O$2,$P$2)","v":84433}]
[{"$f":" RTD(\"cqg.rtd\",,\"StudyData\", $N$2, \"Bar\", \"\", \"Time\", $M$2, $F202,$R$2,$Q$2, \"\",\"False\")","v":44182.548611111109},{"$f":" RTD(\"cqg.rtd\",,\"StudyData\", $N$2, \"Bar\", \"\", \"Open\", $M$2, $F202, $R$2,$Q$2,,$O$2,$P$2)","v":310.58},{"$f":" RTD(\"cqg.rtd\",,\"StudyData\", $N$2, \"Bar\", \"\", \"High\", $M$2, $F202, $R$2,$Q$2,,$O$2,$P$2)","v":310.7},{"$f":" RTD(\"cqg.rtd\",,\"StudyData\", $N$2, \"Bar\", \"\", \"Low\", $M$2, $F202, $R$2,$Q$2,,$O$2,$P$2)","v":310.51},{"$f":" RTD(\"cqg.rtd\",,\"StudyData\", $N$2, \"Bar\", \"\", \"Close\", $M$2, $F202, $R$2,$Q$2,,$O$2,$P$2)","v":310.58},-201,null,44182.548611111109,{"$f":"RTD(\"cqg.rtd\",,\"StudyData\",$N$2, \"Vol\", \"VolType=Auto,CoCType=Auto\", \"Vol\", $M$2, $F202, $R$2,$Q$2,,$O$2,$P$2)","v":105184}]
[{"$f":" RTD(\"cqg.rtd\",,\"StudyData\", $N$2, \"Bar\", \"\", \"Time\", $M$2, $F203,$R$2,$Q$2, \"\",\"False\")","v":44182.545138888891},{"$f":" RTD(\"cqg.rtd\",,\"StudyData\", $N$2, \"Bar\", \"\", \"Open\", $M$2, $F203, $R$2,$Q$2,,$O$2,$P$2)","v":310.58},{"$f":" RTD(\"cqg.rtd\",,\"StudyData\", $N$2, \"Bar\", \"\", \"High\", $M$2, $F203, $R$2,$Q$2,,$O$2,$P$2)","v":310.69},{"$f":" RTD(\"cqg.rtd\",,\"StudyData\", $N$2, \"Bar\", \"\", \"Low\", $M$2, $F203, $R$2,$Q$2,,$O$2,$P$2)","v":310.52999999999997},{"$f":" RTD(\"cqg.rtd\",,\"StudyData\", $N$2, \"Bar\", \"\", \"Close\", $M$2, $F203, $R$2,$Q$2,,$O$2,$P$2)","v":310.58999999999997},-202,null,44182.545138888891,{"$f":"RTD(\"cqg.rtd\",,\"StudyData\",$N$2, \"Vol\", \"VolType=Auto,CoCType=Auto\", \"Vol\", $M$2, $F203, $R$2,$Q$2,,$O$2,$P$2)","v":99506}]
[{"$f":" RTD(\"cqg.rtd\",,\"StudyData\", $N$2, \"Bar\", \"\", \"Time\", $M$2, $F204,$R$2,$Q$2, \"\",\"False\")","v":44182.541666666664},{"$f":" RTD(\"cqg.rtd\",,\"StudyData\", $N$2, \"Bar\", \"\", \"Open\", $M$2, $F204, $R$2,$Q$2,,$O$2,$P$2)","v":310.63},{"$f":" RTD(\"cqg.rtd\",,\"StudyData\", $N$2, \"Bar\", \"\", \"High\", $M$2, $F204, $R$2,$Q$2,,$O$2,$P$2)","v":310.67},{"$f":" RTD(\"cqg.rtd\",,\"StudyData\", $N$2, \"Bar\", \"\", \"Low\", $M$2, $F204, $R$2,$Q$2,,$O$2,$P$2)","v":310.54000000000002},{"$f":" RTD(\"cqg.rtd\",,\"StudyData\", $N$2, \"Bar\", \"\", \"Close\", $M$2, $F204, $R$2,$Q$2,,$O$2,$P$2)","v":310.57},-203,null,44182.541666666664,{"$f":"RTD(\"cqg.rtd\",,\"StudyData\",$N$2, \"Vol\", \"VolType=Auto,CoCType=Auto\", \"Vol\", $M$2, $F204, $R$2,$Q$2,,$O$2,$P$2)","v":110548}]
[{"$f":" RTD(\"cqg.rtd\",,\"StudyData\", $N$2, \"Bar\", \"\", \"Time\", $M$2, $F205,$R$2,$Q$2, \"\",\"False\")","v":44182.538194444445},{"$f":" RTD(\"cqg.rtd\",,\"StudyData\", $N$2, \"Bar\", \"\", \"Open\", $M$2, $F205, $R$2,$Q$2,,$O$2,$P$2)","v":310.63},{"$f":" RTD(\"cqg.rtd\",,\"StudyData\", $N$2, \"Bar\", \"\", \"High\", $M$2, $F205, $R$2,$Q$2,,$O$2,$P$2)","v":310.7},{"$f":" RTD(\"cqg.rtd\",,\"StudyData\", $N$2, \"Bar\", \"\", \"Low\", $M$2, $F205, $R$2,$Q$2,,$O$2,$P$2)","v":310.58},{"$f":" RTD(\"cqg.rtd\",,\"StudyData\", $N$2, \"Bar\", \"\", \"Close\", $M$2, $F205, $R$2,$Q$2,,$O$2,$P$2)","v":310.63},-204,null,44182.538194444445,{"$f":"RTD(\"cqg.rtd\",,\"StudyData\",$N$2, \"Vol\", \"VolType=Auto,CoCType=Auto\", \"Vol\", $M$2, $F205, $R$2,$Q$2,,$O$2,$P$2)","v":129267}]
[{"$f":" RTD(\"cqg.rtd\",,\"StudyData\", $N$2, \"Bar\", \"\", \"Time\", $M$2, $F206,$R$2,$Q$2, \"\",\"False\")","v":44182.534722222219},{"$f":" RTD(\"cqg.rtd\",,\"StudyData\", $N$2, \"Bar\", \"\", \"Open\", $M$2, $F206, $R$2,$Q$2,,$O$2,$P$2)","v":310.55},{"$f":" RTD(\"cqg.rtd\",,\"StudyData\", $N$2, \"Bar\", \"\", \"High\", $M$2, $F206, $R$2,$Q$2,,$O$2,$P$2)","v":310.73},{"$f":" RTD(\"cqg.rtd\",,\"StudyData\", $N$2, \"Bar\", \"\", \"Low\", $M$2, $F206, $R$2,$Q$2,,$O$2,$P$2)","v":310.52},{"$f":" RTD(\"cqg.rtd\",,\"StudyData\", $N$2, \"Bar\", \"\", \"Close\", $M$2, $F206, $R$2,$Q$2,,$O$2,$P$2)","v":310.63},-205,null,44182.534722222219,{"$f":"RTD(\"cqg.rtd\",,\"StudyData\",$N$2, \"Vol\", \"VolType=Auto,CoCType=Auto\", \"Vol\", $M$2, $F206, $R$2,$Q$2,,$O$2,$P$2)","v":132369}]
[{"$f":" RTD(\"cqg.rtd\",,\"StudyData\", $N$2, \"Bar\", \"\", \"Time\", $M$2, $F207,$R$2,$Q$2, \"\",\"False\")","v":44182.53125},{"$f":" RTD(\"cqg.rtd\",,\"StudyData\", $N$2, \"Bar\", \"\", \"Open\", $M$2, $F207, $R$2,$Q$2,,$O$2,$P$2)","v":310.41000000000003},{"$f":" RTD(\"cqg.rtd\",,\"StudyData\", $N$2, \"Bar\", \"\", \"High\", $M$2, $F207, $R$2,$Q$2,,$O$2,$P$2)","v":310.57},{"$f":" RTD(\"cqg.rtd\",,\"StudyData\", $N$2, \"Bar\", \"\", \"Low\", $M$2, $F207, $R$2,$Q$2,,$O$2,$P$2)","v":310.35000000000002},{"$f":" RTD(\"cqg.rtd\",,\"StudyData\", $N$2, \"Bar\", \"\", \"Close\", $M$2, $F207, $R$2,$Q$2,,$O$2,$P$2)","v":310.56},-206,null,44182.53125,{"$f":"RTD(\"cqg.rtd\",,\"StudyData\",$N$2, \"Vol\", \"VolType=Auto,CoCType=Auto\", \"Vol\", $M$2, $F207, $R$2,$Q$2,,$O$2,$P$2)","v":82998}]
[{"$f":" RTD(\"cqg.rtd\",,\"StudyData\", $N$2, \"Bar\", \"\", \"Time\", $M$2, $F208,$R$2,$Q$2, \"\",\"False\")","v":44182.527777777781},{"$f":" RTD(\"cqg.rtd\",,\"StudyData\", $N$2, \"Bar\", \"\", \"Open\", $M$2, $F208, $R$2,$Q$2,,$O$2,$P$2)","v":310.23},{"$f":" RTD(\"cqg.rtd\",,\"StudyData\", $N$2, \"Bar\", \"\", \"High\", $M$2, $F208, $R$2,$Q$2,,$O$2,$P$2)","v":310.44},{"$f":" RTD(\"cqg.rtd\",,\"StudyData\", $N$2, \"Bar\", \"\", \"Low\", $M$2, $F208, $R$2,$Q$2,,$O$2,$P$2)","v":310.2},{"$f":" RTD(\"cqg.rtd\",,\"StudyData\", $N$2, \"Bar\", \"\", \"Close\", $M$2, $F208, $R$2,$Q$2,,$O$2,$P$2)","v":310.39999999999998},-207,null,44182.527777777781,{"$f":"RTD(\"cqg.rtd\",,\"StudyData\",$N$2, \"Vol\", \"VolType=Auto,CoCType=Auto\", \"Vol\", $M$2, $F208, $R$2,$Q$2,,$O$2,$P$2)","v":91285}]
[{"$f":" RTD(\"cqg.rtd\",,\"StudyData\", $N$2, \"Bar\", \"\", \"Time\", $M$2, $F209,$R$2,$Q$2, \"\",\"False\")","v":44182.524305555555},{"$f":" RTD(\"cqg.rtd\",,\"StudyData\", $N$2, \"Bar\", \"\", \"Open\", $M$2, $F209, $R$2,$Q$2,,$O$2,$P$2)","v":310.27999999999997},{"$f":" RTD(\"cqg.rtd\",,\"StudyData\", $N$2, \"Bar\", \"\", \"High\", $M$2, $F209, $R$2,$Q$2,,$O$2,$P$2)","v":310.35000000000002},{"$f":" RTD(\"cqg.rtd\",,\"StudyData\", $N$2, \"Bar\", \"\", \"Low\", $M$2, $F209, $R$2,$Q$2,,$O$2,$P$2)","v":310.14999999999998},{"$f":" RTD(\"cqg.rtd\",,\"StudyData\", $N$2, \"Bar\", \"\", \"Close\", $M$2, $F209, $R$2,$Q$2,,$O$2,$P$2)","v":310.24},-208,null,44182.524305555555,{"$f":"RTD(\"cqg.rtd\",,\"StudyData\",$N$2, \"Vol\", \"VolType=Auto,CoCType=Auto\", \"Vol\", $M$2, $F209, $R$2,$Q$2,,$O$2,$P$2)","v":82001}]
[{"$f":" RTD(\"cqg.rtd\",,\"StudyData\", $N$2, \"Bar\", \"\", \"Time\", $M$2, $F210,$R$2,$Q$2, \"\",\"False\")","v":44182.520833333336},{"$f":" RTD(\"cqg.rtd\",,\"StudyData\", $N$2, \"Bar\", \"\", \"Open\", $M$2, $F210, $R$2,$Q$2,,$O$2,$P$2)","v":310.33},{"$f":" RTD(\"cqg.rtd\",,\"StudyData\", $N$2, \"Bar\", \"\", \"High\", $M$2, $F210, $R$2,$Q$2,,$O$2,$P$2)","v":310.36},{"$f":" RTD(\"cqg.rtd\",,\"StudyData\", $N$2, \"Bar\", \"\", \"Low\", $M$2, $F210, $R$2,$Q$2,,$O$2,$P$2)","v":310.13},{"$f":" RTD(\"cqg.rtd\",,\"StudyData\", $N$2, \"Bar\", \"\", \"Close\", $M$2, $F210, $R$2,$Q$2,,$O$2,$P$2)","v":310.27999999999997},-209,null,44182.520833333336,{"$f":"RTD(\"cqg.rtd\",,\"StudyData\",$N$2, \"Vol\", \"VolType=Auto,CoCType=Auto\", \"Vol\", $M$2, $F210, $R$2,$Q$2,,$O$2,$P$2)","v":156464}]
[{"$f":" RTD(\"cqg.rtd\",,\"StudyData\", $N$2, \"Bar\", \"\", \"Time\", $M$2, $F211,$R$2,$Q$2, \"\",\"False\")","v":44182.517361111109},{"$f":" RTD(\"cqg.rtd\",,\"StudyData\", $N$2, \"Bar\", \"\", \"Open\", $M$2, $F211, $R$2,$Q$2,,$O$2,$P$2)","v":310.43},{"$f":" RTD(\"cqg.rtd\",,\"StudyData\", $N$2, \"Bar\", \"\", \"High\", $M$2, $F211, $R$2,$Q$2,,$O$2,$P$2)","v":310.5},{"$f":" RTD(\"cqg.rtd\",,\"StudyData\", $N$2, \"Bar\", \"\", \"Low\", $M$2, $F211, $R$2,$Q$2,,$O$2,$P$2)","v":310.31},{"$f":" RTD(\"cqg.rtd\",,\"StudyData\", $N$2, \"Bar\", \"\", \"Close\", $M$2, $F211, $R$2,$Q$2,,$O$2,$P$2)","v":310.33},-210,null,44182.517361111109,{"$f":"RTD(\"cqg.rtd\",,\"StudyData\",$N$2, \"Vol\", \"VolType=Auto,CoCType=Auto\", \"Vol\", $M$2, $F211, $R$2,$Q$2,,$O$2,$P$2)","v":67135}]
[{"$f":" RTD(\"cqg.rtd\",,\"StudyData\", $N$2, \"Bar\", \"\", \"Time\", $M$2, $F212,$R$2,$Q$2, \"\",\"False\")","v":44182.513888888891},{"$f":" RTD(\"cqg.rtd\",,\"StudyData\", $N$2, \"Bar\", \"\", \"Open\", $M$2, $F212, $R$2,$Q$2,,$O$2,$P$2)","v":310.3},{"$f":" RTD(\"cqg.rtd\",,\"StudyData\", $N$2, \"Bar\", \"\", \"High\", $M$2, $F212, $R$2,$Q$2,,$O$2,$P$2)","v":310.49},{"$f":" RTD(\"cqg.rtd\",,\"StudyData\", $N$2, \"Bar\", \"\", \"Low\", $M$2, $F212, $R$2,$Q$2,,$O$2,$P$2)","v":310.27999999999997},{"$f":" RTD(\"cqg.rtd\",,\"StudyData\", $N$2, \"Bar\", \"\", \"Close\", $M$2, $F212, $R$2,$Q$2,,$O$2,$P$2)","v":310.43},-211,null,44182.513888888891,{"$f":"RTD(\"cqg.rtd\",,\"StudyData\",$N$2, \"Vol\", \"VolType=Auto,CoCType=Auto\", \"Vol\", $M$2, $F212, $R$2,$Q$2,,$O$2,$P$2)","v":57939}]
[{"$f":" RTD(\"cqg.rtd\",,\"StudyData\", $N$2, \"Bar\", \"\", \"Time\", $M$2, $F213,$R$2,$Q$2, \"\",\"False\")","v":44182.510416666664},{"$f":" RTD(\"cqg.rtd\",,\"StudyData\", $N$2, \"Bar\", \"\", \"Open\", $M$2, $F213, $R$2,$Q$2,,$O$2,$P$2)","v":310.47000000000003},{"$f":" RTD(\"cqg.rtd\",,\"StudyData\", $N$2, \"Bar\", \"\", \"High\", $M$2, $F213, $R$2,$Q$2,,$O$2,$P$2)","v":310.48},{"$f":" RTD(\"cqg.rtd\",,\"StudyData\", $N$2, \"Bar\", \"\", \"Low\", $M$2, $F213, $R$2,$Q$2,,$O$2,$P$2)","v":310.23},{"$f":" RTD(\"cqg.rtd\",,\"StudyData\", $N$2, \"Bar\", \"\", \"Close\", $M$2, $F213, $R$2,$Q$2,,$O$2,$P$2)","v":310.29000000000002},-212,null,44182.510416666664,{"$f":"RTD(\"cqg.rtd\",,\"StudyData\",$N$2, \"Vol\", \"VolType=Auto,CoCType=Auto\", \"Vol\", $M$2, $F213, $R$2,$Q$2,,$O$2,$P$2)","v":103339}]
[{"$f":" RTD(\"cqg.rtd\",,\"StudyData\", $N$2, \"Bar\", \"\", \"Time\", $M$2, $F214,$R$2,$Q$2, \"\",\"False\")","v":44182.506944444445},{"$f":" RTD(\"cqg.rtd\",,\"StudyData\", $N$2, \"Bar\", \"\", \"Open\", $M$2, $F214, $R$2,$Q$2,,$O$2,$P$2)","v":310.54000000000002},{"$f":" RTD(\"cqg.rtd\",,\"StudyData\", $N$2, \"Bar\", \"\", \"High\", $M$2, $F214, $R$2,$Q$2,,$O$2,$P$2)","v":310.56},{"$f":" RTD(\"cqg.rtd\",,\"StudyData\", $N$2, \"Bar\", \"\", \"Low\", $M$2, $F214, $R$2,$Q$2,,$O$2,$P$2)","v":310.43},{"$f":" RTD(\"cqg.rtd\",,\"StudyData\", $N$2, \"Bar\", \"\", \"Close\", $M$2, $F214, $R$2,$Q$2,,$O$2,$P$2)","v":310.47000000000003},-213,null,44182.506944444445,{"$f":"RTD(\"cqg.rtd\",,\"StudyData\",$N$2, \"Vol\", \"VolType=Auto,CoCType=Auto\", \"Vol\", $M$2, $F214, $R$2,$Q$2,,$O$2,$P$2)","v":44738}]
[{"$f":" RTD(\"cqg.rtd\",,\"StudyData\", $N$2, \"Bar\", \"\", \"Time\", $M$2, $F215,$R$2,$Q$2, \"\",\"False\")","v":44182.503472222219},{"$f":" RTD(\"cqg.rtd\",,\"StudyData\", $N$2, \"Bar\", \"\", \"Open\", $M$2, $F215, $R$2,$Q$2,,$O$2,$P$2)","v":310.5},{"$f":" RTD(\"cqg.rtd\",,\"StudyData\", $N$2, \"Bar\", \"\", \"High\", $M$2, $F215, $R$2,$Q$2,,$O$2,$P$2)","v":310.63},{"$f":" RTD(\"cqg.rtd\",,\"StudyData\", $N$2, \"Bar\", \"\", \"Low\", $M$2, $F215, $R$2,$Q$2,,$O$2,$P$2)","v":310.45999999999998},{"$f":" RTD(\"cqg.rtd\",,\"StudyData\", $N$2, \"Bar\", \"\", \"Close\", $M$2, $F215, $R$2,$Q$2,,$O$2,$P$2)","v":310.52999999999997},-214,null,44182.503472222219,{"$f":"RTD(\"cqg.rtd\",,\"StudyData\",$N$2, \"Vol\", \"VolType=Auto,CoCType=Auto\", \"Vol\", $M$2, $F215, $R$2,$Q$2,,$O$2,$P$2)","v":77597}]
[{"$f":" RTD(\"cqg.rtd\",,\"StudyData\", $N$2, \"Bar\", \"\", \"Time\", $M$2, $F216,$R$2,$Q$2, \"\",\"False\")","v":44182.5},{"$f":" RTD(\"cqg.rtd\",,\"StudyData\", $N$2, \"Bar\", \"\", \"Open\", $M$2, $F216, $R$2,$Q$2,,$O$2,$P$2)","v":310.45},{"$f":" RTD(\"cqg.rtd\",,\"StudyData\", $N$2, \"Bar\", \"\", \"High\", $M$2, $F216, $R$2,$Q$2,,$O$2,$P$2)","v":310.56},{"$f":" RTD(\"cqg.rtd\",,\"StudyData\", $N$2, \"Bar\", \"\", \"Low\", $M$2, $F216, $R$2,$Q$2,,$O$2,$P$2)","v":310.39999999999998},{"$f":" RTD(\"cqg.rtd\",,\"StudyData\", $N$2, \"Bar\", \"\", \"Close\", $M$2, $F216, $R$2,$Q$2,,$O$2,$P$2)","v":310.5},-215,null,44182.5,{"$f":"RTD(\"cqg.rtd\",,\"StudyData\",$N$2, \"Vol\", \"VolType=Auto,CoCType=Auto\", \"Vol\", $M$2, $F216, $R$2,$Q$2,,$O$2,$P$2)","v":52655}]
[{"$f":" RTD(\"cqg.rtd\",,\"StudyData\", $N$2, \"Bar\", \"\", \"Time\", $M$2, $F217,$R$2,$Q$2, \"\",\"False\")","v":44182.496527777781},{"$f":" RTD(\"cqg.rtd\",,\"StudyData\", $N$2, \"Bar\", \"\", \"Open\", $M$2, $F217, $R$2,$Q$2,,$O$2,$P$2)","v":310.54000000000002},{"$f":" RTD(\"cqg.rtd\",,\"StudyData\", $N$2, \"Bar\", \"\", \"High\", $M$2, $F217, $R$2,$Q$2,,$O$2,$P$2)","v":310.57},{"$f":" RTD(\"cqg.rtd\",,\"StudyData\", $N$2, \"Bar\", \"\", \"Low\", $M$2, $F217, $R$2,$Q$2,,$O$2,$P$2)","v":310.44},{"$f":" RTD(\"cqg.rtd\",,\"StudyData\", $N$2, \"Bar\", \"\", \"Close\", $M$2, $F217, $R$2,$Q$2,,$O$2,$P$2)","v":310.44},-216,null,44182.496527777781,{"$f":"RTD(\"cqg.rtd\",,\"StudyData\",$N$2, \"Vol\", \"VolType=Auto,CoCType=Auto\", \"Vol\", $M$2, $F217, $R$2,$Q$2,,$O$2,$P$2)","v":85221}]
[{"$f":" RTD(\"cqg.rtd\",,\"StudyData\", $N$2, \"Bar\", \"\", \"Time\", $M$2, $F218,$R$2,$Q$2, \"\",\"False\")","v":44182.493055555555},{"$f":" RTD(\"cqg.rtd\",,\"StudyData\", $N$2, \"Bar\", \"\", \"Open\", $M$2, $F218, $R$2,$Q$2,,$O$2,$P$2)","v":310.51},{"$f":" RTD(\"cqg.rtd\",,\"StudyData\", $N$2, \"Bar\", \"\", \"High\", $M$2, $F218, $R$2,$Q$2,,$O$2,$P$2)","v":310.57},{"$f":" RTD(\"cqg.rtd\",,\"StudyData\", $N$2, \"Bar\", \"\", \"Low\", $M$2, $F218, $R$2,$Q$2,,$O$2,$P$2)","v":310.41000000000003},{"$f":" RTD(\"cqg.rtd\",,\"StudyData\", $N$2, \"Bar\", \"\", \"Close\", $M$2, $F218, $R$2,$Q$2,,$O$2,$P$2)","v":310.52999999999997},-217,null,44182.493055555555,{"$f":"RTD(\"cqg.rtd\",,\"StudyData\",$N$2, \"Vol\", \"VolType=Auto,CoCType=Auto\", \"Vol\", $M$2, $F218, $R$2,$Q$2,,$O$2,$P$2)","v":91245}]
[{"$f":" RTD(\"cqg.rtd\",,\"StudyData\", $N$2, \"Bar\", \"\", \"Time\", $M$2, $F219,$R$2,$Q$2, \"\",\"False\")","v":44182.489583333336},{"$f":" RTD(\"cqg.rtd\",,\"StudyData\", $N$2, \"Bar\", \"\", \"Open\", $M$2, $F219, $R$2,$Q$2,,$O$2,$P$2)","v":310.36},{"$f":" RTD(\"cqg.rtd\",,\"StudyData\", $N$2, \"Bar\", \"\", \"High\", $M$2, $F219, $R$2,$Q$2,,$O$2,$P$2)","v":310.54000000000002},{"$f":" RTD(\"cqg.rtd\",,\"StudyData\", $N$2, \"Bar\", \"\", \"Low\", $M$2, $F219, $R$2,$Q$2,,$O$2,$P$2)","v":310.35000000000002},{"$f":" RTD(\"cqg.rtd\",,\"StudyData\", $N$2, \"Bar\", \"\", \"Close\", $M$2, $F219, $R$2,$Q$2,,$O$2,$P$2)","v":310.51},-218,null,44182.489583333336,{"$f":"RTD(\"cqg.rtd\",,\"StudyData\",$N$2, \"Vol\", \"VolType=Auto,CoCType=Auto\", \"Vol\", $M$2, $F219, $R$2,$Q$2,,$O$2,$P$2)","v":92118}]
[{"$f":" RTD(\"cqg.rtd\",,\"StudyData\", $N$2, \"Bar\", \"\", \"Time\", $M$2, $F220,$R$2,$Q$2, \"\",\"False\")","v":44182.486111111109},{"$f":" RTD(\"cqg.rtd\",,\"StudyData\", $N$2, \"Bar\", \"\", \"Open\", $M$2, $F220, $R$2,$Q$2,,$O$2,$P$2)","v":310.08},{"$f":" RTD(\"cqg.rtd\",,\"StudyData\", $N$2, \"Bar\", \"\", \"High\", $M$2, $F220, $R$2,$Q$2,,$O$2,$P$2)","v":310.38},{"$f":" RTD(\"cqg.rtd\",,\"StudyData\", $N$2, \"Bar\", \"\", \"Low\", $M$2, $F220, $R$2,$Q$2,,$O$2,$P$2)","v":310.07},{"$f":" RTD(\"cqg.rtd\",,\"StudyData\", $N$2, \"Bar\", \"\", \"Close\", $M$2, $F220, $R$2,$Q$2,,$O$2,$P$2)","v":310.35000000000002},-219,null,44182.486111111109,{"$f":"RTD(\"cqg.rtd\",,\"StudyData\",$N$2, \"Vol\", \"VolType=Auto,CoCType=Auto\", \"Vol\", $M$2, $F220, $R$2,$Q$2,,$O$2,$P$2)","v":90776}]
[{"$f":" RTD(\"cqg.rtd\",,\"StudyData\", $N$2, \"Bar\", \"\", \"Time\", $M$2, $F221,$R$2,$Q$2, \"\",\"False\")","v":44182.482638888891},{"$f":" RTD(\"cqg.rtd\",,\"StudyData\", $N$2, \"Bar\", \"\", \"Open\", $M$2, $F221, $R$2,$Q$2,,$O$2,$P$2)","v":310.10000000000002},{"$f":" RTD(\"cqg.rtd\",,\"StudyData\", $N$2, \"Bar\", \"\", \"High\", $M$2, $F221, $R$2,$Q$2,,$O$2,$P$2)","v":310.11},{"$f":" RTD(\"cqg.rtd\",,\"StudyData\", $N$2, \"Bar\", \"\", \"Low\", $M$2, $F221, $R$2,$Q$2,,$O$2,$P$2)","v":309.94},{"$f":" RTD(\"cqg.rtd\",,\"StudyData\", $N$2, \"Bar\", \"\", \"Close\", $M$2, $F221, $R$2,$Q$2,,$O$2,$P$2)","v":310.07},-220,null,44182.482638888891,{"$f":"RTD(\"cqg.rtd\",,\"StudyData\",$N$2, \"Vol\", \"VolType=Auto,CoCType=Auto\", \"Vol\", $M$2, $F221, $R$2,$Q$2,,$O$2,$P$2)","v":78161}]
[{"$f":" RTD(\"cqg.rtd\",,\"StudyData\", $N$2, \"Bar\", \"\", \"Time\", $M$2, $F222,$R$2,$Q$2, \"\",\"False\")","v":44182.479166666664},{"$f":" RTD(\"cqg.rtd\",,\"StudyData\", $N$2, \"Bar\", \"\", \"Open\", $M$2, $F222, $R$2,$Q$2,,$O$2,$P$2)","v":310.19},{"$f":" RTD(\"cqg.rtd\",,\"StudyData\", $N$2, \"Bar\", \"\", \"High\", $M$2, $F222, $R$2,$Q$2,,$O$2,$P$2)","v":310.22000000000003},{"$f":" RTD(\"cqg.rtd\",,\"StudyData\", $N$2, \"Bar\", \"\", \"Low\", $M$2, $F222, $R$2,$Q$2,,$O$2,$P$2)","v":310.08},{"$f":" RTD(\"cqg.rtd\",,\"StudyData\", $N$2, \"Bar\", \"\", \"Close\", $M$2, $F222, $R$2,$Q$2,,$O$2,$P$2)","v":310.11},-221,null,44182.479166666664,{"$f":"RTD(\"cqg.rtd\",,\"StudyData\",$N$2, \"Vol\", \"VolType=Auto,CoCType=Auto\", \"Vol\", $M$2, $F222, $R$2,$Q$2,,$O$2,$P$2)","v":68018}]
[{"$f":" RTD(\"cqg.rtd\",,\"StudyData\", $N$2, \"Bar\", \"\", \"Time\", $M$2, $F223,$R$2,$Q$2, \"\",\"False\")","v":44182.475694444445},{"$f":" RTD(\"cqg.rtd\",,\"StudyData\", $N$2, \"Bar\", \"\", \"Open\", $M$2, $F223, $R$2,$Q$2,,$O$2,$P$2)","v":310.06},{"$f":" RTD(\"cqg.rtd\",,\"StudyData\", $N$2, \"Bar\", \"\", \"High\", $M$2, $F223, $R$2,$Q$2,,$O$2,$P$2)","v":310.25},{"$f":" RTD(\"cqg.rtd\",,\"StudyData\", $N$2, \"Bar\", \"\", \"Low\", $M$2, $F223, $R$2,$Q$2,,$O$2,$P$2)","v":309.95999999999998},{"$f":" RTD(\"cqg.rtd\",,\"StudyData\", $N$2, \"Bar\", \"\", \"Close\", $M$2, $F223, $R$2,$Q$2,,$O$2,$P$2)","v":310.18},-222,null,44182.475694444445,{"$f":"RTD(\"cqg.rtd\",,\"StudyData\",$N$2, \"Vol\", \"VolType=Auto,CoCType=Auto\", \"Vol\", $M$2, $F223, $R$2,$Q$2,,$O$2,$P$2)","v":110471}]
[{"$f":" RTD(\"cqg.rtd\",,\"StudyData\", $N$2, \"Bar\", \"\", \"Time\", $M$2, $F224,$R$2,$Q$2, \"\",\"False\")","v":44182.472222222219},{"$f":" RTD(\"cqg.rtd\",,\"StudyData\", $N$2, \"Bar\", \"\", \"Open\", $M$2, $F224, $R$2,$Q$2,,$O$2,$P$2)","v":309.94},{"$f":" RTD(\"cqg.rtd\",,\"StudyData\", $N$2, \"Bar\", \"\", \"High\", $M$2, $F224, $R$2,$Q$2,,$O$2,$P$2)","v":310.08},{"$f":" RTD(\"cqg.rtd\",,\"StudyData\", $N$2, \"Bar\", \"\", \"Low\", $M$2, $F224, $R$2,$Q$2,,$O$2,$P$2)","v":309.94},{"$f":" RTD(\"cqg.rtd\",,\"StudyData\", $N$2, \"Bar\", \"\", \"Close\", $M$2, $F224, $R$2,$Q$2,,$O$2,$P$2)","v":310.06},-223,null,44182.472222222219,{"$f":"RTD(\"cqg.rtd\",,\"StudyData\",$N$2, \"Vol\", \"VolType=Auto,CoCType=Auto\", \"Vol\", $M$2, $F224, $R$2,$Q$2,,$O$2,$P$2)","v":64709}]
[{"$f":" RTD(\"cqg.rtd\",,\"StudyData\", $N$2, \"Bar\", \"\", \"Time\", $M$2, $F225,$R$2,$Q$2, \"\",\"False\")","v":44182.46875},{"$f":" RTD(\"cqg.rtd\",,\"StudyData\", $N$2, \"Bar\", \"\", \"Open\", $M$2, $F225, $R$2,$Q$2,,$O$2,$P$2)","v":310.02},{"$f":" RTD(\"cqg.rtd\",,\"StudyData\", $N$2, \"Bar\", \"\", \"High\", $M$2, $F225, $R$2,$Q$2,,$O$2,$P$2)","v":310.11},{"$f":" RTD(\"cqg.rtd\",,\"StudyData\", $N$2, \"Bar\", \"\", \"Low\", $M$2, $F225, $R$2,$Q$2,,$O$2,$P$2)","v":309.77},{"$f":" RTD(\"cqg.rtd\",,\"StudyData\", $N$2, \"Bar\", \"\", \"Close\", $M$2, $F225, $R$2,$Q$2,,$O$2,$P$2)","v":309.98},-224,null,44182.46875,{"$f":"RTD(\"cqg.rtd\",,\"StudyData\",$N$2, \"Vol\", \"VolType=Auto,CoCType=Auto\", \"Vol\", $M$2, $F225, $R$2,$Q$2,,$O$2,$P$2)","v":169592}]
[{"$f":" RTD(\"cqg.rtd\",,\"StudyData\", $N$2, \"Bar\", \"\", \"Time\", $M$2, $F226,$R$2,$Q$2, \"\",\"False\")","v":44182.465277777781},{"$f":" RTD(\"cqg.rtd\",,\"StudyData\", $N$2, \"Bar\", \"\", \"Open\", $M$2, $F226, $R$2,$Q$2,,$O$2,$P$2)","v":310.14999999999998},{"$f":" RTD(\"cqg.rtd\",,\"StudyData\", $N$2, \"Bar\", \"\", \"High\", $M$2, $F226, $R$2,$Q$2,,$O$2,$P$2)","v":310.14999999999998},{"$f":" RTD(\"cqg.rtd\",,\"StudyData\", $N$2, \"Bar\", \"\", \"Low\", $M$2, $F226, $R$2,$Q$2,,$O$2,$P$2)","v":309.94},{"$f":" RTD(\"cqg.rtd\",,\"StudyData\", $N$2, \"Bar\", \"\", \"Close\", $M$2, $F226, $R$2,$Q$2,,$O$2,$P$2)","v":310.04000000000002},-225,null,44182.465277777781,{"$f":"RTD(\"cqg.rtd\",,\"StudyData\",$N$2, \"Vol\", \"VolType=Auto,CoCType=Auto\", \"Vol\", $M$2, $F226, $R$2,$Q$2,,$O$2,$P$2)","v":109553}]
[{"$f":" RTD(\"cqg.rtd\",,\"StudyData\", $N$2, \"Bar\", \"\", \"Time\", $M$2, $F227,$R$2,$Q$2, \"\",\"False\")","v":44182.461805555555},{"$f":" RTD(\"cqg.rtd\",,\"StudyData\", $N$2, \"Bar\", \"\", \"Open\", $M$2, $F227, $R$2,$Q$2,,$O$2,$P$2)","v":310.23},{"$f":" RTD(\"cqg.rtd\",,\"StudyData\", $N$2, \"Bar\", \"\", \"High\", $M$2, $F227, $R$2,$Q$2,,$O$2,$P$2)","v":310.33999999999997},{"$f":" RTD(\"cqg.rtd\",,\"StudyData\", $N$2, \"Bar\", \"\", \"Low\", $M$2, $F227, $R$2,$Q$2,,$O$2,$P$2)","v":310.08},{"$f":" RTD(\"cqg.rtd\",,\"StudyData\", $N$2, \"Bar\", \"\", \"Close\", $M$2, $F227, $R$2,$Q$2,,$O$2,$P$2)","v":310.14999999999998},-226,null,44182.461805555555,{"$f":"RTD(\"cqg.rtd\",,\"StudyData\",$N$2, \"Vol\", \"VolType=Auto,CoCType=Auto\", \"Vol\", $M$2, $F227, $R$2,$Q$2,,$O$2,$P$2)","v":140159}]
[{"$f":" RTD(\"cqg.rtd\",,\"StudyData\", $N$2, \"Bar\", \"\", \"Time\", $M$2, $F228,$R$2,$Q$2, \"\",\"False\")","v":44182.458333333336},{"$f":" RTD(\"cqg.rtd\",,\"StudyData\", $N$2, \"Bar\", \"\", \"Open\", $M$2, $F228, $R$2,$Q$2,,$O$2,$P$2)","v":310.08},{"$f":" RTD(\"cqg.rtd\",,\"StudyData\", $N$2, \"Bar\", \"\", \"High\", $M$2, $F228, $R$2,$Q$2,,$O$2,$P$2)","v":310.23},{"$f":" RTD(\"cqg.rtd\",,\"StudyData\", $N$2, \"Bar\", \"\", \"Low\", $M$2, $F228, $R$2,$Q$2,,$O$2,$P$2)","v":310.06},{"$f":" RTD(\"cqg.rtd\",,\"StudyData\", $N$2, \"Bar\", \"\", \"Close\", $M$2, $F228, $R$2,$Q$2,,$O$2,$P$2)","v":310.22000000000003},-227,null,44182.458333333336,{"$f":"RTD(\"cqg.rtd\",,\"StudyData\",$N$2, \"Vol\", \"VolType=Auto,CoCType=Auto\", \"Vol\", $M$2, $F228, $R$2,$Q$2,,$O$2,$P$2)","v":171311}]
[{"$f":" RTD(\"cqg.rtd\",,\"StudyData\", $N$2, \"Bar\", \"\", \"Time\", $M$2, $F229,$R$2,$Q$2, \"\",\"False\")","v":44182.454861111109},{"$f":" RTD(\"cqg.rtd\",,\"StudyData\", $N$2, \"Bar\", \"\", \"Open\", $M$2, $F229, $R$2,$Q$2,,$O$2,$P$2)","v":309.5},{"$f":" RTD(\"cqg.rtd\",,\"StudyData\", $N$2, \"Bar\", \"\", \"High\", $M$2, $F229, $R$2,$Q$2,,$O$2,$P$2)","v":310.08},{"$f":" RTD(\"cqg.rtd\",,\"StudyData\", $N$2, \"Bar\", \"\", \"Low\", $M$2, $F229, $R$2,$Q$2,,$O$2,$P$2)","v":309.44},{"$f":" RTD(\"cqg.rtd\",,\"StudyData\", $N$2, \"Bar\", \"\", \"Close\", $M$2, $F229, $R$2,$Q$2,,$O$2,$P$2)","v":310.08},-228,null,44182.454861111109,{"$f":"RTD(\"cqg.rtd\",,\"StudyData\",$N$2, \"Vol\", \"VolType=Auto,CoCType=Auto\", \"Vol\", $M$2, $F229, $R$2,$Q$2,,$O$2,$P$2)","v":221510}]
[{"$f":" RTD(\"cqg.rtd\",,\"StudyData\", $N$2, \"Bar\", \"\", \"Time\", $M$2, $F230,$R$2,$Q$2, \"\",\"False\")","v":44182.451388888891},{"$f":" RTD(\"cqg.rtd\",,\"StudyData\", $N$2, \"Bar\", \"\", \"Open\", $M$2, $F230, $R$2,$Q$2,,$O$2,$P$2)","v":309.73},{"$f":" RTD(\"cqg.rtd\",,\"StudyData\", $N$2, \"Bar\", \"\", \"High\", $M$2, $F230, $R$2,$Q$2,,$O$2,$P$2)","v":309.73},{"$f":" RTD(\"cqg.rtd\",,\"StudyData\", $N$2, \"Bar\", \"\", \"Low\", $M$2, $F230, $R$2,$Q$2,,$O$2,$P$2)","v":309.39},{"$f":" RTD(\"cqg.rtd\",,\"StudyData\", $N$2, \"Bar\", \"\", \"Close\", $M$2, $F230, $R$2,$Q$2,,$O$2,$P$2)","v":309.48},-229,null,44182.451388888891,{"$f":"RTD(\"cqg.rtd\",,\"StudyData\",$N$2, \"Vol\", \"VolType=Auto,CoCType=Auto\", \"Vol\", $M$2, $F230, $R$2,$Q$2,,$O$2,$P$2)","v":304862}]
[{"$f":" RTD(\"cqg.rtd\",,\"StudyData\", $N$2, \"Bar\", \"\", \"Time\", $M$2, $F231,$R$2,$Q$2, \"\",\"False\")","v":44182.447916666664},{"$f":" RTD(\"cqg.rtd\",,\"StudyData\", $N$2, \"Bar\", \"\", \"Open\", $M$2, $F231, $R$2,$Q$2,,$O$2,$P$2)","v":309.99},{"$f":" RTD(\"cqg.rtd\",,\"StudyData\", $N$2, \"Bar\", \"\", \"High\", $M$2, $F231, $R$2,$Q$2,,$O$2,$P$2)","v":310.07},{"$f":" RTD(\"cqg.rtd\",,\"StudyData\", $N$2, \"Bar\", \"\", \"Low\", $M$2, $F231, $R$2,$Q$2,,$O$2,$P$2)","v":309.70999999999998},{"$f":" RTD(\"cqg.rtd\",,\"StudyData\", $N$2, \"Bar\", \"\", \"Close\", $M$2, $F231, $R$2,$Q$2,,$O$2,$P$2)","v":309.73},-230,null,44182.447916666664,{"$f":"RTD(\"cqg.rtd\",,\"StudyData\",$N$2, \"Vol\", \"VolType=Auto,CoCType=Auto\", \"Vol\", $M$2, $F231, $R$2,$Q$2,,$O$2,$P$2)","v":191339}]
[{"$f":" RTD(\"cqg.rtd\",,\"StudyData\", $N$2, \"Bar\", \"\", \"Time\", $M$2, $F232,$R$2,$Q$2, \"\",\"False\")","v":44182.444444444445},{"$f":" RTD(\"cqg.rtd\",,\"StudyData\", $N$2, \"Bar\", \"\", \"Open\", $M$2, $F232, $R$2,$Q$2,,$O$2,$P$2)","v":310.02},{"$f":" RTD(\"cqg.rtd\",,\"StudyData\", $N$2, \"Bar\", \"\", \"High\", $M$2, $F232, $R$2,$Q$2,,$O$2,$P$2)","v":310.16000000000003},{"$f":" RTD(\"cqg.rtd\",,\"StudyData\", $N$2, \"Bar\", \"\", \"Low\", $M$2, $F232, $R$2,$Q$2,,$O$2,$P$2)","v":309.95},{"$f":" RTD(\"cqg.rtd\",,\"StudyData\", $N$2, \"Bar\", \"\", \"Close\", $M$2, $F232, $R$2,$Q$2,,$O$2,$P$2)","v":310},-231,null,44182.444444444445,{"$f":"RTD(\"cqg.rtd\",,\"StudyData\",$N$2, \"Vol\", \"VolType=Auto,CoCType=Auto\", \"Vol\", $M$2, $F232, $R$2,$Q$2,,$O$2,$P$2)","v":112955}]
[{"$f":" RTD(\"cqg.rtd\",,\"StudyData\", $N$2, \"Bar\", \"\", \"Time\", $M$2, $F233,$R$2,$Q$2, \"\",\"False\")","v":44182.440972222219},{"$f":" RTD(\"cqg.rtd\",,\"StudyData\", $N$2, \"Bar\", \"\", \"Open\", $M$2, $F233, $R$2,$Q$2,,$O$2,$P$2)","v":310.22000000000003},{"$f":" RTD(\"cqg.rtd\",,\"StudyData\", $N$2, \"Bar\", \"\", \"High\", $M$2, $F233, $R$2,$Q$2,,$O$2,$P$2)","v":310.23},{"$f":" RTD(\"cqg.rtd\",,\"StudyData\", $N$2, \"Bar\", \"\", \"Low\", $M$2, $F233, $R$2,$Q$2,,$O$2,$P$2)","v":309.98},{"$f":" RTD(\"cqg.rtd\",,\"StudyData\", $N$2, \"Bar\", \"\", \"Close\", $M$2, $F233, $R$2,$Q$2,,$O$2,$P$2)","v":310.02},-232,null,44182.440972222219,{"$f":"RTD(\"cqg.rtd\",,\"StudyData\",$N$2, \"Vol\", \"VolType=Auto,CoCType=Auto\", \"Vol\", $M$2, $F233, $R$2,$Q$2,,$O$2,$P$2)","v":127819}]
[{"$f":" RTD(\"cqg.rtd\",,\"StudyData\", $N$2, \"Bar\", \"\", \"Time\", $M$2, $F234,$R$2,$Q$2, \"\",\"False\")","v":44182.4375},{"$f":" RTD(\"cqg.rtd\",,\"StudyData\", $N$2, \"Bar\", \"\", \"Open\", $M$2, $F234, $R$2,$Q$2,,$O$2,$P$2)","v":310.37},{"$f":" RTD(\"cqg.rtd\",,\"StudyData\", $N$2, \"Bar\", \"\", \"High\", $M$2, $F234, $R$2,$Q$2,,$O$2,$P$2)","v":310.39999999999998},{"$f":" RTD(\"cqg.rtd\",,\"StudyData\", $N$2, \"Bar\", \"\", \"Low\", $M$2, $F234, $R$2,$Q$2,,$O$2,$P$2)","v":310.08},{"$f":" RTD(\"cqg.rtd\",,\"StudyData\", $N$2, \"Bar\", \"\", \"Close\", $M$2, $F234, $R$2,$Q$2,,$O$2,$P$2)","v":310.22000000000003},-233,null,44182.4375,{"$f":"RTD(\"cqg.rtd\",,\"StudyData\",$N$2, \"Vol\", \"VolType=Auto,CoCType=Auto\", \"Vol\", $M$2, $F234, $R$2,$Q$2,,$O$2,$P$2)","v":151482}]
[{"$f":" RTD(\"cqg.rtd\",,\"StudyData\", $N$2, \"Bar\", \"\", \"Time\", $M$2, $F235,$R$2,$Q$2, \"\",\"False\")","v":44182.434027777781},{"$f":" RTD(\"cqg.rtd\",,\"StudyData\", $N$2, \"Bar\", \"\", \"Open\", $M$2, $F235, $R$2,$Q$2,,$O$2,$P$2)","v":310.3},{"$f":" RTD(\"cqg.rtd\",,\"StudyData\", $N$2, \"Bar\", \"\", \"High\", $M$2, $F235, $R$2,$Q$2,,$O$2,$P$2)","v":310.42},{"$f":" RTD(\"cqg.rtd\",,\"StudyData\", $N$2, \"Bar\", \"\", \"Low\", $M$2, $F235, $R$2,$Q$2,,$O$2,$P$2)","v":310.16000000000003},{"$f":" RTD(\"cqg.rtd\",,\"StudyData\", $N$2, \"Bar\", \"\", \"Close\", $M$2, $F235, $R$2,$Q$2,,$O$2,$P$2)","v":310.36},-234,null,44182.434027777781,{"$f":"RTD(\"cqg.rtd\",,\"StudyData\",$N$2, \"Vol\", \"VolType=Auto,CoCType=Auto\", \"Vol\", $M$2, $F235, $R$2,$Q$2,,$O$2,$P$2)","v":130494}]
[{"$f":" RTD(\"cqg.rtd\",,\"StudyData\", $N$2, \"Bar\", \"\", \"Time\", $M$2, $F236,$R$2,$Q$2, \"\",\"False\")","v":44182.430555555555},{"$f":" RTD(\"cqg.rtd\",,\"StudyData\", $N$2, \"Bar\", \"\", \"Open\", $M$2, $F236, $R$2,$Q$2,,$O$2,$P$2)","v":310.08999999999997},{"$f":" RTD(\"cqg.rtd\",,\"StudyData\", $N$2, \"Bar\", \"\", \"High\", $M$2, $F236, $R$2,$Q$2,,$O$2,$P$2)","v":310.31},{"$f":" RTD(\"cqg.rtd\",,\"StudyData\", $N$2, \"Bar\", \"\", \"Low\", $M$2, $F236, $R$2,$Q$2,,$O$2,$P$2)","v":309.92},{"$f":" RTD(\"cqg.rtd\",,\"StudyData\", $N$2, \"Bar\", \"\", \"Close\", $M$2, $F236, $R$2,$Q$2,,$O$2,$P$2)","v":310.29000000000002},-235,null,44182.430555555555,{"$f":"RTD(\"cqg.rtd\",,\"StudyData\",$N$2, \"Vol\", \"VolType=Auto,CoCType=Auto\", \"Vol\", $M$2, $F236, $R$2,$Q$2,,$O$2,$P$2)","v":162575}]
[{"$f":" RTD(\"cqg.rtd\",,\"StudyData\", $N$2, \"Bar\", \"\", \"Time\", $M$2, $F237,$R$2,$Q$2, \"\",\"False\")","v":44182.427083333336},{"$f":" RTD(\"cqg.rtd\",,\"StudyData\", $N$2, \"Bar\", \"\", \"Open\", $M$2, $F237, $R$2,$Q$2,,$O$2,$P$2)","v":309.99},{"$f":" RTD(\"cqg.rtd\",,\"StudyData\", $N$2, \"Bar\", \"\", \"High\", $M$2, $F237, $R$2,$Q$2,,$O$2,$P$2)","v":310.37},{"$f":" RTD(\"cqg.rtd\",,\"StudyData\", $N$2, \"Bar\", \"\", \"Low\", $M$2, $F237, $R$2,$Q$2,,$O$2,$P$2)","v":309.95999999999998},{"$f":" RTD(\"cqg.rtd\",,\"StudyData\", $N$2, \"Bar\", \"\", \"Close\", $M$2, $F237, $R$2,$Q$2,,$O$2,$P$2)","v":310.12},-236,null,44182.427083333336,{"$f":"RTD(\"cqg.rtd\",,\"StudyData\",$N$2, \"Vol\", \"VolType=Auto,CoCType=Auto\", \"Vol\", $M$2, $F237, $R$2,$Q$2,,$O$2,$P$2)","v":189059}]
[{"$f":" RTD(\"cqg.rtd\",,\"StudyData\", $N$2, \"Bar\", \"\", \"Time\", $M$2, $F238,$R$2,$Q$2, \"\",\"False\")","v":44182.423611111109},{"$f":" RTD(\"cqg.rtd\",,\"StudyData\", $N$2, \"Bar\", \"\", \"Open\", $M$2, $F238, $R$2,$Q$2,,$O$2,$P$2)","v":310.27999999999997},{"$f":" RTD(\"cqg.rtd\",,\"StudyData\", $N$2, \"Bar\", \"\", \"High\", $M$2, $F238, $R$2,$Q$2,,$O$2,$P$2)","v":310.29000000000002},{"$f":" RTD(\"cqg.rtd\",,\"StudyData\", $N$2, \"Bar\", \"\", \"Low\", $M$2, $F238, $R$2,$Q$2,,$O$2,$P$2)","v":309.97000000000003},{"$f":" RTD(\"cqg.rtd\",,\"StudyData\", $N$2, \"Bar\", \"\", \"Close\", $M$2, $F238, $R$2,$Q$2,,$O$2,$P$2)","v":310},-237,null,44182.423611111109,{"$f":"RTD(\"cqg.rtd\",,\"StudyData\",$N$2, \"Vol\", \"VolType=Auto,CoCType=Auto\", \"Vol\", $M$2, $F238, $R$2,$Q$2,,$O$2,$P$2)","v":158296}]
[{"$f":" RTD(\"cqg.rtd\",,\"StudyData\", $N$2, \"Bar\", \"\", \"Time\", $M$2, $F239,$R$2,$Q$2, \"\",\"False\")","v":44182.420138888891},{"$f":" RTD(\"cqg.rtd\",,\"StudyData\", $N$2, \"Bar\", \"\", \"Open\", $M$2, $F239, $R$2,$Q$2,,$O$2,$P$2)","v":310.02},{"$f":" RTD(\"cqg.rtd\",,\"StudyData\", $N$2, \"Bar\", \"\", \"High\", $M$2, $F239, $R$2,$Q$2,,$O$2,$P$2)","v":310.29000000000002},{"$f":" RTD(\"cqg.rtd\",,\"StudyData\", $N$2, \"Bar\", \"\", \"Low\", $M$2, $F239, $R$2,$Q$2,,$O$2,$P$2)","v":310.02},{"$f":" RTD(\"cqg.rtd\",,\"StudyData\", $N$2, \"Bar\", \"\", \"Close\", $M$2, $F239, $R$2,$Q$2,,$O$2,$P$2)","v":310.27999999999997},-238,null,44182.420138888891,{"$f":"RTD(\"cqg.rtd\",,\"StudyData\",$N$2, \"Vol\", \"VolType=Auto,CoCType=Auto\", \"Vol\", $M$2, $F239, $R$2,$Q$2,,$O$2,$P$2)","v":147340}]
[{"$f":" RTD(\"cqg.rtd\",,\"StudyData\", $N$2, \"Bar\", \"\", \"Time\", $M$2, $F240,$R$2,$Q$2, \"\",\"False\")","v":44182.416666666664},{"$f":" RTD(\"cqg.rtd\",,\"StudyData\", $N$2, \"Bar\", \"\", \"Open\", $M$2, $F240, $R$2,$Q$2,,$O$2,$P$2)","v":309.83999999999997},{"$f":" RTD(\"cqg.rtd\",,\"StudyData\", $N$2, \"Bar\", \"\", \"High\", $M$2, $F240, $R$2,$Q$2,,$O$2,$P$2)","v":310.19},{"$f":" RTD(\"cqg.rtd\",,\"StudyData\", $N$2, \"Bar\", \"\", \"Low\", $M$2, $F240, $R$2,$Q$2,,$O$2,$P$2)","v":309.77},{"$f":" RTD(\"cqg.rtd\",,\"StudyData\", $N$2, \"Bar\", \"\", \"Close\", $M$2, $F240, $R$2,$Q$2,,$O$2,$P$2)","v":310.02},-239,null,44182.416666666664,{"$f":"RTD(\"cqg.rtd\",,\"StudyData\",$N$2, \"Vol\", \"VolType=Auto,CoCType=Auto\", \"Vol\", $M$2, $F240, $R$2,$Q$2,,$O$2,$P$2)","v":192063}]
[{"$f":" RTD(\"cqg.rtd\",,\"StudyData\", $N$2, \"Bar\", \"\", \"Time\", $M$2, $F241,$R$2,$Q$2, \"\",\"False\")","v":44182.413194444445},{"$f":" RTD(\"cqg.rtd\",,\"StudyData\", $N$2, \"Bar\", \"\", \"Open\", $M$2, $F241, $R$2,$Q$2,,$O$2,$P$2)","v":310.19},{"$f":" RTD(\"cqg.rtd\",,\"StudyData\", $N$2, \"Bar\", \"\", \"High\", $M$2, $F241, $R$2,$Q$2,,$O$2,$P$2)","v":310.27999999999997},{"$f":" RTD(\"cqg.rtd\",,\"StudyData\", $N$2, \"Bar\", \"\", \"Low\", $M$2, $F241, $R$2,$Q$2,,$O$2,$P$2)","v":309.75},{"$f":" RTD(\"cqg.rtd\",,\"StudyData\", $N$2, \"Bar\", \"\", \"Close\", $M$2, $F241, $R$2,$Q$2,,$O$2,$P$2)","v":309.82},-240,null,44182.413194444445,{"$f":"RTD(\"cqg.rtd\",,\"StudyData\",$N$2, \"Vol\", \"VolType=Auto,CoCType=Auto\", \"Vol\", $M$2, $F241, $R$2,$Q$2,,$O$2,$P$2)","v":167072}]
[{"$f":" RTD(\"cqg.rtd\",,\"StudyData\", $N$2, \"Bar\", \"\", \"Time\", $M$2, $F242,$R$2,$Q$2, \"\",\"False\")","v":44182.409722222219},{"$f":" RTD(\"cqg.rtd\",,\"StudyData\", $N$2, \"Bar\", \"\", \"Open\", $M$2, $F242, $R$2,$Q$2,,$O$2,$P$2)","v":310.36},{"$f":" RTD(\"cqg.rtd\",,\"StudyData\", $N$2, \"Bar\", \"\", \"High\", $M$2, $F242, $R$2,$Q$2,,$O$2,$P$2)","v":310.45999999999998},{"$f":" RTD(\"cqg.rtd\",,\"StudyData\", $N$2, \"Bar\", \"\", \"Low\", $M$2, $F242, $R$2,$Q$2,,$O$2,$P$2)","v":310.06},{"$f":" RTD(\"cqg.rtd\",,\"StudyData\", $N$2, \"Bar\", \"\", \"Close\", $M$2, $F242, $R$2,$Q$2,,$O$2,$P$2)","v":310.19},-241,null,44182.409722222219,{"$f":"RTD(\"cqg.rtd\",,\"StudyData\",$N$2, \"Vol\", \"VolType=Auto,CoCType=Auto\", \"Vol\", $M$2, $F242, $R$2,$Q$2,,$O$2,$P$2)","v":141145}]
[{"$f":" RTD(\"cqg.rtd\",,\"StudyData\", $N$2, \"Bar\", \"\", \"Time\", $M$2, $F243,$R$2,$Q$2, \"\",\"False\")","v":44182.40625},{"$f":" RTD(\"cqg.rtd\",,\"StudyData\", $N$2, \"Bar\", \"\", \"Open\", $M$2, $F243, $R$2,$Q$2,,$O$2,$P$2)","v":310.38},{"$f":" RTD(\"cqg.rtd\",,\"StudyData\", $N$2, \"Bar\", \"\", \"High\", $M$2, $F243, $R$2,$Q$2,,$O$2,$P$2)","v":310.63},{"$f":" RTD(\"cqg.rtd\",,\"StudyData\", $N$2, \"Bar\", \"\", \"Low\", $M$2, $F243, $R$2,$Q$2,,$O$2,$P$2)","v":310.31},{"$f":" RTD(\"cqg.rtd\",,\"StudyData\", $N$2, \"Bar\", \"\", \"Close\", $M$2, $F243, $R$2,$Q$2,,$O$2,$P$2)","v":310.38},-242,null,44182.40625,{"$f":"RTD(\"cqg.rtd\",,\"StudyData\",$N$2, \"Vol\", \"VolType=Auto,CoCType=Auto\", \"Vol\", $M$2, $F243, $R$2,$Q$2,,$O$2,$P$2)","v":239087}]
[{"$f":" RTD(\"cqg.rtd\",,\"StudyData\", $N$2, \"Bar\", \"\", \"Time\", $M$2, $F244,$R$2,$Q$2, \"\",\"False\")","v":44182.402777777781},{"$f":" RTD(\"cqg.rtd\",,\"StudyData\", $N$2, \"Bar\", \"\", \"Open\", $M$2, $F244, $R$2,$Q$2,,$O$2,$P$2)","v":310.68},{"$f":" RTD(\"cqg.rtd\",,\"StudyData\", $N$2, \"Bar\", \"\", \"High\", $M$2, $F244, $R$2,$Q$2,,$O$2,$P$2)","v":310.7},{"$f":" RTD(\"cqg.rtd\",,\"StudyData\", $N$2, \"Bar\", \"\", \"Low\", $M$2, $F244, $R$2,$Q$2,,$O$2,$P$2)","v":310.10000000000002},{"$f":" RTD(\"cqg.rtd\",,\"StudyData\", $N$2, \"Bar\", \"\", \"Close\", $M$2, $F244, $R$2,$Q$2,,$O$2,$P$2)","v":310.38},-243,null,44182.402777777781,{"$f":"RTD(\"cqg.rtd\",,\"StudyData\",$N$2, \"Vol\", \"VolType=Auto,CoCType=Auto\", \"Vol\", $M$2, $F244, $R$2,$Q$2,,$O$2,$P$2)","v":286573}]
[{"$f":" RTD(\"cqg.rtd\",,\"StudyData\", $N$2, \"Bar\", \"\", \"Time\", $M$2, $F245,$R$2,$Q$2, \"\",\"False\")","v":44182.399305555555},{"$f":" RTD(\"cqg.rtd\",,\"StudyData\", $N$2, \"Bar\", \"\", \"Open\", $M$2, $F245, $R$2,$Q$2,,$O$2,$P$2)","v":310.57},{"$f":" RTD(\"cqg.rtd\",,\"StudyData\", $N$2, \"Bar\", \"\", \"High\", $M$2, $F245, $R$2,$Q$2,,$O$2,$P$2)","v":310.77},{"$f":" RTD(\"cqg.rtd\",,\"StudyData\", $N$2, \"Bar\", \"\", \"Low\", $M$2, $F245, $R$2,$Q$2,,$O$2,$P$2)","v":310.42},{"$f":" RTD(\"cqg.rtd\",,\"StudyData\", $N$2, \"Bar\", \"\", \"Close\", $M$2, $F245, $R$2,$Q$2,,$O$2,$P$2)","v":310.68},-244,null,44182.399305555555,{"$f":"RTD(\"cqg.rtd\",,\"StudyData\",$N$2, \"Vol\", \"VolType=Auto,CoCType=Auto\", \"Vol\", $M$2, $F245, $R$2,$Q$2,,$O$2,$P$2)","v":171950}]
[{"$f":" RTD(\"cqg.rtd\",,\"StudyData\", $N$2, \"Bar\", \"\", \"Time\", $M$2, $F246,$R$2,$Q$2, \"\",\"False\")","v":44182.395833333336},{"$f":" RTD(\"cqg.rtd\",,\"StudyData\", $N$2, \"Bar\", \"\", \"Open\", $M$2, $F246, $R$2,$Q$2,,$O$2,$P$2)","v":310.64},{"$f":" RTD(\"cqg.rtd\",,\"StudyData\", $N$2, \"Bar\", \"\", \"High\", $M$2, $F246, $R$2,$Q$2,,$O$2,$P$2)","v":310.70999999999998},{"$f":" RTD(\"cqg.rtd\",,\"StudyData\", $N$2, \"Bar\", \"\", \"Low\", $M$2, $F246, $R$2,$Q$2,,$O$2,$P$2)","v":310.51},{"$f":" RTD(\"cqg.rtd\",,\"StudyData\", $N$2, \"Bar\", \"\", \"Close\", $M$2, $F246, $R$2,$Q$2,,$O$2,$P$2)","v":310.58},-245,null,44182.395833333336,{"$f":"RTD(\"cqg.rtd\",,\"StudyData\",$N$2, \"Vol\", \"VolType=Auto,CoCType=Auto\", \"Vol\", $M$2, $F246, $R$2,$Q$2,,$O$2,$P$2)","v":173357}]
[{"$f":" RTD(\"cqg.rtd\",,\"StudyData\", $N$2, \"Bar\", \"\", \"Time\", $M$2, $F247,$R$2,$Q$2, \"\",\"False\")","v":44182.392361111109},{"$f":" RTD(\"cqg.rtd\",,\"StudyData\", $N$2, \"Bar\", \"\", \"Open\", $M$2, $F247, $R$2,$Q$2,,$O$2,$P$2)","v":310.13},{"$f":" RTD(\"cqg.rtd\",,\"StudyData\", $N$2, \"Bar\", \"\", \"High\", $M$2, $F247, $R$2,$Q$2,,$O$2,$P$2)","v":310.68},{"$f":" RTD(\"cqg.rtd\",,\"StudyData\", $N$2, \"Bar\", \"\", \"Low\", $M$2, $F247, $R$2,$Q$2,,$O$2,$P$2)","v":310.05},{"$f":" RTD(\"cqg.rtd\",,\"StudyData\", $N$2, \"Bar\", \"\", \"Close\", $M$2, $F247, $R$2,$Q$2,,$O$2,$P$2)","v":310.63},-246,null,44182.392361111109,{"$f":"RTD(\"cqg.rtd\",,\"StudyData\",$N$2, \"Vol\", \"VolType=Auto,CoCType=Auto\", \"Vol\", $M$2, $F247, $R$2,$Q$2,,$O$2,$P$2)","v":202569}]
[{"$f":" RTD(\"cqg.rtd\",,\"StudyData\", $N$2, \"Bar\", \"\", \"Time\", $M$2, $F248,$R$2,$Q$2, \"\",\"False\")","v":44182.388888888891},{"$f":" RTD(\"cqg.rtd\",,\"StudyData\", $N$2, \"Bar\", \"\", \"Open\", $M$2, $F248, $R$2,$Q$2,,$O$2,$P$2)","v":310.3},{"$f":" RTD(\"cqg.rtd\",,\"StudyData\", $N$2, \"Bar\", \"\", \"High\", $M$2, $F248, $R$2,$Q$2,,$O$2,$P$2)","v":310.33},{"$f":" RTD(\"cqg.rtd\",,\"StudyData\", $N$2, \"Bar\", \"\", \"Low\", $M$2, $F248, $R$2,$Q$2,,$O$2,$P$2)","v":310.08999999999997},{"$f":" RTD(\"cqg.rtd\",,\"StudyData\", $N$2, \"Bar\", \"\", \"Close\", $M$2, $F248, $R$2,$Q$2,,$O$2,$P$2)","v":310.17},-247,null,44182.388888888891,{"$f":"RTD(\"cqg.rtd\",,\"StudyData\",$N$2, \"Vol\", \"VolType=Auto,CoCType=Auto\", \"Vol\", $M$2, $F248, $R$2,$Q$2,,$O$2,$P$2)","v":156212}]
[{"$f":" RTD(\"cqg.rtd\",,\"StudyData\", $N$2, \"Bar\", \"\", \"Time\", $M$2, $F249,$R$2,$Q$2, \"\",\"False\")","v":44182.385416666664},{"$f":" RTD(\"cqg.rtd\",,\"StudyData\", $N$2, \"Bar\", \"\", \"Open\", $M$2, $F249, $R$2,$Q$2,,$O$2,$P$2)","v":310.08},{"$f":" RTD(\"cqg.rtd\",,\"StudyData\", $N$2, \"Bar\", \"\", \"High\", $M$2, $F249, $R$2,$Q$2,,$O$2,$P$2)","v":310.36},{"$f":" RTD(\"cqg.rtd\",,\"StudyData\", $N$2, \"Bar\", \"\", \"Low\", $M$2, $F249, $R$2,$Q$2,,$O$2,$P$2)","v":309.89},{"$f":" RTD(\"cqg.rtd\",,\"StudyData\", $N$2, \"Bar\", \"\", \"Close\", $M$2, $F249, $R$2,$Q$2,,$O$2,$P$2)","v":310.33},-248,null,44182.385416666664,{"$f":"RTD(\"cqg.rtd\",,\"StudyData\",$N$2, \"Vol\", \"VolType=Auto,CoCType=Auto\", \"Vol\", $M$2, $F249, $R$2,$Q$2,,$O$2,$P$2)","v":368618}]
[{"$f":" RTD(\"cqg.rtd\",,\"StudyData\", $N$2, \"Bar\", \"\", \"Time\", $M$2, $F250,$R$2,$Q$2, \"\",\"False\")","v":44182.381944444445},{"$f":" RTD(\"cqg.rtd\",,\"StudyData\", $N$2, \"Bar\", \"\", \"Open\", $M$2, $F250, $R$2,$Q$2,,$O$2,$P$2)","v":310.33},{"$f":" RTD(\"cqg.rtd\",,\"StudyData\", $N$2, \"Bar\", \"\", \"High\", $M$2, $F250, $R$2,$Q$2,,$O$2,$P$2)","v":310.45},{"$f":" RTD(\"cqg.rtd\",,\"StudyData\", $N$2, \"Bar\", \"\", \"Low\", $M$2, $F250, $R$2,$Q$2,,$O$2,$P$2)","v":310.04000000000002},{"$f":" RTD(\"cqg.rtd\",,\"StudyData\", $N$2, \"Bar\", \"\", \"Close\", $M$2, $F250, $R$2,$Q$2,,$O$2,$P$2)","v":310.08999999999997},-249,null,44182.381944444445,{"$f":"RTD(\"cqg.rtd\",,\"StudyData\",$N$2, \"Vol\", \"VolType=Auto,CoCType=Auto\", \"Vol\", $M$2, $F250, $R$2,$Q$2,,$O$2,$P$2)","v":270825}]
[{"$f":" RTD(\"cqg.rtd\",,\"StudyData\", $N$2, \"Bar\", \"\", \"Time\", $M$2, $F251,$R$2,$Q$2, \"\",\"False\")","v":44182.378472222219},{"$f":" RTD(\"cqg.rtd\",,\"StudyData\", $N$2, \"Bar\", \"\", \"Open\", $M$2, $F251, $R$2,$Q$2,,$O$2,$P$2)","v":310.36},{"$f":" RTD(\"cqg.rtd\",,\"StudyData\", $N$2, \"Bar\", \"\", \"High\", $M$2, $F251, $R$2,$Q$2,,$O$2,$P$2)","v":310.51},{"$f":" RTD(\"cqg.rtd\",,\"StudyData\", $N$2, \"Bar\", \"\", \"Low\", $M$2, $F251, $R$2,$Q$2,,$O$2,$P$2)","v":310.08999999999997},{"$f":" RTD(\"cqg.rtd\",,\"StudyData\", $N$2, \"Bar\", \"\", \"Close\", $M$2, $F251, $R$2,$Q$2,,$O$2,$P$2)","v":310.32},-250,null,44182.378472222219,{"$f":"RTD(\"cqg.rtd\",,\"StudyData\",$N$2, \"Vol\", \"VolType=Auto,CoCType=Auto\", \"Vol\", $M$2, $F251, $R$2,$Q$2,,$O$2,$P$2)","v":294961}]
[{"$f":" RTD(\"cqg.rtd\",,\"StudyData\", $N$2, \"Bar\", \"\", \"Time\", $M$2, $F252,$R$2,$Q$2, \"\",\"False\")","v":44182.375},{"$f":" RTD(\"cqg.rtd\",,\"StudyData\", $N$2, \"Bar\", \"\", \"Open\", $M$2, $F252, $R$2,$Q$2,,$O$2,$P$2)","v":310.69},{"$f":" RTD(\"cqg.rtd\",,\"StudyData\", $N$2, \"Bar\", \"\", \"High\", $M$2, $F252, $R$2,$Q$2,,$O$2,$P$2)","v":310.81},{"$f":" RTD(\"cqg.rtd\",,\"StudyData\", $N$2, \"Bar\", \"\", \"Low\", $M$2, $F252, $R$2,$Q$2,,$O$2,$P$2)","v":310.27},{"$f":" RTD(\"cqg.rtd\",,\"StudyData\", $N$2, \"Bar\", \"\", \"Close\", $M$2, $F252, $R$2,$Q$2,,$O$2,$P$2)","v":310.33999999999997},-251,null,44182.375,{"$f":"RTD(\"cqg.rtd\",,\"StudyData\",$N$2, \"Vol\", \"VolType=Auto,CoCType=Auto\", \"Vol\", $M$2, $F252, $R$2,$Q$2,,$O$2,$P$2)","v":344824}]
[{"$f":" RTD(\"cqg.rtd\",,\"StudyData\", $N$2, \"Bar\", \"\", \"Time\", $M$2, $F253,$R$2,$Q$2, \"\",\"False\")","v":44182.371527777781},{"$f":" RTD(\"cqg.rtd\",,\"StudyData\", $N$2, \"Bar\", \"\", \"Open\", $M$2, $F253, $R$2,$Q$2,,$O$2,$P$2)","v":310.67},{"$f":" RTD(\"cqg.rtd\",,\"StudyData\", $N$2, \"Bar\", \"\", \"High\", $M$2, $F253, $R$2,$Q$2,,$O$2,$P$2)","v":310.81},{"$f":" RTD(\"cqg.rtd\",,\"StudyData\", $N$2, \"Bar\", \"\", \"Low\", $M$2, $F253, $R$2,$Q$2,,$O$2,$P$2)","v":310.42},{"$f":" RTD(\"cqg.rtd\",,\"StudyData\", $N$2, \"Bar\", \"\", \"Close\", $M$2, $F253, $R$2,$Q$2,,$O$2,$P$2)","v":310.68},-252,null,44182.371527777781,{"$f":"RTD(\"cqg.rtd\",,\"StudyData\",$N$2, \"Vol\", \"VolType=Auto,CoCType=Auto\", \"Vol\", $M$2, $F253, $R$2,$Q$2,,$O$2,$P$2)","v":314406}]
[{"$f":" RTD(\"cqg.rtd\",,\"StudyData\", $N$2, \"Bar\", \"\", \"Time\", $M$2, $F254,$R$2,$Q$2, \"\",\"False\")","v":44182.368055555555},{"$f":" RTD(\"cqg.rtd\",,\"StudyData\", $N$2, \"Bar\", \"\", \"Open\", $M$2, $F254, $R$2,$Q$2,,$O$2,$P$2)","v":311.04000000000002},{"$f":" RTD(\"cqg.rtd\",,\"StudyData\", $N$2, \"Bar\", \"\", \"High\", $M$2, $F254, $R$2,$Q$2,,$O$2,$P$2)","v":311.08},{"$f":" RTD(\"cqg.rtd\",,\"StudyData\", $N$2, \"Bar\", \"\", \"Low\", $M$2, $F254, $R$2,$Q$2,,$O$2,$P$2)","v":310.66000000000003},{"$f":" RTD(\"cqg.rtd\",,\"StudyData\", $N$2, \"Bar\", \"\", \"Close\", $M$2, $F254, $R$2,$Q$2,,$O$2,$P$2)","v":310.67},-253,null,44182.368055555555,{"$f":"RTD(\"cqg.rtd\",,\"StudyData\",$N$2, \"Vol\", \"VolType=Auto,CoCType=Auto\", \"Vol\", $M$2, $F254, $R$2,$Q$2,,$O$2,$P$2)","v":234333}]
[{"$f":" RTD(\"cqg.rtd\",,\"StudyData\", $N$2, \"Bar\", \"\", \"Time\", $M$2, $F255,$R$2,$Q$2, \"\",\"False\")","v":44182.364583333336},{"$f":" RTD(\"cqg.rtd\",,\"StudyData\", $N$2, \"Bar\", \"\", \"Open\", $M$2, $F255, $R$2,$Q$2,,$O$2,$P$2)","v":310.69},{"$f":" RTD(\"cqg.rtd\",,\"StudyData\", $N$2, \"Bar\", \"\", \"High\", $M$2, $F255, $R$2,$Q$2,,$O$2,$P$2)","v":311.11},{"$f":" RTD(\"cqg.rtd\",,\"StudyData\", $N$2, \"Bar\", \"\", \"Low\", $M$2, $F255, $R$2,$Q$2,,$O$2,$P$2)","v":310.54000000000002},{"$f":" RTD(\"cqg.rtd\",,\"StudyData\", $N$2, \"Bar\", \"\", \"Close\", $M$2, $F255, $R$2,$Q$2,,$O$2,$P$2)","v":311.04000000000002},-254,null,44182.364583333336,{"$f":"RTD(\"cqg.rtd\",,\"StudyData\",$N$2, \"Vol\", \"VolType=Auto,CoCType=Auto\", \"Vol\", $M$2, $F255, $R$2,$Q$2,,$O$2,$P$2)","v":332319}]
[{"$f":" RTD(\"cqg.rtd\",,\"StudyData\", $N$2, \"Bar\", \"\", \"Time\", $M$2, $F256,$R$2,$Q$2, \"\",\"False\")","v":44182.361111111109},{"$f":" RTD(\"cqg.rtd\",,\"StudyData\", $N$2, \"Bar\", \"\", \"Open\", $M$2, $F256, $R$2,$Q$2,,$O$2,$P$2)","v":311.01},{"$f":" RTD(\"cqg.rtd\",,\"StudyData\", $N$2, \"Bar\", \"\", \"High\", $M$2, $F256, $R$2,$Q$2,,$O$2,$P$2)","v":311.02},{"$f":" RTD(\"cqg.rtd\",,\"StudyData\", $N$2, \"Bar\", \"\", \"Low\", $M$2, $F256, $R$2,$Q$2,,$O$2,$P$2)","v":310.67},{"$f":" RTD(\"cqg.rtd\",,\"StudyData\", $N$2, \"Bar\", \"\", \"Close\", $M$2, $F256, $R$2,$Q$2,,$O$2,$P$2)","v":310.69},-255,null,44182.361111111109,{"$f":"RTD(\"cqg.rtd\",,\"StudyData\",$N$2, \"Vol\", \"VolType=Auto,CoCType=Auto\", \"Vol\", $M$2, $F256, $R$2,$Q$2,,$O$2,$P$2)","v":419192}]
[{"$f":" RTD(\"cqg.rtd\",,\"StudyData\", $N$2, \"Bar\", \"\", \"Time\", $M$2, $F257,$R$2,$Q$2, \"\",\"False\")","v":44182.357638888891},{"$f":" RTD(\"cqg.rtd\",,\"StudyData\", $N$2, \"Bar\", \"\", \"Open\", $M$2, $F257, $R$2,$Q$2,,$O$2,$P$2)","v":311.08999999999997},{"$f":" RTD(\"cqg.rtd\",,\"StudyData\", $N$2, \"Bar\", \"\", \"High\", $M$2, $F257, $R$2,$Q$2,,$O$2,$P$2)","v":311.19},{"$f":" RTD(\"cqg.rtd\",,\"StudyData\", $N$2, \"Bar\", \"\", \"Low\", $M$2, $F257, $R$2,$Q$2,,$O$2,$P$2)","v":310.7},{"$f":" RTD(\"cqg.rtd\",,\"StudyData\", $N$2, \"Bar\", \"\", \"Close\", $M$2, $F257, $R$2,$Q$2,,$O$2,$P$2)","v":311.02999999999997},-256,null,44182.357638888891,{"$f":"RTD(\"cqg.rtd\",,\"StudyData\",$N$2, \"Vol\", \"VolType=Auto,CoCType=Auto\", \"Vol\", $M$2, $F257, $R$2,$Q$2,,$O$2,$P$2)","v":377303}]
[{"$f":" RTD(\"cqg.rtd\",,\"StudyData\", $N$2, \"Bar\", \"\", \"Time\", $M$2, $F258,$R$2,$Q$2, \"\",\"False\")","v":44182.354166666664},{"$f":" RTD(\"cqg.rtd\",,\"StudyData\", $N$2, \"Bar\", \"\", \"Open\", $M$2, $F258, $R$2,$Q$2,,$O$2,$P$2)","v":310.63},{"$f":" RTD(\"cqg.rtd\",,\"StudyData\", $N$2, \"Bar\", \"\", \"High\", $M$2, $F258, $R$2,$Q$2,,$O$2,$P$2)","v":311.24},{"$f":" RTD(\"cqg.rtd\",,\"StudyData\", $N$2, \"Bar\", \"\", \"Low\", $M$2, $F258, $R$2,$Q$2,,$O$2,$P$2)","v":310.52},{"$f":" RTD(\"cqg.rtd\",,\"StudyData\", $N$2, \"Bar\", \"\", \"Close\", $M$2, $F258, $R$2,$Q$2,,$O$2,$P$2)","v":311.08},-257,null,{"$f":"A258","v":44182.354166666664},{"$f":"RTD(\"cqg.rtd\",,\"StudyData\",$N$2, \"Vol\", \"VolType=Auto,CoCType=Auto\", \"Vol\", $M$2, $F258, $R$2,$Q$2,,$O$2,$P$2)","v":929536}]
[{"$f":" RTD(\"cqg.rtd\",,\"StudyData\", $N$2, \"Bar\", \"\", \"Time\", $M$2, $F259,$R$2,$Q$2, \"\",\"False\")","v":44181.631944444445},{"$f":" RTD(\"cqg.rtd\",,\"StudyData\", $N$2, \"Bar\", \"\", \"Open\", $M$2, $F259, $R$2,$Q$2,,$O$2,$P$2)","v":309.05},{"$f":" RTD(\"cqg.rtd\",,\"StudyData\", $N$2, \"Bar\", \"\", \"High\", $M$2, $F259, $R$2,$Q$2,,$O$2,$P$2)","v":309.10000000000002},{"$f":" RTD(\"cqg.rtd\",,\"StudyData\", $N$2, \"Bar\", \"\", \"Low\", $M$2, $F259, $R$2,$Q$2,,$O$2,$P$2)","v":309},{"$f":" RTD(\"cqg.rtd\",,\"StudyData\", $N$2, \"Bar\", \"\", \"Close\", $M$2, $F259, $R$2,$Q$2,,$O$2,$P$2)","v":309.10000000000002},{"$f":"F258-1","v":-258},null,44181.631944444445,{"$f":"RTD(\"cqg.rtd\",,\"StudyData\",$N$2, \"Vol\", \"VolType=Auto,CoCType=Auto\", \"Vol\", $M$2, $F259, $R$2,$Q$2,,$O$2,$P$2)","v":558715}]
[{"$f":" RTD(\"cqg.rtd\",,\"StudyData\", $N$2, \"Bar\", \"\", \"Time\", $M$2, $F260,$R$2,$Q$2, \"\",\"False\")","v":44181.628472222219},{"$f":" RTD(\"cqg.rtd\",,\"StudyData\", $N$2, \"Bar\", \"\", \"Open\", $M$2, $F260, $R$2,$Q$2,,$O$2,$P$2)","v":309.02},{"$f":" RTD(\"cqg.rtd\",,\"StudyData\", $N$2, \"Bar\", \"\", \"High\", $M$2, $F260, $R$2,$Q$2,,$O$2,$P$2)","v":309.08},{"$f":" RTD(\"cqg.rtd\",,\"StudyData\", $N$2, \"Bar\", \"\", \"Low\", $M$2, $F260, $R$2,$Q$2,,$O$2,$P$2)","v":309},{"$f":" RTD(\"cqg.rtd\",,\"StudyData\", $N$2, \"Bar\", \"\", \"Close\", $M$2, $F260, $R$2,$Q$2,,$O$2,$P$2)","v":309.07},-259,null,44181.628472222219,{"$f":"RTD(\"cqg.rtd\",,\"StudyData\",$N$2, \"Vol\", \"VolType=Auto,CoCType=Auto\", \"Vol\", $M$2, $F260, $R$2,$Q$2,,$O$2,$P$2)","v":49271}]
[{"$f":" RTD(\"cqg.rtd\",,\"StudyData\", $N$2, \"Bar\", \"\", \"Time\", $M$2, $F261,$R$2,$Q$2, \"\",\"False\")","v":44181.625},{"$f":" RTD(\"cqg.rtd\",,\"StudyData\", $N$2, \"Bar\", \"\", \"Open\", $M$2, $F261, $R$2,$Q$2,,$O$2,$P$2)","v":309.01},{"$f":" RTD(\"cqg.rtd\",,\"StudyData\", $N$2, \"Bar\", \"\", \"High\", $M$2, $F261, $R$2,$Q$2,,$O$2,$P$2)","v":309.17},{"$f":" RTD(\"cqg.rtd\",,\"StudyData\", $N$2, \"Bar\", \"\", \"Low\", $M$2, $F261, $R$2,$Q$2,,$O$2,$P$2)","v":308.45},{"$f":" RTD(\"cqg.rtd\",,\"StudyData\", $N$2, \"Bar\", \"\", \"Close\", $M$2, $F261, $R$2,$Q$2,,$O$2,$P$2)","v":309.01},-260,null,44181.625,{"$f":"RTD(\"cqg.rtd\",,\"StudyData\",$N$2, \"Vol\", \"VolType=Auto,CoCType=Auto\", \"Vol\", $M$2, $F261, $R$2,$Q$2,,$O$2,$P$2)","v":662643}]
[{"$f":" RTD(\"cqg.rtd\",,\"StudyData\", $N$2, \"Bar\", \"\", \"Time\", $M$2, $F262,$R$2,$Q$2, \"\",\"False\")","v":44181.621527777781},{"$f":" RTD(\"cqg.rtd\",,\"StudyData\", $N$2, \"Bar\", \"\", \"Open\", $M$2, $F262, $R$2,$Q$2,,$O$2,$P$2)","v":309.32},{"$f":" RTD(\"cqg.rtd\",,\"StudyData\", $N$2, \"Bar\", \"\", \"High\", $M$2, $F262, $R$2,$Q$2,,$O$2,$P$2)","v":309.39},{"$f":" RTD(\"cqg.rtd\",,\"StudyData\", $N$2, \"Bar\", \"\", \"Low\", $M$2, $F262, $R$2,$Q$2,,$O$2,$P$2)","v":308.86},{"$f":" RTD(\"cqg.rtd\",,\"StudyData\", $N$2, \"Bar\", \"\", \"Close\", $M$2, $F262, $R$2,$Q$2,,$O$2,$P$2)","v":308.98},-261,null,44181.621527777781,{"$f":"RTD(\"cqg.rtd\",,\"StudyData\",$N$2, \"Vol\", \"VolType=Auto,CoCType=Auto\", \"Vol\", $M$2, $F262, $R$2,$Q$2,,$O$2,$P$2)","v":1041820}]
[{"$f":" RTD(\"cqg.rtd\",,\"StudyData\", $N$2, \"Bar\", \"\", \"Time\", $M$2, $F263,$R$2,$Q$2, \"\",\"False\")","v":44181.618055555555},{"$f":" RTD(\"cqg.rtd\",,\"StudyData\", $N$2, \"Bar\", \"\", \"Open\", $M$2, $F263, $R$2,$Q$2,,$O$2,$P$2)","v":309.54000000000002},{"$f":" RTD(\"cqg.rtd\",,\"StudyData\", $N$2, \"Bar\", \"\", \"High\", $M$2, $F263, $R$2,$Q$2,,$O$2,$P$2)","v":309.55},{"$f":" RTD(\"cqg.rtd\",,\"StudyData\", $N$2, \"Bar\", \"\", \"Low\", $M$2, $F263, $R$2,$Q$2,,$O$2,$P$2)","v":309.06},{"$f":" RTD(\"cqg.rtd\",,\"StudyData\", $N$2, \"Bar\", \"\", \"Close\", $M$2, $F263, $R$2,$Q$2,,$O$2,$P$2)","v":309.32},-262,null,44181.618055555555,{"$f":"RTD(\"cqg.rtd\",,\"StudyData\",$N$2, \"Vol\", \"VolType=Auto,CoCType=Auto\", \"Vol\", $M$2, $F263, $R$2,$Q$2,,$O$2,$P$2)","v":876390}]
[{"$f":" RTD(\"cqg.rtd\",,\"StudyData\", $N$2, \"Bar\", \"\", \"Time\", $M$2, $F264,$R$2,$Q$2, \"\",\"False\")","v":44181.614583333336},{"$f":" RTD(\"cqg.rtd\",,\"StudyData\", $N$2, \"Bar\", \"\", \"Open\", $M$2, $F264, $R$2,$Q$2,,$O$2,$P$2)","v":309.56},{"$f":" RTD(\"cqg.rtd\",,\"StudyData\", $N$2, \"Bar\", \"\", \"High\", $M$2, $F264, $R$2,$Q$2,,$O$2,$P$2)","v":309.61},{"$f":" RTD(\"cqg.rtd\",,\"StudyData\", $N$2, \"Bar\", \"\", \"Low\", $M$2, $F264, $R$2,$Q$2,,$O$2,$P$2)","v":309.43},{"$f":" RTD(\"cqg.rtd\",,\"StudyData\", $N$2, \"Bar\", \"\", \"Close\", $M$2, $F264, $R$2,$Q$2,,$O$2,$P$2)","v":309.55},-263,null,44181.614583333336,{"$f":"RTD(\"cqg.rtd\",,\"StudyData\",$N$2, \"Vol\", \"VolType=Auto,CoCType=Auto\", \"Vol\", $M$2, $F264, $R$2,$Q$2,,$O$2,$P$2)","v":292070}]
[{"$f":" RTD(\"cqg.rtd\",,\"StudyData\", $N$2, \"Bar\", \"\", \"Time\", $M$2, $F265,$R$2,$Q$2, \"\",\"False\")","v":44181.611111111109},{"$f":" RTD(\"cqg.rtd\",,\"StudyData\", $N$2, \"Bar\", \"\", \"Open\", $M$2, $F265, $R$2,$Q$2,,$O$2,$P$2)","v":309.66000000000003},{"$f":" RTD(\"cqg.rtd\",,\"StudyData\", $N$2, \"Bar\", \"\", \"High\", $M$2, $F265, $R$2,$Q$2,,$O$2,$P$2)","v":309.77999999999997},{"$f":" RTD(\"cqg.rtd\",,\"StudyData\", $N$2, \"Bar\", \"\", \"Low\", $M$2, $F265, $R$2,$Q$2,,$O$2,$P$2)","v":309.52},{"$f":" RTD(\"cqg.rtd\",,\"StudyData\", $N$2, \"Bar\", \"\", \"Close\", $M$2, $F265, $R$2,$Q$2,,$O$2,$P$2)","v":309.56},-264,null,44181.611111111109,{"$f":"RTD(\"cqg.rtd\",,\"StudyData\",$N$2, \"Vol\", \"VolType=Auto,CoCType=Auto\", \"Vol\", $M$2, $F265, $R$2,$Q$2,,$O$2,$P$2)","v":362845}]
[{"$f":" RTD(\"cqg.rtd\",,\"StudyData\", $N$2, \"Bar\", \"\", \"Time\", $M$2, $F266,$R$2,$Q$2, \"\",\"False\")","v":44181.607638888891},{"$f":" RTD(\"cqg.rtd\",,\"StudyData\", $N$2, \"Bar\", \"\", \"Open\", $M$2, $F266, $R$2,$Q$2,,$O$2,$P$2)","v":309.72000000000003},{"$f":" RTD(\"cqg.rtd\",,\"StudyData\", $N$2, \"Bar\", \"\", \"High\", $M$2, $F266, $R$2,$Q$2,,$O$2,$P$2)","v":309.74},{"$f":" RTD(\"cqg.rtd\",,\"StudyData\", $N$2, \"Bar\", \"\", \"Low\", $M$2, $F266, $R$2,$Q$2,,$O$2,$P$2)","v":309.42},{"$f":" RTD(\"cqg.rtd\",,\"StudyData\", $N$2, \"Bar\", \"\", \"Close\", $M$2, $F266, $R$2,$Q$2,,$O$2,$P$2)","v":309.67},-265,null,44181.607638888891,{"$f":"RTD(\"cqg.rtd\",,\"StudyData\",$N$2, \"Vol\", \"VolType=Auto,CoCType=Auto\", \"Vol\", $M$2, $F266, $R$2,$Q$2,,$O$2,$P$2)","v":378430}]
[{"$f":" RTD(\"cqg.rtd\",,\"StudyData\", $N$2, \"Bar\", \"\", \"Time\", $M$2, $F267,$R$2,$Q$2, \"\",\"False\")","v":44181.604166666664},{"$f":" RTD(\"cqg.rtd\",,\"StudyData\", $N$2, \"Bar\", \"\", \"Open\", $M$2, $F267, $R$2,$Q$2,,$O$2,$P$2)","v":309.47000000000003},{"$f":" RTD(\"cqg.rtd\",,\"StudyData\", $N$2, \"Bar\", \"\", \"High\", $M$2, $F267, $R$2,$Q$2,,$O$2,$P$2)","v":309.75},{"$f":" RTD(\"cqg.rtd\",,\"StudyData\", $N$2, \"Bar\", \"\", \"Low\", $M$2, $F267, $R$2,$Q$2,,$O$2,$P$2)","v":309.45},{"$f":" RTD(\"cqg.rtd\",,\"StudyData\", $N$2, \"Bar\", \"\", \"Close\", $M$2, $F267, $R$2,$Q$2,,$O$2,$P$2)","v":309.72000000000003},-266,null,44181.604166666664,{"$f":"RTD(\"cqg.rtd\",,\"StudyData\",$N$2, \"Vol\", \"VolType=Auto,CoCType=Auto\", \"Vol\", $M$2, $F267, $R$2,$Q$2,,$O$2,$P$2)","v":410643}]
[{"$f":" RTD(\"cqg.rtd\",,\"StudyData\", $N$2, \"Bar\", \"\", \"Time\", $M$2, $F268,$R$2,$Q$2, \"\",\"False\")","v":44181.600694444445},{"$f":" RTD(\"cqg.rtd\",,\"StudyData\", $N$2, \"Bar\", \"\", \"Open\", $M$2, $F268, $R$2,$Q$2,,$O$2,$P$2)","v":309.43},{"$f":" RTD(\"cqg.rtd\",,\"StudyData\", $N$2, \"Bar\", \"\", \"High\", $M$2, $F268, $R$2,$Q$2,,$O$2,$P$2)","v":309.56},{"$f":" RTD(\"cqg.rtd\",,\"StudyData\", $N$2, \"Bar\", \"\", \"Low\", $M$2, $F268, $R$2,$Q$2,,$O$2,$P$2)","v":309.39999999999998},{"$f":" RTD(\"cqg.rtd\",,\"StudyData\", $N$2, \"Bar\", \"\", \"Close\", $M$2, $F268, $R$2,$Q$2,,$O$2,$P$2)","v":309.47000000000003},-267,null,44181.600694444445,{"$f":"RTD(\"cqg.rtd\",,\"StudyData\",$N$2, \"Vol\", \"VolType=Auto,CoCType=Auto\", \"Vol\", $M$2, $F268, $R$2,$Q$2,,$O$2,$P$2)","v":339108}]
[{"$f":" RTD(\"cqg.rtd\",,\"StudyData\", $N$2, \"Bar\", \"\", \"Time\", $M$2, $F269,$R$2,$Q$2, \"\",\"False\")","v":44181.597222222219},{"$f":" RTD(\"cqg.rtd\",,\"StudyData\", $N$2, \"Bar\", \"\", \"Open\", $M$2, $F269, $R$2,$Q$2,,$O$2,$P$2)","v":309.23},{"$f":" RTD(\"cqg.rtd\",,\"StudyData\", $N$2, \"Bar\", \"\", \"High\", $M$2, $F269, $R$2,$Q$2,,$O$2,$P$2)","v":309.48},{"$f":" RTD(\"cqg.rtd\",,\"StudyData\", $N$2, \"Bar\", \"\", \"Low\", $M$2, $F269, $R$2,$Q$2,,$O$2,$P$2)","v":309.22000000000003},{"$f":" RTD(\"cqg.rtd\",,\"StudyData\", $N$2, \"Bar\", \"\", \"Close\", $M$2, $F269, $R$2,$Q$2,,$O$2,$P$2)","v":309.44},-268,null,44181.597222222219,{"$f":"RTD(\"cqg.rtd\",,\"StudyData\",$N$2, \"Vol\", \"VolType=Auto,CoCType=Auto\", \"Vol\", $M$2, $F269, $R$2,$Q$2,,$O$2,$P$2)","v":258266}]
[{"$f":" RTD(\"cqg.rtd\",,\"StudyData\", $N$2, \"Bar\", \"\", \"Time\", $M$2, $F270,$R$2,$Q$2, \"\",\"False\")","v":44181.59375},{"$f":" RTD(\"cqg.rtd\",,\"StudyData\", $N$2, \"Bar\", \"\", \"Open\", $M$2, $F270, $R$2,$Q$2,,$O$2,$P$2)","v":309.08999999999997},{"$f":" RTD(\"cqg.rtd\",,\"StudyData\", $N$2, \"Bar\", \"\", \"High\", $M$2, $F270, $R$2,$Q$2,,$O$2,$P$2)","v":309.27999999999997},{"$f":" RTD(\"cqg.rtd\",,\"StudyData\", $N$2, \"Bar\", \"\", \"Low\", $M$2, $F270, $R$2,$Q$2,,$O$2,$P$2)","v":308.98},{"$f":" RTD(\"cqg.rtd\",,\"StudyData\", $N$2, \"Bar\", \"\", \"Close\", $M$2, $F270, $R$2,$Q$2,,$O$2,$P$2)","v":309.24},-269,null,44181.59375,{"$f":"RTD(\"cqg.rtd\",,\"StudyData\",$N$2, \"Vol\", \"VolType=Auto,CoCType=Auto\", \"Vol\", $M$2, $F270, $R$2,$Q$2,,$O$2,$P$2)","v":194956}]
[{"$f":" RTD(\"cqg.rtd\",,\"StudyData\", $N$2, \"Bar\", \"\", \"Time\", $M$2, $F271,$R$2,$Q$2, \"\",\"False\")","v":44181.590277777781},{"$f":" RTD(\"cqg.rtd\",,\"StudyData\", $N$2, \"Bar\", \"\", \"Open\", $M$2, $F271, $R$2,$Q$2,,$O$2,$P$2)","v":309.17},{"$f":" RTD(\"cqg.rtd\",,\"StudyData\", $N$2, \"Bar\", \"\", \"High\", $M$2, $F271, $R$2,$Q$2,,$O$2,$P$2)","v":309.20999999999998},{"$f":" RTD(\"cqg.rtd\",,\"StudyData\", $N$2, \"Bar\", \"\", \"Low\", $M$2, $F271, $R$2,$Q$2,,$O$2,$P$2)","v":308.95999999999998},{"$f":" RTD(\"cqg.rtd\",,\"StudyData\", $N$2, \"Bar\", \"\", \"Close\", $M$2, $F271, $R$2,$Q$2,,$O$2,$P$2)","v":309.08999999999997},-270,null,44181.590277777781,{"$f":"RTD(\"cqg.rtd\",,\"StudyData\",$N$2, \"Vol\", \"VolType=Auto,CoCType=Auto\", \"Vol\", $M$2, $F271, $R$2,$Q$2,,$O$2,$P$2)","v":167326}]
[{"$f":" RTD(\"cqg.rtd\",,\"StudyData\", $N$2, \"Bar\", \"\", \"Time\", $M$2, $F272,$R$2,$Q$2, \"\",\"False\")","v":44181.586805555555},{"$f":" RTD(\"cqg.rtd\",,\"StudyData\", $N$2, \"Bar\", \"\", \"Open\", $M$2, $F272, $R$2,$Q$2,,$O$2,$P$2)","v":309.25},{"$f":" RTD(\"cqg.rtd\",,\"StudyData\", $N$2, \"Bar\", \"\", \"High\", $M$2, $F272, $R$2,$Q$2,,$O$2,$P$2)","v":309.33},{"$f":" RTD(\"cqg.rtd\",,\"StudyData\", $N$2, \"Bar\", \"\", \"Low\", $M$2, $F272, $R$2,$Q$2,,$O$2,$P$2)","v":309.02},{"$f":" RTD(\"cqg.rtd\",,\"StudyData\", $N$2, \"Bar\", \"\", \"Close\", $M$2, $F272, $R$2,$Q$2,,$O$2,$P$2)","v":309.14999999999998},-271,null,44181.586805555555,{"$f":"RTD(\"cqg.rtd\",,\"StudyData\",$N$2, \"Vol\", \"VolType=Auto,CoCType=Auto\", \"Vol\", $M$2, $F272, $R$2,$Q$2,,$O$2,$P$2)","v":297391}]
[{"$f":" RTD(\"cqg.rtd\",,\"StudyData\", $N$2, \"Bar\", \"\", \"Time\", $M$2, $F273,$R$2,$Q$2, \"\",\"False\")","v":44181.583333333336},{"$f":" RTD(\"cqg.rtd\",,\"StudyData\", $N$2, \"Bar\", \"\", \"Open\", $M$2, $F273, $R$2,$Q$2,,$O$2,$P$2)","v":309.23},{"$f":" RTD(\"cqg.rtd\",,\"StudyData\", $N$2, \"Bar\", \"\", \"High\", $M$2, $F273, $R$2,$Q$2,,$O$2,$P$2)","v":309.31},{"$f":" RTD(\"cqg.rtd\",,\"StudyData\", $N$2, \"Bar\", \"\", \"Low\", $M$2, $F273, $R$2,$Q$2,,$O$2,$P$2)","v":309.08},{"$f":" RTD(\"cqg.rtd\",,\"StudyData\", $N$2, \"Bar\", \"\", \"Close\", $M$2, $F273, $R$2,$Q$2,,$O$2,$P$2)","v":309.25},-272,null,44181.583333333336,{"$f":"RTD(\"cqg.rtd\",,\"StudyData\",$N$2, \"Vol\", \"VolType=Auto,CoCType=Auto\", \"Vol\", $M$2, $F273, $R$2,$Q$2,,$O$2,$P$2)","v":198715}]
[{"$f":" RTD(\"cqg.rtd\",,\"StudyData\", $N$2, \"Bar\", \"\", \"Time\", $M$2, $F274,$R$2,$Q$2, \"\",\"False\")","v":44181.579861111109},{"$f":" RTD(\"cqg.rtd\",,\"StudyData\", $N$2, \"Bar\", \"\", \"Open\", $M$2, $F274, $R$2,$Q$2,,$O$2,$P$2)","v":309.13},{"$f":" RTD(\"cqg.rtd\",,\"StudyData\", $N$2, \"Bar\", \"\", \"High\", $M$2, $F274, $R$2,$Q$2,,$O$2,$P$2)","v":309.29000000000002},{"$f":" RTD(\"cqg.rtd\",,\"StudyData\", $N$2, \"Bar\", \"\", \"Low\", $M$2, $F274, $R$2,$Q$2,,$O$2,$P$2)","v":309.08999999999997},{"$f":" RTD(\"cqg.rtd\",,\"StudyData\", $N$2, \"Bar\", \"\", \"Close\", $M$2, $F274, $R$2,$Q$2,,$O$2,$P$2)","v":309.24},-273,null,44181.579861111109,{"$f":"RTD(\"cqg.rtd\",,\"StudyData\",$N$2, \"Vol\", \"VolType=Auto,CoCType=Auto\", \"Vol\", $M$2, $F274, $R$2,$Q$2,,$O$2,$P$2)","v":274124}]
[{"$f":" RTD(\"cqg.rtd\",,\"StudyData\", $N$2, \"Bar\", \"\", \"Time\", $M$2, $F275,$R$2,$Q$2, \"\",\"False\")","v":44181.576388888891},{"$f":" RTD(\"cqg.rtd\",,\"StudyData\", $N$2, \"Bar\", \"\", \"Open\", $M$2, $F275, $R$2,$Q$2,,$O$2,$P$2)","v":309.2},{"$f":" RTD(\"cqg.rtd\",,\"StudyData\", $N$2, \"Bar\", \"\", \"High\", $M$2, $F275, $R$2,$Q$2,,$O$2,$P$2)","v":309.24},{"$f":" RTD(\"cqg.rtd\",,\"StudyData\", $N$2, \"Bar\", \"\", \"Low\", $M$2, $F275, $R$2,$Q$2,,$O$2,$P$2)","v":309.06},{"$f":" RTD(\"cqg.rtd\",,\"StudyData\", $N$2, \"Bar\", \"\", \"Close\", $M$2, $F275, $R$2,$Q$2,,$O$2,$P$2)","v":309.11},-274,null,44181.576388888891,{"$f":"RTD(\"cqg.rtd\",,\"StudyData\",$N$2, \"Vol\", \"VolType=Auto,CoCType=Auto\", \"Vol\", $M$2, $F275, $R$2,$Q$2,,$O$2,$P$2)","v":322020}]
[{"$f":" RTD(\"cqg.rtd\",,\"StudyData\", $N$2, \"Bar\", \"\", \"Time\", $M$2, $F276,$R$2,$Q$2, \"\",\"False\")","v":44181.572916666664},{"$f":" RTD(\"cqg.rtd\",,\"StudyData\", $N$2, \"Bar\", \"\", \"Open\", $M$2, $F276, $R$2,$Q$2,,$O$2,$P$2)","v":309.04000000000002},{"$f":" RTD(\"cqg.rtd\",,\"StudyData\", $N$2, \"Bar\", \"\", \"High\", $M$2, $F276, $R$2,$Q$2,,$O$2,$P$2)","v":309.23},{"$f":" RTD(\"cqg.rtd\",,\"StudyData\", $N$2, \"Bar\", \"\", \"Low\", $M$2, $F276, $R$2,$Q$2,,$O$2,$P$2)","v":308.99},{"$f":" RTD(\"cqg.rtd\",,\"StudyData\", $N$2, \"Bar\", \"\", \"Close\", $M$2, $F276, $R$2,$Q$2,,$O$2,$P$2)","v":309.2},-275,null,44181.572916666664,{"$f":"RTD(\"cqg.rtd\",,\"StudyData\",$N$2, \"Vol\", \"VolType=Auto,CoCType=Auto\", \"Vol\", $M$2, $F276, $R$2,$Q$2,,$O$2,$P$2)","v":176872}]
[{"$f":" RTD(\"cqg.rtd\",,\"StudyData\", $N$2, \"Bar\", \"\", \"Time\", $M$2, $F277,$R$2,$Q$2, \"\",\"False\")","v":44181.569444444445},{"$f":" RTD(\"cqg.rtd\",,\"StudyData\", $N$2, \"Bar\", \"\", \"Open\", $M$2, $F277, $R$2,$Q$2,,$O$2,$P$2)","v":308.95999999999998},{"$f":" RTD(\"cqg.rtd\",,\"StudyData\", $N$2, \"Bar\", \"\", \"High\", $M$2, $F277, $R$2,$Q$2,,$O$2,$P$2)","v":309.07},{"$f":" RTD(\"cqg.rtd\",,\"StudyData\", $N$2, \"Bar\", \"\", \"Low\", $M$2, $F277, $R$2,$Q$2,,$O$2,$P$2)","v":308.85000000000002},{"$f":" RTD(\"cqg.rtd\",,\"StudyData\", $N$2, \"Bar\", \"\", \"Close\", $M$2, $F277, $R$2,$Q$2,,$O$2,$P$2)","v":309.02999999999997},-276,null,44181.569444444445,{"$f":"RTD(\"cqg.rtd\",,\"StudyData\",$N$2, \"Vol\", \"VolType=Auto,CoCType=Auto\", \"Vol\", $M$2, $F277, $R$2,$Q$2,,$O$2,$P$2)","v":223511}]
[{"$f":" RTD(\"cqg.rtd\",,\"StudyData\", $N$2, \"Bar\", \"\", \"Time\", $M$2, $F278,$R$2,$Q$2, \"\",\"False\")","v":44181.565972222219},{"$f":" RTD(\"cqg.rtd\",,\"StudyData\", $N$2, \"Bar\", \"\", \"Open\", $M$2, $F278, $R$2,$Q$2,,$O$2,$P$2)","v":308.48},{"$f":" RTD(\"cqg.rtd\",,\"StudyData\", $N$2, \"Bar\", \"\", \"High\", $M$2, $F278, $R$2,$Q$2,,$O$2,$P$2)","v":309.05},{"$f":" RTD(\"cqg.rtd\",,\"StudyData\", $N$2, \"Bar\", \"\", \"Low\", $M$2, $F278, $R$2,$Q$2,,$O$2,$P$2)","v":308.47000000000003},{"$f":" RTD(\"cqg.rtd\",,\"StudyData\", $N$2, \"Bar\", \"\", \"Close\", $M$2, $F278, $R$2,$Q$2,,$O$2,$P$2)","v":308.95999999999998},-277,null,44181.565972222219,{"$f":"RTD(\"cqg.rtd\",,\"StudyData\",$N$2, \"Vol\", \"VolType=Auto,CoCType=Auto\", \"Vol\", $M$2, $F278, $R$2,$Q$2,,$O$2,$P$2)","v":458379}]
[{"$f":" RTD(\"cqg.rtd\",,\"StudyData\", $N$2, \"Bar\", \"\", \"Time\", $M$2, $F279,$R$2,$Q$2, \"\",\"False\")","v":44181.5625},{"$f":" RTD(\"cqg.rtd\",,\"StudyData\", $N$2, \"Bar\", \"\", \"Open\", $M$2, $F279, $R$2,$Q$2,,$O$2,$P$2)","v":308.04000000000002},{"$f":" RTD(\"cqg.rtd\",,\"StudyData\", $N$2, \"Bar\", \"\", \"High\", $M$2, $F279, $R$2,$Q$2,,$O$2,$P$2)","v":308.49},{"$f":" RTD(\"cqg.rtd\",,\"StudyData\", $N$2, \"Bar\", \"\", \"Low\", $M$2, $F279, $R$2,$Q$2,,$O$2,$P$2)","v":308.04000000000002},{"$f":" RTD(\"cqg.rtd\",,\"StudyData\", $N$2, \"Bar\", \"\", \"Close\", $M$2, $F279, $R$2,$Q$2,,$O$2,$P$2)","v":308.48},-278,null,44181.5625,{"$f":"RTD(\"cqg.rtd\",,\"StudyData\",$N$2, \"Vol\", \"VolType=Auto,CoCType=Auto\", \"Vol\", $M$2, $F279, $R$2,$Q$2,,$O$2,$P$2)","v":198307}]
[{"$f":" RTD(\"cqg.rtd\",,\"StudyData\", $N$2, \"Bar\", \"\", \"Time\", $M$2, $F280,$R$2,$Q$2, \"\",\"False\")","v":44181.559027777781},{"$f":" RTD(\"cqg.rtd\",,\"StudyData\", $N$2, \"Bar\", \"\", \"Open\", $M$2, $F280, $R$2,$Q$2,,$O$2,$P$2)","v":308.12},{"$f":" RTD(\"cqg.rtd\",,\"StudyData\", $N$2, \"Bar\", \"\", \"High\", $M$2, $F280, $R$2,$Q$2,,$O$2,$P$2)","v":308.12},{"$f":" RTD(\"cqg.rtd\",,\"StudyData\", $N$2, \"Bar\", \"\", \"Low\", $M$2, $F280, $R$2,$Q$2,,$O$2,$P$2)","v":307.93},{"$f":" RTD(\"cqg.rtd\",,\"StudyData\", $N$2, \"Bar\", \"\", \"Close\", $M$2, $F280, $R$2,$Q$2,,$O$2,$P$2)","v":308.02999999999997},-279,null,44181.559027777781,{"$f":"RTD(\"cqg.rtd\",,\"StudyData\",$N$2, \"Vol\", \"VolType=Auto,CoCType=Auto\", \"Vol\", $M$2, $F280, $R$2,$Q$2,,$O$2,$P$2)","v":229059}]
[{"$f":" RTD(\"cqg.rtd\",,\"StudyData\", $N$2, \"Bar\", \"\", \"Time\", $M$2, $F281,$R$2,$Q$2, \"\",\"False\")","v":44181.555555555555},{"$f":" RTD(\"cqg.rtd\",,\"StudyData\", $N$2, \"Bar\", \"\", \"Open\", $M$2, $F281, $R$2,$Q$2,,$O$2,$P$2)","v":307.77999999999997},{"$f":" RTD(\"cqg.rtd\",,\"StudyData\", $N$2, \"Bar\", \"\", \"High\", $M$2, $F281, $R$2,$Q$2,,$O$2,$P$2)","v":308.12},{"$f":" RTD(\"cqg.rtd\",,\"StudyData\", $N$2, \"Bar\", \"\", \"Low\", $M$2, $F281, $R$2,$Q$2,,$O$2,$P$2)","v":307.7},{"$f":" RTD(\"cqg.rtd\",,\"StudyData\", $N$2, \"Bar\", \"\", \"Close\", $M$2, $F281, $R$2,$Q$2,,$O$2,$P$2)","v":308.12},-280,null,44181.555555555555,{"$f":"RTD(\"cqg.rtd\",,\"StudyData\",$N$2, \"Vol\", \"VolType=Auto,CoCType=Auto\", \"Vol\", $M$2, $F281, $R$2,$Q$2,,$O$2,$P$2)","v":369702}]
[{"$f":" RTD(\"cqg.rtd\",,\"StudyData\", $N$2, \"Bar\", \"\", \"Time\", $M$2, $F282,$R$2,$Q$2, \"\",\"False\")","v":44181.552083333336},{"$f":" RTD(\"cqg.rtd\",,\"StudyData\", $N$2, \"Bar\", \"\", \"Open\", $M$2, $F282, $R$2,$Q$2,,$O$2,$P$2)","v":307.85000000000002},{"$f":" RTD(\"cqg.rtd\",,\"StudyData\", $N$2, \"Bar\", \"\", \"High\", $M$2, $F282, $R$2,$Q$2,,$O$2,$P$2)","v":307.89999999999998},{"$f":" RTD(\"cqg.rtd\",,\"StudyData\", $N$2, \"Bar\", \"\", \"Low\", $M$2, $F282, $R$2,$Q$2,,$O$2,$P$2)","v":307.67},{"$f":" RTD(\"cqg.rtd\",,\"StudyData\", $N$2, \"Bar\", \"\", \"Close\", $M$2, $F282, $R$2,$Q$2,,$O$2,$P$2)","v":307.76},-281,null,44181.552083333336,{"$f":"RTD(\"cqg.rtd\",,\"StudyData\",$N$2, \"Vol\", \"VolType=Auto,CoCType=Auto\", \"Vol\", $M$2, $F282, $R$2,$Q$2,,$O$2,$P$2)","v":194270}]
[{"$f":" RTD(\"cqg.rtd\",,\"StudyData\", $N$2, \"Bar\", \"\", \"Time\", $M$2, $F283,$R$2,$Q$2, \"\",\"False\")","v":44181.548611111109},{"$f":" RTD(\"cqg.rtd\",,\"StudyData\", $N$2, \"Bar\", \"\", \"Open\", $M$2, $F283, $R$2,$Q$2,,$O$2,$P$2)","v":307.85000000000002},{"$f":" RTD(\"cqg.rtd\",,\"StudyData\", $N$2, \"Bar\", \"\", \"High\", $M$2, $F283, $R$2,$Q$2,,$O$2,$P$2)","v":307.91000000000003},{"$f":" RTD(\"cqg.rtd\",,\"StudyData\", $N$2, \"Bar\", \"\", \"Low\", $M$2, $F283, $R$2,$Q$2,,$O$2,$P$2)","v":307.58},{"$f":" RTD(\"cqg.rtd\",,\"StudyData\", $N$2, \"Bar\", \"\", \"Close\", $M$2, $F283, $R$2,$Q$2,,$O$2,$P$2)","v":307.87},-282,null,44181.548611111109,{"$f":"RTD(\"cqg.rtd\",,\"StudyData\",$N$2, \"Vol\", \"VolType=Auto,CoCType=Auto\", \"Vol\", $M$2, $F283, $R$2,$Q$2,,$O$2,$P$2)","v":221940}]
[{"$f":" RTD(\"cqg.rtd\",,\"StudyData\", $N$2, \"Bar\", \"\", \"Time\", $M$2, $F284,$R$2,$Q$2, \"\",\"False\")","v":44181.545138888891},{"$f":" RTD(\"cqg.rtd\",,\"StudyData\", $N$2, \"Bar\", \"\", \"Open\", $M$2, $F284, $R$2,$Q$2,,$O$2,$P$2)","v":308.23},{"$f":" RTD(\"cqg.rtd\",,\"StudyData\", $N$2, \"Bar\", \"\", \"High\", $M$2, $F284, $R$2,$Q$2,,$O$2,$P$2)","v":308.26},{"$f":" RTD(\"cqg.rtd\",,\"StudyData\", $N$2, \"Bar\", \"\", \"Low\", $M$2, $F284, $R$2,$Q$2,,$O$2,$P$2)","v":307.66000000000003},{"$f":" RTD(\"cqg.rtd\",,\"StudyData\", $N$2, \"Bar\", \"\", \"Close\", $M$2, $F284, $R$2,$Q$2,,$O$2,$P$2)","v":307.88},-283,null,44181.545138888891,{"$f":"RTD(\"cqg.rtd\",,\"StudyData\",$N$2, \"Vol\", \"VolType=Auto,CoCType=Auto\", \"Vol\", $M$2, $F284, $R$2,$Q$2,,$O$2,$P$2)","v":336131}]
[{"$f":" RTD(\"cqg.rtd\",,\"StudyData\", $N$2, \"Bar\", \"\", \"Time\", $M$2, $F285,$R$2,$Q$2, \"\",\"False\")","v":44181.541666666664},{"$f":" RTD(\"cqg.rtd\",,\"StudyData\", $N$2, \"Bar\", \"\", \"Open\", $M$2, $F285, $R$2,$Q$2,,$O$2,$P$2)","v":308.45},{"$f":" RTD(\"cqg.rtd\",,\"StudyData\", $N$2, \"Bar\", \"\", \"High\", $M$2, $F285, $R$2,$Q$2,,$O$2,$P$2)","v":308.67},{"$f":" RTD(\"cqg.rtd\",,\"StudyData\", $N$2, \"Bar\", \"\", \"Low\", $M$2, $F285, $R$2,$Q$2,,$O$2,$P$2)","v":308.05},{"$f":" RTD(\"cqg.rtd\",,\"StudyData\", $N$2, \"Bar\", \"\", \"Close\", $M$2, $F285, $R$2,$Q$2,,$O$2,$P$2)","v":308.26},-284,null,44181.541666666664,{"$f":"RTD(\"cqg.rtd\",,\"StudyData\",$N$2, \"Vol\", \"VolType=Auto,CoCType=Auto\", \"Vol\", $M$2, $F285, $R$2,$Q$2,,$O$2,$P$2)","v":294105}]
[{"$f":" RTD(\"cqg.rtd\",,\"StudyData\", $N$2, \"Bar\", \"\", \"Time\", $M$2, $F286,$R$2,$Q$2, \"\",\"False\")","v":44181.538194444445},{"$f":" RTD(\"cqg.rtd\",,\"StudyData\", $N$2, \"Bar\", \"\", \"Open\", $M$2, $F286, $R$2,$Q$2,,$O$2,$P$2)","v":308.55},{"$f":" RTD(\"cqg.rtd\",,\"StudyData\", $N$2, \"Bar\", \"\", \"High\", $M$2, $F286, $R$2,$Q$2,,$O$2,$P$2)","v":308.60000000000002},{"$f":" RTD(\"cqg.rtd\",,\"StudyData\", $N$2, \"Bar\", \"\", \"Low\", $M$2, $F286, $R$2,$Q$2,,$O$2,$P$2)","v":308.39999999999998},{"$f":" RTD(\"cqg.rtd\",,\"StudyData\", $N$2, \"Bar\", \"\", \"Close\", $M$2, $F286, $R$2,$Q$2,,$O$2,$P$2)","v":308.39999999999998},-285,null,44181.538194444445,{"$f":"RTD(\"cqg.rtd\",,\"StudyData\",$N$2, \"Vol\", \"VolType=Auto,CoCType=Auto\", \"Vol\", $M$2, $F286, $R$2,$Q$2,,$O$2,$P$2)","v":91771}]
[{"$f":" RTD(\"cqg.rtd\",,\"StudyData\", $N$2, \"Bar\", \"\", \"Time\", $M$2, $F287,$R$2,$Q$2, \"\",\"False\")","v":44181.534722222219},{"$f":" RTD(\"cqg.rtd\",,\"StudyData\", $N$2, \"Bar\", \"\", \"Open\", $M$2, $F287, $R$2,$Q$2,,$O$2,$P$2)","v":308.55},{"$f":" RTD(\"cqg.rtd\",,\"StudyData\", $N$2, \"Bar\", \"\", \"High\", $M$2, $F287, $R$2,$Q$2,,$O$2,$P$2)","v":308.61},{"$f":" RTD(\"cqg.rtd\",,\"StudyData\", $N$2, \"Bar\", \"\", \"Low\", $M$2, $F287, $R$2,$Q$2,,$O$2,$P$2)","v":308.47000000000003},{"$f":" RTD(\"cqg.rtd\",,\"StudyData\", $N$2, \"Bar\", \"\", \"Close\", $M$2, $F287, $R$2,$Q$2,,$O$2,$P$2)","v":308.55},-286,null,44181.534722222219,{"$f":"RTD(\"cqg.rtd\",,\"StudyData\",$N$2, \"Vol\", \"VolType=Auto,CoCType=Auto\", \"Vol\", $M$2, $F287, $R$2,$Q$2,,$O$2,$P$2)","v":139867}]
[{"$f":" RTD(\"cqg.rtd\",,\"StudyData\", $N$2, \"Bar\", \"\", \"Time\", $M$2, $F288,$R$2,$Q$2, \"\",\"False\")","v":44181.53125},{"$f":" RTD(\"cqg.rtd\",,\"StudyData\", $N$2, \"Bar\", \"\", \"Open\", $M$2, $F288, $R$2,$Q$2,,$O$2,$P$2)","v":308.60000000000002},{"$f":" RTD(\"cqg.rtd\",,\"StudyData\", $N$2, \"Bar\", \"\", \"High\", $M$2, $F288, $R$2,$Q$2,,$O$2,$P$2)","v":308.63},{"$f":" RTD(\"cqg.rtd\",,\"StudyData\", $N$2, \"Bar\", \"\", \"Low\", $M$2, $F288, $R$2,$Q$2,,$O$2,$P$2)","v":308.48},{"$f":" RTD(\"cqg.rtd\",,\"StudyData\", $N$2, \"Bar\", \"\", \"Close\", $M$2, $F288, $R$2,$Q$2,,$O$2,$P$2)","v":308.54000000000002},-287,null,44181.53125,{"$f":"RTD(\"cqg.rtd\",,\"StudyData\",$N$2, \"Vol\", \"VolType=Auto,CoCType=Auto\", \"Vol\", $M$2, $F288, $R$2,$Q$2,,$O$2,$P$2)","v":134574}]
[{"$f":" RTD(\"cqg.rtd\",,\"StudyData\", $N$2, \"Bar\", \"\", \"Time\", $M$2, $F289,$R$2,$Q$2, \"\",\"False\")","v":44181.527777777781},{"$f":" RTD(\"cqg.rtd\",,\"StudyData\", $N$2, \"Bar\", \"\", \"Open\", $M$2, $F289, $R$2,$Q$2,,$O$2,$P$2)","v":308.52},{"$f":" RTD(\"cqg.rtd\",,\"StudyData\", $N$2, \"Bar\", \"\", \"High\", $M$2, $F289, $R$2,$Q$2,,$O$2,$P$2)","v":308.62},{"$f":" RTD(\"cqg.rtd\",,\"StudyData\", $N$2, \"Bar\", \"\", \"Low\", $M$2, $F289, $R$2,$Q$2,,$O$2,$P$2)","v":308.49},{"$f":" RTD(\"cqg.rtd\",,\"StudyData\", $N$2, \"Bar\", \"\", \"Close\", $M$2, $F289, $R$2,$Q$2,,$O$2,$P$2)","v":308.60000000000002},-288,null,44181.527777777781,{"$f":"RTD(\"cqg.rtd\",,\"StudyData\",$N$2, \"Vol\", \"VolType=Auto,CoCType=Auto\", \"Vol\", $M$2, $F289, $R$2,$Q$2,,$O$2,$P$2)","v":98016}]
[{"$f":" RTD(\"cqg.rtd\",,\"StudyData\", $N$2, \"Bar\", \"\", \"Time\", $M$2, $F290,$R$2,$Q$2, \"\",\"False\")","v":44181.524305555555},{"$f":" RTD(\"cqg.rtd\",,\"StudyData\", $N$2, \"Bar\", \"\", \"Open\", $M$2, $F290, $R$2,$Q$2,,$O$2,$P$2)","v":308.47000000000003},{"$f":" RTD(\"cqg.rtd\",,\"StudyData\", $N$2, \"Bar\", \"\", \"High\", $M$2, $F290, $R$2,$Q$2,,$O$2,$P$2)","v":308.56},{"$f":" RTD(\"cqg.rtd\",,\"StudyData\", $N$2, \"Bar\", \"\", \"Low\", $M$2, $F290, $R$2,$Q$2,,$O$2,$P$2)","v":308.41000000000003},{"$f":" RTD(\"cqg.rtd\",,\"StudyData\", $N$2, \"Bar\", \"\", \"Close\", $M$2, $F290, $R$2,$Q$2,,$O$2,$P$2)","v":308.52},-289,null,44181.524305555555,{"$f":"RTD(\"cqg.rtd\",,\"StudyData\",$N$2, \"Vol\", \"VolType=Auto,CoCType=Auto\", \"Vol\", $M$2, $F290, $R$2,$Q$2,,$O$2,$P$2)","v":54494}]
[{"$f":" RTD(\"cqg.rtd\",,\"StudyData\", $N$2, \"Bar\", \"\", \"Time\", $M$2, $F291,$R$2,$Q$2, \"\",\"False\")","v":44181.520833333336},{"$f":" RTD(\"cqg.rtd\",,\"StudyData\", $N$2, \"Bar\", \"\", \"Open\", $M$2, $F291, $R$2,$Q$2,,$O$2,$P$2)","v":308.14999999999998},{"$f":" RTD(\"cqg.rtd\",,\"StudyData\", $N$2, \"Bar\", \"\", \"High\", $M$2, $F291, $R$2,$Q$2,,$O$2,$P$2)","v":308.54000000000002},{"$f":" RTD(\"cqg.rtd\",,\"StudyData\", $N$2, \"Bar\", \"\", \"Low\", $M$2, $F291, $R$2,$Q$2,,$O$2,$P$2)","v":308.12},{"$f":" RTD(\"cqg.rtd\",,\"StudyData\", $N$2, \"Bar\", \"\", \"Close\", $M$2, $F291, $R$2,$Q$2,,$O$2,$P$2)","v":308.49},-290,null,44181.520833333336,{"$f":"RTD(\"cqg.rtd\",,\"StudyData\",$N$2, \"Vol\", \"VolType=Auto,CoCType=Auto\", \"Vol\", $M$2, $F291, $R$2,$Q$2,,$O$2,$P$2)","v":97337}]
[{"$f":" RTD(\"cqg.rtd\",,\"StudyData\", $N$2, \"Bar\", \"\", \"Time\", $M$2, $F292,$R$2,$Q$2, \"\",\"False\")","v":44181.517361111109},{"$f":" RTD(\"cqg.rtd\",,\"StudyData\", $N$2, \"Bar\", \"\", \"Open\", $M$2, $F292, $R$2,$Q$2,,$O$2,$P$2)","v":308.33},{"$f":" RTD(\"cqg.rtd\",,\"StudyData\", $N$2, \"Bar\", \"\", \"High\", $M$2, $F292, $R$2,$Q$2,,$O$2,$P$2)","v":308.38},{"$f":" RTD(\"cqg.rtd\",,\"StudyData\", $N$2, \"Bar\", \"\", \"Low\", $M$2, $F292, $R$2,$Q$2,,$O$2,$P$2)","v":308.11},{"$f":" RTD(\"cqg.rtd\",,\"StudyData\", $N$2, \"Bar\", \"\", \"Close\", $M$2, $F292, $R$2,$Q$2,,$O$2,$P$2)","v":308.14999999999998},-291,null,44181.517361111109,{"$f":"RTD(\"cqg.rtd\",,\"StudyData\",$N$2, \"Vol\", \"VolType=Auto,CoCType=Auto\", \"Vol\", $M$2, $F292, $R$2,$Q$2,,$O$2,$P$2)","v":64975}]
[{"$f":" RTD(\"cqg.rtd\",,\"StudyData\", $N$2, \"Bar\", \"\", \"Time\", $M$2, $F293,$R$2,$Q$2, \"\",\"False\")","v":44181.513888888891},{"$f":" RTD(\"cqg.rtd\",,\"StudyData\", $N$2, \"Bar\", \"\", \"Open\", $M$2, $F293, $R$2,$Q$2,,$O$2,$P$2)","v":308.31},{"$f":" RTD(\"cqg.rtd\",,\"StudyData\", $N$2, \"Bar\", \"\", \"High\", $M$2, $F293, $R$2,$Q$2,,$O$2,$P$2)","v":308.42},{"$f":" RTD(\"cqg.rtd\",,\"StudyData\", $N$2, \"Bar\", \"\", \"Low\", $M$2, $F293, $R$2,$Q$2,,$O$2,$P$2)","v":308.27999999999997},{"$f":" RTD(\"cqg.rtd\",,\"StudyData\", $N$2, \"Bar\", \"\", \"Close\", $M$2, $F293, $R$2,$Q$2,,$O$2,$P$2)","v":308.33999999999997},-292,null,44181.513888888891,{"$f":"RTD(\"cqg.rtd\",,\"StudyData\",$N$2, \"Vol\", \"VolType=Auto,CoCType=Auto\", \"Vol\", $M$2, $F293, $R$2,$Q$2,,$O$2,$P$2)","v":59542}]
[{"$f":" RTD(\"cqg.rtd\",,\"StudyData\", $N$2, \"Bar\", \"\", \"Time\", $M$2, $F294,$R$2,$Q$2, \"\",\"False\")","v":44181.510416666664},{"$f":" RTD(\"cqg.rtd\",,\"StudyData\", $N$2, \"Bar\", \"\", \"Open\", $M$2, $F294, $R$2,$Q$2,,$O$2,$P$2)","v":308.37},{"$f":" RTD(\"cqg.rtd\",,\"StudyData\", $N$2, \"Bar\", \"\", \"High\", $M$2, $F294, $R$2,$Q$2,,$O$2,$P$2)","v":308.37},{"$f":" RTD(\"cqg.rtd\",,\"StudyData\", $N$2, \"Bar\", \"\", \"Low\", $M$2, $F294, $R$2,$Q$2,,$O$2,$P$2)","v":308.19},{"$f":" RTD(\"cqg.rtd\",,\"StudyData\", $N$2, \"Bar\", \"\", \"Close\", $M$2, $F294, $R$2,$Q$2,,$O$2,$P$2)","v":308.31},-293,null,44181.510416666664,{"$f":"RTD(\"cqg.rtd\",,\"StudyData\",$N$2, \"Vol\", \"VolType=Auto,CoCType=Auto\", \"Vol\", $M$2, $F294, $R$2,$Q$2,,$O$2,$P$2)","v":46082}]
[{"$f":" RTD(\"cqg.rtd\",,\"StudyData\", $N$2, \"Bar\", \"\", \"Time\", $M$2, $F295,$R$2,$Q$2, \"\",\"False\")","v":44181.506944444445},{"$f":" RTD(\"cqg.rtd\",,\"StudyData\", $N$2, \"Bar\", \"\", \"Open\", $M$2, $F295, $R$2,$Q$2,,$O$2,$P$2)","v":308.01},{"$f":" RTD(\"cqg.rtd\",,\"StudyData\", $N$2, \"Bar\", \"\", \"High\", $M$2, $F295, $R$2,$Q$2,,$O$2,$P$2)","v":308.37},{"$f":" RTD(\"cqg.rtd\",,\"StudyData\", $N$2, \"Bar\", \"\", \"Low\", $M$2, $F295, $R$2,$Q$2,,$O$2,$P$2)","v":308},{"$f":" RTD(\"cqg.rtd\",,\"StudyData\", $N$2, \"Bar\", \"\", \"Close\", $M$2, $F295, $R$2,$Q$2,,$O$2,$P$2)","v":308.37},-294,null,44181.506944444445,{"$f":"RTD(\"cqg.rtd\",,\"StudyData\",$N$2, \"Vol\", \"VolType=Auto,CoCType=Auto\", \"Vol\", $M$2, $F295, $R$2,$Q$2,,$O$2,$P$2)","v":87048}]
[{"$f":" RTD(\"cqg.rtd\",,\"StudyData\", $N$2, \"Bar\", \"\", \"Time\", $M$2, $F296,$R$2,$Q$2, \"\",\"False\")","v":44181.503472222219},{"$f":" RTD(\"cqg.rtd\",,\"StudyData\", $N$2, \"Bar\", \"\", \"Open\", $M$2, $F296, $R$2,$Q$2,,$O$2,$P$2)","v":308.36},{"$f":" RTD(\"cqg.rtd\",,\"StudyData\", $N$2, \"Bar\", \"\", \"High\", $M$2, $F296, $R$2,$Q$2,,$O$2,$P$2)","v":308.36},{"$f":" RTD(\"cqg.rtd\",,\"StudyData\", $N$2, \"Bar\", \"\", \"Low\", $M$2, $F296, $R$2,$Q$2,,$O$2,$P$2)","v":307.98},{"$f":" RTD(\"cqg.rtd\",,\"StudyData\", $N$2, \"Bar\", \"\", \"Close\", $M$2, $F296, $R$2,$Q$2,,$O$2,$P$2)","v":308.02999999999997},-295,null,44181.503472222219,{"$f":"RTD(\"cqg.rtd\",,\"StudyData\",$N$2, \"Vol\", \"VolType=Auto,CoCType=Auto\", \"Vol\", $M$2, $F296, $R$2,$Q$2,,$O$2,$P$2)","v":91892}]
[{"$f":" RTD(\"cqg.rtd\",,\"StudyData\", $N$2, \"Bar\", \"\", \"Time\", $M$2, $F297,$R$2,$Q$2, \"\",\"False\")","v":44181.5},{"$f":" RTD(\"cqg.rtd\",,\"StudyData\", $N$2, \"Bar\", \"\", \"Open\", $M$2, $F297, $R$2,$Q$2,,$O$2,$P$2)","v":308.42},{"$f":" RTD(\"cqg.rtd\",,\"StudyData\", $N$2, \"Bar\", \"\", \"High\", $M$2, $F297, $R$2,$Q$2,,$O$2,$P$2)","v":308.43},{"$f":" RTD(\"cqg.rtd\",,\"StudyData\", $N$2, \"Bar\", \"\", \"Low\", $M$2, $F297, $R$2,$Q$2,,$O$2,$P$2)","v":308.23},{"$f":" RTD(\"cqg.rtd\",,\"StudyData\", $N$2, \"Bar\", \"\", \"Close\", $M$2, $F297, $R$2,$Q$2,,$O$2,$P$2)","v":308.37},-296,null,44181.5,{"$f":"RTD(\"cqg.rtd\",,\"StudyData\",$N$2, \"Vol\", \"VolType=Auto,CoCType=Auto\", \"Vol\", $M$2, $F297, $R$2,$Q$2,,$O$2,$P$2)","v":50372}]
[{"$f":" RTD(\"cqg.rtd\",,\"StudyData\", $N$2, \"Bar\", \"\", \"Time\", $M$2, $F298,$R$2,$Q$2, \"\",\"False\")","v":44181.496527777781},{"$f":" RTD(\"cqg.rtd\",,\"StudyData\", $N$2, \"Bar\", \"\", \"Open\", $M$2, $F298, $R$2,$Q$2,,$O$2,$P$2)","v":308.32},{"$f":" RTD(\"cqg.rtd\",,\"StudyData\", $N$2, \"Bar\", \"\", \"High\", $M$2, $F298, $R$2,$Q$2,,$O$2,$P$2)","v":308.45999999999998},{"$f":" RTD(\"cqg.rtd\",,\"StudyData\", $N$2, \"Bar\", \"\", \"Low\", $M$2, $F298, $R$2,$Q$2,,$O$2,$P$2)","v":308.29000000000002},{"$f":" RTD(\"cqg.rtd\",,\"StudyData\", $N$2, \"Bar\", \"\", \"Close\", $M$2, $F298, $R$2,$Q$2,,$O$2,$P$2)","v":308.45},-297,null,44181.496527777781,{"$f":"RTD(\"cqg.rtd\",,\"StudyData\",$N$2, \"Vol\", \"VolType=Auto,CoCType=Auto\", \"Vol\", $M$2, $F298, $R$2,$Q$2,,$O$2,$P$2)","v":44854}]
[{"$f":" RTD(\"cqg.rtd\",,\"StudyData\", $N$2, \"Bar\", \"\", \"Time\", $M$2, $F299,$R$2,$Q$2, \"\",\"False\")","v":44181.493055555555},{"$f":" RTD(\"cqg.rtd\",,\"StudyData\", $N$2, \"Bar\", \"\", \"Open\", $M$2, $F299, $R$2,$Q$2,,$O$2,$P$2)","v":308.27999999999997},{"$f":" RTD(\"cqg.rtd\",,\"StudyData\", $N$2, \"Bar\", \"\", \"High\", $M$2, $F299, $R$2,$Q$2,,$O$2,$P$2)","v":308.33999999999997},{"$f":" RTD(\"cqg.rtd\",,\"StudyData\", $N$2, \"Bar\", \"\", \"Low\", $M$2, $F299, $R$2,$Q$2,,$O$2,$P$2)","v":308},{"$f":" RTD(\"cqg.rtd\",,\"StudyData\", $N$2, \"Bar\", \"\", \"Close\", $M$2, $F299, $R$2,$Q$2,,$O$2,$P$2)","v":308.33},-298,null,44181.493055555555,{"$f":"RTD(\"cqg.rtd\",,\"StudyData\",$N$2, \"Vol\", \"VolType=Auto,CoCType=Auto\", \"Vol\", $M$2, $F299, $R$2,$Q$2,,$O$2,$P$2)","v":89150}]
[{"$f":" RTD(\"cqg.rtd\",,\"StudyData\", $N$2, \"Bar\", \"\", \"Time\", $M$2, $F300,$R$2,$Q$2, \"\",\"False\")","v":44181.489583333336},{"$f":" RTD(\"cqg.rtd\",,\"StudyData\", $N$2, \"Bar\", \"\", \"Open\", $M$2, $F300, $R$2,$Q$2,,$O$2,$P$2)","v":308.39},{"$f":" RTD(\"cqg.rtd\",,\"StudyData\", $N$2, \"Bar\", \"\", \"High\", $M$2, $F300, $R$2,$Q$2,,$O$2,$P$2)","v":308.51},{"$f":" RTD(\"cqg.rtd\",,\"StudyData\", $N$2, \"Bar\", \"\", \"Low\", $M$2, $F300, $R$2,$Q$2,,$O$2,$P$2)","v":308.26},{"$f":" RTD(\"cqg.rtd\",,\"StudyData\", $N$2, \"Bar\", \"\", \"Close\", $M$2, $F300, $R$2,$Q$2,,$O$2,$P$2)","v":308.29000000000002},-299,null,44181.489583333336,{"$f":"RTD(\"cqg.rtd\",,\"StudyData\",$N$2, \"Vol\", \"VolType=Auto,CoCType=Auto\", \"Vol\", $M$2, $F300, $R$2,$Q$2,,$O$2,$P$2)","v":121049}]
[{"$f":" RTD(\"cqg.rtd\",,\"StudyData\", $N$2, \"Bar\", \"\", \"Time\", $M$2, $F301,$R$2,$Q$2, \"\",\"False\")","v":44181.486111111109},{"$f":" RTD(\"cqg.rtd\",,\"StudyData\", $N$2, \"Bar\", \"\", \"Open\", $M$2, $F301, $R$2,$Q$2,,$O$2,$P$2)","v":308.35000000000002},{"$f":" RTD(\"cqg.rtd\",,\"StudyData\", $N$2, \"Bar\", \"\", \"High\", $M$2, $F301, $R$2,$Q$2,,$O$2,$P$2)","v":308.48},{"$f":" RTD(\"cqg.rtd\",,\"StudyData\", $N$2, \"Bar\", \"\", \"Low\", $M$2, $F301, $R$2,$Q$2,,$O$2,$P$2)","v":308.19},{"$f":" RTD(\"cqg.rtd\",,\"StudyData\", $N$2, \"Bar\", \"\", \"Close\", $M$2, $F301, $R$2,$Q$2,,$O$2,$P$2)","v":308.39},-300,null,44181.486111111109,{"$f":"RTD(\"cqg.rtd\",,\"StudyData\",$N$2, \"Vol\", \"VolType=Auto,CoCType=Auto\", \"Vol\", $M$2, $F301, $R$2,$Q$2,,$O$2,$P$2)","v":116013}]