{"text_format":"1","workbook":"xlsx","n_sheets":4,"sheets":["Main","Data","Ranked","BarData"],"not_rendered":{"charts":2,"images":4,"macros":1,"external_links":0,"defined_names":0,"comments":0,"pivot_tables":0},"unopened":[],"bounds":{"document_bytes":16777216,"sheet_cells":100000,"rows_first":2000,"rows_last":500,"rows_between":2000,"halvings":0,"cell_chars":16384,"cell_head_chars":4096},"cells_cut":0,"cells_raw":0,"read":"whole","date_system":"1900"}

{"sheet":"Main","index":0,"n_rows":47,"n_cols":28,"rows_kept":47,"cut":false,"hidden":false,"merged":[[23,22,23,23],[24,24,24,25],[23,24,23,25],[4,7,4,10],[46,8,46,12],[43,9,43,12],[45,9,45,12],[4,1,4,2],[4,4,4,5],[45,2,45,5],[28,9,28,12],[29,9,29,12],[30,9,30,12],[31,9,31,12],[32,9,32,12],[33,9,33,12],[34,9,34,12],[35,9,35,12],[36,9,36,12],[37,9,37,12],[38,9,38,12],[39,9,39,12],[40,9,40,12],[44,9,44,12],[41,9,41,12],[42,9,42,12],[40,2,40,5],[41,2,41,5],[42,2,42,5],[43,2,43,5],[44,2,44,5],[35,2,35,5],[36,2,36,5],[37,2,37,5],[38,2,38,5],[39,2,39,5],[31,2,31,5],[32,2,32,5],[33,2,33,5],[34,2,34,5],[27,9,27,12],[5,1,5,6],[5,8,5,13],[28,2,28,5],[29,2,29,5],[25,2,25,5],[26,2,26,5],[27,2,27,5],[22,9,22,12],[23,9,23,12],[24,9,24,12],[25,9,25,12],[26,9,26,12],[22,2,22,5],[23,2,23,5],[24,2,24,5],[13,2,13,5],[14,2,14,5],[15,2,15,5],[7,9,7,12],[30,2,30,5],[20,9,20,12],[21,9,21,12],[20,2,20,5],[21,2,21,5],[18,9,18,12],[19,9,19,12],[18,2,18,5],[19,2,19,5],[1,22,3,25],[1,20,1,21],[6,16,6,19],[7,16,7,19],[8,16,8,19],[9,16,9,19],[10,16,10,19],[11,16,11,19],[12,16,12,19],[1,6,3,19],[10,9,10,12],[11,9,11,12],[16,2,16,5],[7,2,7,5],[8,2,8,5],[9,2,9,5],[10,2,10,5],[1,1,3,5],[6,9,6,12],[23,18,23,19],[8,9,8,12],[9,9,9,12],[12,9,12,12],[13,9,13,12],[14,9,14,12],[14,16,14,19],[17,2,17,5],[15,9,15,12],[16,9,16,12],[17,9,17,12],[6,2,6,5],[12,2,12,5],[11,2,11,5],[24,17,24,19],[4,16,4,19],[5,16,5,19],[15,16,15,19],[16,16,16,19],[17,16,17,19],[18,16,18,19],[19,16,19,19],[20,16,20,19],[21,16,21,19],[22,16,22,19],[24,14,24,16],[23,14,23,16],[13,16,13,19]]}
[]
[null,null,null,null,null,null,"CQG NASDAQ 100 Index Internal Performance ",null,null,null,null,null,null,null,null,null,null,null,null,null,"Ribbon",null,{"$f":"RTD(\"cqg.rtd\", ,\"SystemInfo\", \"Linetime\")","v":44187.404652777775}]
[]
[]
[null,"Lookback Period: ",null,12,"Time Frame: ",null,5,"Number of Stocks Making New Highs:",null,null,null,{"$f":"Ranked!U2","v":12},"New Lows:",{"$f":"Ranked!V2","v":4},null,"Symbol","Description",null,null,null,"Last:","NC","%NC","Open","High","Low"]
[null,{"$f":"\"New \"&$D$5&\"-Bar High Symbols, Descriptions and Net % Daily Change\"","v":"New 12-Bar High Symbols, Descriptions and Net % Daily Change"},null,null,null,null,null,null,{"$f":"\"New \"&$D$5&\"-Bar Low Symbols, Descriptions and Net % Daily Change\"","v":"New 12-Bar Low Symbols, Descriptions and Net % Daily Change"},null,null,null,null,null,null,"DJI",{"$f":"IF(P6=\"\",\"\",RTD(\"cqg.rtd\", ,\"ContractData\",P6, \"LongDescription\",, \"T\"))","v":"DJ Industrial Average"},null,null,null,{"$f":"IF(P6=\"\",\"\",TEXT(RTD(\"cqg.rtd\",,\"ContractData\",P6,\"LastTradeToday\",,\"T\"),AB6))","v":"30137.8"},{"$f":"IF(P6=\"\",\"\",TEXT(RTD(\"cqg.rtd\", ,\"ContractData\", P6, \"NetLastTradeToday\",, \"T\"),AB6))","v":"-78.6"},{"$f":"IFERROR(IF(P6=\"\",\"\",RTD(\"cqg.rtd\", ,\"ContractData\", P6, \"PerCentNetLastTrade\",, \"T\")/100),\"\")","v":-2.6012364146622362E-3},{"$f":"IF(P6=\"\",\"\",TEXT(RTD(\"cqg.rtd\", ,\"ContractData\", P6, \"OPen\",, \"T\"),AB6))","v":"30200.2"},{"$f":"IF(P6=\"\",\"\",TEXT(RTD(\"cqg.rtd\", ,\"ContractData\", P6, \"HIgh\",, \"T\"),AB6))","v":"30200.2"},{"$f":"IF(P6=\"\",\"\",TEXT(RTD(\"cqg.rtd\", ,\"ContractData\", P6, \"LOw\",, \"T\"),AB6))","v":"30034.3"},{"$f":"IF(P6=\"\",\"\",IF(LEN(RTD(\"cqg.rtd\",,\"ContractData\",P6,\"TickSize\",,\"T\"))=1,0,LEN(RTD(\"cqg.rtd\",,\"ContractData\",P6,\"TickSize\",,\"T\"))-2))","v":1},{"$f":"IF(AA6=0,\"#\",IF(AA6=1,\"#.0\",IF(AA6=2,\"#.00\",IF(AA6=3,\"#.000\",IF(AA6=4,\"#.0000\",IF(AA6=5,\"#.00000\",IF(AA6=6,\"#.000000\",IF(AA6=7,\"#.0000000\"))))))))","v":"#.0"}]
{"$rows_left_out":42}
{"sheet":"Data","index":1,"n_rows":103,"n_cols":20,"rows_kept":103,"cut":false,"hidden":true,"merged":[]}
["Symbol",{"$f":"Main!D5","v":12},{"$f":"Main!G5","v":5},null,null,null,null,0,0,null,null,null,null,null,null,null,null,null,"UP"]
["S.US.AAPL ",{"$f":"IFERROR(RTD(\"cqg.rtd\",,\"StudyData\",A2,\"Bar\",, \"High\",$C$1,\"0\",,,,,\"T\"),\"\")","v":133.18},{"$f":"IFERROR(RTD(\"cqg.rtd\",,\"StudyData\",A2,\"Bar\",, \"Low\",$C$1,\"0\",,,,,\"T\"),\"\")","v":132.84},{"$f":"IFERROR(RTD(\"cqg.rtd\",,\"StudyData\",\"HiLevel(\"&A2&\",Period1:=\"&$B$1&\",AllowGaps:=0,InputChoice1:=High,InputChoice3:=High)\",\"Bar\",, \"Close\",$C$1,\"-1\",,,,,\"T\"),\"\")","v":134.4},{"$f":"IFERROR(RTD(\"cqg.rtd\",,\"StudyData\",\"LoLevel(\"&A2&\",Period2:=\"&$B$1&\",AllowGaps:=0,InputChoice2:=Low,InputChoice4:=Low)\",\"Bar\",, \"Close\",$C$1,\"-1\",,,,,\"T\"),\"\")","v":131.55000000000001},{"$f":"IF(B2=\"\",0,IFERROR(IF(B2>D2,1,0),\"\"))","v":0},{"$f":"IF(C2=\"\",0,IFERROR(IF(C2<E2,1,0),\"\"))","v":0},{"$f":"IF(F2=1,INT(H1+1),H1+0.001)","v":1E-3},{"$f":"IF(G2=1,INT(I1+1),I1+0.001)","v":1E-3},{"$f":"A2","v":"S.US.AAPL "},{"$f":"RTD(\"cqg.rtd\", ,\"ContractData\",A2, \"PerCentNetLastTrade\",, \"T\")/100","v":3.844654137097403E-2},{"$f":"RANK($K2,$K$2:K$103)+COUNTIF($K$2:K2,K2)-1","v":3},{"$f":"J2","v":"S.US.AAPL "},1,{"$f":"IFERROR(VLOOKUP(N2,$L$2:$M$103,2,FALSE),\"\")","v":"S.US.PTON "},{"$f":"RTD(\"cqg.rtd\", ,\"ContractData\",O2, \"PerCentNetLastTrade\",, \"T\")/100","v":0.13366576632730798},{"$f":"VLOOKUP(O2,$A$2:$H103,8,FALSE)","v":9.0059999999999967},null,1,{"$f":"IFERROR(VLOOKUP(S2,$H$2:$J$103,3,FALSE),\"\")","v":"S.US.ANSS "}]
["S.US.ADBE ",{"$f":"IFERROR(RTD(\"cqg.rtd\",,\"StudyData\",A3,\"Bar\",, \"High\",$C$1,\"0\",,,,,\"T\"),\"\")","v":503},{"$f":"IFERROR(RTD(\"cqg.rtd\",,\"StudyData\",A3,\"Bar\",, \"Low\",$C$1,\"0\",,,,,\"T\"),\"\")","v":502.55},{"$f":"IFERROR(RTD(\"cqg.rtd\",,\"StudyData\",\"HiLevel(\"&A3&\",Period1:=\"&$B$1&\",AllowGaps:=0,InputChoice1:=High,InputChoice3:=High)\",\"Bar\",, \"Close\",$C$1,\"-1\",,,,,\"T\"),\"\")","v":503.35},{"$f":"IFERROR(RTD(\"cqg.rtd\",,\"StudyData\",\"LoLevel(\"&A3&\",Period2:=\"&$B$1&\",AllowGaps:=0,InputChoice2:=Low,InputChoice4:=Low)\",\"Bar\",, \"Close\",$C$1,\"-1\",,,,,\"T\"),\"\")","v":497.65},{"$f":"IF(B3=\"\",0,IFERROR(IF(B3>D3,1,0),\"\"))","v":0},{"$f":"IF(C3=\"\",0,IFERROR(IF(C3<E3,1,0),\"\"))","v":0},{"$f":"IF(F3=1,INT(H2+1),H2+0.001)","v":2E-3},2E-3,{"$f":"A3","v":"S.US.ADBE "},{"$f":"RTD(\"cqg.rtd\", ,\"ContractData\",A3, \"PerCentNetLastTrade\",, \"T\")/100","v":8.70803988844078E-3},{"$f":"RANK($K3,$K$2:K$103)+COUNTIF($K$2:K3,K3)-1","v":22},{"$f":"J3","v":"S.US.ADBE "},{"$f":"N2+1","v":2},{"$f":"IFERROR(VLOOKUP(N3,$L$2:$M$103,2,FALSE),\"\")","v":"S.US.WDAY "},{"$f":"RTD(\"cqg.rtd\", ,\"ContractData\",O3, \"PerCentNetLastTrade\",, \"T\")/100","v":4.89022779795312E-2},{"$f":"VLOOKUP(O3,$A$2:$H104,8,FALSE)","v":12.002999999999998},null,{"$f":"S2+1","v":2},{"$f":"IFERROR(VLOOKUP(S3,$H$2:$J$103,3,FALSE),\"\")","v":"S.US.CERN "}]
["S.US.ADI ",{"$f":"IFERROR(RTD(\"cqg.rtd\",,\"StudyData\",A4,\"Bar\",, \"High\",$C$1,\"0\",,,,,\"T\"),\"\")","v":143.63},{"$f":"IFERROR(RTD(\"cqg.rtd\",,\"StudyData\",A4,\"Bar\",, \"Low\",$C$1,\"0\",,,,,\"T\"),\"\")","v":143.44999999999999},{"$f":"IFERROR(RTD(\"cqg.rtd\",,\"StudyData\",\"HiLevel(\"&A4&\",Period1:=\"&$B$1&\",AllowGaps:=0,InputChoice1:=High,InputChoice3:=High)\",\"Bar\",, \"Close\",$C$1,\"-1\",,,,,\"T\"),\"\")","v":143.68},{"$f":"IFERROR(RTD(\"cqg.rtd\",,\"StudyData\",\"LoLevel(\"&A4&\",Period2:=\"&$B$1&\",AllowGaps:=0,InputChoice2:=Low,InputChoice4:=Low)\",\"Bar\",, \"Close\",$C$1,\"-1\",,,,,\"T\"),\"\")","v":142.66999999999999},{"$f":"IF(B4=\"\",0,IFERROR(IF(B4>D4,1,0),\"\"))","v":0},0,3.0000000000000001E-3,3.0000000000000001E-3,"S.US.ADI ",{"$f":"RTD(\"cqg.rtd\", ,\"ContractData\",A4, \"PerCentNetLastTrade\",, \"T\")/100","v":7.0131145241601796E-3},{"$f":"RANK($K4,$K$2:K$103)+COUNTIF($K$2:K4,K4)-1","v":26},"S.US.ADI ",{"$f":"N3+1","v":3},"S.US.AAPL ",{"$f":"RTD(\"cqg.rtd\", ,\"ContractData\",O4, \"PerCentNetLastTrade\",, \"T\")/100","v":3.844654137097403E-2},{"$f":"VLOOKUP(O4,$A$2:$H105,8,FALSE)","v":1E-3},null,{"$f":"S3+1","v":3},"S.US.CPRT "]
["S.US.ADP ",{"$f":"IFERROR(RTD(\"cqg.rtd\",,\"StudyData\",A5,\"Bar\",, \"High\",$C$1,\"0\",,,,,\"T\"),\"\")","v":176.1},{"$f":"IFERROR(RTD(\"cqg.rtd\",,\"StudyData\",A5,\"Bar\",, \"Low\",$C$1,\"0\",,,,,\"T\"),\"\")","v":175.96},{"$f":"IFERROR(RTD(\"cqg.rtd\",,\"StudyData\",\"HiLevel(\"&A5&\",Period1:=\"&$B$1&\",AllowGaps:=0,InputChoice1:=High,InputChoice3:=High)\",\"Bar\",, \"Close\",$C$1,\"-1\",,,,,\"T\"),\"\")","v":177.02},{"$f":"IFERROR(RTD(\"cqg.rtd\",,\"StudyData\",\"LoLevel(\"&A5&\",Period2:=\"&$B$1&\",AllowGaps:=0,InputChoice2:=Low,InputChoice4:=Low)\",\"Bar\",, \"Close\",$C$1,\"-1\",,,,,\"T\"),\"\")","v":175.46},0,0,4.0000000000000001E-3,4.0000000000000001E-3,"S.US.ADP ",{"$f":"RTD(\"cqg.rtd\", ,\"ContractData\",A5, \"PerCentNetLastTrade\",, \"T\")/100","v":-7.831427122654798E-3},{"$f":"RANK($K5,$K$2:K$103)+COUNTIF($K$2:K5,K5)-1","v":81},"S.US.ADP ",4,"S.US.ILMN ",{"$f":"RTD(\"cqg.rtd\", ,\"ContractData\",O5, \"PerCentNetLastTrade\",, \"T\")/100","v":3.1767917712268702E-2},{"$f":"VLOOKUP(O5,$A$2:$H106,8,FALSE)","v":7.0010000000000003},null,4,"S.US.CSX "]
["S.US.ADSK ",{"$f":"IFERROR(RTD(\"cqg.rtd\",,\"StudyData\",A6,\"Bar\",, \"High\",$C$1,\"0\",,,,,\"T\"),\"\")","v":303.3},{"$f":"IFERROR(RTD(\"cqg.rtd\",,\"StudyData\",A6,\"Bar\",, \"Low\",$C$1,\"0\",,,,,\"T\"),\"\")","v":302.88},{"$f":"IFERROR(RTD(\"cqg.rtd\",,\"StudyData\",\"HiLevel(\"&A6&\",Period1:=\"&$B$1&\",AllowGaps:=0,InputChoice1:=High,InputChoice3:=High)\",\"Bar\",, \"Close\",$C$1,\"-1\",,,,,\"T\"),\"\")","v":303.36},{"$f":"IFERROR(RTD(\"cqg.rtd\",,\"StudyData\",\"LoLevel(\"&A6&\",Period2:=\"&$B$1&\",AllowGaps:=0,InputChoice2:=Low,InputChoice4:=Low)\",\"Bar\",, \"Close\",$C$1,\"-1\",,,,,\"T\"),\"\")","v":300},0,0,5.0000000000000001E-3,5.0000000000000001E-3,"S.US.ADSK ",{"$f":"RTD(\"cqg.rtd\", ,\"ContractData\",A6, \"PerCentNetLastTrade\",, \"T\")/100","v":7.3118851369316671E-3},{"$f":"RANK($K6,$K$2:K$103)+COUNTIF($K$2:K6,K6)-1","v":24},"S.US.ADSK ",5,"S.US.OKTA ",{"$f":"RTD(\"cqg.rtd\", ,\"ContractData\",O6, \"PerCentNetLastTrade\",, \"T\")/100","v":3.0195252957828263E-2},{"$f":"VLOOKUP(O6,$A$2:$H107,8,FALSE)","v":9},null,5,"S.US.EXC "]
{"$rows_left_out":98}
{"sheet":"Ranked","index":2,"n_rows":103,"n_cols":22,"rows_kept":103,"cut":false,"hidden":false,"merged":[]}
[null,null,null,null,null,null,null,"New Highs",null,null,null,null,null,null,null,null,null,"New Lows"]
[1,{"$f":"IFERROR(VLOOKUP(A2,Data!$H$2:$J$103,3,FALSE),\"\")","v":"S.US.ANSS "},{"$f":"IFERROR(RTD(\"cqg.rtd\", ,\"ContractData\",B2, \"PerCentNetLastTrade\",, \"T\")/100,\"\")","v":1.1771316196094957E-2},{"$f":"IFERROR(RANK($C2,$C$2:C$103)+COUNTIF($C$2:C2,C2)-1,\"\")","v":3},{"$f":"IF(B2=\"\",\"\",B2)","v":"S.US.ANSS "},1,{"$f":"IFERROR(VLOOKUP(F2,$D$2:$E$103,2,FALSE),\"\")","v":"S.US.OKTA "},{"$f":"IF(G2=\"\",\"\",RTD(\"cqg.rtd\", ,\"ContractData\",G2, \"LongDescription\",, \"T\"))","v":"Okta, Inc. Cl A"},{"$f":"IFERROR(RTD(\"cqg.rtd\", ,\"ContractData\",G2, \"PerCentNetLastTrade\",, \"T\")/100,\"\")","v":3.0195252957828263E-2},{"$f":"IF(I2<>\"\",1,0)","v":1},1,{"$f":"IFERROR(VLOOKUP(A2,Data!$I$2:$J$103,2,FALSE),\"\")","v":"S.US.ALXN "},{"$f":"IFERROR(RTD(\"cqg.rtd\", ,\"ContractData\",L2, \"PerCentNetLastTrade\",, \"T\")/100,\"\")","v":-9.1067622553768646E-3},{"$f":"IFERROR(RANK($M2,$M$2:M$104)+COUNTIF($M$2:M2,M2)-1,\"\")","v":2},{"$f":"IF(L2=\"\",\"\",L2)","v":"S.US.ALXN "},1,{"$f":"IFERROR(VLOOKUP(P2,$N$2:$O$103,2,FALSE),\"\")","v":"S.US.ORLY "},{"$f":"IF(Q2=\"\",\"\",RTD(\"cqg.rtd\", ,\"ContractData\",Q2, \"LongDescription\",, \"T\"))","v":"OReilly Automotive Inc"},{"$f":"IFERROR(RTD(\"cqg.rtd\", ,\"ContractData\",Q2, \"PerCentNetLastTrade\",, \"T\")/100,\"\")","v":-6.054044499436576E-3},{"$f":"IF(S2<>\"\",1,0)","v":1},{"$f":"COUNTIF(J2:J105,\"1\")","v":12},{"$f":"COUNTIF(T2:T105,\"1\")","v":4}]
[{"$f":"A2+1","v":2},{"$f":"IFERROR(VLOOKUP(A3,Data!$H$2:$J$103,3,FALSE),\"\")","v":"S.US.CERN "},{"$f":"IFERROR(RTD(\"cqg.rtd\", ,\"ContractData\",B3, \"PerCentNetLastTrade\",, \"T\")/100,\"\")","v":7.1810941376158769E-3},{"$f":"IFERROR(RANK($C3,$C$2:C$103)+COUNTIF($C$2:C3,C3)-1,\"\")","v":6},{"$f":"IF(B3=\"\",\"\",B3)","v":"S.US.CERN "},{"$f":"F2+1","v":2},{"$f":"IFERROR(VLOOKUP(F3,$D$2:$E$103,2,FALSE),\"\")","v":"S.US.SPLK "},{"$f":"IF(G3=\"\",\"\",RTD(\"cqg.rtd\", ,\"ContractData\",G3, \"LongDescription\",, \"T\"))","v":"Splunk, Inc."},{"$f":"IFERROR(RTD(\"cqg.rtd\", ,\"ContractData\",G3, \"PerCentNetLastTrade\",, \"T\")/100,\"\")","v":1.2043356081894821E-2},{"$f":"IF(I3<>\"\",1,0)","v":1},{"$f":"K2+1","v":2},{"$f":"IFERROR(VLOOKUP(A3,Data!$I$2:$J$103,2,FALSE),\"\")","v":"S.US.GILD "},{"$f":"IFERROR(RTD(\"cqg.rtd\", ,\"ContractData\",L3, \"PerCentNetLastTrade\",, \"T\")/100,\"\")","v":-2.4086094977792964E-2},{"$f":"IFERROR(RANK($M3,$M$2:M$104)+COUNTIF($M$2:M3,M3)-1,\"\")","v":4},{"$f":"IF(L3=\"\",\"\",L3)","v":"S.US.GILD "},{"$f":"P2+1","v":2},{"$f":"IFERROR(VLOOKUP(P3,$N$2:$O$103,2,FALSE),\"\")","v":"S.US.ALXN "},{"$f":"IF(Q3=\"\",\"\",RTD(\"cqg.rtd\", ,\"ContractData\",Q3, \"LongDescription\",, \"T\"))","v":"Alexion Pharmaceuticals"},{"$f":"IFERROR(RTD(\"cqg.rtd\", ,\"ContractData\",Q3, \"PerCentNetLastTrade\",, \"T\")/100,\"\")","v":-9.1067622553768646E-3},{"$f":"IF(S3<>\"\",1,0)","v":1}]
[{"$f":"A3+1","v":3},{"$f":"IFERROR(VLOOKUP(A4,Data!$H$2:$J$103,3,FALSE),\"\")","v":"S.US.CPRT "},{"$f":"IFERROR(RTD(\"cqg.rtd\", ,\"ContractData\",B4, \"PerCentNetLastTrade\",, \"T\")/100,\"\")","v":5.9747912915370759E-3},{"$f":"IFERROR(RANK($C4,$C$2:C$103)+COUNTIF($C$2:C4,C4)-1,\"\")","v":8},"S.US.CPRT ",{"$f":"F3+1","v":3},"S.US.ANSS ",{"$f":"IF(G4=\"\",\"\",RTD(\"cqg.rtd\", ,\"ContractData\",G4, \"LongDescription\",, \"T\"))","v":"ANSYS Inc"},{"$f":"IFERROR(RTD(\"cqg.rtd\", ,\"ContractData\",G4, \"PerCentNetLastTrade\",, \"T\")/100,\"\")","v":1.1771316196094957E-2},1,{"$f":"K3+1","v":3},{"$f":"IFERROR(VLOOKUP(A4,Data!$I$2:$J$103,2,FALSE),\"\")","v":"S.US.ORLY "},{"$f":"IFERROR(RTD(\"cqg.rtd\", ,\"ContractData\",L4, \"PerCentNetLastTrade\",, \"T\")/100,\"\")","v":-6.054044499436576E-3},{"$f":"IFERROR(RANK($M4,$M$2:M$104)+COUNTIF($M$2:M4,M4)-1,\"\")","v":1},"S.US.ORLY ",{"$f":"P3+1","v":3},"S.US.PDD ",{"$f":"IF(Q4=\"\",\"\",RTD(\"cqg.rtd\", ,\"ContractData\",Q4, \"LongDescription\",, \"T\"))","v":"Pinduoduo Inc"},{"$f":"IFERROR(RTD(\"cqg.rtd\", ,\"ContractData\",Q4, \"PerCentNetLastTrade\",, \"T\")/100,\"\")","v":-2.3149724245931775E-2},1]
[4,{"$f":"IFERROR(VLOOKUP(A5,Data!$H$2:$J$103,3,FALSE),\"\")","v":"S.US.CSX "},{"$f":"IFERROR(RTD(\"cqg.rtd\", ,\"ContractData\",B5, \"PerCentNetLastTrade\",, \"T\")/100,\"\")","v":1.5609320994536737E-3},{"$f":"IFERROR(RANK($C5,$C$2:C$103)+COUNTIF($C$2:C5,C5)-1,\"\")","v":10},"S.US.CSX ",4,"S.US.IDXX ",{"$f":"IF(G5=\"\",\"\",RTD(\"cqg.rtd\", ,\"ContractData\",G5, \"LongDescription\",, \"T\"))","v":"IDEXX Laboratories Inc"},{"$f":"IFERROR(RTD(\"cqg.rtd\", ,\"ContractData\",G5, \"PerCentNetLastTrade\",, \"T\")/100,\"\")","v":1.1088874366933508E-2},1,4,{"$f":"IFERROR(VLOOKUP(A5,Data!$I$2:$J$103,2,FALSE),\"\")","v":"S.US.PDD "},{"$f":"IFERROR(RTD(\"cqg.rtd\", ,\"ContractData\",L5, \"PerCentNetLastTrade\",, \"T\")/100,\"\")","v":-2.3149724245931775E-2},{"$f":"IFERROR(RANK($M5,$M$2:M$104)+COUNTIF($M$2:M5,M5)-1,\"\")","v":3},"S.US.PDD ",4,"S.US.GILD ",{"$f":"IF(Q5=\"\",\"\",RTD(\"cqg.rtd\", ,\"ContractData\",Q5, \"LongDescription\",, \"T\"))","v":"Gilead Sciences Inc"},{"$f":"IFERROR(RTD(\"cqg.rtd\", ,\"ContractData\",Q5, \"PerCentNetLastTrade\",, \"T\")/100,\"\")","v":-2.4086094977792964E-2},1]
[5,{"$f":"IFERROR(VLOOKUP(A6,Data!$H$2:$J$103,3,FALSE),\"\")","v":"S.US.EXC "},{"$f":"IFERROR(RTD(\"cqg.rtd\", ,\"ContractData\",B6, \"PerCentNetLastTrade\",, \"T\")/100,\"\")","v":9.6362322331968193E-3},{"$f":"IFERROR(RANK($C6,$C$2:C$103)+COUNTIF($C$2:C6,C6)-1,\"\")","v":5},"S.US.EXC ",5,"S.US.EXC ",{"$f":"IF(G6=\"\",\"\",RTD(\"cqg.rtd\", ,\"ContractData\",G6, \"LongDescription\",, \"T\"))","v":"Exelon Corporation"},{"$f":"IFERROR(RTD(\"cqg.rtd\", ,\"ContractData\",G6, \"PerCentNetLastTrade\",, \"T\")/100,\"\")","v":9.6362322331968193E-3},1,5,{"$f":"IFERROR(VLOOKUP(A6,Data!$I$2:$J$103,2,FALSE),\"\")","v":""},{"$f":"IFERROR(RTD(\"cqg.rtd\", ,\"ContractData\",L6, \"PerCentNetLastTrade\",, \"T\")/100,\"\")","v":""},{"$f":"IFERROR(RANK($M6,$M$2:M$104)+COUNTIF($M$2:M6,M6)-1,\"\")","v":""},"",5,"",{"$f":"IF(Q6=\"\",\"\",RTD(\"cqg.rtd\", ,\"ContractData\",Q6, \"LongDescription\",, \"T\"))","v":""},{"$f":"IFERROR(RTD(\"cqg.rtd\", ,\"ContractData\",Q6, \"PerCentNetLastTrade\",, \"T\")/100,\"\")","v":""},0]
{"$rows_left_out":98}
{"sheet":"BarData","index":3,"n_rows":301,"n_cols":18,"rows_kept":301,"cut":false,"hidden":true,"merged":[]}
[{"$f":" RTD(\"cqg.rtd\",,\"StudyData\", $N$2, \"Bar\", \"\", \"Time\", $M$2, $F1,$R$2,$Q$2, \"\",\"False\")","v":44187.402777777781},{"$f":" IF(RTD(\"cqg.rtd\",,\"StudyData\", $N$2, \"Bar\", \"\", \"Open\", $M$2, $F1, $R$2,$Q$2,,$O$2,$P$2)=\"\",NA(),RTD(\"cqg.rtd\",,\"StudyData\", $N$2, \"Bar\", \"\", \"Open\", $M$2, $F1, $R$2,$Q$2,,$O$2,$P$2))","v":310.2},{"$f":" IF(RTD(\"cqg.rtd\",,\"StudyData\", $N$2, \"Bar\", \"\", \"High\", $M$2, $F1, $R$2,$Q$2,,$O$2,$P$2)=\"\",NA(),RTD(\"cqg.rtd\",,\"StudyData\", $N$2, \"Bar\", \"\", \"High\", $M$2, $F1, $R$2,$Q$2,,$O$2,$P$2))","v":310.27},{"$f":" IF(RTD(\"cqg.rtd\",,\"StudyData\", $N$2, \"Bar\", \"\", \"Low\", $M$2, $F1, $R$2,$Q$2,,$O$2,$P$2)=\"\",NA(),RTD(\"cqg.rtd\",,\"StudyData\", $N$2, \"Bar\", \"\", \"Low\", $M$2, $F1, $R$2,$Q$2,,$O$2,$P$2))","v":310.02},{"$f":" IF(RTD(\"cqg.rtd\",,\"StudyData\", $N$2, \"Bar\", \"\", \"Close\", $M$2, $F1, $R$2,$Q$2,,$O$2,$P$2)=\"\",NA(),RTD(\"cqg.rtd\",,\"StudyData\", $N$2, \"Bar\", \"\", \"Close\", $M$2, $F1, $R$2,$Q$2,,$O$2,$P$2))","v":310.19},0,null,{"$f":"A1","v":44187.402777777781},{"$f":"RTD(\"cqg.rtd\",,\"StudyData\",$N$2, \"Vol\", \"VolType=Auto,CoCType=Auto\", \"Vol\", $M$2, $F1, $R$2,$Q$2,,$O$2,$P$2)","v":92537},null,null,null,"Chart","Symbol","Continuation","Decimal=T, Tick=D","CustomSessionName","Type All or PrimaryOnly"]
[{"$f":" RTD(\"cqg.rtd\",,\"StudyData\", $N$2, \"Bar\", \"\", \"Time\", $M$2, $F2,$R$2,$Q$2, \"\",\"False\")","v":44187.399305555555},{"$f":" RTD(\"cqg.rtd\",,\"StudyData\", $N$2, \"Bar\", \"\", \"Open\", $M$2, $F2, $R$2,$Q$2,,$O$2,$P$2)","v":310.13},{"$f":" RTD(\"cqg.rtd\",,\"StudyData\", $N$2, \"Bar\", \"\", \"High\", $M$2, $F2, $R$2,$Q$2,,$O$2,$P$2)","v":310.26},{"$f":" RTD(\"cqg.rtd\",,\"StudyData\", $N$2, \"Bar\", \"\", \"Low\", $M$2, $F2, $R$2,$Q$2,,$O$2,$P$2)","v":310.06},{"$f":" RTD(\"cqg.rtd\",,\"StudyData\", $N$2, \"Bar\", \"\", \"Close\", $M$2, $F2, $R$2,$Q$2,,$O$2,$P$2)","v":310.20999999999998},{"$f":"F1-1","v":-1},null,{"$f":"A2","v":44187.399305555555},{"$f":"RTD(\"cqg.rtd\",,\"StudyData\",$N$2, \"Vol\", \"VolType=Auto,CoCType=Auto\", \"Vol\", $M$2, $F2, $R$2,$Q$2,,$O$2,$P$2)","v":117876},null,null,null,{"$f":"Main!U24","v":5},{"$f":"Main!R24","v":"S.QQQ"},true,"T",null,{"$f":"Main!W24","v":"All"}]
[{"$f":" RTD(\"cqg.rtd\",,\"StudyData\", $N$2, \"Bar\", \"\", \"Time\", $M$2, $F3,$R$2,$Q$2, \"\",\"False\")","v":44187.395833333336},{"$f":" RTD(\"cqg.rtd\",,\"StudyData\", $N$2, \"Bar\", \"\", \"Open\", $M$2, $F3, $R$2,$Q$2,,$O$2,$P$2)","v":309.57},{"$f":" RTD(\"cqg.rtd\",,\"StudyData\", $N$2, \"Bar\", \"\", \"High\", $M$2, $F3, $R$2,$Q$2,,$O$2,$P$2)","v":310.14},{"$f":" RTD(\"cqg.rtd\",,\"StudyData\", $N$2, \"Bar\", \"\", \"Low\", $M$2, $F3, $R$2,$Q$2,,$O$2,$P$2)","v":309.39999999999998},{"$f":" RTD(\"cqg.rtd\",,\"StudyData\", $N$2, \"Bar\", \"\", \"Close\", $M$2, $F3, $R$2,$Q$2,,$O$2,$P$2)","v":310.14},{"$f":"F2-1","v":-2},null,44187.395833333336,{"$f":"RTD(\"cqg.rtd\",,\"StudyData\",$N$2, \"Vol\", \"VolType=Auto,CoCType=Auto\", \"Vol\", $M$2, $F3, $R$2,$Q$2,,$O$2,$P$2)","v":288742}]
[{"$f":" RTD(\"cqg.rtd\",,\"StudyData\", $N$2, \"Bar\", \"\", \"Time\", $M$2, $F4,$R$2,$Q$2, \"\",\"False\")","v":44187.392361111109},{"$f":" RTD(\"cqg.rtd\",,\"StudyData\", $N$2, \"Bar\", \"\", \"Open\", $M$2, $F4, $R$2,$Q$2,,$O$2,$P$2)","v":309.49},{"$f":" RTD(\"cqg.rtd\",,\"StudyData\", $N$2, \"Bar\", \"\", \"High\", $M$2, $F4, $R$2,$Q$2,,$O$2,$P$2)","v":309.69},{"$f":" RTD(\"cqg.rtd\",,\"StudyData\", $N$2, \"Bar\", \"\", \"Low\", $M$2, $F4, $R$2,$Q$2,,$O$2,$P$2)","v":309.24},{"$f":" RTD(\"cqg.rtd\",,\"StudyData\", $N$2, \"Bar\", \"\", \"Close\", $M$2, $F4, $R$2,$Q$2,,$O$2,$P$2)","v":309.57},-3,null,44187.392361111109,{"$f":"RTD(\"cqg.rtd\",,\"StudyData\",$N$2, \"Vol\", \"VolType=Auto,CoCType=Auto\", \"Vol\", $M$2, $F4, $R$2,$Q$2,,$O$2,$P$2)","v":273803}]
[{"$f":" RTD(\"cqg.rtd\",,\"StudyData\", $N$2, \"Bar\", \"\", \"Time\", $M$2, $F5,$R$2,$Q$2, \"\",\"False\")","v":44187.388888888891},{"$f":" RTD(\"cqg.rtd\",,\"StudyData\", $N$2, \"Bar\", \"\", \"Open\", $M$2, $F5, $R$2,$Q$2,,$O$2,$P$2)","v":309.45999999999998},{"$f":" RTD(\"cqg.rtd\",,\"StudyData\", $N$2, \"Bar\", \"\", \"High\", $M$2, $F5, $R$2,$Q$2,,$O$2,$P$2)","v":309.63},{"$f":" RTD(\"cqg.rtd\",,\"StudyData\", $N$2, \"Bar\", \"\", \"Low\", $M$2, $F5, $R$2,$Q$2,,$O$2,$P$2)","v":309.19},{"$f":" RTD(\"cqg.rtd\",,\"StudyData\", $N$2, \"Bar\", \"\", \"Close\", $M$2, $F5, $R$2,$Q$2,,$O$2,$P$2)","v":309.48},-4,null,44187.388888888891,{"$f":"RTD(\"cqg.rtd\",,\"StudyData\",$N$2, \"Vol\", \"VolType=Auto,CoCType=Auto\", \"Vol\", $M$2, $F5, $R$2,$Q$2,,$O$2,$P$2)","v":306363}]
[{"$f":" RTD(\"cqg.rtd\",,\"StudyData\", $N$2, \"Bar\", \"\", \"Time\", $M$2, $F6,$R$2,$Q$2, \"\",\"False\")","v":44187.385416666664},{"$f":" RTD(\"cqg.rtd\",,\"StudyData\", $N$2, \"Bar\", \"\", \"Open\", $M$2, $F6, $R$2,$Q$2,,$O$2,$P$2)","v":309.27},{"$f":" RTD(\"cqg.rtd\",,\"StudyData\", $N$2, \"Bar\", \"\", \"High\", $M$2, $F6, $R$2,$Q$2,,$O$2,$P$2)","v":309.95999999999998},{"$f":" RTD(\"cqg.rtd\",,\"StudyData\", $N$2, \"Bar\", \"\", \"Low\", $M$2, $F6, $R$2,$Q$2,,$O$2,$P$2)","v":309.18},{"$f":" RTD(\"cqg.rtd\",,\"StudyData\", $N$2, \"Bar\", \"\", \"Close\", $M$2, $F6, $R$2,$Q$2,,$O$2,$P$2)","v":309.45999999999998},-5,null,44187.385416666664,{"$f":"RTD(\"cqg.rtd\",,\"StudyData\",$N$2, \"Vol\", \"VolType=Auto,CoCType=Auto\", \"Vol\", $M$2, $F6, $R$2,$Q$2,,$O$2,$P$2)","v":294667}]
{"$rows_left_out":295}