{"text_format":"1","workbook":"xlsx","n_sheets":4,"sheets":["Main","Symbols","NASDAQ100","S&P500"],"not_rendered":{"charts":2,"images":2,"macros":1,"external_links":0,"defined_names":0,"comments":0,"pivot_tables":0},"unopened":[],"bounds":{"document_bytes":16777216,"sheet_cells":100000,"rows_first":2000,"rows_last":500,"rows_between":2000,"halvings":0,"cell_chars":16384,"cell_head_chars":4096},"cells_cut":0,"cells_raw":0,"read":"whole","date_system":"1900"}

{"sheet":"Main","index":0,"n_rows":48,"n_cols":28,"rows_kept":48,"cut":false,"hidden":false,"merged":[[46,1,47,1],[46,2,47,3],[46,4,47,6],[46,7,47,18],[47,19,47,26],[13,17,13,19],[36,11,36,13],[34,14,34,16],[34,11,34,13],[45,14,45,16],[45,11,45,13],[43,14,43,16],[43,11,43,13],[42,14,42,16],[42,11,42,13],[40,14,40,16],[40,11,40,13],[35,11,35,13],[35,14,35,16],[38,11,38,13],[39,14,39,16],[39,11,39,13],[37,14,37,16],[37,11,37,13],[38,14,38,16],[41,11,41,13],[41,14,41,16],[44,11,44,13],[44,14,44,16],[21,17,21,19],[20,17,20,19],[19,17,19,19],[18,17,18,19],[33,14,33,16],[33,11,33,13],[31,14,31,16],[31,11,31,13],[44,17,44,19],[29,11,29,13],[29,14,29,16],[32,11,32,13],[36,14,36,16],[32,14,32,16],[17,17,17,19],[15,17,15,19],[14,17,14,19],[26,17,26,19],[16,17,16,19],[13,1,13,3],[12,1,12,3],[21,1,21,3],[20,1,20,3],[19,1,19,3],[18,1,18,3],[17,1,17,3],[16,1,16,3],[22,11,22,16],[26,14,26,16],[14,11,14,16],[15,1,15,3],[14,1,14,3],[11,1,11,3],[11,17,11,19],[23,11,23,13],[24,11,24,13],[30,11,30,13],[28,11,28,13],[27,11,27,13],[25,11,25,13],[30,14,30,16],[28,14,28,16],[27,14,27,16],[25,14,25,16],[24,14,24,16],[23,14,23,16],[24,17,24,26],[25,17,25,19],[24,1,24,10],[12,17,12,19],[22,24,23,24],[22,25,23,25],[22,26,23,26],[27,17,27,19],[28,17,28,19],[26,11,26,13],[45,17,45,19],[22,1,23,3],[22,8,23,8],[22,9,23,9],[22,10,23,10],[22,17,23,19],[39,17,39,19],[40,17,40,19],[41,17,41,19],[42,17,42,19],[43,17,43,19],[34,17,34,19],[35,17,35,26],[36,17,36,19],[37,17,37,19],[38,17,38,19],[29,17,29,19],[30,17,30,19],[31,17,31,19],[34,1,34,3],[33,17,33,19],[25,1,25,3],[32,17,32,19],[36,1,36,3],[1,24,2,26],[1,4,2,23],[5,1,5,3],[3,1,4,3],[3,8,4,8],[3,9,4,9],[3,10,4,10],[8,1,8,3],[8,17,8,19],[3,26,4,26],[5,11,5,16],[9,17,9,19],[9,1,9,3],[10,1,10,3],[3,24,4,24],[3,25,4,25],[5,17,5,19],[6,1,6,3],[7,1,7,3],[6,17,6,19],[7,17,7,19],[3,17,4,19],[3,11,4,16],[46,19,46,26],[3,22,3,23],[4,22,4,23],[44,1,44,3],[45,1,45,3],[39,1,39,3],[40,1,40,3],[41,1,41,3],[42,1,42,3],[43,1,43,3],[10,17,10,19],[3,6,3,7],[4,6,4,7],[37,1,37,3],[38,1,38,3],[35,1,35,10],[26,1,26,3],[27,1,27,3],[28,1,28,3],[29,1,29,3],[30,1,30,3],[31,1,31,3],[32,1,32,3],[33,1,33,3]]}
[]
[null,null,null,null,"CQG S&P 500® and Nasdaq 100® Performance Dashboard",null,null,null,null,null,null,null,null,null,null,null,null,null,null,null,null,null,null,null,{"$f":"RTD(\"cqg.rtd\", ,\"SystemInfo\", \"Linetime\")","v":44398.356666666667}]
[]
[null,"Description",null,null,null,"Net","% Net",null,"Open","High","Low","5-minute Charts",null,null,null,null,null,"Description",null,null,"Last","Net","% Net",null,"Open","High","Low"]
[null,null,null,null,null,"Change","Change",null,null,null,null,null,null,null,null,null,null,null,null,null,"Price","Change","Change"]
[{"$f":"Symbols!C5","v":"X.US.SPC"},{"$f":"RTD(\"cqg.rtd\",,\"ContractData\",A6,\"LongDescription\",,\"T\")&\"  (\"&RIGHT(A6,LEN(A6)-5)&\")\"","v":"S&P 500  (SPC)"},null,null,{"$f":"IFERROR(RTD(\"cqg.rtd\", ,\"ContractData\",A6, \"LastTrade\",, \"T\"),\"\")","v":4337.79},{"$f":"IFERROR(RTD(\"cqg.rtd\", ,\"ContractData\",A6, \"NetChange\",, \"T\"),\"\")","v":11.81},{"$f":"IFERROR(RTD(\"cqg.rtd\", ,\"ContractData\",A6, \"PerCentNetLastTrade\",, \"T\")/100,\"\")","v":3.4073087118846376E-3},{"$f":"G6","v":3.4073087118846376E-3},{"$f":"IFERROR(RTD(\"cqg.rtd\", ,\"ContractData\",A6, \"Open\",, \"T\"),\"\")","v":4331.13},{"$f":"IFERROR(RTD(\"cqg.rtd\", ,\"ContractData\",A6, \"High\",, \"T\"),\"\")","v":4339.99},{"$f":"IFERROR(RTD(\"cqg.rtd\", ,\"ContractData\",A6, \"Low\",, \"T\"),\"\")","v":4331.13},{"$f":"B6","v":"S&P 500  (SPC)"},null,null,null,null,null,{"$f":"IFERROR(RTD(\"cqg.rtd\", ,\"ContractData\",AB6, \"LongDescription\",, \"T\"),\"\")&\"  (\"&RIGHT(AB6,LEN(AB6)-5)&\")\"","v":"NASDAQ Composite Index  (NQCOMP)"},null,null,{"$f":"IFERROR(RTD(\"cqg.rtd\", ,\"ContractData\",AB6, \"LastTrade\",, \"T\"),\"\")","v":14518.98},{"$f":"IFERROR(RTD(\"cqg.rtd\", ,\"ContractData\",AB6, \"NetChange\",, \"T\"),\"\")","v":20.100000000000001},{"$f":"IFERROR(RTD(\"cqg.rtd\", ,\"ContractData\",AB6, \"PerCentNetLastTrade\",, \"T\")/100,\"\")","v":1.3863139773554922E-3},{"$f":"W6","v":1.3863139773554922E-3},{"$f":"IFERROR(RTD(\"cqg.rtd\", ,\"ContractData\",AB6, \"Open\",, \"T\"),\"\")","v":14508.75},{"$f":"IFERROR(RTD(\"cqg.rtd\", ,\"ContractData\",AB6, \"High\",, \"T\"),\"\")","v":14518.98},{"$f":"IFERROR(RTD(\"cqg.rtd\", ,\"ContractData\",AB6, \"Low\",, \"T\"),\"\")","v":14498.65},{"$f":"Symbols!H5","v":"X.US.NQCOMP"}]
[{"$f":"Symbols!C6","v":"X.US.DJI"},{"$f":"RTD(\"cqg.rtd\",,\"ContractData\",A7,\"LongDescription\",,\"T\")&\"  (\"&RIGHT(A7,LEN(A7)-5)&\")\"","v":"DJ Industrial Average  (DJI)"},null,null,{"$f":"IFERROR(RTD(\"cqg.rtd\", ,\"ContractData\",A7, \"LastTrade\",, \"T\"),\"\")","v":34665.200000000004},{"$f":"IFERROR(RTD(\"cqg.rtd\", ,\"ContractData\",A7, \"NetChange\",, \"T\"),\"\")","v":131.1},{"$f":"IFERROR(RTD(\"cqg.rtd\", ,\"ContractData\",A7, \"PerCentNetLastTrade\",, \"T\")/100,\"\")","v":4.4419461113413055E-3},4.4419461113413055E-3,{"$f":"IFERROR(RTD(\"cqg.rtd\", ,\"ContractData\",A7, \"Open\",, \"T\"),\"\")","v":34556.9},{"$f":"IFERROR(RTD(\"cqg.rtd\", ,\"ContractData\",A7, \"High\",, \"T\"),\"\")","v":34697.5},{"$f":"IFERROR(RTD(\"cqg.rtd\", ,\"ContractData\",A7, \"Low\",, \"T\"),\"\")","v":34556.9},null,null,null,null,null,null,{"$f":"IFERROR(RTD(\"cqg.rtd\", ,\"ContractData\",AB7, \"LongDescription\",, \"T\"),\"\")&\"  (\"&RIGHT(AB7,LEN(AB7)-5)&\")\"","v":"NASDAQ-100 Index  (NDX)"},null,null,{"$f":"IFERROR(RTD(\"cqg.rtd\", ,\"ContractData\",AB7, \"LastTrade\",, \"T\"),\"\")","v":14733.57},{"$f":"IFERROR(RTD(\"cqg.rtd\", ,\"ContractData\",AB7, \"NetChange\",, \"T\"),\"\")","v":5.36},{"$f":"IFERROR(RTD(\"cqg.rtd\", ,\"ContractData\",AB7, \"PerCentNetLastTrade\",, \"T\")/100,\"\")","v":3.6392745622176761E-4},3.6392745622176761E-4,{"$f":"IFERROR(RTD(\"cqg.rtd\", ,\"ContractData\",AB7, \"Open\",, \"T\"),\"\")","v":14723.67},{"$f":"IFERROR(RTD(\"cqg.rtd\", ,\"ContractData\",AB7, \"High\",, \"T\"),\"\")","v":14734.880000000001},{"$f":"IFERROR(RTD(\"cqg.rtd\", ,\"ContractData\",AB7, \"Low\",, \"T\"),\"\")","v":14710.11},{"$f":"Symbols!H6","v":"X.US.NDX"}]
[{"$f":"Symbols!C7","v":"S.US.XLF"},{"$f":"RTD(\"cqg.rtd\",,\"ContractData\",A8,\"LongDescription\",,\"T\")&\"  (\"&RIGHT(A8,LEN(A8)-5)&\")\"","v":"Financial Select Sector SPDR  (XLF)"},null,null,{"$f":"IFERROR(RTD(\"cqg.rtd\", ,\"ContractData\",A8, \"LastTrade\",, \"T\"),\"\")","v":36.300000000000004},{"$f":"IFERROR(RTD(\"cqg.rtd\", ,\"ContractData\",A8, \"NetChange\",, \"T\"),\"\")","v":0.32},{"$f":"IFERROR(RTD(\"cqg.rtd\", ,\"ContractData\",A8, \"PerCentNetLastTrade\",, \"T\")/100,\"\")","v":8.8938299055030569E-3},8.8938299055030569E-3,{"$f":"IFERROR(RTD(\"cqg.rtd\", ,\"ContractData\",A8, \"Open\",, \"T\"),\"\")","v":36.270000000000003},{"$f":"IFERROR(RTD(\"cqg.rtd\", ,\"ContractData\",A8, \"High\",, \"T\"),\"\")","v":36.4},{"$f":"IFERROR(RTD(\"cqg.rtd\", ,\"ContractData\",A8, \"Low\",, \"T\"),\"\")","v":36.24},null,null,null,null,null,null,{"$f":"IFERROR(RTD(\"cqg.rtd\", ,\"ContractData\",AB8, \"LongDescription\",, \"T\"),\"\")&\"  (\"&RIGHT(AB8,LEN(AB8)-5)&\")\"","v":"NASDAQ Financial 100  (IXF)"},null,null,{"$f":"IFERROR(RTD(\"cqg.rtd\", ,\"ContractData\",AB8, \"LastTrade\",, \"T\"),\"\")","v":6027.88},{"$f":"IFERROR(RTD(\"cqg.rtd\", ,\"ContractData\",AB8, \"NetChange\",, \"T\"),\"\")","v":62.1},{"$f":"IFERROR(RTD(\"cqg.rtd\", ,\"ContractData\",AB8, \"PerCentNetLastTrade\",, \"T\")/100,\"\")","v":1.0409368096041087E-2},1.0409368096041087E-2,{"$f":"IFERROR(RTD(\"cqg.rtd\", ,\"ContractData\",AB8, \"Open\",, \"T\"),\"\")","v":6015.46},{"$f":"IFERROR(RTD(\"cqg.rtd\", ,\"ContractData\",AB8, \"High\",, \"T\"),\"\")","v":6029.6500000000005},{"$f":"IFERROR(RTD(\"cqg.rtd\", ,\"ContractData\",AB8, \"Low\",, \"T\"),\"\")","v":6015.46},{"$f":"Symbols!H7","v":"X.US.IXF"}]
[{"$f":"Symbols!C8","v":"X.US.BTK"},{"$f":"RTD(\"cqg.rtd\",,\"ContractData\",A9,\"LongDescription\",,\"T\")&\"  (\"&RIGHT(A9,LEN(A9)-5)&\")\"","v":"Biotechnology Index  (BTK)"},null,null,{"$f":"IFERROR(RTD(\"cqg.rtd\", ,\"ContractData\",A9, \"LastTrade\",, \"T\"),\"\")","v":5741.76},{"$f":"IFERROR(RTD(\"cqg.rtd\", ,\"ContractData\",A9, \"NetChange\",, \"T\"),\"\")","v":-4.13},{"$f":"IFERROR(RTD(\"cqg.rtd\", ,\"ContractData\",A9, \"PerCentNetLastTrade\",, \"T\")/100,\"\")","v":-7.187746371754419E-4},-7.187746371754419E-4,{"$f":"IFERROR(RTD(\"cqg.rtd\", ,\"ContractData\",A9, \"Open\",, \"T\"),\"\")","v":5745.89},{"$f":"IFERROR(RTD(\"cqg.rtd\", ,\"ContractData\",A9, \"High\",, \"T\"),\"\")","v":5745.89},{"$f":"IFERROR(RTD(\"cqg.rtd\", ,\"ContractData\",A9, \"Low\",, \"T\"),\"\")","v":5737.34},null,null,null,null,null,null,{"$f":"IFERROR(RTD(\"cqg.rtd\", ,\"ContractData\",AB9, \"LongDescription\",, \"T\"),\"\")&\"  (\"&RIGHT(AB9,LEN(AB9)-5)&\")\"","v":"NASDAQ Biotechnology  (NBI)"},null,null,{"$f":"IFERROR(RTD(\"cqg.rtd\", ,\"ContractData\",AB9, \"LastTrade\",, \"T\"),\"\")","v":5117.54},{"$f":"IFERROR(RTD(\"cqg.rtd\", ,\"ContractData\",AB9, \"NetChange\",, \"T\"),\"\")","v":-7.61},{"$f":"IFERROR(RTD(\"cqg.rtd\", ,\"ContractData\",AB9, \"PerCentNetLastTrade\",, \"T\")/100,\"\")","v":-1.4848345902071158E-3},-1.4848345902071158E-3,{"$f":"IFERROR(RTD(\"cqg.rtd\", ,\"ContractData\",AB9, \"Open\",, \"T\"),\"\")","v":5105.51},{"$f":"IFERROR(RTD(\"cqg.rtd\", ,\"ContractData\",AB9, \"High\",, \"T\"),\"\")","v":5117.54},{"$f":"IFERROR(RTD(\"cqg.rtd\", ,\"ContractData\",AB9, \"Low\",, \"T\"),\"\")","v":5100.8},{"$f":"Symbols!H8","v":"X.US.NBI"}]
[{"$f":"Symbols!C9","v":"X.US.NYPID"},{"$f":"RTD(\"cqg.rtd\",,\"ContractData\",A10,\"LongDescription\",,\"T\")&\"  (\"&RIGHT(A10,LEN(A10)-5)&\")\"","v":"NYSE Healthcare Index  (NYPID)"},null,null,{"$f":"IFERROR(RTD(\"cqg.rtd\", ,\"ContractData\",A10, \"LastTrade\",, \"T\"),\"\")","v":22205.100000000002},{"$f":"IFERROR(RTD(\"cqg.rtd\", ,\"ContractData\",A10, \"NetChange\",, \"T\"),\"\")","v":42.43},{"$f":"IFERROR(RTD(\"cqg.rtd\", ,\"ContractData\",A10, \"PerCentNetLastTrade\",, \"T\")/100,\"\")","v":1.9144805206231922E-3},1.9144805206231922E-3,{"$f":"IFERROR(RTD(\"cqg.rtd\", ,\"ContractData\",A10, \"Open\",, \"T\"),\"\")","v":22162.670000000002},{"$f":"IFERROR(RTD(\"cqg.rtd\", ,\"ContractData\",A10, \"High\",, \"T\"),\"\")","v":22263.11},{"$f":"IFERROR(RTD(\"cqg.rtd\", ,\"ContractData\",A10, \"Low\",, \"T\"),\"\")","v":22162.670000000002},null,null,null,null,null,null,{"$f":"IFERROR(RTD(\"cqg.rtd\", ,\"ContractData\",AB10, \"LongDescription\",, \"T\"),\"\")&\"  (\"&RIGHT(AB10,LEN(AB10)-5)&\")\"","v":"Nasdaq Health Care Index  (NHC)"},null,null,{"$f":"IFERROR(RTD(\"cqg.rtd\", ,\"ContractData\",AB10, \"LastTrade\",, \"T\"),\"\")","v":1263},{"$f":"IFERROR(RTD(\"cqg.rtd\", ,\"ContractData\",AB10, \"NetChange\",, \"T\"),\"\")","v":1.07},{"$f":"IFERROR(RTD(\"cqg.rtd\", ,\"ContractData\",AB10, \"PerCentNetLastTrade\",, \"T\")/100,\"\")","v":8.4790757015048375E-4},8.4790757015048375E-4,{"$f":"IFERROR(RTD(\"cqg.rtd\", ,\"ContractData\",AB10, \"Open\",, \"T\"),\"\")","v":1262.95},{"$f":"IFERROR(RTD(\"cqg.rtd\", ,\"ContractData\",AB10, \"High\",, \"T\"),\"\")","v":1263.75},{"$f":"IFERROR(RTD(\"cqg.rtd\", ,\"ContractData\",AB10, \"Low\",, \"T\"),\"\")","v":1262.03},{"$f":"Symbols!H9","v":"X.US.NHC"}]
[{"$f":"Symbols!C10","v":"X.US.IXE"},{"$f":"RTD(\"cqg.rtd\",,\"ContractData\",A11,\"LongDescription\",,\"T\")&\"  (\"&RIGHT(A11,LEN(A11)-5)&\")\"","v":"S&P 500 Select Sector Energy Index  (IXE)"},null,null,{"$f":"IFERROR(RTD(\"cqg.rtd\", ,\"ContractData\",A11, \"LastTrade\",, \"T\"),\"\")","v":508.22},{"$f":"IFERROR(RTD(\"cqg.rtd\", ,\"ContractData\",A11, \"NetChange\",, \"T\"),\"\")","v":9.620000000000001},{"$f":"IFERROR(RTD(\"cqg.rtd\", ,\"ContractData\",A11, \"PerCentNetLastTrade\",, \"T\")/100,\"\")","v":1.9294023265142398E-2},1.9294023265142398E-2,{"$f":"IFERROR(RTD(\"cqg.rtd\", ,\"ContractData\",A11, \"Open\",, \"T\"),\"\")","v":498.6},{"$f":"IFERROR(RTD(\"cqg.rtd\", ,\"ContractData\",A11, \"High\",, \"T\"),\"\")","v":510.05},{"$f":"IFERROR(RTD(\"cqg.rtd\", ,\"ContractData\",A11, \"Low\",, \"T\"),\"\")","v":498.6},null,null,null,null,null,null,{"$f":"IFERROR(RTD(\"cqg.rtd\", ,\"ContractData\",AB11, \"LongDescription\",, \"T\"),\"\")&\"  (\"&RIGHT(AB11,LEN(AB11)-5)&\")\"","v":"PHLX Oil Service Sector  (OSX)"},null,null,{"$f":"IFERROR(RTD(\"cqg.rtd\", ,\"ContractData\",AB11, \"LastTrade\",, \"T\"),\"\")","v":56.43},{"$f":"IFERROR(RTD(\"cqg.rtd\", ,\"ContractData\",AB11, \"NetChange\",, \"T\"),\"\")","v":1.85},{"$f":"IFERROR(RTD(\"cqg.rtd\", ,\"ContractData\",AB11, \"PerCentNetLastTrade\",, \"T\")/100,\"\")","v":3.3895199706852328E-2},3.3895199706852328E-2,{"$f":"IFERROR(RTD(\"cqg.rtd\", ,\"ContractData\",AB11, \"Open\",, \"T\"),\"\")","v":55.96},{"$f":"IFERROR(RTD(\"cqg.rtd\", ,\"ContractData\",AB11, \"High\",, \"T\"),\"\")","v":56.57},{"$f":"IFERROR(RTD(\"cqg.rtd\", ,\"ContractData\",AB11, \"Low\",, \"T\"),\"\")","v":55.95},{"$f":"Symbols!H10","v":"X.US.OSX"}]
[{"$f":"Symbols!C11","v":"S.US.BAC"},{"$f":"RTD(\"cqg.rtd\",,\"ContractData\",A12,\"LongDescription\",,\"T\")&\"  (\"&RIGHT(A12,LEN(A12)-5)&\")\"","v":"Bank of America Corp  (BAC)"},null,null,{"$f":"IFERROR(RTD(\"cqg.rtd\", ,\"ContractData\",A12, \"LastTrade\",, \"T\"),\"\")","v":38.050000000000004},{"$f":"IFERROR(RTD(\"cqg.rtd\", ,\"ContractData\",A12, \"NetChange\",, \"T\"),\"\")","v":0.37},{"$f":"IFERROR(RTD(\"cqg.rtd\", ,\"ContractData\",A12, \"PerCentNetLastTrade\",, \"T\")/100,\"\")","v":9.8169275669938976E-3},{"$f":"G12","v":9.8169275669938976E-3},{"$f":"IFERROR(RTD(\"cqg.rtd\", ,\"ContractData\",A12, \"Open\",, \"T\"),\"\")","v":38.050000000000004},{"$f":"IFERROR(RTD(\"cqg.rtd\", ,\"ContractData\",A12, \"High\",, \"T\"),\"\")","v":38.18},{"$f":"IFERROR(RTD(\"cqg.rtd\", ,\"ContractData\",A12, \"Low\",, \"T\"),\"\")","v":37.980000000000004},null,null,null,null,null,null,{"$f":"IFERROR(RTD(\"cqg.rtd\", ,\"ContractData\",AB12, \"LongDescription\",, \"T\"),\"\")&\"  (\"&RIGHT(AB12,LEN(AB12)-5)&\")\"","v":"Energy Select Sector SPDR  (XLE)"},null,null,{"$f":"IFERROR(RTD(\"cqg.rtd\", ,\"ContractData\",AB12, \"LastTrade\",, \"T\"),\"\")","v":48.53},{"$f":"IFERROR(RTD(\"cqg.rtd\", ,\"ContractData\",AB12, \"NetChange\",, \"T\"),\"\")","v":0.95000000000000007},{"$f":"IFERROR(RTD(\"cqg.rtd\", ,\"ContractData\",AB12, \"PerCentNetLastTrade\",, \"T\")/100,\"\")","v":1.9962176927926033E-2},1.9962176927926033E-2,{"$f":"IFERROR(RTD(\"cqg.rtd\", ,\"ContractData\",AB12, \"Open\",, \"T\"),\"\")","v":48.53},{"$f":"IFERROR(RTD(\"cqg.rtd\", ,\"ContractData\",AB12, \"High\",, \"T\"),\"\")","v":48.71},{"$f":"IFERROR(RTD(\"cqg.rtd\", ,\"ContractData\",AB12, \"Low\",, \"T\"),\"\")","v":48.42},{"$f":"Symbols!H11","v":"S.US.XLE"}]
[{"$f":"Symbols!C12","v":"S.US.RSP"},{"$f":"RTD(\"cqg.rtd\",,\"ContractData\",A13,\"LongDescription\",,\"T\")&\"  (\"&RIGHT(A13,LEN(A13)-5)&\")\"","v":"Invesco S&P 500 Equal Weight ETF  (RSP)"},null,null,{"$f":"IFERROR(RTD(\"cqg.rtd\", ,\"ContractData\",A13, \"LastTrade\",, \"T\"),\"\")","v":150.28},{"$f":"IFERROR(RTD(\"cqg.rtd\", ,\"ContractData\",A13, \"NetChange\",, \"T\"),\"\")","v":0.87},{"$f":"IFERROR(RTD(\"cqg.rtd\", ,\"ContractData\",A13, \"PerCentNetLastTrade\",, \"T\")/100,\"\")","v":5.9575607470379547E-3},{"$f":"G13","v":5.9575607470379547E-3},{"$f":"IFERROR(RTD(\"cqg.rtd\", ,\"ContractData\",A13, \"Open\",, \"T\"),\"\")","v":150.15},{"$f":"IFERROR(RTD(\"cqg.rtd\", ,\"ContractData\",A13, \"High\",, \"T\"),\"\")","v":150.39000000000001},{"$f":"IFERROR(RTD(\"cqg.rtd\", ,\"ContractData\",A13, \"Low\",, \"T\"),\"\")","v":150.13},null,null,null,null,null,null,{"$f":"IFERROR(RTD(\"cqg.rtd\", ,\"ContractData\",AB13, \"LongDescription\",, \"T\"),\"\")&\"  (\"&RIGHT(AB13,LEN(AB13)-5)&\")\"","v":"Apple Inc  (AAPL)"},null,null,{"$f":"IFERROR(RTD(\"cqg.rtd\", ,\"ContractData\",AB13, \"LastTrade\",, \"T\"),\"\")","v":145.72},{"$f":"IFERROR(RTD(\"cqg.rtd\", ,\"ContractData\",AB13, \"NetChange\",, \"T\"),\"\")","v":-0.42},{"$f":"IFERROR(RTD(\"cqg.rtd\", ,\"ContractData\",AB13, \"PerCentNetLastTrade\",, \"T\")/100,\"\")","v":-2.8737598357851525E-3},{"$f":"W13","v":-2.8737598357851525E-3},{"$f":"IFERROR(RTD(\"cqg.rtd\", ,\"ContractData\",AB13, \"Open\",, \"T\"),\"\")","v":145.53},{"$f":"IFERROR(RTD(\"cqg.rtd\", ,\"ContractData\",AB13, \"High\",, \"T\"),\"\")","v":145.83000000000001},{"$f":"IFERROR(RTD(\"cqg.rtd\", ,\"ContractData\",AB13, \"Low\",, \"T\"),\"\")","v":145.22999999999999},{"$f":"Symbols!H12","v":"S.US.AAPL"}]
[{"$f":"Symbols!C13","v":"S.US.SPY"},{"$f":"RTD(\"cqg.rtd\",,\"ContractData\",A14,\"LongDescription\",,\"T\")&\"  (\"&RIGHT(A14,LEN(A14)-5)&\")\"","v":"SPDR S&P 500  (SPY)"},null,null,{"$f":"IFERROR(RTD(\"cqg.rtd\", ,\"ContractData\",A14, \"LastTrade\",, \"T\"),\"\")","v":432.40000000000003},{"$f":"IFERROR(RTD(\"cqg.rtd\", ,\"ContractData\",A14, \"NetChange\",, \"T\"),\"\")","v":1.35},{"$f":"IFERROR(RTD(\"cqg.rtd\", ,\"ContractData\",A14, \"PerCentNetLastTrade\",, \"T\")/100,\"\")","v":3.10861596993458E-3},3.10861596993458E-3,{"$f":"IFERROR(RTD(\"cqg.rtd\", ,\"ContractData\",A14, \"Open\",, \"T\"),\"\")","v":432.34000000000003},{"$f":"IFERROR(RTD(\"cqg.rtd\", ,\"ContractData\",A14, \"High\",, \"T\"),\"\")","v":432.59000000000003},{"$f":"IFERROR(RTD(\"cqg.rtd\", ,\"ContractData\",A14, \"Low\",, \"T\"),\"\")","v":432.14},null,null,null,null,null,null,{"$f":"IFERROR(RTD(\"cqg.rtd\", ,\"ContractData\",AB14, \"LongDescription\",, \"T\"),\"\")&\"  (\"&RIGHT(AB14,LEN(AB14)-5)&\")\"","v":"Tesla, Inc.  (TSLA)"},null,null,{"$f":"IFERROR(RTD(\"cqg.rtd\", ,\"ContractData\",AB14, \"LastTrade\",, \"T\"),\"\")","v":661.45},{"$f":"IFERROR(RTD(\"cqg.rtd\", ,\"ContractData\",AB14, \"NetChange\",, \"T\"),\"\")","v":0.95000000000000007},{"$f":"IFERROR(RTD(\"cqg.rtd\", ,\"ContractData\",AB14, \"PerCentNetLastTrade\",, \"T\")/100,\"\")","v":1.438304314912945E-3},1.438304314912945E-3,{"$f":"IFERROR(RTD(\"cqg.rtd\", ,\"ContractData\",AB14, \"Open\",, \"T\"),\"\")","v":659.61},{"$f":"IFERROR(RTD(\"cqg.rtd\", ,\"ContractData\",AB14, \"High\",, \"T\"),\"\")","v":663.66},{"$f":"IFERROR(RTD(\"cqg.rtd\", ,\"ContractData\",AB14, \"Low\",, \"T\"),\"\")","v":659.24},{"$f":"Symbols!H13","v":"S.US.TSLA"}]
[{"$f":"Symbols!C14","v":"F.US.EP"},{"$f":"RTD(\"cqg.rtd\",,\"ContractData\",A15,\"LongDescription\",,\"T\")&\"  (\"&RIGHT(A15,LEN(A15)-5)&\")\"","v":"E-Mini S&P 500, Sep 21  (EP)"},null,null,{"$f":"IFERROR(RTD(\"cqg.rtd\", ,\"ContractData\",A15, \"LastTrade\",, \"T\"),\"\")","v":4328.75},{"$f":"IFERROR(RTD(\"cqg.rtd\", ,\"ContractData\",A15, \"NetChange\",, \"T\"),\"\")","v":13},{"$f":"IFERROR(RTD(\"cqg.rtd\", ,\"ContractData\",A15, \"PerCentNetLastTrade\",, \"T\")/100,\"\")","v":3.0703278878461359E-3},3.0703278878461359E-3,{"$f":"IFERROR(RTD(\"cqg.rtd\", ,\"ContractData\",A15, \"Open\",, \"T\"),\"\")","v":4318.75},{"$f":"IFERROR(RTD(\"cqg.rtd\", ,\"ContractData\",A15, \"High\",, \"T\"),\"\")","v":4338.5},{"$f":"IFERROR(RTD(\"cqg.rtd\", ,\"ContractData\",A15, \"Low\",, \"T\"),\"\")","v":4310},{"$f":"R6","v":"NASDAQ Composite Index  (NQCOMP)"},null,null,null,null,null,{"$f":"IFERROR(RTD(\"cqg.rtd\", ,\"ContractData\",AB15, \"LongDescription\",, \"T\"),\"\")&\"  (\"&RIGHT(AB15,LEN(AB15)-5)&\")\"","v":"Micron Technology Inc  (MU)"},null,null,{"$f":"IFERROR(RTD(\"cqg.rtd\", ,\"ContractData\",AB15, \"LastTrade\",, \"T\"),\"\")","v":75.650000000000006},{"$f":"IFERROR(RTD(\"cqg.rtd\", ,\"ContractData\",AB15, \"NetChange\",, \"T\"),\"\")","v":0.28000000000000003},{"$f":"IFERROR(RTD(\"cqg.rtd\", ,\"ContractData\",AB15, \"PerCentNetLastTrade\",, \"T\")/100,\"\")","v":3.4487332537471815E-3},3.4487332537471815E-3,{"$f":"IFERROR(RTD(\"cqg.rtd\", ,\"ContractData\",AB15, \"Open\",, \"T\"),\"\")","v":75.34},{"$f":"IFERROR(RTD(\"cqg.rtd\", ,\"ContractData\",AB15, \"High\",, \"T\"),\"\")","v":75.83},{"$f":"IFERROR(RTD(\"cqg.rtd\", ,\"ContractData\",AB15, \"Low\",, \"T\"),\"\")","v":75.34},{"$f":"Symbols!H14","v":"S.US.MU"}]
[{"$f":"Symbols!C15","v":"F.US.CLE"},{"$f":"RTD(\"cqg.rtd\",,\"ContractData\",A16,\"LongDescription\",,\"T\")&\"  (\"&RIGHT(A16,LEN(A16)-5)&\")\"","v":"Crude Light (Globex), Sep 21  (CLE)"},null,null,{"$f":"IFERROR(RTD(\"cqg.rtd\", ,\"ContractData\",A16, \"LastTrade\",, \"T\"),\"\")","v":68.97},{"$f":"IFERROR(RTD(\"cqg.rtd\", ,\"ContractData\",A16, \"NetChange\",, \"T\"),\"\")","v":1.77},{"$f":"IFERROR(RTD(\"cqg.rtd\", ,\"ContractData\",A16, \"PerCentNetLastTrade\",, \"T\")/100,\"\")","v":2.6339285714285718E-2},2.6339285714285718E-2,{"$f":"IFERROR(RTD(\"cqg.rtd\", ,\"ContractData\",A16, \"Open\",, \"T\"),\"\")","v":66.45},{"$f":"IFERROR(RTD(\"cqg.rtd\", ,\"ContractData\",A16, \"High\",, \"T\"),\"\")","v":68.989999999999995},{"$f":"IFERROR(RTD(\"cqg.rtd\", ,\"ContractData\",A16, \"Low\",, \"T\"),\"\")","v":66.44},null,null,null,null,null,null,{"$f":"IFERROR(RTD(\"cqg.rtd\", ,\"ContractData\",AB16, \"LongDescription\",, \"T\"),\"\")&\"  (\"&RIGHT(AB16,LEN(AB16)-5)&\")\"","v":"Invesco QQQ Trust Series 1  (QQQ)"},null,null,{"$f":"IFERROR(RTD(\"cqg.rtd\", ,\"ContractData\",AB16, \"LastTrade\",, \"T\"),\"\")","v":358.75},{"$f":"IFERROR(RTD(\"cqg.rtd\", ,\"ContractData\",AB16, \"NetChange\",, \"T\"),\"\")","v":-0.04},{"$f":"IFERROR(RTD(\"cqg.rtd\", ,\"ContractData\",AB16, \"PerCentNetLastTrade\",, \"T\")/100,\"\")","v":-1.1148582736419633E-4},-1.1148582736419633E-4,{"$f":"IFERROR(RTD(\"cqg.rtd\", ,\"ContractData\",AB16, \"Open\",, \"T\"),\"\")","v":358.35},{"$f":"IFERROR(RTD(\"cqg.rtd\", ,\"ContractData\",AB16, \"High\",, \"T\"),\"\")","v":358.79},{"$f":"IFERROR(RTD(\"cqg.rtd\", ,\"ContractData\",AB16, \"Low\",, \"T\"),\"\")","v":358.12},{"$f":"Symbols!H15","v":"S.US.QQQ"}]
[{"$f":"Symbols!C16","v":"F.US.HOE"},{"$f":"RTD(\"cqg.rtd\",,\"ContractData\",A17,\"LongDescription\",,\"T\")&\"  (\"&RIGHT(A17,LEN(A17)-5)&\")\"","v":"NY Harbor ULSD, Sep 21  (HOE)"},null,null,{"$f":"IFERROR(RTD(\"cqg.rtd\", ,\"ContractData\",A17, \"LastTrade\",, \"T\"),\"\")","v":2.0590000000000002},{"$f":"IFERROR(RTD(\"cqg.rtd\", ,\"ContractData\",A17, \"NetChange\",, \"T\"),\"\")","v":4.48E-2},{"$f":"IFERROR(RTD(\"cqg.rtd\", ,\"ContractData\",A17, \"PerCentNetLastTrade\",, \"T\")/100,\"\")","v":2.2242081223314468E-2},2.2242081223314468E-2,{"$f":"IFERROR(RTD(\"cqg.rtd\", ,\"ContractData\",A17, \"Open\",, \"T\"),\"\")","v":1.9973000000000001},{"$f":"IFERROR(RTD(\"cqg.rtd\", ,\"ContractData\",A17, \"High\",, \"T\"),\"\")","v":2.0592000000000001},{"$f":"IFERROR(RTD(\"cqg.rtd\", ,\"ContractData\",A17, \"Low\",, \"T\"),\"\")","v":1.9942000000000002},null,null,null,null,null,null,{"$f":"IFERROR(RTD(\"cqg.rtd\", ,\"ContractData\",AB17, \"LongDescription\",, \"T\"),\"\")&\"  (\"&RIGHT(AB17,LEN(AB17)-5)&\")\"","v":"Cisco Systems Inc  (CSCO)"},null,null,{"$f":"IFERROR(RTD(\"cqg.rtd\", ,\"ContractData\",AB17, \"LastTrade\",, \"T\"),\"\")","v":53.53},{"$f":"IFERROR(RTD(\"cqg.rtd\", ,\"ContractData\",AB17, \"NetChange\",, \"T\"),\"\")","v":-0.05},{"$f":"IFERROR(RTD(\"cqg.rtd\", ,\"ContractData\",AB17, \"PerCentNetLastTrade\",, \"T\")/100,\"\")","v":-9.3318402388951102E-4},-9.3318402388951102E-4,{"$f":"IFERROR(RTD(\"cqg.rtd\", ,\"ContractData\",AB17, \"Open\",, \"T\"),\"\")","v":53.82},{"$f":"IFERROR(RTD(\"cqg.rtd\", ,\"ContractData\",AB17, \"High\",, \"T\"),\"\")","v":53.84},{"$f":"IFERROR(RTD(\"cqg.rtd\", ,\"ContractData\",AB17, \"Low\",, \"T\"),\"\")","v":53.480000000000004},{"$f":"Symbols!H16","v":"S.US.CSCO"}]
[{"$f":"Symbols!C17","v":"F.US.RBE"},{"$f":"RTD(\"cqg.rtd\",,\"ContractData\",A18,\"LongDescription\",,\"T\")&\"  (\"&RIGHT(A18,LEN(A18)-5)&\")\"","v":"RBOB Gasoline (Globex), Sep 21  (RBE)"},null,null,{"$f":"IFERROR(RTD(\"cqg.rtd\", ,\"ContractData\",A18, \"LastTrade\",, \"T\"),\"\")","v":2.1473},{"$f":"IFERROR(RTD(\"cqg.rtd\", ,\"ContractData\",A18, \"NetChange\",, \"T\"),\"\")","v":3.7200000000000004E-2},{"$f":"IFERROR(RTD(\"cqg.rtd\", ,\"ContractData\",A18, \"PerCentNetLastTrade\",, \"T\")/100,\"\")","v":1.7484836997725552E-2},1.7484836997725552E-2,{"$f":"IFERROR(RTD(\"cqg.rtd\", ,\"ContractData\",A18, \"Open\",, \"T\"),\"\")","v":2.0910000000000002},{"$f":"IFERROR(RTD(\"cqg.rtd\", ,\"ContractData\",A18, \"High\",, \"T\"),\"\")","v":2.1482000000000001},{"$f":"IFERROR(RTD(\"cqg.rtd\", ,\"ContractData\",A18, \"Low\",, \"T\"),\"\")","v":2.0851000000000002},null,null,null,null,null,null,{"$f":"IFERROR(RTD(\"cqg.rtd\", ,\"ContractData\",AB18, \"LongDescription\",, \"T\"),\"\")&\"  (\"&RIGHT(AB18,LEN(AB18)-5)&\")\"","v":"Facebook, Inc.  (FB)"},null,null,{"$f":"IFERROR(RTD(\"cqg.rtd\", ,\"ContractData\",AB18, \"LastTrade\",, \"T\"),\"\")","v":342.51},{"$f":"IFERROR(RTD(\"cqg.rtd\", ,\"ContractData\",AB18, \"NetChange\",, \"T\"),\"\")","v":0.98},{"$f":"IFERROR(RTD(\"cqg.rtd\", ,\"ContractData\",AB18, \"PerCentNetLastTrade\",, \"T\")/100,\"\")","v":2.4878534215301762E-3},2.4878534215301762E-3,{"$f":"IFERROR(RTD(\"cqg.rtd\", ,\"ContractData\",AB18, \"Open\",, \"T\"),\"\")","v":341.5},{"$f":"IFERROR(RTD(\"cqg.rtd\", ,\"ContractData\",AB18, \"High\",, \"T\"),\"\")","v":342.87},{"$f":"IFERROR(RTD(\"cqg.rtd\", ,\"ContractData\",AB18, \"Low\",, \"T\"),\"\")","v":341.25},{"$f":"Symbols!H17","v":"S.US.FB"}]
[{"$f":"Symbols!C18","v":"F.US.GCE"},{"$f":"RTD(\"cqg.rtd\",,\"ContractData\",A19,\"LongDescription\",,\"T\")&\"  (\"&RIGHT(A19,LEN(A19)-5)&\")\"","v":"Gold (Globex), Aug 21  (GCE)"},null,null,{"$f":"IFERROR(RTD(\"cqg.rtd\", ,\"ContractData\",A19, \"LastTrade\",, \"T\"),\"\")","v":1798.7},{"$f":"IFERROR(RTD(\"cqg.rtd\", ,\"ContractData\",A19, \"NetChange\",, \"T\"),\"\")","v":-12.700000000000001},{"$f":"IFERROR(RTD(\"cqg.rtd\", ,\"ContractData\",A19, \"PerCentNetLastTrade\",, \"T\")/100,\"\")","v":-7.0111515954510324E-3},-7.0111515954510324E-3,{"$f":"IFERROR(RTD(\"cqg.rtd\", ,\"ContractData\",A19, \"Open\",, \"T\"),\"\")","v":1810.6000000000001},{"$f":"IFERROR(RTD(\"cqg.rtd\", ,\"ContractData\",A19, \"High\",, \"T\"),\"\")","v":1814.4},{"$f":"IFERROR(RTD(\"cqg.rtd\", ,\"ContractData\",A19, \"Low\",, \"T\"),\"\")","v":1794.3000000000002},null,null,null,null,null,null,{"$f":"IFERROR(RTD(\"cqg.rtd\", ,\"ContractData\",AB19, \"LongDescription\",, \"T\"),\"\")&\"  (\"&RIGHT(AB19,LEN(AB19)-5)&\")\"","v":"iShares 20+ Year Treasury Bond ETF  (TLT)"},null,null,{"$f":"IFERROR(RTD(\"cqg.rtd\", ,\"ContractData\",AB19, \"LastTrade\",, \"T\"),\"\")","v":148.32},{"$f":"IFERROR(RTD(\"cqg.rtd\", ,\"ContractData\",AB19, \"NetChange\",, \"T\"),\"\")","v":-1.67},{"$f":"IFERROR(RTD(\"cqg.rtd\", ,\"ContractData\",AB19, \"PerCentNetLastTrade\",, \"T\")/100,\"\")","v":-1.1200000000000002E-2},-1.1200000000000002E-2,{"$f":"IFERROR(RTD(\"cqg.rtd\", ,\"ContractData\",AB19, \"Open\",, \"T\"),\"\")","v":148.18},{"$f":"IFERROR(RTD(\"cqg.rtd\", ,\"ContractData\",AB19, \"High\",, \"T\"),\"\")","v":148.34},{"$f":"IFERROR(RTD(\"cqg.rtd\", ,\"ContractData\",AB19, \"Low\",, \"T\"),\"\")","v":148.14000000000001},{"$f":"Symbols!H18","v":"S.US.TLT"}]
[{"$f":"Symbols!C19","v":"F.US.DD"},{"$f":"RTD(\"cqg.rtd\",,\"ContractData\",A20,\"LongDescription\",,\"T\")&\"  (\"&RIGHT(A20,LEN(A20)-5)&\")\"","v":"DAX Index, Sep 21  (DD)"},null,null,{"$f":"IFERROR(RTD(\"cqg.rtd\", ,\"ContractData\",A20, \"LastTrade\",, \"T\"),\"\")","v":15370},{"$f":"IFERROR(RTD(\"cqg.rtd\", ,\"ContractData\",A20, \"NetChange\",, \"T\"),\"\")","v":162},{"$f":"IFERROR(RTD(\"cqg.rtd\", ,\"ContractData\",A20, \"PerCentNetLastTrade\",, \"T\")/100,\"\")","v":1.0519395134779751E-2},1.0519395134779751E-2,{"$f":"IFERROR(RTD(\"cqg.rtd\", ,\"ContractData\",A20, \"Open\",, \"T\"),\"\")","v":15273},{"$f":"IFERROR(RTD(\"cqg.rtd\", ,\"ContractData\",A20, \"High\",, \"T\"),\"\")","v":15377},{"$f":"IFERROR(RTD(\"cqg.rtd\", ,\"ContractData\",A20, \"Low\",, \"T\"),\"\")","v":15182},null,null,null,null,null,null,{"$f":"IFERROR(RTD(\"cqg.rtd\", ,\"ContractData\",AB20, \"LongDescription\",, \"T\"),\"\")&\"  (\"&RIGHT(AB20,LEN(AB20)-5)&\")\"","v":"Intel Corporation  (INTC)"},null,null,{"$f":"IFERROR(RTD(\"cqg.rtd\", ,\"ContractData\",AB20, \"LastTrade\",, \"T\"),\"\")","v":55.160000000000004},{"$f":"IFERROR(RTD(\"cqg.rtd\", ,\"ContractData\",AB20, \"NetChange\",, \"T\"),\"\")","v":-7.0000000000000007E-2},{"$f":"IFERROR(RTD(\"cqg.rtd\", ,\"ContractData\",AB20, \"PerCentNetLastTrade\",, \"T\")/100,\"\")","v":-1.4482259232440262E-3},-1.4482259232440262E-3,{"$f":"IFERROR(RTD(\"cqg.rtd\", ,\"ContractData\",AB20, \"Open\",, \"T\"),\"\")","v":55.18},{"$f":"IFERROR(RTD(\"cqg.rtd\", ,\"ContractData\",AB20, \"High\",, \"T\"),\"\")","v":55.27},{"$f":"IFERROR(RTD(\"cqg.rtd\", ,\"ContractData\",AB20, \"Low\",, \"T\"),\"\")","v":55.01},{"$f":"Symbols!H19","v":"S.US.INTC"}]
[{"$f":"Symbols!C20","v":"F.US.DSX"},{"$f":"RTD(\"cqg.rtd\",,\"ContractData\",A21,\"LongDescription\",,\"T\")&\"  (\"&RIGHT(A21,LEN(A21)-5)&\")\"","v":"Euro STOXX 50, Sep 21  (DSX)"},null,null,{"$f":"IFERROR(RTD(\"cqg.rtd\", ,\"ContractData\",A21, \"LastTrade\",, \"T\"),\"\")","v":4006},{"$f":"IFERROR(RTD(\"cqg.rtd\", ,\"ContractData\",A21, \"NetChange\",, \"T\"),\"\")","v":56.5},{"$f":"IFERROR(RTD(\"cqg.rtd\", ,\"ContractData\",A21, \"PerCentNetLastTrade\",, \"T\")/100,\"\")","v":1.4305608304848717E-2},1.4305608304848717E-2,{"$f":"IFERROR(RTD(\"cqg.rtd\", ,\"ContractData\",A21, \"Open\",, \"T\"),\"\")","v":3966},{"$f":"IFERROR(RTD(\"cqg.rtd\", ,\"ContractData\",A21, \"High\",, \"T\"),\"\")","v":4011.5},{"$f":"IFERROR(RTD(\"cqg.rtd\", ,\"ContractData\",A21, \"Low\",, \"T\"),\"\")","v":3944},null,null,null,null,null,null,{"$f":"IFERROR(RTD(\"cqg.rtd\", ,\"ContractData\",AB21, \"LongDescription\",, \"T\"),\"\")&\"  (\"&RIGHT(AB21,LEN(AB21)-5)&\")\"","v":"QUALCOMM Inc  (QCOM)"},null,null,{"$f":"IFERROR(RTD(\"cqg.rtd\", ,\"ContractData\",AB21, \"LastTrade\",, \"T\"),\"\")","v":140.14000000000001},{"$f":"IFERROR(RTD(\"cqg.rtd\", ,\"ContractData\",AB21, \"NetChange\",, \"T\"),\"\")","v":0.65},{"$f":"IFERROR(RTD(\"cqg.rtd\", ,\"ContractData\",AB21, \"PerCentNetLastTrade\",, \"T\")/100,\"\")","v":4.2278753135077032E-3},4.2278753135077032E-3,{"$f":"IFERROR(RTD(\"cqg.rtd\", ,\"ContractData\",AB21, \"Open\",, \"T\"),\"\")","v":139.65},{"$f":"IFERROR(RTD(\"cqg.rtd\", ,\"ContractData\",AB21, \"High\",, \"T\"),\"\")","v":140.19},{"$f":"IFERROR(RTD(\"cqg.rtd\", ,\"ContractData\",AB21, \"Low\",, \"T\"),\"\")","v":139.65},{"$f":"Symbols!H20","v":"S.US.QCOM"}]
[{"$f":"Symbols!C21","v":"S.SPLV"},{"$f":"RTD(\"cqg.rtd\",,\"ContractData\",A22,\"LongDescription\",,\"T\")&\"  (\"&RIGHT(A22,LEN(A22)-5)&\")\"","v":"PowerShares Exchange-Traded Fund Trust II  (V)"},null,null,{"$f":"IFERROR(RTD(\"cqg.rtd\", ,\"ContractData\",A22, \"LastTrade\",, \"T\"),\"\")","v":62.550000000000004},{"$f":"IFERROR(RTD(\"cqg.rtd\", ,\"ContractData\",A22, \"NetChange\",, \"T\"),\"\")","v":0.04},{"$f":"IFERROR(RTD(\"cqg.rtd\", ,\"ContractData\",A22, \"PerCentNetLastTrade\",, \"T\")/100,\"\")","v":6.3989761638137894E-4},6.3989761638137894E-4,{"$f":"IFERROR(RTD(\"cqg.rtd\", ,\"ContractData\",A22, \"Open\",, \"T\"),\"\")","v":62.56},{"$f":"IFERROR(RTD(\"cqg.rtd\", ,\"ContractData\",A22, \"High\",, \"T\"),\"\")","v":62.620000000000005},{"$f":"IFERROR(RTD(\"cqg.rtd\", ,\"ContractData\",A22, \"Low\",, \"T\"),\"\")","v":62.54},null,null,null,null,null,null,{"$f":"IFERROR(RTD(\"cqg.rtd\", ,\"ContractData\",AB22, \"LongDescription\",, \"T\"),\"\")&\"  (\"&RIGHT(AB22,LEN(AB22)-5)&\")\"","v":"American Airlines Group Inc.  (AAL)"},null,null,{"$f":"IFERROR(RTD(\"cqg.rtd\", ,\"ContractData\",AB22, \"LastTrade\",, \"T\"),\"\")","v":20.86},{"$f":"IFERROR(RTD(\"cqg.rtd\", ,\"ContractData\",AB22, \"NetChange\",, \"T\"),\"\")","v":0.32},{"$f":"IFERROR(RTD(\"cqg.rtd\", ,\"ContractData\",AB22, \"PerCentNetLastTrade\",, \"T\")/100,\"\")","v":1.5077821011673152E-2},1.5077821011673152E-2,{"$f":"IFERROR(RTD(\"cqg.rtd\", ,\"ContractData\",AB22, \"Open\",, \"T\"),\"\")","v":20.79},{"$f":"IFERROR(RTD(\"cqg.rtd\", ,\"ContractData\",AB22, \"High\",, \"T\"),\"\")","v":20.98},{"$f":"IFERROR(RTD(\"cqg.rtd\", ,\"ContractData\",AB22, \"Low\",, \"T\"),\"\")","v":20.75},{"$f":"Symbols!H21","v":"S.US.AAL"}]
[null,"Description",null,null,"Last","Net","% Net","Tdy Vol","Open","High","Low",null,null,null,null,null,null,"Description",null,null,"Last","Net","% Net","Tdy Vol","Open","High","Low"]
[null,null,null,null,"Price","Change","Change","21d-Vol",null,null,null,"NYSE Total Volume",null,null,"NASDAQ Total Volume",null,null,null,null,null,"Price","Change","Change","21d-Vol"]
[null,"CQG Top Ten Percentage Performers in the S&P 500",null,null,null,null,null,null,null,null,null,{"$f":"IFERROR(RTD(\"cqg.rtd\", ,\"ContractData\",\"DJTOV\", \"LastTrade\",, \"T\"),\"\")","v":47451},null,null,{"$f":"O28+O31+O34","v":233609},null,null,"CQG Top Ten Percentage Performers in the NASDAQ 100"]
[{"$f":"TRIM('S&P500'!I1)","v":"S.US.IPG"},{"$f":"IFERROR(RTD(\"cqg.rtd\",,\"ContractData\",A26,\"LongDescription\",,\"T\")&\"  (\"&RIGHT(A26,LEN(A26)-5)&\")\",\"\")","v":"Interpublic Grp of Cos  (IPG)"},null,null,{"$f":"IF(B26=\"\",\"\",IFERROR(RTD(\"cqg.rtd\",,\"ContractData\",A26,\"LastTrade\",,\"T\"),\"\"))","v":34.619999999999997},{"$f":"IF(B26=\"\",\"\",IFERROR(RTD(\"cqg.rtd\", ,\"ContractData\",A26, \"NetChange\",, \"T\"),\"\"))","v":3.4},{"$f":"IFERROR(RTD(\"cqg.rtd\", ,\"ContractData\",A26, \"PerCentNetLastTrade\",, \"T\")/100,\"\")","v":0.10713143588103614},{"$f":"IFERROR(RTD(\"cqg.rtd\",,\"StudyData\",A26, \"Vol\", \"VolType=Auto,CoCType=Auto\", \"Vol\",\"ADC\",\"0\",\"ALL\",,,\"TRUE\",\"T\")/ RTD(\"cqg.rtd\",,\"StudyData\",A26, \"MA\", \"InputChoice=ContractVol,MAType=Sim,Period=21\", \"MA\",\"D\",\"-1\",\"all\",,,,\"T\"),\"\")","v":0.22977561782483516},{"$f":"IF(B26=\"\",\"\",IFERROR(RTD(\"cqg.rtd\", ,\"ContractData\",A26, \"Open\",, \"T\"),\"\"))","v":34.54},{"$f":"IF(B26=\"\",\"\",IFERROR(RTD(\"cqg.rtd\", ,\"ContractData\",A26, \"High\",, \"T\"),\"\"))","v":35.25},{"$f":"IF(B26=\"\",\"\",IFERROR(RTD(\"cqg.rtd\",,\"ContractData\",A26,\"Low\",,\"T\"),\"\"))","v":33.92},"NYSE Up Volume",null,null,"NASDAQ Up Volume",null,null,{"$f":"IFERROR(RTD(\"cqg.rtd\",,\"ContractData\",AB26,\"LongDescription\",,\"T\")&\"  (\"&RIGHT(AB26,LEN(AB26)-5)&\")\",\"\")","v":"ASML Holding NV NY Reg Shs  (ASML)"},null,null,{"$f":"IF(R26=\"\",\"\",IFERROR(RTD(\"cqg.rtd\",,\"ContractData\",AB26,\"LastTrade\",,\"T\"),\"\"))","v":704.5},{"$f":"IF(R26=\"\",\"\",IFERROR(RTD(\"cqg.rtd\", ,\"ContractData\",AB26, \"NetChange\",, \"T\"),\"\"))","v":20.8},{"$f":"IFERROR(RTD(\"cqg.rtd\", ,\"ContractData\",AB26, \"PerCentNetLastTrade\",, \"T\")/100,\"\")","v":2.9895475476938823E-2},{"$f":"IFERROR(RTD(\"cqg.rtd\",,\"StudyData\",AB26, \"Vol\", \"VolType=Auto,CoCType=Auto\", \"Vol\",\"ADC\",\"0\",\"ALL\",,,\"TRUE\",\"T\")/ RTD(\"cqg.rtd\",,\"StudyData\",AB26, \"MA\", \"InputChoice=ContractVol,MAType=Sim,Period=21\", \"MA\",\"D\",\"-1\",\"all\",,,,\"T\"),\"\")","v":0.16687125054059759},{"$f":"IF(R26=\"\",\"\",IFERROR(RTD(\"cqg.rtd\", ,\"ContractData\",AB26, \"Open\",, \"T\"),\"\"))","v":705.93000000000006},{"$f":"IF(R26=\"\",\"\",IFERROR(RTD(\"cqg.rtd\", ,\"ContractData\",AB26, \"High\",, \"T\"),\"\"))","v":706.48},{"$f":"IF(R26=\"\",\"\",IFERROR(RTD(\"cqg.rtd\", ,\"ContractData\",AB26, \"Low\",, \"T\"),\"\"))","v":702.95},{"$f":"NASDAQ100!I1","v":"S.US.ASML"}]
[{"$f":"TRIM('S&P500'!I2)","v":"S.US.CMG"},{"$f":"IFERROR(RTD(\"cqg.rtd\",,\"ContractData\",A27,\"LongDescription\",,\"T\")&\"  (\"&RIGHT(A27,LEN(A27)-5)&\")\",\"\")","v":"Chipotle Mexican Grill  (CMG)"},null,null,{"$f":"IF(B27=\"\",\"\",IFERROR(RTD(\"cqg.rtd\",,\"ContractData\",A27,\"LastTrade\",,\"T\"),\"\"))","v":1686.64},{"$f":"IF(B27=\"\",\"\",IFERROR(RTD(\"cqg.rtd\", ,\"ContractData\",A27, \"NetChange\",, \"T\"),\"\"))","v":112.29},{"$f":"IFERROR(RTD(\"cqg.rtd\", ,\"ContractData\",A27, \"PerCentNetLastTrade\",, \"T\")/100,\"\")","v":7.1324673674849931E-2},{"$f":"IFERROR(RTD(\"cqg.rtd\",,\"StudyData\",A27, \"Vol\", \"VolType=Auto,CoCType=Auto\", \"Vol\",\"ADC\",\"0\",\"ALL\",,,\"TRUE\",\"T\")/ RTD(\"cqg.rtd\",,\"StudyData\",A27, \"MA\", \"InputChoice=ContractVol,MAType=Sim,Period=21\", \"MA\",\"D\",\"-1\",\"all\",,,,\"T\"),\"\")","v":0.33590777838041663},{"$f":"IF(B27=\"\",\"\",IFERROR(RTD(\"cqg.rtd\", ,\"ContractData\",A27, \"Open\",, \"T\"),\"\"))","v":1656.8400000000001},{"$f":"IF(B27=\"\",\"\",IFERROR(RTD(\"cqg.rtd\", ,\"ContractData\",A27, \"High\",, \"T\"),\"\"))","v":1689.71},{"$f":"IF(B27=\"\",\"\",IFERROR(RTD(\"cqg.rtd\",,\"ContractData\",A27,\"Low\",,\"T\"),\"\"))","v":1656.8400000000001},null,null,null,null,null,null,{"$f":"IFERROR(RTD(\"cqg.rtd\",,\"ContractData\",AB27,\"LongDescription\",,\"T\")&\"  (\"&RIGHT(AB27,LEN(AB27)-5)&\")\",\"\")","v":"Check Point Sftwr Tech Ltd  (CHKP)"},null,null,{"$f":"IF(R27=\"\",\"\",IFERROR(RTD(\"cqg.rtd\",,\"ContractData\",AB27,\"LastTrade\",,\"T\"),\"\"))","v":124},{"$f":"IF(R27=\"\",\"\",IFERROR(RTD(\"cqg.rtd\", ,\"ContractData\",AB27, \"NetChange\",, \"T\"),\"\"))","v":2.1800000000000002},{"$f":"IFERROR(RTD(\"cqg.rtd\", ,\"ContractData\",AB27, \"PerCentNetLastTrade\",, \"T\")/100,\"\")","v":1.7895255294697095E-2},{"$f":"IFERROR(RTD(\"cqg.rtd\",,\"StudyData\",AB27, \"Vol\", \"VolType=Auto,CoCType=Auto\", \"Vol\",\"ADC\",\"0\",\"ALL\",,,\"TRUE\",\"T\")/ RTD(\"cqg.rtd\",,\"StudyData\",AB27, \"MA\", \"InputChoice=ContractVol,MAType=Sim,Period=21\", \"MA\",\"D\",\"-1\",\"all\",,,,\"T\"),\"\")","v":7.2703798305396472E-2},{"$f":"IF(R27=\"\",\"\",IFERROR(RTD(\"cqg.rtd\", ,\"ContractData\",AB27, \"Open\",, \"T\"),\"\"))","v":123.76},{"$f":"IF(R27=\"\",\"\",IFERROR(RTD(\"cqg.rtd\", ,\"ContractData\",AB27, \"High\",, \"T\"),\"\"))","v":124.08},{"$f":"IF(R27=\"\",\"\",IFERROR(RTD(\"cqg.rtd\", ,\"ContractData\",AB27, \"Low\",, \"T\"),\"\"))","v":123.68},{"$f":"NASDAQ100!I2","v":"S.US.CHKP"}]
[{"$f":"TRIM('S&P500'!I3)","v":"S.US.CCL"},{"$f":"IFERROR(RTD(\"cqg.rtd\",,\"ContractData\",A28,\"LongDescription\",,\"T\")&\"  (\"&RIGHT(A28,LEN(A28)-5)&\")\",\"\")","v":"Carnival Corp  (CCL)"},null,null,{"$f":"IF(B28=\"\",\"\",IFERROR(RTD(\"cqg.rtd\",,\"ContractData\",A28,\"LastTrade\",,\"T\"),\"\"))","v":22.07},{"$f":"IF(B28=\"\",\"\",IFERROR(RTD(\"cqg.rtd\", ,\"ContractData\",A28, \"NetChange\",, \"T\"),\"\"))","v":0.89},{"$f":"IFERROR(RTD(\"cqg.rtd\", ,\"ContractData\",A28, \"PerCentNetLastTrade\",, \"T\")/100,\"\")","v":4.2000943841434636E-2},{"$f":"IFERROR(RTD(\"cqg.rtd\",,\"StudyData\",A28, \"Vol\", \"VolType=Auto,CoCType=Auto\", \"Vol\",\"ADC\",\"0\",\"ALL\",,,\"TRUE\",\"T\")/ RTD(\"cqg.rtd\",,\"StudyData\",A28, \"MA\", \"InputChoice=ContractVol,MAType=Sim,Period=21\", \"MA\",\"D\",\"-1\",\"all\",,,,\"T\"),\"\")","v":0.18021497840821499},{"$f":"IF(B28=\"\",\"\",IFERROR(RTD(\"cqg.rtd\", ,\"ContractData\",A28, \"Open\",, \"T\"),\"\"))","v":21.740000000000002},{"$f":"IF(B28=\"\",\"\",IFERROR(RTD(\"cqg.rtd\", ,\"ContractData\",A28, \"High\",, \"T\"),\"\"))","v":22.22},{"$f":"IF(B28=\"\",\"\",IFERROR(RTD(\"cqg.rtd\",,\"ContractData\",A28,\"Low\",,\"T\"),\"\"))","v":21.67},{"$f":"IFERROR(RTD(\"cqg.rtd\", ,\"ContractData\",\"DJUPV\", \"LastTrade\",, \"T\"),\"\")","v":38564},null,null,{"$f":"IFERROR(RTD(\"cqg.rtd\", ,\"ContractData\",\"NASUPV\", \"LastTrade\",, \"T\"),\"\")","v":168809},null,null,{"$f":"IFERROR(RTD(\"cqg.rtd\",,\"ContractData\",AB28,\"LongDescription\",,\"T\")&\"  (\"&RIGHT(AB28,LEN(AB28)-5)&\")\",\"\")","v":"NVIDIA Corp  (NVDA)"},null,null,{"$f":"IF(R28=\"\",\"\",IFERROR(RTD(\"cqg.rtd\",,\"ContractData\",AB28,\"LastTrade\",,\"T\"),\"\"))","v":189.12},{"$f":"IF(R28=\"\",\"\",IFERROR(RTD(\"cqg.rtd\", ,\"ContractData\",AB28, \"NetChange\",, \"T\"),\"\"))","v":3.19},{"$f":"IFERROR(RTD(\"cqg.rtd\", ,\"ContractData\",AB28, \"PerCentNetLastTrade\",, \"T\")/100,\"\")","v":1.6118633139909733E-2},{"$f":"IFERROR(RTD(\"cqg.rtd\",,\"StudyData\",AB28, \"Vol\", \"VolType=Auto,CoCType=Auto\", \"Vol\",\"ADC\",\"0\",\"ALL\",,,\"TRUE\",\"T\")/ RTD(\"cqg.rtd\",,\"StudyData\",AB28, \"MA\", \"InputChoice=ContractVol,MAType=Sim,Period=21\", \"MA\",\"D\",\"-1\",\"all\",,,,\"T\"),\"\")","v":4.4120406705821701E-2},{"$f":"IF(R28=\"\",\"\",IFERROR(RTD(\"cqg.rtd\", ,\"ContractData\",AB28, \"Open\",, \"T\"),\"\"))","v":188.82},{"$f":"IF(R28=\"\",\"\",IFERROR(RTD(\"cqg.rtd\", ,\"ContractData\",AB28, \"High\",, \"T\"),\"\"))","v":189.5},{"$f":"IF(R28=\"\",\"\",IFERROR(RTD(\"cqg.rtd\", ,\"ContractData\",AB28, \"Low\",, \"T\"),\"\"))","v":187.42000000000002},{"$f":"NASDAQ100!I3","v":"S.US.NVDA"}]
[{"$f":"TRIM('S&P500'!I4)","v":"S.US.SLB"},{"$f":"IFERROR(RTD(\"cqg.rtd\",,\"ContractData\",A29,\"LongDescription\",,\"T\")&\"  (\"&RIGHT(A29,LEN(A29)-5)&\")\",\"\")","v":"Schlumberger Limited  (SLB)"},null,null,{"$f":"IF(B29=\"\",\"\",IFERROR(RTD(\"cqg.rtd\",,\"ContractData\",A29,\"LastTrade\",,\"T\"),\"\"))","v":28.240000000000002},{"$f":"IF(B29=\"\",\"\",IFERROR(RTD(\"cqg.rtd\", ,\"ContractData\",A29, \"NetChange\",, \"T\"),\"\"))","v":1.01},{"$f":"IFERROR(RTD(\"cqg.rtd\", ,\"ContractData\",A29, \"PerCentNetLastTrade\",, \"T\")/100,\"\")","v":3.6710719530102791E-2},{"$f":"IFERROR(RTD(\"cqg.rtd\",,\"StudyData\",A29, \"Vol\", \"VolType=Auto,CoCType=Auto\", \"Vol\",\"ADC\",\"0\",\"ALL\",,,\"TRUE\",\"T\")/ RTD(\"cqg.rtd\",,\"StudyData\",A29, \"MA\", \"InputChoice=ContractVol,MAType=Sim,Period=21\", \"MA\",\"D\",\"-1\",\"all\",,,,\"T\"),\"\")","v":6.3508123651752235E-2},{"$f":"IF(B29=\"\",\"\",IFERROR(RTD(\"cqg.rtd\", ,\"ContractData\",A29, \"Open\",, \"T\"),\"\"))","v":28.03},{"$f":"IF(B29=\"\",\"\",IFERROR(RTD(\"cqg.rtd\", ,\"ContractData\",A29, \"High\",, \"T\"),\"\"))","v":28.37},{"$f":"IF(B29=\"\",\"\",IFERROR(RTD(\"cqg.rtd\",,\"ContractData\",A29,\"Low\",,\"T\"),\"\"))","v":28.03},"NYSE Down Volume",null,null,"NASDAQ Down Volume",null,null,{"$f":"IFERROR(RTD(\"cqg.rtd\",,\"ContractData\",AB29,\"LongDescription\",,\"T\")&\"  (\"&RIGHT(AB29,LEN(AB29)-5)&\")\",\"\")","v":"Liberty Global Inc Series A  (LBTYA)"},null,null,{"$f":"IF(R29=\"\",\"\",IFERROR(RTD(\"cqg.rtd\",,\"ContractData\",AB29,\"LastTrade\",,\"T\"),\"\"))","v":26.150000000000002},{"$f":"IF(R29=\"\",\"\",IFERROR(RTD(\"cqg.rtd\", ,\"ContractData\",AB29, \"NetChange\",, \"T\"),\"\"))","v":0.43},{"$f":"IFERROR(RTD(\"cqg.rtd\", ,\"ContractData\",AB29, \"PerCentNetLastTrade\",, \"T\")/100,\"\")","v":1.6323357947920714E-2},{"$f":"IFERROR(RTD(\"cqg.rtd\",,\"StudyData\",AB29, \"Vol\", \"VolType=Auto,CoCType=Auto\", \"Vol\",\"ADC\",\"0\",\"ALL\",,,\"TRUE\",\"T\")/ RTD(\"cqg.rtd\",,\"StudyData\",AB29, \"MA\", \"InputChoice=ContractVol,MAType=Sim,Period=21\", \"MA\",\"D\",\"-1\",\"all\",,,,\"T\"),\"\")","v":3.8632324678939928E-2},{"$f":"IF(R29=\"\",\"\",IFERROR(RTD(\"cqg.rtd\", ,\"ContractData\",AB29, \"Open\",, \"T\"),\"\"))","v":25.8},{"$f":"IF(R29=\"\",\"\",IFERROR(RTD(\"cqg.rtd\", ,\"ContractData\",AB29, \"High\",, \"T\"),\"\"))","v":26.150000000000002},{"$f":"IF(R29=\"\",\"\",IFERROR(RTD(\"cqg.rtd\", ,\"ContractData\",AB29, \"Low\",, \"T\"),\"\"))","v":25.71},{"$f":"NASDAQ100!I4","v":"S.US.LBTYA"}]
[{"$f":"TRIM('S&P500'!I5)","v":"S.US.OXY"},{"$f":"IFERROR(RTD(\"cqg.rtd\",,\"ContractData\",A30,\"LongDescription\",,\"T\")&\"  (\"&RIGHT(A30,LEN(A30)-5)&\")\",\"\")","v":"Occidental Petroleum  (OXY)"},null,null,{"$f":"IF(B30=\"\",\"\",IFERROR(RTD(\"cqg.rtd\",,\"ContractData\",A30,\"LastTrade\",,\"T\"),\"\"))","v":26.3},{"$f":"IF(B30=\"\",\"\",IFERROR(RTD(\"cqg.rtd\", ,\"ContractData\",A30, \"NetChange\",, \"T\"),\"\"))","v":0.94000000000000006},{"$f":"IFERROR(RTD(\"cqg.rtd\", ,\"ContractData\",A30, \"PerCentNetLastTrade\",, \"T\")/100,\"\")","v":3.6657469452108786E-2},{"$f":"IFERROR(RTD(\"cqg.rtd\",,\"StudyData\",A30, \"Vol\", \"VolType=Auto,CoCType=Auto\", \"Vol\",\"ADC\",\"0\",\"ALL\",,,\"TRUE\",\"T\")/ RTD(\"cqg.rtd\",,\"StudyData\",A30, \"MA\", \"InputChoice=ContractVol,MAType=Sim,Period=21\", \"MA\",\"D\",\"-1\",\"all\",,,,\"T\"),\"\")","v":6.0780683981620058E-2},{"$f":"IF(B30=\"\",\"\",IFERROR(RTD(\"cqg.rtd\", ,\"ContractData\",A30, \"Open\",, \"T\"),\"\"))","v":25.87},{"$f":"IF(B30=\"\",\"\",IFERROR(RTD(\"cqg.rtd\", ,\"ContractData\",A30, \"High\",, \"T\"),\"\"))","v":26.45},{"$f":"IF(B30=\"\",\"\",IFERROR(RTD(\"cqg.rtd\",,\"ContractData\",A30,\"Low\",,\"T\"),\"\"))","v":25.87},null,null,null,null,null,null,{"$f":"IFERROR(RTD(\"cqg.rtd\",,\"ContractData\",AB30,\"LongDescription\",,\"T\")&\"  (\"&RIGHT(AB30,LEN(AB30)-5)&\")\",\"\")","v":"Liberty Global  (LBTYK)"},null,null,{"$f":"IF(R30=\"\",\"\",IFERROR(RTD(\"cqg.rtd\",,\"ContractData\",AB30,\"LastTrade\",,\"T\"),\"\"))","v":26.38},{"$f":"IF(R30=\"\",\"\",IFERROR(RTD(\"cqg.rtd\", ,\"ContractData\",AB30, \"NetChange\",, \"T\"),\"\"))","v":0.44},{"$f":"IFERROR(RTD(\"cqg.rtd\", ,\"ContractData\",AB30, \"PerCentNetLastTrade\",, \"T\")/100,\"\")","v":1.6178736517719571E-2},{"$f":"IFERROR(RTD(\"cqg.rtd\",,\"StudyData\",AB30, \"Vol\", \"VolType=Auto,CoCType=Auto\", \"Vol\",\"ADC\",\"0\",\"ALL\",,,\"TRUE\",\"T\")/ RTD(\"cqg.rtd\",,\"StudyData\",AB30, \"MA\", \"InputChoice=ContractVol,MAType=Sim,Period=21\", \"MA\",\"D\",\"-1\",\"all\",,,,\"T\"),\"\")","v":2.4895622100574617E-2},{"$f":"IF(R30=\"\",\"\",IFERROR(RTD(\"cqg.rtd\", ,\"ContractData\",AB30, \"Open\",, \"T\"),\"\"))","v":26.07},{"$f":"IF(R30=\"\",\"\",IFERROR(RTD(\"cqg.rtd\", ,\"ContractData\",AB30, \"High\",, \"T\"),\"\"))","v":26.39},{"$f":"IF(R30=\"\",\"\",IFERROR(RTD(\"cqg.rtd\", ,\"ContractData\",AB30, \"Low\",, \"T\"),\"\"))","v":26.04},{"$f":"NASDAQ100!I5","v":"S.US.LBTYK"}]
[{"$f":"TRIM('S&P500'!I6)","v":"S.US.HAL"},{"$f":"IFERROR(RTD(\"cqg.rtd\",,\"ContractData\",A31,\"LongDescription\",,\"T\")&\"  (\"&RIGHT(A31,LEN(A31)-5)&\")\",\"\")","v":"Halliburton Company  (HAL)"},null,null,{"$f":"IF(B31=\"\",\"\",IFERROR(RTD(\"cqg.rtd\",,\"ContractData\",A31,\"LastTrade\",,\"T\"),\"\"))","v":20.7},{"$f":"IF(B31=\"\",\"\",IFERROR(RTD(\"cqg.rtd\", ,\"ContractData\",A31, \"NetChange\",, \"T\"),\"\"))","v":0.63},{"$f":"IFERROR(RTD(\"cqg.rtd\", ,\"ContractData\",A31, \"PerCentNetLastTrade\",, \"T\")/100,\"\")","v":3.1390134529147982E-2},{"$f":"IFERROR(RTD(\"cqg.rtd\",,\"StudyData\",A31, \"Vol\", \"VolType=Auto,CoCType=Auto\", \"Vol\",\"ADC\",\"0\",\"ALL\",,,\"TRUE\",\"T\")/ RTD(\"cqg.rtd\",,\"StudyData\",A31, \"MA\", \"InputChoice=ContractVol,MAType=Sim,Period=21\", \"MA\",\"D\",\"-1\",\"all\",,,,\"T\"),\"\")","v":0.11713450512491635},{"$f":"IF(B31=\"\",\"\",IFERROR(RTD(\"cqg.rtd\", ,\"ContractData\",A31, \"Open\",, \"T\"),\"\"))","v":20.92},{"$f":"IF(B31=\"\",\"\",IFERROR(RTD(\"cqg.rtd\", ,\"ContractData\",A31, \"High\",, \"T\"),\"\"))","v":21.07},{"$f":"IF(B31=\"\",\"\",IFERROR(RTD(\"cqg.rtd\",,\"ContractData\",A31,\"Low\",,\"T\"),\"\"))","v":20.66},{"$f":"IFERROR(RTD(\"cqg.rtd\", ,\"ContractData\",\"DJDNV\", \"LastTrade\",, \"T\"),\"\")","v":8228},null,null,{"$f":"IFERROR(RTD(\"cqg.rtd\", ,\"ContractData\",\"NASDNV\", \"LastTrade\",, \"T\"),\"\")","v":49478},null,null,{"$f":"IFERROR(RTD(\"cqg.rtd\",,\"ContractData\",AB31,\"LongDescription\",,\"T\")&\"  (\"&RIGHT(AB31,LEN(AB31)-5)&\")\",\"\")","v":"Expedia Group, Inc.  (EXPE)"},null,null,{"$f":"IF(R31=\"\",\"\",IFERROR(RTD(\"cqg.rtd\",,\"ContractData\",AB31,\"LastTrade\",,\"T\"),\"\"))","v":158.64000000000001},{"$f":"IF(R31=\"\",\"\",IFERROR(RTD(\"cqg.rtd\", ,\"ContractData\",AB31, \"NetChange\",, \"T\"),\"\"))","v":2.52},{"$f":"IFERROR(RTD(\"cqg.rtd\", ,\"ContractData\",AB31, \"PerCentNetLastTrade\",, \"T\")/100,\"\")","v":1.6141429669485011E-2},{"$f":"IFERROR(RTD(\"cqg.rtd\",,\"StudyData\",AB31, \"Vol\", \"VolType=Auto,CoCType=Auto\", \"Vol\",\"ADC\",\"0\",\"ALL\",,,\"TRUE\",\"T\")/ RTD(\"cqg.rtd\",,\"StudyData\",AB31, \"MA\", \"InputChoice=ContractVol,MAType=Sim,Period=21\", \"MA\",\"D\",\"-1\",\"all\",,,,\"T\"),\"\")","v":1.3863899214744499E-2},{"$f":"IF(R31=\"\",\"\",IFERROR(RTD(\"cqg.rtd\", ,\"ContractData\",AB31, \"Open\",, \"T\"),\"\"))","v":157.59},{"$f":"IF(R31=\"\",\"\",IFERROR(RTD(\"cqg.rtd\", ,\"ContractData\",AB31, \"High\",, \"T\"),\"\"))","v":158.82},{"$f":"IF(R31=\"\",\"\",IFERROR(RTD(\"cqg.rtd\", ,\"ContractData\",AB31, \"Low\",, \"T\"),\"\"))","v":157.59},{"$f":"NASDAQ100!I6","v":"S.US.EXPE"}]
[{"$f":"TRIM('S&P500'!I7)","v":"S.US.CMA"},{"$f":"IFERROR(RTD(\"cqg.rtd\",,\"ContractData\",A32,\"LongDescription\",,\"T\")&\"  (\"&RIGHT(A32,LEN(A32)-5)&\")\",\"\")","v":"Comerica Inc  (CMA)"},null,null,{"$f":"IF(B32=\"\",\"\",IFERROR(RTD(\"cqg.rtd\",,\"ContractData\",A32,\"LastTrade\",,\"T\"),\"\"))","v":67.78},{"$f":"IF(B32=\"\",\"\",IFERROR(RTD(\"cqg.rtd\", ,\"ContractData\",A32, \"NetChange\",, \"T\"),\"\"))","v":2.33},{"$f":"IFERROR(RTD(\"cqg.rtd\", ,\"ContractData\",A32, \"PerCentNetLastTrade\",, \"T\")/100,\"\")","v":3.2287541882424609E-2},{"$f":"IFERROR(RTD(\"cqg.rtd\",,\"StudyData\",A32, \"Vol\", \"VolType=Auto,CoCType=Auto\", \"Vol\",\"ADC\",\"0\",\"ALL\",,,\"TRUE\",\"T\")/ RTD(\"cqg.rtd\",,\"StudyData\",A32, \"MA\", \"InputChoice=ContractVol,MAType=Sim,Period=21\", \"MA\",\"D\",\"-1\",\"all\",,,,\"T\"),\"\")","v":4.0142451392077942E-2},{"$f":"IF(B32=\"\",\"\",IFERROR(RTD(\"cqg.rtd\", ,\"ContractData\",A32, \"Open\",, \"T\"),\"\"))","v":66.16},{"$f":"IF(B32=\"\",\"\",IFERROR(RTD(\"cqg.rtd\", ,\"ContractData\",A32, \"High\",, \"T\"),\"\"))","v":67.989999999999995},{"$f":"IF(B32=\"\",\"\",IFERROR(RTD(\"cqg.rtd\",,\"ContractData\",A32,\"Low\",,\"T\"),\"\"))","v":66.16},"NYSE Unchanged Vol",null,null,"NASDAQ Unchanged Vol",null,null,{"$f":"IFERROR(RTD(\"cqg.rtd\",,\"ContractData\",AB32,\"LongDescription\",,\"T\")&\"  (\"&RIGHT(AB32,LEN(AB32)-5)&\")\",\"\")","v":"Fox Corporation Class A  (FOXA)"},null,null,{"$f":"IF(R32=\"\",\"\",IFERROR(RTD(\"cqg.rtd\",,\"ContractData\",AB32,\"LastTrade\",,\"T\"),\"\"))","v":35.480000000000004},{"$f":"IF(R32=\"\",\"\",IFERROR(RTD(\"cqg.rtd\", ,\"ContractData\",AB32, \"NetChange\",, \"T\"),\"\"))","v":0.53},{"$f":"IFERROR(RTD(\"cqg.rtd\", ,\"ContractData\",AB32, \"PerCentNetLastTrade\",, \"T\")/100,\"\")","v":1.4583929082070346E-2},{"$f":"IFERROR(RTD(\"cqg.rtd\",,\"StudyData\",AB32, \"Vol\", \"VolType=Auto,CoCType=Auto\", \"Vol\",\"ADC\",\"0\",\"ALL\",,,\"TRUE\",\"T\")/ RTD(\"cqg.rtd\",,\"StudyData\",AB32, \"MA\", \"InputChoice=ContractVol,MAType=Sim,Period=21\", \"MA\",\"D\",\"-1\",\"all\",,,,\"T\"),\"\")","v":2.4889585181759617E-2},{"$f":"IF(R32=\"\",\"\",IFERROR(RTD(\"cqg.rtd\", ,\"ContractData\",AB32, \"Open\",, \"T\"),\"\"))","v":35.050000000000004},{"$f":"IF(R32=\"\",\"\",IFERROR(RTD(\"cqg.rtd\", ,\"ContractData\",AB32, \"High\",, \"T\"),\"\"))","v":35.480000000000004},{"$f":"IF(R32=\"\",\"\",IFERROR(RTD(\"cqg.rtd\", ,\"ContractData\",AB32, \"Low\",, \"T\"),\"\"))","v":35.04},{"$f":"NASDAQ100!I7","v":"S.US.FOXA"}]
[{"$f":"TRIM('S&P500'!I8)","v":"S.US.NOV"},{"$f":"IFERROR(RTD(\"cqg.rtd\",,\"ContractData\",A33,\"LongDescription\",,\"T\")&\"  (\"&RIGHT(A33,LEN(A33)-5)&\")\",\"\")","v":"NOV Inc.  (NOV)"},null,null,{"$f":"IF(B33=\"\",\"\",IFERROR(RTD(\"cqg.rtd\",,\"ContractData\",A33,\"LastTrade\",,\"T\"),\"\"))","v":13.950000000000001},{"$f":"IF(B33=\"\",\"\",IFERROR(RTD(\"cqg.rtd\", ,\"ContractData\",A33, \"NetChange\",, \"T\"),\"\"))","v":0.42},{"$f":"IFERROR(RTD(\"cqg.rtd\", ,\"ContractData\",A33, \"PerCentNetLastTrade\",, \"T\")/100,\"\")","v":2.9520295202952029E-2},{"$f":"IFERROR(RTD(\"cqg.rtd\",,\"StudyData\",A33, \"Vol\", \"VolType=Auto,CoCType=Auto\", \"Vol\",\"ADC\",\"0\",\"ALL\",,,\"TRUE\",\"T\")/ RTD(\"cqg.rtd\",,\"StudyData\",A33, \"MA\", \"InputChoice=ContractVol,MAType=Sim,Period=21\", \"MA\",\"D\",\"-1\",\"all\",,,,\"T\"),\"\")","v":2.6455854431654737E-2},{"$f":"IF(B33=\"\",\"\",IFERROR(RTD(\"cqg.rtd\", ,\"ContractData\",A33, \"Open\",, \"T\"),\"\"))","v":13.92},{"$f":"IF(B33=\"\",\"\",IFERROR(RTD(\"cqg.rtd\", ,\"ContractData\",A33, \"High\",, \"T\"),\"\"))","v":14.09},{"$f":"IF(B33=\"\",\"\",IFERROR(RTD(\"cqg.rtd\",,\"ContractData\",A33,\"Low\",,\"T\"),\"\"))","v":13.91},null,null,null,null,null,null,{"$f":"IFERROR(RTD(\"cqg.rtd\",,\"ContractData\",AB33,\"LongDescription\",,\"T\")&\"  (\"&RIGHT(AB33,LEN(AB33)-5)&\")\",\"\")","v":"Electronic Arts  (EA)"},null,null,{"$f":"IF(R33=\"\",\"\",IFERROR(RTD(\"cqg.rtd\",,\"ContractData\",AB33,\"LastTrade\",,\"T\"),\"\"))","v":143.08000000000001},{"$f":"IF(R33=\"\",\"\",IFERROR(RTD(\"cqg.rtd\", ,\"ContractData\",AB33, \"NetChange\",, \"T\"),\"\"))","v":2.21},{"$f":"IFERROR(RTD(\"cqg.rtd\", ,\"ContractData\",AB33, \"PerCentNetLastTrade\",, \"T\")/100,\"\")","v":1.4248245551853689E-2},{"$f":"IFERROR(RTD(\"cqg.rtd\",,\"StudyData\",AB33, \"Vol\", \"VolType=Auto,CoCType=Auto\", \"Vol\",\"ADC\",\"0\",\"ALL\",,,\"TRUE\",\"T\")/ RTD(\"cqg.rtd\",,\"StudyData\",AB33, \"MA\", \"InputChoice=ContractVol,MAType=Sim,Period=21\", \"MA\",\"D\",\"-1\",\"all\",,,,\"T\"),\"\")","v":5.4025055543181127E-2},{"$f":"IF(R33=\"\",\"\",IFERROR(RTD(\"cqg.rtd\", ,\"ContractData\",AB33, \"Open\",, \"T\"),\"\"))","v":143.89000000000001},{"$f":"IF(R33=\"\",\"\",IFERROR(RTD(\"cqg.rtd\", ,\"ContractData\",AB33, \"High\",, \"T\"),\"\"))","v":143.89000000000001},{"$f":"IF(R33=\"\",\"\",IFERROR(RTD(\"cqg.rtd\", ,\"ContractData\",AB33, \"Low\",, \"T\"),\"\"))","v":142.71},{"$f":"NASDAQ100!I8","v":"S.US.EA"}]
[{"$f":"TRIM('S&P500'!I9)","v":"S.US.NCLH"},{"$f":"IFERROR(RTD(\"cqg.rtd\",,\"ContractData\",A34,\"LongDescription\",,\"T\")&\"  (\"&RIGHT(A34,LEN(A34)-5)&\")\",\"\")","v":"Norwegian Cruise Line  (NCLH)"},null,null,{"$f":"IF(B34=\"\",\"\",IFERROR(RTD(\"cqg.rtd\",,\"ContractData\",A34,\"LastTrade\",,\"T\"),\"\"))","v":24.37},{"$f":"IF(B34=\"\",\"\",IFERROR(RTD(\"cqg.rtd\", ,\"ContractData\",A34, \"NetChange\",, \"T\"),\"\"))","v":0.71},{"$f":"IFERROR(RTD(\"cqg.rtd\", ,\"ContractData\",A34, \"PerCentNetLastTrade\",, \"T\")/100,\"\")","v":2.9138513513513514E-2},{"$f":"IFERROR(RTD(\"cqg.rtd\",,\"StudyData\",A34, \"Vol\", \"VolType=Auto,CoCType=Auto\", \"Vol\",\"ADC\",\"0\",\"ALL\",,,\"TRUE\",\"T\")/ RTD(\"cqg.rtd\",,\"StudyData\",A34, \"MA\", \"InputChoice=ContractVol,MAType=Sim,Period=21\", \"MA\",\"D\",\"-1\",\"all\",,,,\"T\"),\"\")","v":0.12233088047610469},{"$f":"IF(B34=\"\",\"\",IFERROR(RTD(\"cqg.rtd\", ,\"ContractData\",A34, \"Open\",, \"T\"),\"\"))","v":24.01},{"$f":"IF(B34=\"\",\"\",IFERROR(RTD(\"cqg.rtd\", ,\"ContractData\",A34, \"High\",, \"T\"),\"\"))","v":24.46},{"$f":"IF(B34=\"\",\"\",IFERROR(RTD(\"cqg.rtd\",,\"ContractData\",A34,\"Low\",,\"T\"),\"\"))","v":24},{"$f":"IFERROR(RTD(\"cqg.rtd\", ,\"ContractData\",\"DJUCV\", \"LastTrade\",, \"T\"),\"\")","v":658},null,null,{"$f":"IFERROR(RTD(\"cqg.rtd\", ,\"ContractData\",\"NASUCV\", \"LastTrade\",, \"T\"),\"\")","v":15322},null,null,{"$f":"IFERROR(RTD(\"cqg.rtd\",,\"ContractData\",AB34,\"LongDescription\",,\"T\")&\"  (\"&RIGHT(AB34,LEN(AB34)-5)&\")\",\"\")","v":"Applied Materials Inc  (AMAT)"},null,null,{"$f":"IF(R34=\"\",\"\",IFERROR(RTD(\"cqg.rtd\",,\"ContractData\",AB34,\"LastTrade\",,\"T\"),\"\"))","v":133.84},{"$f":"IF(R34=\"\",\"\",IFERROR(RTD(\"cqg.rtd\", ,\"ContractData\",AB34, \"NetChange\",, \"T\"),\"\"))","v":1.86},{"$f":"IFERROR(RTD(\"cqg.rtd\", ,\"ContractData\",AB34, \"PerCentNetLastTrade\",, \"T\")/100,\"\")","v":1.4094112298249601E-2},{"$f":"IFERROR(RTD(\"cqg.rtd\",,\"StudyData\",AB34, \"Vol\", \"VolType=Auto,CoCType=Auto\", \"Vol\",\"ADC\",\"0\",\"ALL\",,,\"TRUE\",\"T\")/ RTD(\"cqg.rtd\",,\"StudyData\",AB34, \"MA\", \"InputChoice=ContractVol,MAType=Sim,Period=21\", \"MA\",\"D\",\"-1\",\"all\",,,,\"T\"),\"\")","v":4.0878263566823662E-2},{"$f":"IF(R34=\"\",\"\",IFERROR(RTD(\"cqg.rtd\", ,\"ContractData\",AB34, \"Open\",, \"T\"),\"\"))","v":132.82},{"$f":"IF(R34=\"\",\"\",IFERROR(RTD(\"cqg.rtd\", ,\"ContractData\",AB34, \"High\",, \"T\"),\"\"))","v":133.84},{"$f":"IF(R34=\"\",\"\",IFERROR(RTD(\"cqg.rtd\", ,\"ContractData\",AB34, \"Low\",, \"T\"),\"\"))","v":132.53},{"$f":"NASDAQ100!I9","v":"S.US.AMAT"}]
[{"$f":"TRIM('S&P500'!I10)","v":"S.US.MRO"},{"$f":"IFERROR(RTD(\"cqg.rtd\",,\"ContractData\",A35,\"LongDescription\",,\"T\")&\"  (\"&RIGHT(A35,LEN(A35)-5)&\")\",\"\")","v":"Marathon Oil Corporation  (MRO)"},null,null,{"$f":"IF(B35=\"\",\"\",IFERROR(RTD(\"cqg.rtd\",,\"ContractData\",A35,\"LastTrade\",,\"T\"),\"\"))","v":""},{"$f":"IF(B35=\"\",\"\",IFERROR(RTD(\"cqg.rtd\", ,\"ContractData\",A35, \"NetChange\",, \"T\"),\"\"))","v":""},{"$f":"IFERROR(RTD(\"cqg.rtd\", ,\"ContractData\",A35, \"PerCentNetLastTrade\",, \"T\")/100,\"\")","v":2.7336860670194002E-2},{"$f":"IFERROR(RTD(\"cqg.rtd\",,\"StudyData\",A35, \"Vol\", \"VolType=Auto,CoCType=Auto\", \"Vol\",\"ADC\",\"0\",\"ALL\",,,\"TRUE\",\"T\")/ RTD(\"cqg.rtd\",,\"StudyData\",A35, \"MA\", \"InputChoice=ContractVol,MAType=Sim,Period=21\", \"MA\",\"D\",\"-1\",\"all\",,,,\"T\"),\"\")","v":4.5706997840350837E-2},{"$f":"IF(B35=\"\",\"\",IFERROR(RTD(\"cqg.rtd\", ,\"ContractData\",A35, \"Open\",, \"T\"),\"\"))","v":""},{"$f":"IF(B35=\"\",\"\",IFERROR(RTD(\"cqg.rtd\", ,\"ContractData\",A35, \"High\",, \"T\"),\"\"))","v":""},{"$f":"IF(B35=\"\",\"\",IFERROR(RTD(\"cqg.rtd\",,\"ContractData\",A35,\"Low\",,\"T\"),\"\"))","v":""},"NYSE Adv Issues",null,null,"NASDAQ Adv Issues",null,null,{"$f":"IFERROR(RTD(\"cqg.rtd\",,\"ContractData\",AB35,\"LongDescription\",,\"T\")&\"  (\"&RIGHT(AB35,LEN(AB35)-5)&\")\",\"\")","v":"Marriot International, Inc.  (MAR)"},null,null,{"$f":"IF(R35=\"\",\"\",IFERROR(RTD(\"cqg.rtd\",,\"ContractData\",AB35,\"LastTrade\",,\"T\"),\"\"))","v":136.83000000000001},{"$f":"IF(R35=\"\",\"\",IFERROR(RTD(\"cqg.rtd\", ,\"ContractData\",AB35, \"NetChange\",, \"T\"),\"\"))","v":1.9000000000000001},{"$f":"IFERROR(RTD(\"cqg.rtd\", ,\"ContractData\",AB35, \"PerCentNetLastTrade\",, \"T\")/100,\"\")","v":1.3330371028660297E-2},{"$f":"IFERROR(RTD(\"cqg.rtd\",,\"StudyData\",AB35, \"Vol\", \"VolType=Auto,CoCType=Auto\", \"Vol\",\"ADC\",\"0\",\"ALL\",,,\"TRUE\",\"T\")/ RTD(\"cqg.rtd\",,\"StudyData\",AB35, \"MA\", \"InputChoice=ContractVol,MAType=Sim,Period=21\", \"MA\",\"D\",\"-1\",\"all\",,,,\"T\"),\"\")","v":2.266304725028457E-2},{"$f":"IF(R35=\"\",\"\",IFERROR(RTD(\"cqg.rtd\", ,\"ContractData\",AB35, \"Open\",, \"T\"),\"\"))","v":135.43},{"$f":"IF(R35=\"\",\"\",IFERROR(RTD(\"cqg.rtd\", ,\"ContractData\",AB35, \"High\",, \"T\"),\"\"))","v":137.20000000000002},{"$f":"IF(R35=\"\",\"\",IFERROR(RTD(\"cqg.rtd\", ,\"ContractData\",AB35, \"Low\",, \"T\"),\"\"))","v":135.43},{"$f":"NASDAQ100!I10","v":"S.US.MAR"}]
[null,"CQG Bottom Ten Percentage Performers in the S&P 500",null,null,null,null,null,null,null,null,null,null,null,null,null,null,null,"CQG Bottom Ten Percentage Performers in the NASDAQ 100"]
[{"$f":"TRIM('S&P500'!N1)","v":"S.US.STX"},{"$f":"IFERROR(RTD(\"cqg.rtd\",,\"ContractData\",A37,\"LongDescription\",,\"T\")&\"  (\"&RIGHT(A37,LEN(A37)-5)&\")\",\"\")","v":"Seagate Technology Holdings PLC  (STX)"},null,null,{"$f":"IF(B37=\"\",\"\",IFERROR(RTD(\"cqg.rtd\",,\"ContractData\",A37,\"LastTrade\",,\"T\"),\"\"))","v":80.320000000000007},{"$f":"IF(B37=\"\",\"\",IFERROR(RTD(\"cqg.rtd\", ,\"ContractData\",A37, \"NetChange\",, \"T\"),\"\"))","v":-5.17},{"$f":"IFERROR(RTD(\"cqg.rtd\", ,\"ContractData\",A37, \"PerCentNetLastTrade\",, \"T\")/100,\"\")","v":-6.0474909346122353E-2},{"$f":"IFERROR(RTD(\"cqg.rtd\",,\"StudyData\",A37, \"Vol\", \"VolType=Auto,CoCType=Auto\", \"Vol\",\"ADC\",\"0\",\"ALL\",,,\"TRUE\",\"T\")/ RTD(\"cqg.rtd\",,\"StudyData\",A37, \"MA\", \"InputChoice=ContractVol,MAType=Sim,Period=21\", \"MA\",\"D\",\"-1\",\"all\",,,,\"T\"),\"\")","v":0.26801483461204934},{"$f":"IF(B37=\"\",\"\",IFERROR(RTD(\"cqg.rtd\", ,\"ContractData\",A37, \"Open\",, \"T\"),\"\"))","v":81.75},{"$f":"IF(B37=\"\",\"\",IFERROR(RTD(\"cqg.rtd\", ,\"ContractData\",A37, \"High\",, \"T\"),\"\"))","v":81.8},{"$f":"IF(B37=\"\",\"\",IFERROR(RTD(\"cqg.rtd\",,\"ContractData\",A37,\"Low\",,\"T\"),\"\"))","v":79.95},{"$f":"IFERROR(RTD(\"cqg.rtd\", ,\"ContractData\",\"DJIUP\", \"LastTrade\",, \"T\"),\"\")","v":2096},null,null,{"$f":"IFERROR(RTD(\"cqg.rtd\", ,\"ContractData\",\"NASIUP\", \"LastTrade\",, \"T\"),\"\")","v":2406},null,null,{"$f":"IFERROR(RTD(\"cqg.rtd\",,\"ContractData\",AB37,\"LongDescription\",,\"T\")&\"  (\"&RIGHT(AB37,LEN(AB37)-5)&\")\",\"\")","v":"NetEase, Inc.  (NTES)"},null,null,{"$f":"IF(R37=\"\",\"\",IFERROR(RTD(\"cqg.rtd\",,\"ContractData\",AB37,\"LastTrade\",,\"T\"),\"\"))","v":110.65},{"$f":"IF(R37=\"\",\"\",IFERROR(RTD(\"cqg.rtd\", ,\"ContractData\",AB37, \"NetChange\",, \"T\"),\"\"))","v":-2.46},{"$f":"IFERROR(RTD(\"cqg.rtd\", ,\"ContractData\",AB37, \"PerCentNetLastTrade\",, \"T\")/100,\"\")","v":-2.2699169757993288E-2},{"$f":"IFERROR(RTD(\"cqg.rtd\",,\"StudyData\",AB37, \"Vol\", \"VolType=Auto,CoCType=Auto\", \"Vol\",\"ADC\",\"0\",\"ALL\",,,\"TRUE\",\"T\")/ RTD(\"cqg.rtd\",,\"StudyData\",AB37, \"MA\", \"InputChoice=ContractVol,MAType=Sim,Period=21\", \"MA\",\"D\",\"-1\",\"all\",,,,\"T\"),\"\")","v":4.3465059806165246E-2},{"$f":"IF(R37=\"\",\"\",IFERROR(RTD(\"cqg.rtd\", ,\"ContractData\",AB37, \"Open\",, \"T\"),\"\"))","v":112.44},{"$f":"IF(R37=\"\",\"\",IFERROR(RTD(\"cqg.rtd\", ,\"ContractData\",AB37, \"High\",, \"T\"),\"\"))","v":112.92},{"$f":"IF(R37=\"\",\"\",IFERROR(RTD(\"cqg.rtd\", ,\"ContractData\",AB37, \"Low\",, \"T\"),\"\"))","v":110.21000000000001},{"$f":"NASDAQ100!N1","v":"S.US.NTES"}]
[{"$f":"TRIM('S&P500'!N2)","v":"S.US.WDC"},{"$f":"IFERROR(RTD(\"cqg.rtd\",,\"ContractData\",A38,\"LongDescription\",,\"T\")&\"  (\"&RIGHT(A38,LEN(A38)-5)&\")\",\"\")","v":"Western Digital Corporation  (WDC)"},null,null,{"$f":"IF(B38=\"\",\"\",IFERROR(RTD(\"cqg.rtd\",,\"ContractData\",A38,\"LastTrade\",,\"T\"),\"\"))","v":62.28},{"$f":"IF(B38=\"\",\"\",IFERROR(RTD(\"cqg.rtd\", ,\"ContractData\",A38, \"NetChange\",, \"T\"),\"\"))","v":-2.25},{"$f":"IFERROR(RTD(\"cqg.rtd\", ,\"ContractData\",A38, \"PerCentNetLastTrade\",, \"T\")/100,\"\")","v":-3.6509900990099008E-2},{"$f":"IFERROR(RTD(\"cqg.rtd\",,\"StudyData\",A38, \"Vol\", \"VolType=Auto,CoCType=Auto\", \"Vol\",\"ADC\",\"0\",\"ALL\",,,\"TRUE\",\"T\")/ RTD(\"cqg.rtd\",,\"StudyData\",A38, \"MA\", \"InputChoice=ContractVol,MAType=Sim,Period=21\", \"MA\",\"D\",\"-1\",\"all\",,,,\"T\"),\"\")","v":0.15300821146787447},{"$f":"IF(B38=\"\",\"\",IFERROR(RTD(\"cqg.rtd\", ,\"ContractData\",A38, \"Open\",, \"T\"),\"\"))","v":64.45},{"$f":"IF(B38=\"\",\"\",IFERROR(RTD(\"cqg.rtd\", ,\"ContractData\",A38, \"High\",, \"T\"),\"\"))","v":64.56},{"$f":"IF(B38=\"\",\"\",IFERROR(RTD(\"cqg.rtd\",,\"ContractData\",A38,\"Low\",,\"T\"),\"\"))","v":61.870000000000005},"NYSE Dec Issues",null,null,"NASDAQ Dec Issues",null,null,{"$f":"IFERROR(RTD(\"cqg.rtd\",,\"ContractData\",AB38,\"LongDescription\",,\"T\")&\"  (\"&RIGHT(AB38,LEN(AB38)-5)&\")\",\"\")","v":"Netflix Inc  (NFLX)"},null,null,{"$f":"IF(R38=\"\",\"\",IFERROR(RTD(\"cqg.rtd\",,\"ContractData\",AB38,\"LastTrade\",,\"T\"),\"\"))","v":524.39},{"$f":"IF(R38=\"\",\"\",IFERROR(RTD(\"cqg.rtd\", ,\"ContractData\",AB38, \"NetChange\",, \"T\"),\"\"))","v":-6.66},{"$f":"IFERROR(RTD(\"cqg.rtd\", ,\"ContractData\",AB38, \"PerCentNetLastTrade\",, \"T\")/100,\"\")","v":-1.2541191978156483E-2},{"$f":"IFERROR(RTD(\"cqg.rtd\",,\"StudyData\",AB38, \"Vol\", \"VolType=Auto,CoCType=Auto\", \"Vol\",\"ADC\",\"0\",\"ALL\",,,\"TRUE\",\"T\")/ RTD(\"cqg.rtd\",,\"StudyData\",AB38, \"MA\", \"InputChoice=ContractVol,MAType=Sim,Period=21\", \"MA\",\"D\",\"-1\",\"all\",,,,\"T\"),\"\")","v":0.23008796088353692},{"$f":"IF(R38=\"\",\"\",IFERROR(RTD(\"cqg.rtd\", ,\"ContractData\",AB38, \"Open\",, \"T\"),\"\"))","v":526.13},{"$f":"IF(R38=\"\",\"\",IFERROR(RTD(\"cqg.rtd\", ,\"ContractData\",AB38, \"High\",, \"T\"),\"\"))","v":530.99},{"$f":"IF(R38=\"\",\"\",IFERROR(RTD(\"cqg.rtd\", ,\"ContractData\",AB38, \"Low\",, \"T\"),\"\"))","v":523.32000000000005},{"$f":"NASDAQ100!N2","v":"S.US.NFLX"}]
[{"$f":"TRIM('S&P500'!N3)","v":"S.US.ALLE"},{"$f":"IFERROR(RTD(\"cqg.rtd\",,\"ContractData\",A39,\"LongDescription\",,\"T\")&\"  (\"&RIGHT(A39,LEN(A39)-5)&\")\",\"\")","v":"Allegion plc  (ALLE)"},null,null,{"$f":"IF(B39=\"\",\"\",IFERROR(RTD(\"cqg.rtd\",,\"ContractData\",A39,\"LastTrade\",,\"T\"),\"\"))","v":138.68},{"$f":"IF(B39=\"\",\"\",IFERROR(RTD(\"cqg.rtd\", ,\"ContractData\",A39, \"NetChange\",, \"T\"),\"\"))","v":-2.67},{"$f":"IFERROR(RTD(\"cqg.rtd\", ,\"ContractData\",A39, \"PerCentNetLastTrade\",, \"T\")/100,\"\")","v":-1.8889281924301379E-2},{"$f":"IFERROR(RTD(\"cqg.rtd\",,\"StudyData\",A39, \"Vol\", \"VolType=Auto,CoCType=Auto\", \"Vol\",\"ADC\",\"0\",\"ALL\",,,\"TRUE\",\"T\")/ RTD(\"cqg.rtd\",,\"StudyData\",A39, \"MA\", \"InputChoice=ContractVol,MAType=Sim,Period=21\", \"MA\",\"D\",\"-1\",\"all\",,,,\"T\"),\"\")","v":4.6032010579477034E-2},{"$f":"IF(B39=\"\",\"\",IFERROR(RTD(\"cqg.rtd\", ,\"ContractData\",A39, \"Open\",, \"T\"),\"\"))","v":140.5},{"$f":"IF(B39=\"\",\"\",IFERROR(RTD(\"cqg.rtd\", ,\"ContractData\",A39, \"High\",, \"T\"),\"\"))","v":140.5},{"$f":"IF(B39=\"\",\"\",IFERROR(RTD(\"cqg.rtd\",,\"ContractData\",A39,\"Low\",,\"T\"),\"\"))","v":138.66},null,null,null,null,null,null,{"$f":"IFERROR(RTD(\"cqg.rtd\",,\"ContractData\",AB39,\"LongDescription\",,\"T\")&\"  (\"&RIGHT(AB39,LEN(AB39)-5)&\")\",\"\")","v":"Illumina Inc  (ILMN)"},null,null,{"$f":"IF(R39=\"\",\"\",IFERROR(RTD(\"cqg.rtd\",,\"ContractData\",AB39,\"LastTrade\",,\"T\"),\"\"))","v":482.34000000000003},{"$f":"IF(R39=\"\",\"\",IFERROR(RTD(\"cqg.rtd\", ,\"ContractData\",AB39, \"NetChange\",, \"T\"),\"\"))","v":-3.27},{"$f":"IFERROR(RTD(\"cqg.rtd\", ,\"ContractData\",AB39, \"PerCentNetLastTrade\",, \"T\")/100,\"\")","v":-1.0076962544894819E-2},{"$f":"IFERROR(RTD(\"cqg.rtd\",,\"StudyData\",AB39, \"Vol\", \"VolType=Auto,CoCType=Auto\", \"Vol\",\"ADC\",\"0\",\"ALL\",,,\"TRUE\",\"T\")/ RTD(\"cqg.rtd\",,\"StudyData\",AB39, \"MA\", \"InputChoice=ContractVol,MAType=Sim,Period=21\", \"MA\",\"D\",\"-1\",\"all\",,,,\"T\"),\"\")","v":2.3077298978759542E-2},{"$f":"IF(R39=\"\",\"\",IFERROR(RTD(\"cqg.rtd\", ,\"ContractData\",AB39, \"Open\",, \"T\"),\"\"))","v":483.95},{"$f":"IF(R39=\"\",\"\",IFERROR(RTD(\"cqg.rtd\", ,\"ContractData\",AB39, \"High\",, \"T\"),\"\"))","v":485.91},{"$f":"IF(R39=\"\",\"\",IFERROR(RTD(\"cqg.rtd\", ,\"ContractData\",AB39, \"Low\",, \"T\"),\"\"))","v":482.34000000000003},{"$f":"NASDAQ100!N3","v":"S.US.ILMN"}]
[{"$f":"TRIM('S&P500'!N4)","v":"S.US.MTB"},{"$f":"IFERROR(RTD(\"cqg.rtd\",,\"ContractData\",A40,\"LongDescription\",,\"T\")&\"  (\"&RIGHT(A40,LEN(A40)-5)&\")\",\"\")","v":"M&T Bank Corp  (MTB)"},null,null,{"$f":"IF(B40=\"\",\"\",IFERROR(RTD(\"cqg.rtd\",,\"ContractData\",A40,\"LastTrade\",,\"T\"),\"\"))","v":132.49},{"$f":"IF(B40=\"\",\"\",IFERROR(RTD(\"cqg.rtd\", ,\"ContractData\",A40, \"NetChange\",, \"T\"),\"\"))","v":-2.17},{"$f":"IFERROR(RTD(\"cqg.rtd\", ,\"ContractData\",A40, \"PerCentNetLastTrade\",, \"T\")/100,\"\")","v":-1.8883293838862558E-2},{"$f":"IFERROR(RTD(\"cqg.rtd\",,\"StudyData\",A40, \"Vol\", \"VolType=Auto,CoCType=Auto\", \"Vol\",\"ADC\",\"0\",\"ALL\",,,\"TRUE\",\"T\")/ RTD(\"cqg.rtd\",,\"StudyData\",A40, \"MA\", \"InputChoice=ContractVol,MAType=Sim,Period=21\", \"MA\",\"D\",\"-1\",\"all\",,,,\"T\"),\"\")","v":0.11704386800822814},{"$f":"IF(B40=\"\",\"\",IFERROR(RTD(\"cqg.rtd\", ,\"ContractData\",A40, \"Open\",, \"T\"),\"\"))","v":131.05000000000001},{"$f":"IF(B40=\"\",\"\",IFERROR(RTD(\"cqg.rtd\", ,\"ContractData\",A40, \"High\",, \"T\"),\"\"))","v":134.16},{"$f":"IF(B40=\"\",\"\",IFERROR(RTD(\"cqg.rtd\",,\"ContractData\",A40,\"Low\",,\"T\"),\"\"))","v":130},{"$f":"IFERROR(RTD(\"cqg.rtd\", ,\"ContractData\",\"DJIDN\", \"LastTrade\",, \"T\"),\"\")","v":535},null,null,{"$f":"IFERROR(RTD(\"cqg.rtd\", ,\"ContractData\",\"NASIDN\", \"LastTrade\",, \"T\"),\"\")","v":901},null,null,{"$f":"IFERROR(RTD(\"cqg.rtd\",,\"ContractData\",AB40,\"LongDescription\",,\"T\")&\"  (\"&RIGHT(AB40,LEN(AB40)-5)&\")\",\"\")","v":"Zoom Video Communications, Inc. Class A  (ZM)"},null,null,{"$f":"IF(R40=\"\",\"\",IFERROR(RTD(\"cqg.rtd\",,\"ContractData\",AB40,\"LastTrade\",,\"T\"),\"\"))","v":353.16},{"$f":"IF(R40=\"\",\"\",IFERROR(RTD(\"cqg.rtd\", ,\"ContractData\",AB40, \"NetChange\",, \"T\"),\"\"))","v":-2.0300000000000002},{"$f":"IFERROR(RTD(\"cqg.rtd\", ,\"ContractData\",AB40, \"PerCentNetLastTrade\",, \"T\")/100,\"\")","v":-7.4477951715803377E-3},{"$f":"IFERROR(RTD(\"cqg.rtd\",,\"StudyData\",AB40, \"Vol\", \"VolType=Auto,CoCType=Auto\", \"Vol\",\"ADC\",\"0\",\"ALL\",,,\"TRUE\",\"T\")/ RTD(\"cqg.rtd\",,\"StudyData\",AB40, \"MA\", \"InputChoice=ContractVol,MAType=Sim,Period=21\", \"MA\",\"D\",\"-1\",\"all\",,,,\"T\"),\"\")","v":3.7624747221192641E-2},{"$f":"IF(R40=\"\",\"\",IFERROR(RTD(\"cqg.rtd\", ,\"ContractData\",AB40, \"Open\",, \"T\"),\"\"))","v":355.34000000000003},{"$f":"IF(R40=\"\",\"\",IFERROR(RTD(\"cqg.rtd\", ,\"ContractData\",AB40, \"High\",, \"T\"),\"\"))","v":355.8},{"$f":"IF(R40=\"\",\"\",IFERROR(RTD(\"cqg.rtd\", ,\"ContractData\",AB40, \"Low\",, \"T\"),\"\"))","v":352},{"$f":"NASDAQ100!N4","v":"S.US.ZM"}]
[{"$f":"TRIM('S&P500'!N5)","v":"S.US.DHR"},{"$f":"IFERROR(RTD(\"cqg.rtd\",,\"ContractData\",A41,\"LongDescription\",,\"T\")&\"  (\"&RIGHT(A41,LEN(A41)-5)&\")\",\"\")","v":"Danaher Corporation  (DHR)"},null,null,{"$f":"IF(B41=\"\",\"\",IFERROR(RTD(\"cqg.rtd\",,\"ContractData\",A41,\"LastTrade\",,\"T\"),\"\"))","v":279.01},{"$f":"IF(B41=\"\",\"\",IFERROR(RTD(\"cqg.rtd\", ,\"ContractData\",A41, \"NetChange\",, \"T\"),\"\"))","v":-3.7800000000000002},{"$f":"IFERROR(RTD(\"cqg.rtd\", ,\"ContractData\",A41, \"PerCentNetLastTrade\",, \"T\")/100,\"\")","v":-1.6184767277856137E-2},{"$f":"IFERROR(RTD(\"cqg.rtd\",,\"StudyData\",A41, \"Vol\", \"VolType=Auto,CoCType=Auto\", \"Vol\",\"ADC\",\"0\",\"ALL\",,,\"TRUE\",\"T\")/ RTD(\"cqg.rtd\",,\"StudyData\",A41, \"MA\", \"InputChoice=ContractVol,MAType=Sim,Period=21\", \"MA\",\"D\",\"-1\",\"all\",,,,\"T\"),\"\")","v":4.0624429313493061E-2},{"$f":"IF(B41=\"\",\"\",IFERROR(RTD(\"cqg.rtd\", ,\"ContractData\",A41, \"Open\",, \"T\"),\"\"))","v":283.03000000000003},{"$f":"IF(B41=\"\",\"\",IFERROR(RTD(\"cqg.rtd\", ,\"ContractData\",A41, \"High\",, \"T\"),\"\"))","v":283.53000000000003},{"$f":"IF(B41=\"\",\"\",IFERROR(RTD(\"cqg.rtd\",,\"ContractData\",A41,\"Low\",,\"T\"),\"\"))","v":278.5},"NYSE Unc Issues",null,null,"NASDAQ Unc Issues",null,null,{"$f":"IFERROR(RTD(\"cqg.rtd\",,\"ContractData\",AB41,\"LongDescription\",,\"T\")&\"  (\"&RIGHT(AB41,LEN(AB41)-5)&\")\",\"\")","v":"Regeneron Pharm Inc  (REGN)"},null,null,{"$f":"IF(R41=\"\",\"\",IFERROR(RTD(\"cqg.rtd\",,\"ContractData\",AB41,\"LastTrade\",,\"T\"),\"\"))","v":582.98},{"$f":"IF(R41=\"\",\"\",IFERROR(RTD(\"cqg.rtd\", ,\"ContractData\",AB41, \"NetChange\",, \"T\"),\"\"))","v":-1.43},{"$f":"IFERROR(RTD(\"cqg.rtd\", ,\"ContractData\",AB41, \"PerCentNetLastTrade\",, \"T\")/100,\"\")","v":-7.2542742320005453E-3},{"$f":"IFERROR(RTD(\"cqg.rtd\",,\"StudyData\",AB41, \"Vol\", \"VolType=Auto,CoCType=Auto\", \"Vol\",\"ADC\",\"0\",\"ALL\",,,\"TRUE\",\"T\")/ RTD(\"cqg.rtd\",,\"StudyData\",AB41, \"MA\", \"InputChoice=ContractVol,MAType=Sim,Period=21\", \"MA\",\"D\",\"-1\",\"all\",,,,\"T\"),\"\")","v":1.2714191177505879E-2},{"$f":"IF(R41=\"\",\"\",IFERROR(RTD(\"cqg.rtd\", ,\"ContractData\",AB41, \"Open\",, \"T\"),\"\"))","v":586.76},{"$f":"IF(R41=\"\",\"\",IFERROR(RTD(\"cqg.rtd\", ,\"ContractData\",AB41, \"High\",, \"T\"),\"\"))","v":586.76},{"$f":"IF(R41=\"\",\"\",IFERROR(RTD(\"cqg.rtd\", ,\"ContractData\",AB41, \"Low\",, \"T\"),\"\"))","v":582.98},{"$f":"NASDAQ100!N5","v":"S.US.REGN"}]
[{"$f":"TRIM('S&P500'!N6)","v":"S.US.NFLX"},{"$f":"IFERROR(RTD(\"cqg.rtd\",,\"ContractData\",A42,\"LongDescription\",,\"T\")&\"  (\"&RIGHT(A42,LEN(A42)-5)&\")\",\"\")","v":"Netflix Inc  (NFLX)"},null,null,{"$f":"IF(B42=\"\",\"\",IFERROR(RTD(\"cqg.rtd\",,\"ContractData\",A42,\"LastTrade\",,\"T\"),\"\"))","v":524.39},{"$f":"IF(B42=\"\",\"\",IFERROR(RTD(\"cqg.rtd\", ,\"ContractData\",A42, \"NetChange\",, \"T\"),\"\"))","v":-6.66},{"$f":"IFERROR(RTD(\"cqg.rtd\", ,\"ContractData\",A42, \"PerCentNetLastTrade\",, \"T\")/100,\"\")","v":-1.2541191978156483E-2},{"$f":"IFERROR(RTD(\"cqg.rtd\",,\"StudyData\",A42, \"Vol\", \"VolType=Auto,CoCType=Auto\", \"Vol\",\"ADC\",\"0\",\"ALL\",,,\"TRUE\",\"T\")/ RTD(\"cqg.rtd\",,\"StudyData\",A42, \"MA\", \"InputChoice=ContractVol,MAType=Sim,Period=21\", \"MA\",\"D\",\"-1\",\"all\",,,,\"T\"),\"\")","v":0.23008796088353692},{"$f":"IF(B42=\"\",\"\",IFERROR(RTD(\"cqg.rtd\", ,\"ContractData\",A42, \"Open\",, \"T\"),\"\"))","v":526.13},{"$f":"IF(B42=\"\",\"\",IFERROR(RTD(\"cqg.rtd\", ,\"ContractData\",A42, \"High\",, \"T\"),\"\"))","v":530.99},{"$f":"IF(B42=\"\",\"\",IFERROR(RTD(\"cqg.rtd\",,\"ContractData\",A42,\"Low\",,\"T\"),\"\"))","v":523.32000000000005},null,null,null,null,null,null,{"$f":"IFERROR(RTD(\"cqg.rtd\",,\"ContractData\",AB42,\"LongDescription\",,\"T\")&\"  (\"&RIGHT(AB42,LEN(AB42)-5)&\")\",\"\")","v":"DocuSign, Inc.  (DOCU)"},null,null,{"$f":"IF(R42=\"\",\"\",IFERROR(RTD(\"cqg.rtd\",,\"ContractData\",AB42,\"LastTrade\",,\"T\"),\"\"))","v":298.47000000000003},{"$f":"IF(R42=\"\",\"\",IFERROR(RTD(\"cqg.rtd\", ,\"ContractData\",AB42, \"NetChange\",, \"T\"),\"\"))","v":-0.99},{"$f":"IFERROR(RTD(\"cqg.rtd\", ,\"ContractData\",AB42, \"PerCentNetLastTrade\",, \"T\")/100,\"\")","v":-9.293988780827829E-3},{"$f":"IFERROR(RTD(\"cqg.rtd\",,\"StudyData\",AB42, \"Vol\", \"VolType=Auto,CoCType=Auto\", \"Vol\",\"ADC\",\"0\",\"ALL\",,,\"TRUE\",\"T\")/ RTD(\"cqg.rtd\",,\"StudyData\",AB42, \"MA\", \"InputChoice=ContractVol,MAType=Sim,Period=21\", \"MA\",\"D\",\"-1\",\"all\",,,,\"T\"),\"\")","v":5.3672637981172805E-2},{"$f":"IF(R42=\"\",\"\",IFERROR(RTD(\"cqg.rtd\", ,\"ContractData\",AB42, \"Open\",, \"T\"),\"\"))","v":300.98},{"$f":"IF(R42=\"\",\"\",IFERROR(RTD(\"cqg.rtd\", ,\"ContractData\",AB42, \"High\",, \"T\"),\"\"))","v":300.98},{"$f":"IF(R42=\"\",\"\",IFERROR(RTD(\"cqg.rtd\", ,\"ContractData\",AB42, \"Low\",, \"T\"),\"\"))","v":297.06},{"$f":"NASDAQ100!N6","v":"S.US.DOCU"}]
[{"$f":"TRIM('S&P500'!N7)","v":"S.US.NVR"},{"$f":"IFERROR(RTD(\"cqg.rtd\",,\"ContractData\",A43,\"LongDescription\",,\"T\")&\"  (\"&RIGHT(A43,LEN(A43)-5)&\")\",\"\")","v":"NVR Inc  (NVR)"},null,null,{"$f":"IF(B43=\"\",\"\",IFERROR(RTD(\"cqg.rtd\",,\"ContractData\",A43,\"LastTrade\",,\"T\"),\"\"))","v":4839.99},{"$f":"IF(B43=\"\",\"\",IFERROR(RTD(\"cqg.rtd\", ,\"ContractData\",A43, \"NetChange\",, \"T\"),\"\"))","v":-95.27},{"$f":"IFERROR(RTD(\"cqg.rtd\", ,\"ContractData\",A43, \"PerCentNetLastTrade\",, \"T\")/100,\"\")","v":-1.2301362986121174E-2},{"$f":"IFERROR(RTD(\"cqg.rtd\",,\"StudyData\",A43, \"Vol\", \"VolType=Auto,CoCType=Auto\", \"Vol\",\"ADC\",\"0\",\"ALL\",,,\"TRUE\",\"T\")/ RTD(\"cqg.rtd\",,\"StudyData\",A43, \"MA\", \"InputChoice=ContractVol,MAType=Sim,Period=21\", \"MA\",\"D\",\"-1\",\"all\",,,,\"T\"),\"\")","v":4.8378832125910765E-2},{"$f":"IF(B43=\"\",\"\",IFERROR(RTD(\"cqg.rtd\", ,\"ContractData\",A43, \"Open\",, \"T\"),\"\"))","v":4901.49},{"$f":"IF(B43=\"\",\"\",IFERROR(RTD(\"cqg.rtd\", ,\"ContractData\",A43, \"High\",, \"T\"),\"\"))","v":4901.49},{"$f":"IF(B43=\"\",\"\",IFERROR(RTD(\"cqg.rtd\",,\"ContractData\",A43,\"Low\",,\"T\"),\"\"))","v":4800},{"$f":"IFERROR(RTD(\"cqg.rtd\", ,\"ContractData\",\"DJIUC\", \"LastTrade\",, \"T\"),\"\")","v":145},null,null,{"$f":"IFERROR(RTD(\"cqg.rtd\", ,\"ContractData\",\"NASIUC\", \"LastTrade\",, \"T\"),\"\")","v":184},null,null,{"$f":"IFERROR(RTD(\"cqg.rtd\",,\"ContractData\",AB43,\"LongDescription\",,\"T\")&\"  (\"&RIGHT(AB43,LEN(AB43)-5)&\")\",\"\")","v":"Workday, Inc.  (WDAY)"},null,null,{"$f":"IF(R43=\"\",\"\",IFERROR(RTD(\"cqg.rtd\",,\"ContractData\",AB43,\"LastTrade\",,\"T\"),\"\"))","v":229.23000000000002},{"$f":"IF(R43=\"\",\"\",IFERROR(RTD(\"cqg.rtd\", ,\"ContractData\",AB43, \"NetChange\",, \"T\"),\"\"))","v":-1.1300000000000001},{"$f":"IFERROR(RTD(\"cqg.rtd\", ,\"ContractData\",AB43, \"PerCentNetLastTrade\",, \"T\")/100,\"\")","v":-6.9315080362171303E-3},{"$f":"IFERROR(RTD(\"cqg.rtd\",,\"StudyData\",AB43, \"Vol\", \"VolType=Auto,CoCType=Auto\", \"Vol\",\"ADC\",\"0\",\"ALL\",,,\"TRUE\",\"T\")/ RTD(\"cqg.rtd\",,\"StudyData\",AB43, \"MA\", \"InputChoice=ContractVol,MAType=Sim,Period=21\", \"MA\",\"D\",\"-1\",\"all\",,,,\"T\"),\"\")","v":3.0413278038265063E-2},{"$f":"IF(R43=\"\",\"\",IFERROR(RTD(\"cqg.rtd\", ,\"ContractData\",AB43, \"Open\",, \"T\"),\"\"))","v":228.61},{"$f":"IF(R43=\"\",\"\",IFERROR(RTD(\"cqg.rtd\", ,\"ContractData\",AB43, \"High\",, \"T\"),\"\"))","v":230.11},{"$f":"IF(R43=\"\",\"\",IFERROR(RTD(\"cqg.rtd\", ,\"ContractData\",AB43, \"Low\",, \"T\"),\"\"))","v":228.12},{"$f":"NASDAQ100!N7","v":"S.US.WDAY"}]
[{"$f":"TRIM('S&P500'!N8)","v":"S.US.EXR"},{"$f":"IFERROR(RTD(\"cqg.rtd\",,\"ContractData\",A44,\"LongDescription\",,\"T\")&\"  (\"&RIGHT(A44,LEN(A44)-5)&\")\",\"\")","v":"Extra Space Storage Inc  (EXR)"},null,null,{"$f":"IF(B44=\"\",\"\",IFERROR(RTD(\"cqg.rtd\",,\"ContractData\",A44,\"LastTrade\",,\"T\"),\"\"))","v":168.65},{"$f":"IF(B44=\"\",\"\",IFERROR(RTD(\"cqg.rtd\", ,\"ContractData\",A44, \"NetChange\",, \"T\"),\"\"))","v":-1.68},{"$f":"IFERROR(RTD(\"cqg.rtd\", ,\"ContractData\",A44, \"PerCentNetLastTrade\",, \"T\")/100,\"\")","v":-1.1719894520949313E-2},{"$f":"IFERROR(RTD(\"cqg.rtd\",,\"StudyData\",A44, \"Vol\", \"VolType=Auto,CoCType=Auto\", \"Vol\",\"ADC\",\"0\",\"ALL\",,,\"TRUE\",\"T\")/ RTD(\"cqg.rtd\",,\"StudyData\",A44, \"MA\", \"InputChoice=ContractVol,MAType=Sim,Period=21\", \"MA\",\"D\",\"-1\",\"all\",,,,\"T\"),\"\")","v":1.8201378972509497E-2},{"$f":"IF(B44=\"\",\"\",IFERROR(RTD(\"cqg.rtd\", ,\"ContractData\",A44, \"Open\",, \"T\"),\"\"))","v":170.20000000000002},{"$f":"IF(B44=\"\",\"\",IFERROR(RTD(\"cqg.rtd\", ,\"ContractData\",A44, \"High\",, \"T\"),\"\"))","v":170.62},{"$f":"IF(B44=\"\",\"\",IFERROR(RTD(\"cqg.rtd\",,\"ContractData\",A44,\"Low\",,\"T\"),\"\"))","v":168.65},"NYSE Tick",null,null,"NASDAQ Tick",null,null,{"$f":"IFERROR(RTD(\"cqg.rtd\",,\"ContractData\",AB44,\"LongDescription\",,\"T\")&\"  (\"&RIGHT(AB44,LEN(AB44)-5)&\")\",\"\")","v":"Synopsis  (SNPS)"},null,null,{"$f":"IF(R44=\"\",\"\",IFERROR(RTD(\"cqg.rtd\",,\"ContractData\",AB44,\"LastTrade\",,\"T\"),\"\"))","v":276.01},{"$f":"IF(R44=\"\",\"\",IFERROR(RTD(\"cqg.rtd\", ,\"ContractData\",AB44, \"NetChange\",, \"T\"),\"\"))","v":-1.37},{"$f":"IFERROR(RTD(\"cqg.rtd\", ,\"ContractData\",AB44, \"PerCentNetLastTrade\",, \"T\")/100,\"\")","v":-6.7652668321997907E-3},{"$f":"IFERROR(RTD(\"cqg.rtd\",,\"StudyData\",AB44, \"Vol\", \"VolType=Auto,CoCType=Auto\", \"Vol\",\"ADC\",\"0\",\"ALL\",,,\"TRUE\",\"T\")/ RTD(\"cqg.rtd\",,\"StudyData\",AB44, \"MA\", \"InputChoice=ContractVol,MAType=Sim,Period=21\", \"MA\",\"D\",\"-1\",\"all\",,,,\"T\"),\"\")","v":2.9772940405006901E-2},{"$f":"IF(R44=\"\",\"\",IFERROR(RTD(\"cqg.rtd\", ,\"ContractData\",AB44, \"Open\",, \"T\"),\"\"))","v":277.73},{"$f":"IF(R44=\"\",\"\",IFERROR(RTD(\"cqg.rtd\", ,\"ContractData\",AB44, \"High\",, \"T\"),\"\"))","v":277.73},{"$f":"IF(R44=\"\",\"\",IFERROR(RTD(\"cqg.rtd\", ,\"ContractData\",AB44, \"Low\",, \"T\"),\"\"))","v":274.88},{"$f":"NASDAQ100!N8","v":"S.US.SNPS"}]
[{"$f":"TRIM('S&P500'!N9)","v":"S.US.TMO"},{"$f":"IFERROR(RTD(\"cqg.rtd\",,\"ContractData\",A45,\"LongDescription\",,\"T\")&\"  (\"&RIGHT(A45,LEN(A45)-5)&\")\",\"\")","v":"Thermo Electron Corp  (TMO)"},null,null,{"$f":"IF(B45=\"\",\"\",IFERROR(RTD(\"cqg.rtd\",,\"ContractData\",A45,\"LastTrade\",,\"T\"),\"\"))","v":517.11},{"$f":"IF(B45=\"\",\"\",IFERROR(RTD(\"cqg.rtd\", ,\"ContractData\",A45, \"NetChange\",, \"T\"),\"\"))","v":-5.57},{"$f":"IFERROR(RTD(\"cqg.rtd\", ,\"ContractData\",A45, \"PerCentNetLastTrade\",, \"T\")/100,\"\")","v":-1.0467296873206015E-2},{"$f":"IFERROR(RTD(\"cqg.rtd\",,\"StudyData\",A45, \"Vol\", \"VolType=Auto,CoCType=Auto\", \"Vol\",\"ADC\",\"0\",\"ALL\",,,\"TRUE\",\"T\")/ RTD(\"cqg.rtd\",,\"StudyData\",A45, \"MA\", \"InputChoice=ContractVol,MAType=Sim,Period=21\", \"MA\",\"D\",\"-1\",\"all\",,,,\"T\"),\"\")","v":2.3627743772282772E-2},{"$f":"IF(B45=\"\",\"\",IFERROR(RTD(\"cqg.rtd\", ,\"ContractData\",A45, \"Open\",, \"T\"),\"\"))","v":522.97},{"$f":"IF(B45=\"\",\"\",IFERROR(RTD(\"cqg.rtd\", ,\"ContractData\",A45, \"High\",, \"T\"),\"\"))","v":522.97},{"$f":"IF(B45=\"\",\"\",IFERROR(RTD(\"cqg.rtd\",,\"ContractData\",A45,\"Low\",,\"T\"),\"\"))","v":517.11},null,null,null,null,null,null,{"$f":"IFERROR(RTD(\"cqg.rtd\",,\"ContractData\",AB45,\"LongDescription\",,\"T\")&\"  (\"&RIGHT(AB45,LEN(AB45)-5)&\")\",\"\")","v":"Seagen Inc.  (SGEN)"},null,null,{"$f":"IF(R45=\"\",\"\",IFERROR(RTD(\"cqg.rtd\",,\"ContractData\",AB45,\"LastTrade\",,\"T\"),\"\"))","v":144.43},{"$f":"IF(R45=\"\",\"\",IFERROR(RTD(\"cqg.rtd\", ,\"ContractData\",AB45, \"NetChange\",, \"T\"),\"\"))","v":-0.87},{"$f":"IFERROR(RTD(\"cqg.rtd\", ,\"ContractData\",AB45, \"PerCentNetLastTrade\",, \"T\")/100,\"\")","v":-5.9876118375774253E-3},{"$f":"IFERROR(RTD(\"cqg.rtd\",,\"StudyData\",AB45, \"Vol\", \"VolType=Auto,CoCType=Auto\", \"Vol\",\"ADC\",\"0\",\"ALL\",,,\"TRUE\",\"T\")/ RTD(\"cqg.rtd\",,\"StudyData\",AB45, \"MA\", \"InputChoice=ContractVol,MAType=Sim,Period=21\", \"MA\",\"D\",\"-1\",\"all\",,,,\"T\"),\"\")","v":2.8744620652958339E-2},{"$f":"IF(R45=\"\",\"\",IFERROR(RTD(\"cqg.rtd\", ,\"ContractData\",AB45, \"Open\",, \"T\"),\"\"))","v":144.20000000000002},{"$f":"IF(R45=\"\",\"\",IFERROR(RTD(\"cqg.rtd\", ,\"ContractData\",AB45, \"High\",, \"T\"),\"\"))","v":145.49},{"$f":"IF(R45=\"\",\"\",IFERROR(RTD(\"cqg.rtd\", ,\"ContractData\",AB45, \"Low\",, \"T\"),\"\"))","v":144.11000000000001},{"$f":"NASDAQ100!N9","v":"S.US.SGEN"}]
[{"$f":"TRIM('S&P500'!N10)","v":"S.US.ILMN"},{"$f":"IFERROR(RTD(\"cqg.rtd\",,\"ContractData\",A46,\"LongDescription\",,\"T\")&\"  (\"&RIGHT(A46,LEN(A46)-5)&\")\",\"\")","v":"Illumina Inc  (ILMN)"},null,null,{"$f":"IF(B46=\"\",\"\",IFERROR(RTD(\"cqg.rtd\",,\"ContractData\",A46,\"LastTrade\",,\"T\"),\"\"))","v":482.34000000000003},{"$f":"IF(B46=\"\",\"\",IFERROR(RTD(\"cqg.rtd\", ,\"ContractData\",A46, \"NetChange\",, \"T\"),\"\"))","v":-3.27},{"$f":"IFERROR(RTD(\"cqg.rtd\", ,\"ContractData\",A46, \"PerCentNetLastTrade\",, \"T\")/100,\"\")","v":-1.0076962544894819E-2},{"$f":"IFERROR(RTD(\"cqg.rtd\",,\"StudyData\",A46, \"Vol\", \"VolType=Auto,CoCType=Auto\", \"Vol\",\"ADC\",\"0\",\"ALL\",,,\"TRUE\",\"T\")/ RTD(\"cqg.rtd\",,\"StudyData\",A46, \"MA\", \"InputChoice=ContractVol,MAType=Sim,Period=21\", \"MA\",\"D\",\"-1\",\"all\",,,,\"T\"),\"\")","v":2.3077298978759542E-2},{"$f":"IF(B46=\"\",\"\",IFERROR(RTD(\"cqg.rtd\", ,\"ContractData\",A46, \"Open\",, \"T\"),\"\"))","v":483.95},{"$f":"IF(B46=\"\",\"\",IFERROR(RTD(\"cqg.rtd\", ,\"ContractData\",A46, \"High\",, \"T\"),\"\"))","v":485.91},{"$f":"IF(B46=\"\",\"\",IFERROR(RTD(\"cqg.rtd\",,\"ContractData\",A46,\"Low\",,\"T\"),\"\"))","v":482.34000000000003},{"$f":"IFERROR(RTD(\"cqg.rtd\", ,\"ContractData\",\"DJTIC\", \"LastTrade\",, \"T\"),\"\")","v":553},null,null,{"$f":"IFERROR(RTD(\"cqg.rtd\", ,\"ContractData\",\"NASTIC\", \"LastTrade\",, \"T\"),\"\")","v":608},null,null,{"$f":"IFERROR(RTD(\"cqg.rtd\",,\"ContractData\",AB46,\"LongDescription\",,\"T\")&\"  (\"&RIGHT(AB46,LEN(AB46)-5)&\")\",\"\")","v":"ANSYS Inc  (ANSS)"},null,null,{"$f":"IF(R46=\"\",\"\",IFERROR(RTD(\"cqg.rtd\",,\"ContractData\",AB46,\"LastTrade\",,\"T\"),\"\"))","v":349.01},{"$f":"IF(R46=\"\",\"\",IFERROR(RTD(\"cqg.rtd\", ,\"ContractData\",AB46, \"NetChange\",, \"T\"),\"\"))","v":-1.49},{"$f":"IFERROR(RTD(\"cqg.rtd\", ,\"ContractData\",AB46, \"PerCentNetLastTrade\",, \"T\")/100,\"\")","v":-5.3011086727277916E-3},{"$f":"IFERROR(RTD(\"cqg.rtd\",,\"StudyData\",AB46, \"Vol\", \"VolType=Auto,CoCType=Auto\", \"Vol\",\"ADC\",\"0\",\"ALL\",,,\"TRUE\",\"T\")/ RTD(\"cqg.rtd\",,\"StudyData\",AB46, \"MA\", \"InputChoice=ContractVol,MAType=Sim,Period=21\", \"MA\",\"D\",\"-1\",\"all\",,,,\"T\"),\"\")","v":1.445148858934546E-2},{"$f":"IF(R46=\"\",\"\",IFERROR(RTD(\"cqg.rtd\", ,\"ContractData\",AB46, \"Open\",, \"T\"),\"\"))","v":350.53000000000003},{"$f":"IF(R46=\"\",\"\",IFERROR(RTD(\"cqg.rtd\", ,\"ContractData\",AB46, \"High\",, \"T\"),\"\"))","v":350.53000000000003},{"$f":"IF(R46=\"\",\"\",IFERROR(RTD(\"cqg.rtd\", ,\"ContractData\",AB46, \"Low\",, \"T\"),\"\"))","v":348.39},{"$f":"NASDAQ100!N10","v":"S.US.ANSS"}]
[null,null,"  Copyright © 2016",null,"Designed by Thom Hartle",null,null,null,null,null,null,null,null,null,null,null,null,null,null,"To better manage performance the dashboard ranking does not update on every quote, but once every"]
[null,null,null,null,null,null,null,null,null,null,null,null,null,null,null,null,null,null,null,"second. Click \"Rank\" to force an update if the percent net change column is out of order."]

{"sheet":"Symbols","index":1,"n_rows":41,"n_cols":51,"rows_kept":41,"cut":false,"hidden":false,"merged":[]}
[]
[null,null,null,null,"Requires Real-Time Data"]
[null,null,"Left hand display",null,null,null,null,"Right hand display",null,null,null,"DJUPV",null,null,"DJDNV",null,null,"NASUPV",null,null,"NASDNV",null,null,"DJUCV",null,null,"NASUCV",null,null,"DJIUP",null,null,"NASIUP",null,null,"DJIDN",null,null,"NASIDN",null,null,"DJIUC",null,null,"NASIUC",null,null,"DJTIC",null,null,"NASTIC"]
[null,null,"Symbols","Description",null,null,null,"Symbols","Description",null,-10,{"$f":"RTD(\"cqg.rtd\",,\"StudyData\",$L$3,\"Bar\",,\"Close\",\"5\",K4,,,,,\"T\")","v":464096},null,-10,{"$f":"RTD(\"cqg.rtd\",,\"StudyData\",$O$3,\"Bar\",,\"Close\",\"5\",N4,,,,,\"T\")","v":46175},null,-10,{"$f":"RTD(\"cqg.rtd\",,\"StudyData\",$R$3,\"Bar\",,\"Close\",\"5\",Q4,,,,,\"T\")","v":2531419},null,-10,{"$f":"RTD(\"cqg.rtd\",,\"StudyData\",$U$3,\"Bar\",,\"Close\",\"5\",T4,,,,,\"T\")","v":800483},null,-10,{"$f":"RTD(\"cqg.rtd\",,\"StudyData\",$X$3,\"Bar\",,\"Close\",\"5\",W4,,,,,\"T\")","v":4217},null,-10,{"$f":"RTD(\"cqg.rtd\",,\"StudyData\",$AA$3,\"Bar\",,\"Close\",\"5\",Z4,,,,,\"T\")","v":338277},null,-10,{"$f":"RTD(\"cqg.rtd\",,\"StudyData\",$AD$3,\"Bar\",,\"Close\",\"5\",AC4,,,,,\"T\")","v":2653},null,-10,{"$f":"RTD(\"cqg.rtd\",,\"StudyData\",$AG$3,\"Bar\",,\"Close\",\"5\",AF4,,,,,\"T\")","v":3436},null,-10,{"$f":"RTD(\"cqg.rtd\",,\"StudyData\",$AJ$3,\"Bar\",,\"Close\",\"5\",AI4,,,,,\"T\")","v":449},null,-10,{"$f":"RTD(\"cqg.rtd\",,\"StudyData\",$AM$3,\"Bar\",,\"Close\",\"5\",AL4,,,,,\"T\")","v":897},null,-10,{"$f":"RTD(\"cqg.rtd\",,\"StudyData\",$AP$3,\"Bar\",,\"Close\",\"5\",AO4,,,,,\"T\")","v":83},null,-10,{"$f":"RTD(\"cqg.rtd\",,\"StudyData\",$AS$3,\"Bar\",,\"Close\",\"5\",AR4,,,,,\"T\")","v":146},null,-10,{"$f":"RTD(\"cqg.rtd\",,\"StudyData\",$AV$3,\"Bar\",,\"Close\",\"5\",AU4,,,,,\"T\")","v":-59},null,-10,{"$f":"RTD(\"cqg.rtd\",,\"StudyData\",$AY$3,\"Bar\",,\"Close\",\"5\",AX4,,,,,\"T\")","v":487}]
[null,null,"X.US.SPC",{"$f":"RTD(\"cqg.rtd\", ,\"ContractData\",C5, \"LongDescription\",, \"T\")","v":"S&P 500"},null,null,null,"X.US.NQCOMP",{"$f":"RTD(\"cqg.rtd\", ,\"ContractData\",H5, \"LongDescription\",, \"T\")","v":"NASDAQ Composite Index"},null,{"$f":"K4+1","v":-9},{"$f":"RTD(\"cqg.rtd\",,\"StudyData\",$L$3,\"Bar\",,\"Close\",\"5\",K5,,,,,\"T\")","v":468846},null,{"$f":"N4+1","v":-9},{"$f":"RTD(\"cqg.rtd\",,\"StudyData\",$O$3,\"Bar\",,\"Close\",\"5\",N5,,,,,\"T\")","v":50445},null,{"$f":"Q4+1","v":-9},{"$f":"RTD(\"cqg.rtd\",,\"StudyData\",$R$3,\"Bar\",,\"Close\",\"5\",Q5,,,,,\"T\")","v":2548853},null,{"$f":"T4+1","v":-9},{"$f":"RTD(\"cqg.rtd\",,\"StudyData\",$U$3,\"Bar\",,\"Close\",\"5\",T5,,,,,\"T\")","v":832499},null,{"$f":"W4+1","v":-9},{"$f":"RTD(\"cqg.rtd\",,\"StudyData\",$X$3,\"Bar\",,\"Close\",\"5\",W5,,,,,\"T\")","v":1139},null,{"$f":"Z4+1","v":-9},{"$f":"RTD(\"cqg.rtd\",,\"StudyData\",$AA$3,\"Bar\",,\"Close\",\"5\",Z5,,,,,\"T\")","v":262686},null,{"$f":"AC4+1","v":-9},{"$f":"RTD(\"cqg.rtd\",,\"StudyData\",$AD$3,\"Bar\",,\"Close\",\"5\",AC5,,,,,\"T\")","v":2648},null,{"$f":"AF4+1","v":-9},{"$f":"RTD(\"cqg.rtd\",,\"StudyData\",$AG$3,\"Bar\",,\"Close\",\"5\",AF5,,,,,\"T\")","v":3422},null,{"$f":"AI4+1","v":-9},{"$f":"RTD(\"cqg.rtd\",,\"StudyData\",$AJ$3,\"Bar\",,\"Close\",\"5\",AI5,,,,,\"T\")","v":450},null,{"$f":"AL4+1","v":-9},{"$f":"RTD(\"cqg.rtd\",,\"StudyData\",$AM$3,\"Bar\",,\"Close\",\"5\",AL5,,,,,\"T\")","v":919},null,{"$f":"AO4+1","v":-9},{"$f":"RTD(\"cqg.rtd\",,\"StudyData\",$AP$3,\"Bar\",,\"Close\",\"5\",AO5,,,,,\"T\")","v":91},null,{"$f":"AR4+1","v":-9},{"$f":"RTD(\"cqg.rtd\",,\"StudyData\",$AS$3,\"Bar\",,\"Close\",\"5\",AR5,,,,,\"T\")","v":148},null,{"$f":"AU4+1","v":-9},{"$f":"RTD(\"cqg.rtd\",,\"StudyData\",$AV$3,\"Bar\",,\"Close\",\"5\",AU5,,,,,\"T\")","v":129},null,{"$f":"AX4+1","v":-9},{"$f":"RTD(\"cqg.rtd\",,\"StudyData\",$AY$3,\"Bar\",,\"Close\",\"5\",AX5,,,,,\"T\")","v":410}]
[null,null,"X.US.DJI",{"$f":"RTD(\"cqg.rtd\", ,\"ContractData\",C6, \"LongDescription\",, \"T\")","v":"DJ Industrial Average"},null,null,null,"X.US.NDX",{"$f":"RTD(\"cqg.rtd\", ,\"ContractData\",H6, \"LongDescription\",, \"T\")","v":"NASDAQ-100 Index"},null,{"$f":"K5+1","v":-8},{"$f":"RTD(\"cqg.rtd\",,\"StudyData\",$L$3,\"Bar\",,\"Close\",\"5\",K6,,,,,\"T\")","v":475671},null,{"$f":"N5+1","v":-8},{"$f":"RTD(\"cqg.rtd\",,\"StudyData\",$O$3,\"Bar\",,\"Close\",\"5\",N6,,,,,\"T\")","v":50487},null,{"$f":"Q5+1","v":-8},{"$f":"RTD(\"cqg.rtd\",,\"StudyData\",$R$3,\"Bar\",,\"Close\",\"5\",Q6,,,,,\"T\")","v":2576317},null,{"$f":"T5+1","v":-8},{"$f":"RTD(\"cqg.rtd\",,\"StudyData\",$U$3,\"Bar\",,\"Close\",\"5\",T6,,,,,\"T\")","v":847614},null,{"$f":"W5+1","v":-8},{"$f":"RTD(\"cqg.rtd\",,\"StudyData\",$X$3,\"Bar\",,\"Close\",\"5\",W6,,,,,\"T\")","v":635},null,{"$f":"Z5+1","v":-8},{"$f":"RTD(\"cqg.rtd\",,\"StudyData\",$AA$3,\"Bar\",,\"Close\",\"5\",Z6,,,,,\"T\")","v":214600},null,{"$f":"AC5+1","v":-8},{"$f":"RTD(\"cqg.rtd\",,\"StudyData\",$AD$3,\"Bar\",,\"Close\",\"5\",AC6,,,,,\"T\")","v":2655},null,{"$f":"AF5+1","v":-8},{"$f":"RTD(\"cqg.rtd\",,\"StudyData\",$AG$3,\"Bar\",,\"Close\",\"5\",AF6,,,,,\"T\")","v":3453},null,{"$f":"AI5+1","v":-8},{"$f":"RTD(\"cqg.rtd\",,\"StudyData\",$AJ$3,\"Bar\",,\"Close\",\"5\",AI6,,,,,\"T\")","v":451},null,{"$f":"AL5+1","v":-8},{"$f":"RTD(\"cqg.rtd\",,\"StudyData\",$AM$3,\"Bar\",,\"Close\",\"5\",AL6,,,,,\"T\")","v":905},null,{"$f":"AO5+1","v":-8},{"$f":"RTD(\"cqg.rtd\",,\"StudyData\",$AP$3,\"Bar\",,\"Close\",\"5\",AO6,,,,,\"T\")","v":85},null,{"$f":"AR5+1","v":-8},{"$f":"RTD(\"cqg.rtd\",,\"StudyData\",$AS$3,\"Bar\",,\"Close\",\"5\",AR6,,,,,\"T\")","v":136},null,{"$f":"AU5+1","v":-8},{"$f":"RTD(\"cqg.rtd\",,\"StudyData\",$AV$3,\"Bar\",,\"Close\",\"5\",AU6,,,,,\"T\")","v":236},null,{"$f":"AX5+1","v":-8},{"$f":"RTD(\"cqg.rtd\",,\"StudyData\",$AY$3,\"Bar\",,\"Close\",\"5\",AX6,,,,,\"T\")","v":487}]
[null,null,"S.US.XLF",{"$f":"RTD(\"cqg.rtd\", ,\"ContractData\",C7, \"LongDescription\",, \"T\")","v":"Financial Select Sector SPDR"},null,null,null,"X.US.IXF",{"$f":"RTD(\"cqg.rtd\", ,\"ContractData\",H7, \"LongDescription\",, \"T\")","v":"NASDAQ Financial 100"},null,-7,{"$f":"RTD(\"cqg.rtd\",,\"StudyData\",$L$3,\"Bar\",,\"Close\",\"5\",K7,,,,,\"T\")","v":484731},null,-7,{"$f":"RTD(\"cqg.rtd\",,\"StudyData\",$O$3,\"Bar\",,\"Close\",\"5\",N7,,,,,\"T\")","v":49753},null,-7,{"$f":"RTD(\"cqg.rtd\",,\"StudyData\",$R$3,\"Bar\",,\"Close\",\"5\",Q7,,,,,\"T\")","v":2625058},null,-7,{"$f":"RTD(\"cqg.rtd\",,\"StudyData\",$U$3,\"Bar\",,\"Close\",\"5\",T7,,,,,\"T\")","v":850115},null,-7,{"$f":"RTD(\"cqg.rtd\",,\"StudyData\",$X$3,\"Bar\",,\"Close\",\"5\",W7,,,,,\"T\")","v":1015},null,-7,{"$f":"RTD(\"cqg.rtd\",,\"StudyData\",$AA$3,\"Bar\",,\"Close\",\"5\",Z7,,,,,\"T\")","v":159811},null,-7,{"$f":"RTD(\"cqg.rtd\",,\"StudyData\",$AD$3,\"Bar\",,\"Close\",\"5\",AC7,,,,,\"T\")","v":2650},null,-7,{"$f":"RTD(\"cqg.rtd\",,\"StudyData\",$AG$3,\"Bar\",,\"Close\",\"5\",AF7,,,,,\"T\")","v":3475},null,-7,{"$f":"RTD(\"cqg.rtd\",,\"StudyData\",$AJ$3,\"Bar\",,\"Close\",\"5\",AI7,,,,,\"T\")","v":448},null,-7,{"$f":"RTD(\"cqg.rtd\",,\"StudyData\",$AM$3,\"Bar\",,\"Close\",\"5\",AL7,,,,,\"T\")","v":877},null,-7,{"$f":"RTD(\"cqg.rtd\",,\"StudyData\",$AP$3,\"Bar\",,\"Close\",\"5\",AO7,,,,,\"T\")","v":94},null,-7,{"$f":"RTD(\"cqg.rtd\",,\"StudyData\",$AS$3,\"Bar\",,\"Close\",\"5\",AR7,,,,,\"T\")","v":147},null,-7,{"$f":"RTD(\"cqg.rtd\",,\"StudyData\",$AV$3,\"Bar\",,\"Close\",\"5\",AU7,,,,,\"T\")","v":341},null,-7,{"$f":"RTD(\"cqg.rtd\",,\"StudyData\",$AY$3,\"Bar\",,\"Close\",\"5\",AX7,,,,,\"T\")","v":520}]
[null,null,"X.US.BTK",{"$f":"RTD(\"cqg.rtd\", ,\"ContractData\",C8, \"LongDescription\",, \"T\")","v":"Biotechnology Index"},null,null,null,"X.US.NBI",{"$f":"RTD(\"cqg.rtd\", ,\"ContractData\",H8, \"LongDescription\",, \"T\")","v":"NASDAQ Biotechnology"},null,-6,{"$f":"RTD(\"cqg.rtd\",,\"StudyData\",$L$3,\"Bar\",,\"Close\",\"5\",K8,,,,,\"T\")","v":496099},null,-6,{"$f":"RTD(\"cqg.rtd\",,\"StudyData\",$O$3,\"Bar\",,\"Close\",\"5\",N8,,,,,\"T\")","v":46204},null,-6,{"$f":"RTD(\"cqg.rtd\",,\"StudyData\",$R$3,\"Bar\",,\"Close\",\"5\",Q8,,,,,\"T\")","v":2697008},null,-6,{"$f":"RTD(\"cqg.rtd\",,\"StudyData\",$U$3,\"Bar\",,\"Close\",\"5\",T8,,,,,\"T\")","v":825616},null,-6,{"$f":"RTD(\"cqg.rtd\",,\"StudyData\",$X$3,\"Bar\",,\"Close\",\"5\",W8,,,,,\"T\")","v":1760},null,-6,{"$f":"RTD(\"cqg.rtd\",,\"StudyData\",$AA$3,\"Bar\",,\"Close\",\"5\",Z8,,,,,\"T\")","v":166760},null,-6,{"$f":"RTD(\"cqg.rtd\",,\"StudyData\",$AD$3,\"Bar\",,\"Close\",\"5\",AC8,,,,,\"T\")","v":2662},null,-6,{"$f":"RTD(\"cqg.rtd\",,\"StudyData\",$AG$3,\"Bar\",,\"Close\",\"5\",AF8,,,,,\"T\")","v":3502},null,-6,{"$f":"RTD(\"cqg.rtd\",,\"StudyData\",$AJ$3,\"Bar\",,\"Close\",\"5\",AI8,,,,,\"T\")","v":443},null,-6,{"$f":"RTD(\"cqg.rtd\",,\"StudyData\",$AM$3,\"Bar\",,\"Close\",\"5\",AL8,,,,,\"T\")","v":861},null,-6,{"$f":"RTD(\"cqg.rtd\",,\"StudyData\",$AP$3,\"Bar\",,\"Close\",\"5\",AO8,,,,,\"T\")","v":91},null,-6,{"$f":"RTD(\"cqg.rtd\",,\"StudyData\",$AS$3,\"Bar\",,\"Close\",\"5\",AR8,,,,,\"T\")","v":141},null,-6,{"$f":"RTD(\"cqg.rtd\",,\"StudyData\",$AV$3,\"Bar\",,\"Close\",\"5\",AU8,,,,,\"T\")","v":285},null,-6,{"$f":"RTD(\"cqg.rtd\",,\"StudyData\",$AY$3,\"Bar\",,\"Close\",\"5\",AX8,,,,,\"T\")","v":507}]
[null,null,"X.US.NYPID",{"$f":"RTD(\"cqg.rtd\", ,\"ContractData\",C9, \"LongDescription\",, \"T\")","v":"NYSE Healthcare Index"},null,null,null,"X.US.NHC",{"$f":"RTD(\"cqg.rtd\", ,\"ContractData\",H9, \"LongDescription\",, \"T\")","v":"Nasdaq Health Care Index"},null,-5,{"$f":"RTD(\"cqg.rtd\",,\"StudyData\",$L$3,\"Bar\",,\"Close\",\"5\",K9,,,,,\"T\")","v":505145},null,-5,{"$f":"RTD(\"cqg.rtd\",,\"StudyData\",$O$3,\"Bar\",,\"Close\",\"5\",N9,,,,,\"T\")","v":47770},null,-5,{"$f":"RTD(\"cqg.rtd\",,\"StudyData\",$R$3,\"Bar\",,\"Close\",\"5\",Q9,,,,,\"T\")","v":2715912},null,-5,{"$f":"RTD(\"cqg.rtd\",,\"StudyData\",$U$3,\"Bar\",,\"Close\",\"5\",T9,,,,,\"T\")","v":851278},null,-5,{"$f":"RTD(\"cqg.rtd\",,\"StudyData\",$X$3,\"Bar\",,\"Close\",\"5\",W9,,,,,\"T\")","v":1823},null,-5,{"$f":"RTD(\"cqg.rtd\",,\"StudyData\",$AA$3,\"Bar\",,\"Close\",\"5\",Z9,,,,,\"T\")","v":216859},null,-5,{"$f":"RTD(\"cqg.rtd\",,\"StudyData\",$AD$3,\"Bar\",,\"Close\",\"5\",AC9,,,,,\"T\")","v":2659},null,-5,{"$f":"RTD(\"cqg.rtd\",,\"StudyData\",$AG$3,\"Bar\",,\"Close\",\"5\",AF9,,,,,\"T\")","v":3504},null,-5,{"$f":"RTD(\"cqg.rtd\",,\"StudyData\",$AJ$3,\"Bar\",,\"Close\",\"5\",AI9,,,,,\"T\")","v":449},null,-5,{"$f":"RTD(\"cqg.rtd\",,\"StudyData\",$AM$3,\"Bar\",,\"Close\",\"5\",AL9,,,,,\"T\")","v":861},null,-5,{"$f":"RTD(\"cqg.rtd\",,\"StudyData\",$AP$3,\"Bar\",,\"Close\",\"5\",AO9,,,,,\"T\")","v":93},null,-5,{"$f":"RTD(\"cqg.rtd\",,\"StudyData\",$AS$3,\"Bar\",,\"Close\",\"5\",AR9,,,,,\"T\")","v":142},null,-5,{"$f":"RTD(\"cqg.rtd\",,\"StudyData\",$AV$3,\"Bar\",,\"Close\",\"5\",AU9,,,,,\"T\")","v":-63},null,-5,{"$f":"RTD(\"cqg.rtd\",,\"StudyData\",$AY$3,\"Bar\",,\"Close\",\"5\",AX9,,,,,\"T\")","v":531}]
[null,null,"X.US.IXE",{"$f":"RTD(\"cqg.rtd\", ,\"ContractData\",C10, \"LongDescription\",, \"T\")","v":"S&P 500 Select Sector Energy Index"},null,null,null,"X.US.OSX",{"$f":"RTD(\"cqg.rtd\", ,\"ContractData\",H10, \"LongDescription\",, \"T\")","v":"PHLX Oil Service Sector"},null,-4,{"$f":"RTD(\"cqg.rtd\",,\"StudyData\",$L$3,\"Bar\",,\"Close\",\"5\",K10,,,,,\"T\")","v":516489},null,-4,{"$f":"RTD(\"cqg.rtd\",,\"StudyData\",$O$3,\"Bar\",,\"Close\",\"5\",N10,,,,,\"T\")","v":49145},null,-4,{"$f":"RTD(\"cqg.rtd\",,\"StudyData\",$R$3,\"Bar\",,\"Close\",\"5\",Q10,,,,,\"T\")","v":2814125},null,-4,{"$f":"RTD(\"cqg.rtd\",,\"StudyData\",$U$3,\"Bar\",,\"Close\",\"5\",T10,,,,,\"T\")","v":817285},null,-4,{"$f":"RTD(\"cqg.rtd\",,\"StudyData\",$X$3,\"Bar\",,\"Close\",\"5\",W10,,,,,\"T\")","v":1752},null,-4,{"$f":"RTD(\"cqg.rtd\",,\"StudyData\",$AA$3,\"Bar\",,\"Close\",\"5\",Z10,,,,,\"T\")","v":132209},null,-4,{"$f":"RTD(\"cqg.rtd\",,\"StudyData\",$AD$3,\"Bar\",,\"Close\",\"5\",AC10,,,,,\"T\")","v":2654},null,-4,{"$f":"RTD(\"cqg.rtd\",,\"StudyData\",$AG$3,\"Bar\",,\"Close\",\"5\",AF10,,,,,\"T\")","v":3518},null,-4,{"$f":"RTD(\"cqg.rtd\",,\"StudyData\",$AJ$3,\"Bar\",,\"Close\",\"5\",AI10,,,,,\"T\")","v":461},null,-4,{"$f":"RTD(\"cqg.rtd\",,\"StudyData\",$AM$3,\"Bar\",,\"Close\",\"5\",AL10,,,,,\"T\")","v":854},null,-4,{"$f":"RTD(\"cqg.rtd\",,\"StudyData\",$AP$3,\"Bar\",,\"Close\",\"5\",AO10,,,,,\"T\")","v":87},null,-4,{"$f":"RTD(\"cqg.rtd\",,\"StudyData\",$AS$3,\"Bar\",,\"Close\",\"5\",AR10,,,,,\"T\")","v":142},null,-4,{"$f":"RTD(\"cqg.rtd\",,\"StudyData\",$AV$3,\"Bar\",,\"Close\",\"5\",AU10,,,,,\"T\")","v":-104},null,-4,{"$f":"RTD(\"cqg.rtd\",,\"StudyData\",$AY$3,\"Bar\",,\"Close\",\"5\",AX10,,,,,\"T\")","v":514}]
[null,null,"S.US.BAC",{"$f":"RTD(\"cqg.rtd\", ,\"ContractData\",C11, \"LongDescription\",, \"T\")","v":"Bank of America Corp"},null,null,null,"S.US.XLE",{"$f":"RTD(\"cqg.rtd\", ,\"ContractData\",H11, \"LongDescription\",, \"T\")","v":"Energy Select Sector SPDR"},null,-3,{"$f":"RTD(\"cqg.rtd\",,\"StudyData\",$L$3,\"Bar\",,\"Close\",\"5\",K11,,,,,\"T\")","v":530641},null,-3,{"$f":"RTD(\"cqg.rtd\",,\"StudyData\",$O$3,\"Bar\",,\"Close\",\"5\",N11,,,,,\"T\")","v":49689},null,-3,{"$f":"RTD(\"cqg.rtd\",,\"StudyData\",$R$3,\"Bar\",,\"Close\",\"5\",Q11,,,,,\"T\")","v":2871018},null,-3,{"$f":"RTD(\"cqg.rtd\",,\"StudyData\",$U$3,\"Bar\",,\"Close\",\"5\",T11,,,,,\"T\")","v":822539},null,-3,{"$f":"RTD(\"cqg.rtd\",,\"StudyData\",$X$3,\"Bar\",,\"Close\",\"5\",W11,,,,,\"T\")","v":1155},null,-3,{"$f":"RTD(\"cqg.rtd\",,\"StudyData\",$AA$3,\"Bar\",,\"Close\",\"5\",Z11,,,,,\"T\")","v":152218},null,-3,{"$f":"RTD(\"cqg.rtd\",,\"StudyData\",$AD$3,\"Bar\",,\"Close\",\"5\",AC11,,,,,\"T\")","v":2648},null,-3,{"$f":"RTD(\"cqg.rtd\",,\"StudyData\",$AG$3,\"Bar\",,\"Close\",\"5\",AF11,,,,,\"T\")","v":3532},null,-3,{"$f":"RTD(\"cqg.rtd\",,\"StudyData\",$AJ$3,\"Bar\",,\"Close\",\"5\",AI11,,,,,\"T\")","v":466},null,-3,{"$f":"RTD(\"cqg.rtd\",,\"StudyData\",$AM$3,\"Bar\",,\"Close\",\"5\",AL11,,,,,\"T\")","v":851},null,-3,{"$f":"RTD(\"cqg.rtd\",,\"StudyData\",$AP$3,\"Bar\",,\"Close\",\"5\",AO11,,,,,\"T\")","v":94},null,-3,{"$f":"RTD(\"cqg.rtd\",,\"StudyData\",$AS$3,\"Bar\",,\"Close\",\"5\",AR11,,,,,\"T\")","v":140},null,-3,{"$f":"RTD(\"cqg.rtd\",,\"StudyData\",$AV$3,\"Bar\",,\"Close\",\"5\",AU11,,,,,\"T\")","v":477},null,-3,{"$f":"RTD(\"cqg.rtd\",,\"StudyData\",$AY$3,\"Bar\",,\"Close\",\"5\",AX11,,,,,\"T\")","v":518}]
[null,null,"S.US.RSP",{"$f":"RTD(\"cqg.rtd\", ,\"ContractData\",C12, \"LongDescription\",, \"T\")","v":"Invesco S&P 500 Equal Weight ETF"},null,null,null,"S.US.AAPL",{"$f":"RTD(\"cqg.rtd\", ,\"ContractData\",H12, \"LongDescription\",, \"T\")","v":"Apple Inc"},null,-2,{"$f":"RTD(\"cqg.rtd\",,\"StudyData\",$L$3,\"Bar\",,\"Close\",\"5\",K12,,,,,\"T\")","v":550253},null,-2,{"$f":"RTD(\"cqg.rtd\",,\"StudyData\",$O$3,\"Bar\",,\"Close\",\"5\",N12,,,,,\"T\")","v":54049},null,-2,{"$f":"RTD(\"cqg.rtd\",,\"StudyData\",$R$3,\"Bar\",,\"Close\",\"5\",Q12,,,,,\"T\")","v":2890373},null,-2,{"$f":"RTD(\"cqg.rtd\",,\"StudyData\",$U$3,\"Bar\",,\"Close\",\"5\",T12,,,,,\"T\")","v":918620},null,-2,{"$f":"RTD(\"cqg.rtd\",,\"StudyData\",$X$3,\"Bar\",,\"Close\",\"5\",W12,,,,,\"T\")","v":3679},null,-2,{"$f":"RTD(\"cqg.rtd\",,\"StudyData\",$AA$3,\"Bar\",,\"Close\",\"5\",Z12,,,,,\"T\")","v":178340},null,-2,{"$f":"RTD(\"cqg.rtd\",,\"StudyData\",$AD$3,\"Bar\",,\"Close\",\"5\",AC12,,,,,\"T\")","v":2643},null,-2,{"$f":"RTD(\"cqg.rtd\",,\"StudyData\",$AG$3,\"Bar\",,\"Close\",\"5\",AF12,,,,,\"T\")","v":3504},null,-2,{"$f":"RTD(\"cqg.rtd\",,\"StudyData\",$AJ$3,\"Bar\",,\"Close\",\"5\",AI12,,,,,\"T\")","v":475},null,-2,{"$f":"RTD(\"cqg.rtd\",,\"StudyData\",$AM$3,\"Bar\",,\"Close\",\"5\",AL12,,,,,\"T\")","v":881},null,-2,{"$f":"RTD(\"cqg.rtd\",,\"StudyData\",$AP$3,\"Bar\",,\"Close\",\"5\",AO12,,,,,\"T\")","v":91},null,-2,{"$f":"RTD(\"cqg.rtd\",,\"StudyData\",$AS$3,\"Bar\",,\"Close\",\"5\",AR12,,,,,\"T\")","v":144},null,-2,{"$f":"RTD(\"cqg.rtd\",,\"StudyData\",$AV$3,\"Bar\",,\"Close\",\"5\",AU12,,,,,\"T\")","v":-231},null,-2,{"$f":"RTD(\"cqg.rtd\",,\"StudyData\",$AY$3,\"Bar\",,\"Close\",\"5\",AX12,,,,,\"T\")","v":291}]
[null,null,"S.US.SPY",{"$f":"RTD(\"cqg.rtd\", ,\"ContractData\",C13, \"LongDescription\",, \"T\")","v":"SPDR S&P 500"},null,null,null,"S.US.TSLA",{"$f":"RTD(\"cqg.rtd\", ,\"ContractData\",H13, \"LongDescription\",, \"T\")","v":"Tesla, Inc."},null,-1,{"$f":"RTD(\"cqg.rtd\",,\"StudyData\",$L$3,\"Bar\",,\"Close\",\"5\",K13,,,,,\"T\")","v":612721},null,-1,{"$f":"RTD(\"cqg.rtd\",,\"StudyData\",$O$3,\"Bar\",,\"Close\",\"5\",N13,,,,,\"T\")","v":65081},null,-1,{"$f":"RTD(\"cqg.rtd\",,\"StudyData\",$R$3,\"Bar\",,\"Close\",\"5\",Q13,,,,,\"T\")","v":3419111},null,-1,{"$f":"RTD(\"cqg.rtd\",,\"StudyData\",$U$3,\"Bar\",,\"Close\",\"5\",T13,,,,,\"T\")","v":1064665},null,-1,{"$f":"RTD(\"cqg.rtd\",,\"StudyData\",$X$3,\"Bar\",,\"Close\",\"5\",W13,,,,,\"T\")","v":3406},null,-1,{"$f":"RTD(\"cqg.rtd\",,\"StudyData\",$AA$3,\"Bar\",,\"Close\",\"5\",Z13,,,,,\"T\")","v":358136},null,-1,{"$f":"RTD(\"cqg.rtd\",,\"StudyData\",$AD$3,\"Bar\",,\"Close\",\"5\",AC13,,,,,\"T\")","v":2629},null,-1,{"$f":"RTD(\"cqg.rtd\",,\"StudyData\",$AG$3,\"Bar\",,\"Close\",\"5\",AF13,,,,,\"T\")","v":3400},null,-1,{"$f":"RTD(\"cqg.rtd\",,\"StudyData\",$AJ$3,\"Bar\",,\"Close\",\"5\",AI13,,,,,\"T\")","v":486},null,-1,{"$f":"RTD(\"cqg.rtd\",,\"StudyData\",$AM$3,\"Bar\",,\"Close\",\"5\",AL13,,,,,\"T\")","v":969},null,-1,{"$f":"RTD(\"cqg.rtd\",,\"StudyData\",$AP$3,\"Bar\",,\"Close\",\"5\",AO13,,,,,\"T\")","v":100},null,-1,{"$f":"RTD(\"cqg.rtd\",,\"StudyData\",$AS$3,\"Bar\",,\"Close\",\"5\",AR13,,,,,\"T\")","v":178},null,-1,{"$f":"RTD(\"cqg.rtd\",,\"StudyData\",$AV$3,\"Bar\",,\"Close\",\"5\",AU13,,,,,\"T\")","v":-310},null,-1,{"$f":"RTD(\"cqg.rtd\",,\"StudyData\",$AY$3,\"Bar\",,\"Close\",\"5\",AX13,,,,,\"T\")","v":-3}]
[null,null,"F.US.EP",{"$f":"RTD(\"cqg.rtd\", ,\"ContractData\",C14, \"LongDescription\",, \"T\")","v":"E-Mini S&P 500, Sep 21"},null,null,null,"S.US.MU",{"$f":"RTD(\"cqg.rtd\", ,\"ContractData\",H14, \"LongDescription\",, \"T\")","v":"Micron Technology Inc"},null,{"$f":"K13+1","v":0},{"$f":"RTD(\"cqg.rtd\",,\"StudyData\",$L$3,\"Bar\",,\"Close\",\"5\",K14,,,,,\"T\")","v":38564},null,0,{"$f":"RTD(\"cqg.rtd\",,\"StudyData\",$O$3,\"Bar\",,\"Close\",\"5\",N14,,,,,\"T\")","v":8228},null,0,{"$f":"RTD(\"cqg.rtd\",,\"StudyData\",$R$3,\"Bar\",,\"Close\",\"5\",Q14,,,,,\"T\")","v":168809},null,0,{"$f":"RTD(\"cqg.rtd\",,\"StudyData\",$U$3,\"Bar\",,\"Close\",\"5\",T14,,,,,\"T\")","v":49478},null,0,{"$f":"RTD(\"cqg.rtd\",,\"StudyData\",$X$3,\"Bar\",,\"Close\",\"5\",W14,,,,,\"T\")","v":658},null,0,{"$f":"RTD(\"cqg.rtd\",,\"StudyData\",$AA$3,\"Bar\",,\"Close\",\"5\",Z14,,,,,\"T\")","v":15322},null,0,{"$f":"RTD(\"cqg.rtd\",,\"StudyData\",$AD$3,\"Bar\",,\"Close\",\"5\",AC14,,,,,\"T\")","v":2096},null,0,{"$f":"RTD(\"cqg.rtd\",,\"StudyData\",$AG$3,\"Bar\",,\"Close\",\"5\",AF14,,,,,\"T\")","v":2406},null,0,{"$f":"RTD(\"cqg.rtd\",,\"StudyData\",$AJ$3,\"Bar\",,\"Close\",\"5\",AI14,,,,,\"T\")","v":535},null,0,{"$f":"RTD(\"cqg.rtd\",,\"StudyData\",$AM$3,\"Bar\",,\"Close\",\"5\",AL14,,,,,\"T\")","v":901},null,0,{"$f":"RTD(\"cqg.rtd\",,\"StudyData\",$AP$3,\"Bar\",,\"Close\",\"5\",AO14,,,,,\"T\")","v":145},null,0,{"$f":"RTD(\"cqg.rtd\",,\"StudyData\",$AS$3,\"Bar\",,\"Close\",\"5\",AR14,,,,,\"T\")","v":184},null,0,{"$f":"RTD(\"cqg.rtd\",,\"StudyData\",$AV$3,\"Bar\",,\"Close\",\"5\",AU14,,,,,\"T\")","v":553},null,0,{"$f":"RTD(\"cqg.rtd\",,\"StudyData\",$AY$3,\"Bar\",,\"Close\",\"5\",AX14,,,,,\"T\")","v":608}]
[null,null,"F.US.CLE",{"$f":"RTD(\"cqg.rtd\", ,\"ContractData\",C15, \"LongDescription\",, \"T\")","v":"Crude Light (Globex), Sep 21"},null,null,null,"S.US.QQQ",{"$f":"RTD(\"cqg.rtd\", ,\"ContractData\",H15, \"LongDescription\",, \"T\")","v":"Invesco QQQ Trust Series 1"}]
[null,null,"F.US.HOE",{"$f":"RTD(\"cqg.rtd\", ,\"ContractData\",C16, \"LongDescription\",, \"T\")","v":"NY Harbor ULSD, Sep 21"},null,null,null,"S.US.CSCO",{"$f":"RTD(\"cqg.rtd\", ,\"ContractData\",H16, \"LongDescription\",, \"T\")","v":"Cisco Systems Inc"}]
[null,null,"F.US.RBE",{"$f":"RTD(\"cqg.rtd\", ,\"ContractData\",C17, \"LongDescription\",, \"T\")","v":"RBOB Gasoline (Globex), Sep 21"},null,null,null,"S.US.FB",{"$f":"RTD(\"cqg.rtd\", ,\"ContractData\",H17, \"LongDescription\",, \"T\")","v":"Facebook, Inc."},null,-24,{"$f":"RTD(\"cqg.rtd\",,\"StudyData\",$C$5,\"Bar\",,\"Time\",\"5\",K17,,,,,\"T\")","v":44397.552083333336},{"$f":"RTD(\"cqg.rtd\",,\"StudyData\",$C$5,\"Bar\",,\"Open\",\"5\",K17,,,,,\"T\")","v":4328.9399999999996},{"$f":"RTD(\"cqg.rtd\",,\"StudyData\",$C$5,\"Bar\",,\"High\",\"5\",K17,,,,,\"T\")","v":4330.97},{"$f":"RTD(\"cqg.rtd\",,\"StudyData\",$C$5,\"Bar\",,\"Low\",\"5\",K17,,,,,\"T\")","v":4328.9399999999996},{"$f":"RTD(\"cqg.rtd\",,\"StudyData\",$C$5,\"Bar\",,\"Close\",\"5\",K17,,,,,\"T\")","v":4330.45},null,-24,{"$f":"RTD(\"cqg.rtd\",,\"StudyData\",$H$5,\"Bar\",,\"Time\",\"5\",R17,,,,,\"T\")","v":44397.541666666664},{"$f":"RTD(\"cqg.rtd\",,\"StudyData\",$H$5,\"Bar\",,\"Open\",\"5\",R17,,,,,\"T\")","v":14496.54},{"$f":"RTD(\"cqg.rtd\",,\"StudyData\",$H$5,\"Bar\",,\"High\",\"5\",R17,,,,,\"T\")","v":14508.82},{"$f":"RTD(\"cqg.rtd\",,\"StudyData\",$H$5,\"Bar\",,\"Low\",\"5\",R17,,,,,\"T\")","v":14496.22},{"$f":"RTD(\"cqg.rtd\",,\"StudyData\",$H$5,\"Bar\",,\"Close\",\"5\",R17,,,,,\"T\")","v":14508.06}]
[null,null,"F.US.GCE",{"$f":"RTD(\"cqg.rtd\", ,\"ContractData\",C18, \"LongDescription\",, \"T\")","v":"Gold (Globex), Aug 21"},null,null,null,"S.US.TLT",{"$f":"RTD(\"cqg.rtd\", ,\"ContractData\",H18, \"LongDescription\",, \"T\")","v":"iShares 20+ Year Treasury Bond ETF"},null,{"$f":"K17+1","v":-23},{"$f":"RTD(\"cqg.rtd\",,\"StudyData\",$C$5,\"Bar\",,\"Time\",\"5\",K18,,,,,\"T\")","v":44397.555555555555},{"$f":"RTD(\"cqg.rtd\",,\"StudyData\",$C$5,\"Bar\",,\"Open\",\"5\",K18,,,,,\"T\")","v":4330.46},{"$f":"RTD(\"cqg.rtd\",,\"StudyData\",$C$5,\"Bar\",,\"High\",\"5\",K18,,,,,\"T\")","v":4330.87},{"$f":"RTD(\"cqg.rtd\",,\"StudyData\",$C$5,\"Bar\",,\"Low\",\"5\",K18,,,,,\"T\")","v":4328.87},{"$f":"RTD(\"cqg.rtd\",,\"StudyData\",$C$5,\"Bar\",,\"Close\",\"5\",K18,,,,,\"T\")","v":4329.63},null,{"$f":"R17+1","v":-23},{"$f":"RTD(\"cqg.rtd\",,\"StudyData\",$H$5,\"Bar\",,\"Time\",\"5\",R18,,,,,\"T\")","v":44397.545138888891},{"$f":"RTD(\"cqg.rtd\",,\"StudyData\",$H$5,\"Bar\",,\"Open\",\"5\",R18,,,,,\"T\")","v":14508.09},{"$f":"RTD(\"cqg.rtd\",,\"StudyData\",$H$5,\"Bar\",,\"High\",\"5\",R18,,,,,\"T\")","v":14515.8},{"$f":"RTD(\"cqg.rtd\",,\"StudyData\",$H$5,\"Bar\",,\"Low\",\"5\",R18,,,,,\"T\")","v":14506.99},{"$f":"RTD(\"cqg.rtd\",,\"StudyData\",$H$5,\"Bar\",,\"Close\",\"5\",R18,,,,,\"T\")","v":14515.6}]
[null,null,"F.US.DD",{"$f":"RTD(\"cqg.rtd\", ,\"ContractData\",C19, \"LongDescription\",, \"T\")","v":"DAX Index, Sep 21"},null,null,null,"S.US.INTC",{"$f":"RTD(\"cqg.rtd\", ,\"ContractData\",H19, \"LongDescription\",, \"T\")","v":"Intel Corporation"},null,{"$f":"K18+1","v":-22},{"$f":"RTD(\"cqg.rtd\",,\"StudyData\",$C$5,\"Bar\",,\"Time\",\"5\",K19,,,,,\"T\")","v":44397.559027777781},{"$f":"RTD(\"cqg.rtd\",,\"StudyData\",$C$5,\"Bar\",,\"Open\",\"5\",K19,,,,,\"T\")","v":4329.6400000000003},{"$f":"RTD(\"cqg.rtd\",,\"StudyData\",$C$5,\"Bar\",,\"High\",\"5\",K19,,,,,\"T\")","v":4330.93},{"$f":"RTD(\"cqg.rtd\",,\"StudyData\",$C$5,\"Bar\",,\"Low\",\"5\",K19,,,,,\"T\")","v":4329.3},{"$f":"RTD(\"cqg.rtd\",,\"StudyData\",$C$5,\"Bar\",,\"Close\",\"5\",K19,,,,,\"T\")","v":4330.7},null,{"$f":"R18+1","v":-22},{"$f":"RTD(\"cqg.rtd\",,\"StudyData\",$H$5,\"Bar\",,\"Time\",\"5\",R19,,,,,\"T\")","v":44397.548611111109},{"$f":"RTD(\"cqg.rtd\",,\"StudyData\",$H$5,\"Bar\",,\"Open\",\"5\",R19,,,,,\"T\")","v":14516.01},{"$f":"RTD(\"cqg.rtd\",,\"StudyData\",$H$5,\"Bar\",,\"High\",\"5\",R19,,,,,\"T\")","v":14523.12},{"$f":"RTD(\"cqg.rtd\",,\"StudyData\",$H$5,\"Bar\",,\"Low\",\"5\",R19,,,,,\"T\")","v":14515.8},{"$f":"RTD(\"cqg.rtd\",,\"StudyData\",$H$5,\"Bar\",,\"Close\",\"5\",R19,,,,,\"T\")","v":14517.33}]
[null,null,"F.US.DSX",{"$f":"RTD(\"cqg.rtd\", ,\"ContractData\",C20, \"LongDescription\",, \"T\")","v":"Euro STOXX 50, Sep 21"},null,null,null,"S.US.QCOM",{"$f":"RTD(\"cqg.rtd\", ,\"ContractData\",H20, \"LongDescription\",, \"T\")","v":"QUALCOMM Inc"},null,-21,{"$f":"RTD(\"cqg.rtd\",,\"StudyData\",$C$5,\"Bar\",,\"Time\",\"5\",K20,,,,,\"T\")","v":44397.5625},{"$f":"RTD(\"cqg.rtd\",,\"StudyData\",$C$5,\"Bar\",,\"Open\",\"5\",K20,,,,,\"T\")","v":4330.71},{"$f":"RTD(\"cqg.rtd\",,\"StudyData\",$C$5,\"Bar\",,\"High\",\"5\",K20,,,,,\"T\")","v":4331.92},{"$f":"RTD(\"cqg.rtd\",,\"StudyData\",$C$5,\"Bar\",,\"Low\",\"5\",K20,,,,,\"T\")","v":4330.54},{"$f":"RTD(\"cqg.rtd\",,\"StudyData\",$C$5,\"Bar\",,\"Close\",\"5\",K20,,,,,\"T\")","v":4330.54},null,-21,{"$f":"RTD(\"cqg.rtd\",,\"StudyData\",$H$5,\"Bar\",,\"Time\",\"5\",R20,,,,,\"T\")","v":44397.552083333336},{"$f":"RTD(\"cqg.rtd\",,\"StudyData\",$H$5,\"Bar\",,\"Open\",\"5\",R20,,,,,\"T\")","v":14517.4},{"$f":"RTD(\"cqg.rtd\",,\"StudyData\",$H$5,\"Bar\",,\"High\",\"5\",R20,,,,,\"T\")","v":14521.64},{"$f":"RTD(\"cqg.rtd\",,\"StudyData\",$H$5,\"Bar\",,\"Low\",\"5\",R20,,,,,\"T\")","v":14516.19},{"$f":"RTD(\"cqg.rtd\",,\"StudyData\",$H$5,\"Bar\",,\"Close\",\"5\",R20,,,,,\"T\")","v":14520.49}]
[null,null,"S.SPLV",{"$f":"RTD(\"cqg.rtd\", ,\"ContractData\",C21, \"LongDescription\",, \"T\")","v":"PowerShares Exchange-Traded Fund Trust II"},null,null,null,"S.US.AAL",{"$f":"RTD(\"cqg.rtd\", ,\"ContractData\",H21, \"LongDescription\",, \"T\")","v":"American Airlines Group Inc."},null,-20,{"$f":"RTD(\"cqg.rtd\",,\"StudyData\",$C$5,\"Bar\",,\"Time\",\"5\",K21,,,,,\"T\")","v":44397.565972222219},{"$f":"RTD(\"cqg.rtd\",,\"StudyData\",$C$5,\"Bar\",,\"Open\",\"5\",K21,,,,,\"T\")","v":4330.55},{"$f":"RTD(\"cqg.rtd\",,\"StudyData\",$C$5,\"Bar\",,\"High\",\"5\",K21,,,,,\"T\")","v":4331.54},{"$f":"RTD(\"cqg.rtd\",,\"StudyData\",$C$5,\"Bar\",,\"Low\",\"5\",K21,,,,,\"T\")","v":4329.2700000000004},{"$f":"RTD(\"cqg.rtd\",,\"StudyData\",$C$5,\"Bar\",,\"Close\",\"5\",K21,,,,,\"T\")","v":4329.2700000000004},null,-20,{"$f":"RTD(\"cqg.rtd\",,\"StudyData\",$H$5,\"Bar\",,\"Time\",\"5\",R21,,,,,\"T\")","v":44397.555555555555},{"$f":"RTD(\"cqg.rtd\",,\"StudyData\",$H$5,\"Bar\",,\"Open\",\"5\",R21,,,,,\"T\")","v":14520.6},{"$f":"RTD(\"cqg.rtd\",,\"StudyData\",$H$5,\"Bar\",,\"High\",\"5\",R21,,,,,\"T\")","v":14526.13},{"$f":"RTD(\"cqg.rtd\",,\"StudyData\",$H$5,\"Bar\",,\"Low\",\"5\",R21,,,,,\"T\")","v":14518.63},{"$f":"RTD(\"cqg.rtd\",,\"StudyData\",$H$5,\"Bar\",,\"Close\",\"5\",R21,,,,,\"T\")","v":14521.63}]
[null,null,null,null,null,null,null,null,null,null,-19,{"$f":"RTD(\"cqg.rtd\",,\"StudyData\",$C$5,\"Bar\",,\"Time\",\"5\",K22,,,,,\"T\")","v":44397.569444444445},{"$f":"RTD(\"cqg.rtd\",,\"StudyData\",$C$5,\"Bar\",,\"Open\",\"5\",K22,,,,,\"T\")","v":4329.1400000000003},{"$f":"RTD(\"cqg.rtd\",,\"StudyData\",$C$5,\"Bar\",,\"High\",\"5\",K22,,,,,\"T\")","v":4331.46},{"$f":"RTD(\"cqg.rtd\",,\"StudyData\",$C$5,\"Bar\",,\"Low\",\"5\",K22,,,,,\"T\")","v":4328.75},{"$f":"RTD(\"cqg.rtd\",,\"StudyData\",$C$5,\"Bar\",,\"Close\",\"5\",K22,,,,,\"T\")","v":4329.75},null,-19,{"$f":"RTD(\"cqg.rtd\",,\"StudyData\",$H$5,\"Bar\",,\"Time\",\"5\",R22,,,,,\"T\")","v":44397.559027777781},{"$f":"RTD(\"cqg.rtd\",,\"StudyData\",$H$5,\"Bar\",,\"Open\",\"5\",R22,,,,,\"T\")","v":14521.62},{"$f":"RTD(\"cqg.rtd\",,\"StudyData\",$H$5,\"Bar\",,\"High\",\"5\",R22,,,,,\"T\")","v":14533.21},{"$f":"RTD(\"cqg.rtd\",,\"StudyData\",$H$5,\"Bar\",,\"Low\",\"5\",R22,,,,,\"T\")","v":14520.96},{"$f":"RTD(\"cqg.rtd\",,\"StudyData\",$H$5,\"Bar\",,\"Close\",\"5\",R22,,,,,\"T\")","v":14533.1}]
[null,null,"Enter in the symbols you require.",null,null,null,null,null,null,null,-18,{"$f":"RTD(\"cqg.rtd\",,\"StudyData\",$C$5,\"Bar\",,\"Time\",\"5\",K23,,,,,\"T\")","v":44397.572916666664},{"$f":"RTD(\"cqg.rtd\",,\"StudyData\",$C$5,\"Bar\",,\"Open\",\"5\",K23,,,,,\"T\")","v":4329.72},{"$f":"RTD(\"cqg.rtd\",,\"StudyData\",$C$5,\"Bar\",,\"High\",\"5\",K23,,,,,\"T\")","v":4329.95},{"$f":"RTD(\"cqg.rtd\",,\"StudyData\",$C$5,\"Bar\",,\"Low\",\"5\",K23,,,,,\"T\")","v":4327.25},{"$f":"RTD(\"cqg.rtd\",,\"StudyData\",$C$5,\"Bar\",,\"Close\",\"5\",K23,,,,,\"T\")","v":4328.8599999999997},null,-18,{"$f":"RTD(\"cqg.rtd\",,\"StudyData\",$H$5,\"Bar\",,\"Time\",\"5\",R23,,,,,\"T\")","v":44397.5625},{"$f":"RTD(\"cqg.rtd\",,\"StudyData\",$H$5,\"Bar\",,\"Open\",\"5\",R23,,,,,\"T\")","v":14533.04},{"$f":"RTD(\"cqg.rtd\",,\"StudyData\",$H$5,\"Bar\",,\"High\",\"5\",R23,,,,,\"T\")","v":14538.28},{"$f":"RTD(\"cqg.rtd\",,\"StudyData\",$H$5,\"Bar\",,\"Low\",\"5\",R23,,,,,\"T\")","v":14533},{"$f":"RTD(\"cqg.rtd\",,\"StudyData\",$H$5,\"Bar\",,\"Close\",\"5\",R23,,,,,\"T\")","v":14533.22}]
[null,null,"The two charts in the center top of the main page use the first symbol in the Left Hand and Right Hand Display columns above.",null,null,null,null,null,null,null,-17,{"$f":"RTD(\"cqg.rtd\",,\"StudyData\",$C$5,\"Bar\",,\"Time\",\"5\",K24,,,,,\"T\")","v":44397.576388888891},{"$f":"RTD(\"cqg.rtd\",,\"StudyData\",$C$5,\"Bar\",,\"Open\",\"5\",K24,,,,,\"T\")","v":4328.8599999999997},{"$f":"RTD(\"cqg.rtd\",,\"StudyData\",$C$5,\"Bar\",,\"High\",\"5\",K24,,,,,\"T\")","v":4330.93},{"$f":"RTD(\"cqg.rtd\",,\"StudyData\",$C$5,\"Bar\",,\"Low\",\"5\",K24,,,,,\"T\")","v":4328.63},{"$f":"RTD(\"cqg.rtd\",,\"StudyData\",$C$5,\"Bar\",,\"Close\",\"5\",K24,,,,,\"T\")","v":4329.8500000000004},null,-17,{"$f":"RTD(\"cqg.rtd\",,\"StudyData\",$H$5,\"Bar\",,\"Time\",\"5\",R24,,,,,\"T\")","v":44397.565972222219},{"$f":"RTD(\"cqg.rtd\",,\"StudyData\",$H$5,\"Bar\",,\"Open\",\"5\",R24,,,,,\"T\")","v":14533.18},{"$f":"RTD(\"cqg.rtd\",,\"StudyData\",$H$5,\"Bar\",,\"High\",\"5\",R24,,,,,\"T\")","v":14533.54},{"$f":"RTD(\"cqg.rtd\",,\"StudyData\",$H$5,\"Bar\",,\"Low\",\"5\",R24,,,,,\"T\")","v":14523.69},{"$f":"RTD(\"cqg.rtd\",,\"StudyData\",$H$5,\"Bar\",,\"Close\",\"5\",R24,,,,,\"T\")","v":14524.53}]
[null,null,null,null,null,null,null,null,null,null,-16,{"$f":"RTD(\"cqg.rtd\",,\"StudyData\",$C$5,\"Bar\",,\"Time\",\"5\",K25,,,,,\"T\")","v":44397.579861111109},{"$f":"RTD(\"cqg.rtd\",,\"StudyData\",$C$5,\"Bar\",,\"Open\",\"5\",K25,,,,,\"T\")","v":4329.72},{"$f":"RTD(\"cqg.rtd\",,\"StudyData\",$C$5,\"Bar\",,\"High\",\"5\",K25,,,,,\"T\")","v":4329.83},{"$f":"RTD(\"cqg.rtd\",,\"StudyData\",$C$5,\"Bar\",,\"Low\",\"5\",K25,,,,,\"T\")","v":4327.7},{"$f":"RTD(\"cqg.rtd\",,\"StudyData\",$C$5,\"Bar\",,\"Close\",\"5\",K25,,,,,\"T\")","v":4328.3},null,-16,{"$f":"RTD(\"cqg.rtd\",,\"StudyData\",$H$5,\"Bar\",,\"Time\",\"5\",R25,,,,,\"T\")","v":44397.569444444445},{"$f":"RTD(\"cqg.rtd\",,\"StudyData\",$H$5,\"Bar\",,\"Open\",\"5\",R25,,,,,\"T\")","v":14524.57},{"$f":"RTD(\"cqg.rtd\",,\"StudyData\",$H$5,\"Bar\",,\"High\",\"5\",R25,,,,,\"T\")","v":14529.03},{"$f":"RTD(\"cqg.rtd\",,\"StudyData\",$H$5,\"Bar\",,\"Low\",\"5\",R25,,,,,\"T\")","v":14517.33},{"$f":"RTD(\"cqg.rtd\",,\"StudyData\",$H$5,\"Bar\",,\"Close\",\"5\",R25,,,,,\"T\")","v":14520.12}]
[null,null,null,null,null,null,null,null,null,null,-15,{"$f":"RTD(\"cqg.rtd\",,\"StudyData\",$C$5,\"Bar\",,\"Time\",\"5\",K26,,,,,\"T\")","v":44397.583333333336},{"$f":"RTD(\"cqg.rtd\",,\"StudyData\",$C$5,\"Bar\",,\"Open\",\"5\",K26,,,,,\"T\")","v":4328.3500000000004},{"$f":"RTD(\"cqg.rtd\",,\"StudyData\",$C$5,\"Bar\",,\"High\",\"5\",K26,,,,,\"T\")","v":4330.8599999999997},{"$f":"RTD(\"cqg.rtd\",,\"StudyData\",$C$5,\"Bar\",,\"Low\",\"5\",K26,,,,,\"T\")","v":4328.3500000000004},{"$f":"RTD(\"cqg.rtd\",,\"StudyData\",$C$5,\"Bar\",,\"Close\",\"5\",K26,,,,,\"T\")","v":4330.66},null,-15,{"$f":"RTD(\"cqg.rtd\",,\"StudyData\",$H$5,\"Bar\",,\"Time\",\"5\",R26,,,,,\"T\")","v":44397.572916666664},{"$f":"RTD(\"cqg.rtd\",,\"StudyData\",$H$5,\"Bar\",,\"Open\",\"5\",R26,,,,,\"T\")","v":14520.14},{"$f":"RTD(\"cqg.rtd\",,\"StudyData\",$H$5,\"Bar\",,\"High\",\"5\",R26,,,,,\"T\")","v":14523.33},{"$f":"RTD(\"cqg.rtd\",,\"StudyData\",$H$5,\"Bar\",,\"Low\",\"5\",R26,,,,,\"T\")","v":14513.18},{"$f":"RTD(\"cqg.rtd\",,\"StudyData\",$H$5,\"Bar\",,\"Close\",\"5\",R26,,,,,\"T\")","v":14523.33}]
[null,null,"When entering symbols the \"F.US.\" for futures or the \"S.US.\" for stocks or the \"X.US.\" for indicies are required.",null,null,null,null,null,null,null,-14,{"$f":"RTD(\"cqg.rtd\",,\"StudyData\",$C$5,\"Bar\",,\"Time\",\"5\",K27,,,,,\"T\")","v":44397.586805555555},{"$f":"RTD(\"cqg.rtd\",,\"StudyData\",$C$5,\"Bar\",,\"Open\",\"5\",K27,,,,,\"T\")","v":4330.67},{"$f":"RTD(\"cqg.rtd\",,\"StudyData\",$C$5,\"Bar\",,\"High\",\"5\",K27,,,,,\"T\")","v":4332.38},{"$f":"RTD(\"cqg.rtd\",,\"StudyData\",$C$5,\"Bar\",,\"Low\",\"5\",K27,,,,,\"T\")","v":4330.58},{"$f":"RTD(\"cqg.rtd\",,\"StudyData\",$C$5,\"Bar\",,\"Close\",\"5\",K27,,,,,\"T\")","v":4330.78},null,-14,{"$f":"RTD(\"cqg.rtd\",,\"StudyData\",$H$5,\"Bar\",,\"Time\",\"5\",R27,,,,,\"T\")","v":44397.576388888891},{"$f":"RTD(\"cqg.rtd\",,\"StudyData\",$H$5,\"Bar\",,\"Open\",\"5\",R27,,,,,\"T\")","v":14523.5},{"$f":"RTD(\"cqg.rtd\",,\"StudyData\",$H$5,\"Bar\",,\"High\",\"5\",R27,,,,,\"T\")","v":14530.19},{"$f":"RTD(\"cqg.rtd\",,\"StudyData\",$H$5,\"Bar\",,\"Low\",\"5\",R27,,,,,\"T\")","v":14523.5},{"$f":"RTD(\"cqg.rtd\",,\"StudyData\",$H$5,\"Bar\",,\"Close\",\"5\",R27,,,,,\"T\")","v":14529.22}]
[null,null,"Use all capital letters.",null,null,null,null,null,null,null,-13,{"$f":"RTD(\"cqg.rtd\",,\"StudyData\",$C$5,\"Bar\",,\"Time\",\"5\",K28,,,,,\"T\")","v":44397.590277777781},{"$f":"RTD(\"cqg.rtd\",,\"StudyData\",$C$5,\"Bar\",,\"Open\",\"5\",K28,,,,,\"T\")","v":4330.8100000000004},{"$f":"RTD(\"cqg.rtd\",,\"StudyData\",$C$5,\"Bar\",,\"High\",\"5\",K28,,,,,\"T\")","v":4336.21},{"$f":"RTD(\"cqg.rtd\",,\"StudyData\",$C$5,\"Bar\",,\"Low\",\"5\",K28,,,,,\"T\")","v":4330.8100000000004},{"$f":"RTD(\"cqg.rtd\",,\"StudyData\",$C$5,\"Bar\",,\"Close\",\"5\",K28,,,,,\"T\")","v":4335.5200000000004},null,-13,{"$f":"RTD(\"cqg.rtd\",,\"StudyData\",$H$5,\"Bar\",,\"Time\",\"5\",R28,,,,,\"T\")","v":44397.579861111109},{"$f":"RTD(\"cqg.rtd\",,\"StudyData\",$H$5,\"Bar\",,\"Open\",\"5\",R28,,,,,\"T\")","v":14529.19},{"$f":"RTD(\"cqg.rtd\",,\"StudyData\",$H$5,\"Bar\",,\"High\",\"5\",R28,,,,,\"T\")","v":14529.19},{"$f":"RTD(\"cqg.rtd\",,\"StudyData\",$H$5,\"Bar\",,\"Low\",\"5\",R28,,,,,\"T\")","v":14522.91},{"$f":"RTD(\"cqg.rtd\",,\"StudyData\",$H$5,\"Bar\",,\"Close\",\"5\",R28,,,,,\"T\")","v":14525.55}]
[null,null,null,null,null,null,null,null,null,null,-12,{"$f":"RTD(\"cqg.rtd\",,\"StudyData\",$C$5,\"Bar\",,\"Time\",\"5\",K29,,,,,\"T\")","v":44397.59375},{"$f":"RTD(\"cqg.rtd\",,\"StudyData\",$C$5,\"Bar\",,\"Open\",\"5\",K29,,,,,\"T\")","v":4335.5200000000004},{"$f":"RTD(\"cqg.rtd\",,\"StudyData\",$C$5,\"Bar\",,\"High\",\"5\",K29,,,,,\"T\")","v":4336.09},{"$f":"RTD(\"cqg.rtd\",,\"StudyData\",$C$5,\"Bar\",,\"Low\",\"5\",K29,,,,,\"T\")","v":4334.53},{"$f":"RTD(\"cqg.rtd\",,\"StudyData\",$C$5,\"Bar\",,\"Close\",\"5\",K29,,,,,\"T\")","v":4335},null,-12,{"$f":"RTD(\"cqg.rtd\",,\"StudyData\",$H$5,\"Bar\",,\"Time\",\"5\",R29,,,,,\"T\")","v":44397.583333333336},{"$f":"RTD(\"cqg.rtd\",,\"StudyData\",$H$5,\"Bar\",,\"Open\",\"5\",R29,,,,,\"T\")","v":14525.54},{"$f":"RTD(\"cqg.rtd\",,\"StudyData\",$H$5,\"Bar\",,\"High\",\"5\",R29,,,,,\"T\")","v":14537.32},{"$f":"RTD(\"cqg.rtd\",,\"StudyData\",$H$5,\"Bar\",,\"Low\",\"5\",R29,,,,,\"T\")","v":14524.84},{"$f":"RTD(\"cqg.rtd\",,\"StudyData\",$H$5,\"Bar\",,\"Close\",\"5\",R29,,,,,\"T\")","v":14537.31}]
[null,null,null,null,null,null,null,null,null,null,-11,{"$f":"RTD(\"cqg.rtd\",,\"StudyData\",$C$5,\"Bar\",,\"Time\",\"5\",K30,,,,,\"T\")","v":44397.597222222219},{"$f":"RTD(\"cqg.rtd\",,\"StudyData\",$C$5,\"Bar\",,\"Open\",\"5\",K30,,,,,\"T\")","v":4334.9799999999996},{"$f":"RTD(\"cqg.rtd\",,\"StudyData\",$C$5,\"Bar\",,\"High\",\"5\",K30,,,,,\"T\")","v":4336.51},{"$f":"RTD(\"cqg.rtd\",,\"StudyData\",$C$5,\"Bar\",,\"Low\",\"5\",K30,,,,,\"T\")","v":4334.9799999999996},{"$f":"RTD(\"cqg.rtd\",,\"StudyData\",$C$5,\"Bar\",,\"Close\",\"5\",K30,,,,,\"T\")","v":4336.2700000000004},null,-11,{"$f":"RTD(\"cqg.rtd\",,\"StudyData\",$H$5,\"Bar\",,\"Time\",\"5\",R30,,,,,\"T\")","v":44397.586805555555},{"$f":"RTD(\"cqg.rtd\",,\"StudyData\",$H$5,\"Bar\",,\"Open\",\"5\",R30,,,,,\"T\")","v":14537.27},{"$f":"RTD(\"cqg.rtd\",,\"StudyData\",$H$5,\"Bar\",,\"High\",\"5\",R30,,,,,\"T\")","v":14541.07},{"$f":"RTD(\"cqg.rtd\",,\"StudyData\",$H$5,\"Bar\",,\"Low\",\"5\",R30,,,,,\"T\")","v":14535.55},{"$f":"RTD(\"cqg.rtd\",,\"StudyData\",$H$5,\"Bar\",,\"Close\",\"5\",R30,,,,,\"T\")","v":14535.75}]
[null,null,null,null,null,null,null,null,null,null,-10,{"$f":"RTD(\"cqg.rtd\",,\"StudyData\",$C$5,\"Bar\",,\"Time\",\"5\",K31,,,,,\"T\")","v":44397.600694444445},{"$f":"RTD(\"cqg.rtd\",,\"StudyData\",$C$5,\"Bar\",,\"Open\",\"5\",K31,,,,,\"T\")","v":4336.25},{"$f":"RTD(\"cqg.rtd\",,\"StudyData\",$C$5,\"Bar\",,\"High\",\"5\",K31,,,,,\"T\")","v":4336.84},{"$f":"RTD(\"cqg.rtd\",,\"StudyData\",$C$5,\"Bar\",,\"Low\",\"5\",K31,,,,,\"T\")","v":4332.54},{"$f":"RTD(\"cqg.rtd\",,\"StudyData\",$C$5,\"Bar\",,\"Close\",\"5\",K31,,,,,\"T\")","v":4333.66},null,-10,{"$f":"RTD(\"cqg.rtd\",,\"StudyData\",$H$5,\"Bar\",,\"Time\",\"5\",R31,,,,,\"T\")","v":44397.590277777781},{"$f":"RTD(\"cqg.rtd\",,\"StudyData\",$H$5,\"Bar\",,\"Open\",\"5\",R31,,,,,\"T\")","v":14535.73},{"$f":"RTD(\"cqg.rtd\",,\"StudyData\",$H$5,\"Bar\",,\"High\",\"5\",R31,,,,,\"T\")","v":14551.2},{"$f":"RTD(\"cqg.rtd\",,\"StudyData\",$H$5,\"Bar\",,\"Low\",\"5\",R31,,,,,\"T\")","v":14535.73},{"$f":"RTD(\"cqg.rtd\",,\"StudyData\",$H$5,\"Bar\",,\"Close\",\"5\",R31,,,,,\"T\")","v":14549.42}]
[null,null,null,null,null,null,null,null,null,null,-9,{"$f":"RTD(\"cqg.rtd\",,\"StudyData\",$C$5,\"Bar\",,\"Time\",\"5\",K32,,,,,\"T\")","v":44397.604166666664},{"$f":"RTD(\"cqg.rtd\",,\"StudyData\",$C$5,\"Bar\",,\"Open\",\"5\",K32,,,,,\"T\")","v":4333.66},{"$f":"RTD(\"cqg.rtd\",,\"StudyData\",$C$5,\"Bar\",,\"High\",\"5\",K32,,,,,\"T\")","v":4334.38},{"$f":"RTD(\"cqg.rtd\",,\"StudyData\",$C$5,\"Bar\",,\"Low\",\"5\",K32,,,,,\"T\")","v":4331.58},{"$f":"RTD(\"cqg.rtd\",,\"StudyData\",$C$5,\"Bar\",,\"Close\",\"5\",K32,,,,,\"T\")","v":4332.7},null,-9,{"$f":"RTD(\"cqg.rtd\",,\"StudyData\",$H$5,\"Bar\",,\"Time\",\"5\",R32,,,,,\"T\")","v":44397.59375},{"$f":"RTD(\"cqg.rtd\",,\"StudyData\",$H$5,\"Bar\",,\"Open\",\"5\",R32,,,,,\"T\")","v":14549.23},{"$f":"RTD(\"cqg.rtd\",,\"StudyData\",$H$5,\"Bar\",,\"High\",\"5\",R32,,,,,\"T\")","v":14551.68},{"$f":"RTD(\"cqg.rtd\",,\"StudyData\",$H$5,\"Bar\",,\"Low\",\"5\",R32,,,,,\"T\")","v":14544.34},{"$f":"RTD(\"cqg.rtd\",,\"StudyData\",$H$5,\"Bar\",,\"Close\",\"5\",R32,,,,,\"T\")","v":14545.41}]
[null,null,null,null,null,null,null,null,null,null,-8,{"$f":"RTD(\"cqg.rtd\",,\"StudyData\",$C$5,\"Bar\",,\"Time\",\"5\",K33,,,,,\"T\")","v":44397.607638888891},{"$f":"RTD(\"cqg.rtd\",,\"StudyData\",$C$5,\"Bar\",,\"Open\",\"5\",K33,,,,,\"T\")","v":4332.82},{"$f":"RTD(\"cqg.rtd\",,\"StudyData\",$C$5,\"Bar\",,\"High\",\"5\",K33,,,,,\"T\")","v":4332.82},{"$f":"RTD(\"cqg.rtd\",,\"StudyData\",$C$5,\"Bar\",,\"Low\",\"5\",K33,,,,,\"T\")","v":4331.24},{"$f":"RTD(\"cqg.rtd\",,\"StudyData\",$C$5,\"Bar\",,\"Close\",\"5\",K33,,,,,\"T\")","v":4331.6000000000004},null,-8,{"$f":"RTD(\"cqg.rtd\",,\"StudyData\",$H$5,\"Bar\",,\"Time\",\"5\",R33,,,,,\"T\")","v":44397.597222222219},{"$f":"RTD(\"cqg.rtd\",,\"StudyData\",$H$5,\"Bar\",,\"Open\",\"5\",R33,,,,,\"T\")","v":14545.41},{"$f":"RTD(\"cqg.rtd\",,\"StudyData\",$H$5,\"Bar\",,\"High\",\"5\",R33,,,,,\"T\")","v":14552.51},{"$f":"RTD(\"cqg.rtd\",,\"StudyData\",$H$5,\"Bar\",,\"Low\",\"5\",R33,,,,,\"T\")","v":14544.96},{"$f":"RTD(\"cqg.rtd\",,\"StudyData\",$H$5,\"Bar\",,\"Close\",\"5\",R33,,,,,\"T\")","v":14551.19}]
[null,null,null,null,null,null,null,null,null,null,-7,{"$f":"RTD(\"cqg.rtd\",,\"StudyData\",$C$5,\"Bar\",,\"Time\",\"5\",K34,,,,,\"T\")","v":44397.611111111109},{"$f":"RTD(\"cqg.rtd\",,\"StudyData\",$C$5,\"Bar\",,\"Open\",\"5\",K34,,,,,\"T\")","v":4331.6000000000004},{"$f":"RTD(\"cqg.rtd\",,\"StudyData\",$C$5,\"Bar\",,\"High\",\"5\",K34,,,,,\"T\")","v":4332.6099999999997},{"$f":"RTD(\"cqg.rtd\",,\"StudyData\",$C$5,\"Bar\",,\"Low\",\"5\",K34,,,,,\"T\")","v":4330.58},{"$f":"RTD(\"cqg.rtd\",,\"StudyData\",$C$5,\"Bar\",,\"Close\",\"5\",K34,,,,,\"T\")","v":4330.92},null,-7,{"$f":"RTD(\"cqg.rtd\",,\"StudyData\",$H$5,\"Bar\",,\"Time\",\"5\",R34,,,,,\"T\")","v":44397.600694444445},{"$f":"RTD(\"cqg.rtd\",,\"StudyData\",$H$5,\"Bar\",,\"Open\",\"5\",R34,,,,,\"T\")","v":14551.2},{"$f":"RTD(\"cqg.rtd\",,\"StudyData\",$H$5,\"Bar\",,\"High\",\"5\",R34,,,,,\"T\")","v":14552.73},{"$f":"RTD(\"cqg.rtd\",,\"StudyData\",$H$5,\"Bar\",,\"Low\",\"5\",R34,,,,,\"T\")","v":14545.59},{"$f":"RTD(\"cqg.rtd\",,\"StudyData\",$H$5,\"Bar\",,\"Close\",\"5\",R34,,,,,\"T\")","v":14550.49}]
[null,null,null,null,null,null,null,null,null,null,-6,{"$f":"RTD(\"cqg.rtd\",,\"StudyData\",$C$5,\"Bar\",,\"Time\",\"5\",K35,,,,,\"T\")","v":44397.614583333336},{"$f":"RTD(\"cqg.rtd\",,\"StudyData\",$C$5,\"Bar\",,\"Open\",\"5\",K35,,,,,\"T\")","v":4330.79},{"$f":"RTD(\"cqg.rtd\",,\"StudyData\",$C$5,\"Bar\",,\"High\",\"5\",K35,,,,,\"T\")","v":4331.26},{"$f":"RTD(\"cqg.rtd\",,\"StudyData\",$C$5,\"Bar\",,\"Low\",\"5\",K35,,,,,\"T\")","v":4329.72},{"$f":"RTD(\"cqg.rtd\",,\"StudyData\",$C$5,\"Bar\",,\"Close\",\"5\",K35,,,,,\"T\")","v":4331.13},null,-6,{"$f":"RTD(\"cqg.rtd\",,\"StudyData\",$H$5,\"Bar\",,\"Time\",\"5\",R35,,,,,\"T\")","v":44397.604166666664},{"$f":"RTD(\"cqg.rtd\",,\"StudyData\",$H$5,\"Bar\",,\"Open\",\"5\",R35,,,,,\"T\")","v":14550.71},{"$f":"RTD(\"cqg.rtd\",,\"StudyData\",$H$5,\"Bar\",,\"High\",\"5\",R35,,,,,\"T\")","v":14555.75},{"$f":"RTD(\"cqg.rtd\",,\"StudyData\",$H$5,\"Bar\",,\"Low\",\"5\",R35,,,,,\"T\")","v":14548.68},{"$f":"RTD(\"cqg.rtd\",,\"StudyData\",$H$5,\"Bar\",,\"Close\",\"5\",R35,,,,,\"T\")","v":14550.33}]
[null,null,null,null,null,null,null,null,null,null,-5,{"$f":"RTD(\"cqg.rtd\",,\"StudyData\",$C$5,\"Bar\",,\"Time\",\"5\",K36,,,,,\"T\")","v":44397.618055555555},{"$f":"RTD(\"cqg.rtd\",,\"StudyData\",$C$5,\"Bar\",,\"Open\",\"5\",K36,,,,,\"T\")","v":4331.4399999999996},{"$f":"RTD(\"cqg.rtd\",,\"StudyData\",$C$5,\"Bar\",,\"High\",\"5\",K36,,,,,\"T\")","v":4333.37},{"$f":"RTD(\"cqg.rtd\",,\"StudyData\",$C$5,\"Bar\",,\"Low\",\"5\",K36,,,,,\"T\")","v":4327.1000000000004},{"$f":"RTD(\"cqg.rtd\",,\"StudyData\",$C$5,\"Bar\",,\"Close\",\"5\",K36,,,,,\"T\")","v":4331.18},null,-5,{"$f":"RTD(\"cqg.rtd\",,\"StudyData\",$H$5,\"Bar\",,\"Time\",\"5\",R36,,,,,\"T\")","v":44397.607638888891},{"$f":"RTD(\"cqg.rtd\",,\"StudyData\",$H$5,\"Bar\",,\"Open\",\"5\",R36,,,,,\"T\")","v":14550.63},{"$f":"RTD(\"cqg.rtd\",,\"StudyData\",$H$5,\"Bar\",,\"High\",\"5\",R36,,,,,\"T\")","v":14551.14},{"$f":"RTD(\"cqg.rtd\",,\"StudyData\",$H$5,\"Bar\",,\"Low\",\"5\",R36,,,,,\"T\")","v":14546.06},{"$f":"RTD(\"cqg.rtd\",,\"StudyData\",$H$5,\"Bar\",,\"Close\",\"5\",R36,,,,,\"T\")","v":14547.59}]
[null,null,null,null,null,null,null,null,null,null,-4,{"$f":"RTD(\"cqg.rtd\",,\"StudyData\",$C$5,\"Bar\",,\"Time\",\"5\",K37,,,,,\"T\")","v":44397.621527777781},{"$f":"RTD(\"cqg.rtd\",,\"StudyData\",$C$5,\"Bar\",,\"Open\",\"5\",K37,,,,,\"T\")","v":4331.2},{"$f":"RTD(\"cqg.rtd\",,\"StudyData\",$C$5,\"Bar\",,\"High\",\"5\",K37,,,,,\"T\")","v":4331.2},{"$f":"RTD(\"cqg.rtd\",,\"StudyData\",$C$5,\"Bar\",,\"Low\",\"5\",K37,,,,,\"T\")","v":4323.0600000000004},{"$f":"RTD(\"cqg.rtd\",,\"StudyData\",$C$5,\"Bar\",,\"Close\",\"5\",K37,,,,,\"T\")","v":4323.0600000000004},null,-4,{"$f":"RTD(\"cqg.rtd\",,\"StudyData\",$H$5,\"Bar\",,\"Time\",\"5\",R37,,,,,\"T\")","v":44397.611111111109},{"$f":"RTD(\"cqg.rtd\",,\"StudyData\",$H$5,\"Bar\",,\"Open\",\"5\",R37,,,,,\"T\")","v":14547.47},{"$f":"RTD(\"cqg.rtd\",,\"StudyData\",$H$5,\"Bar\",,\"High\",\"5\",R37,,,,,\"T\")","v":14548.44},{"$f":"RTD(\"cqg.rtd\",,\"StudyData\",$H$5,\"Bar\",,\"Low\",\"5\",R37,,,,,\"T\")","v":14541.52},{"$f":"RTD(\"cqg.rtd\",,\"StudyData\",$H$5,\"Bar\",,\"Close\",\"5\",R37,,,,,\"T\")","v":14545.39}]
[null,null,null,null,null,null,null,null,null,null,-3,{"$f":"RTD(\"cqg.rtd\",,\"StudyData\",$C$5,\"Bar\",,\"Time\",\"5\",K38,,,,,\"T\")","v":44397.625},{"$f":"RTD(\"cqg.rtd\",,\"StudyData\",$C$5,\"Bar\",,\"Open\",\"5\",K38,,,,,\"T\")","v":4323.08},{"$f":"RTD(\"cqg.rtd\",,\"StudyData\",$C$5,\"Bar\",,\"High\",\"5\",K38,,,,,\"T\")","v":4323.3599999999997},{"$f":"RTD(\"cqg.rtd\",,\"StudyData\",$C$5,\"Bar\",,\"Low\",\"5\",K38,,,,,\"T\")","v":4323.07},{"$f":"RTD(\"cqg.rtd\",,\"StudyData\",$C$5,\"Bar\",,\"Close\",\"5\",K38,,,,,\"T\")","v":4323.07},null,-3,{"$f":"RTD(\"cqg.rtd\",,\"StudyData\",$H$5,\"Bar\",,\"Time\",\"5\",R38,,,,,\"T\")","v":44397.614583333336},{"$f":"RTD(\"cqg.rtd\",,\"StudyData\",$H$5,\"Bar\",,\"Open\",\"5\",R38,,,,,\"T\")","v":14545.11},{"$f":"RTD(\"cqg.rtd\",,\"StudyData\",$H$5,\"Bar\",,\"High\",\"5\",R38,,,,,\"T\")","v":14545.99},{"$f":"RTD(\"cqg.rtd\",,\"StudyData\",$H$5,\"Bar\",,\"Low\",\"5\",R38,,,,,\"T\")","v":14536.55},{"$f":"RTD(\"cqg.rtd\",,\"StudyData\",$H$5,\"Bar\",,\"Close\",\"5\",R38,,,,,\"T\")","v":14540.48}]
[null,null,null,null,null,null,null,null,null,null,-2,{"$f":"RTD(\"cqg.rtd\",,\"StudyData\",$C$5,\"Bar\",,\"Time\",\"5\",K39,,,,,\"T\")","v":44397.628472222219},{"$f":"RTD(\"cqg.rtd\",,\"StudyData\",$C$5,\"Bar\",,\"Open\",\"5\",K39,,,,,\"T\")","v":4323.0600000000004},{"$f":"RTD(\"cqg.rtd\",,\"StudyData\",$C$5,\"Bar\",,\"High\",\"5\",K39,,,,,\"T\")","v":4323.07},{"$f":"RTD(\"cqg.rtd\",,\"StudyData\",$C$5,\"Bar\",,\"Low\",\"5\",K39,,,,,\"T\")","v":4323.0600000000004},{"$f":"RTD(\"cqg.rtd\",,\"StudyData\",$C$5,\"Bar\",,\"Close\",\"5\",K39,,,,,\"T\")","v":4323.0600000000004},null,-2,{"$f":"RTD(\"cqg.rtd\",,\"StudyData\",$H$5,\"Bar\",,\"Time\",\"5\",R39,,,,,\"T\")","v":44397.618055555555},{"$f":"RTD(\"cqg.rtd\",,\"StudyData\",$H$5,\"Bar\",,\"Open\",\"5\",R39,,,,,\"T\")","v":14543.33},{"$f":"RTD(\"cqg.rtd\",,\"StudyData\",$H$5,\"Bar\",,\"High\",\"5\",R39,,,,,\"T\")","v":14544.4},{"$f":"RTD(\"cqg.rtd\",,\"StudyData\",$H$5,\"Bar\",,\"Low\",\"5\",R39,,,,,\"T\")","v":14521.91},{"$f":"RTD(\"cqg.rtd\",,\"StudyData\",$H$5,\"Bar\",,\"Close\",\"5\",R39,,,,,\"T\")","v":14532.65}]
[null,null,null,null,null,null,null,null,null,null,-1,{"$f":"RTD(\"cqg.rtd\",,\"StudyData\",$C$5,\"Bar\",,\"Time\",\"5\",K40,,,,,\"T\")","v":44397.631944444445},{"$f":"RTD(\"cqg.rtd\",,\"StudyData\",$C$5,\"Bar\",,\"Open\",\"5\",K40,,,,,\"T\")","v":4323.0600000000004},{"$f":"RTD(\"cqg.rtd\",,\"StudyData\",$C$5,\"Bar\",,\"High\",\"5\",K40,,,,,\"T\")","v":4323.0600000000004},{"$f":"RTD(\"cqg.rtd\",,\"StudyData\",$C$5,\"Bar\",,\"Low\",\"5\",K40,,,,,\"T\")","v":4323.0600000000004},{"$f":"RTD(\"cqg.rtd\",,\"StudyData\",$C$5,\"Bar\",,\"Close\",\"5\",K40,,,,,\"T\")","v":4323.0600000000004},null,-1,{"$f":"RTD(\"cqg.rtd\",,\"StudyData\",$H$5,\"Bar\",,\"Time\",\"5\",R40,,,,,\"T\")","v":44397.621527777781},{"$f":"RTD(\"cqg.rtd\",,\"StudyData\",$H$5,\"Bar\",,\"Open\",\"5\",R40,,,,,\"T\")","v":14532.89},{"$f":"RTD(\"cqg.rtd\",,\"StudyData\",$H$5,\"Bar\",,\"High\",\"5\",R40,,,,,\"T\")","v":14532.89},{"$f":"RTD(\"cqg.rtd\",,\"StudyData\",$H$5,\"Bar\",,\"Low\",\"5\",R40,,,,,\"T\")","v":14498.28},{"$f":"RTD(\"cqg.rtd\",,\"StudyData\",$H$5,\"Bar\",,\"Close\",\"5\",R40,,,,,\"T\")","v":14498.88}]
[null,null,null,null,null,null,null,null,null,null,0,{"$f":"RTD(\"cqg.rtd\",,\"StudyData\",$C$5,\"Bar\",,\"Time\",\"5\",K41,,,,,\"T\")","v":44398.354166666664},{"$f":"IF(RTD(\"cqg.rtd\",,\"StudyData\",$C$5,\"Bar\",,\"Open\",\"5\",K41,,,,,\"T\")=\"\",NA(),RTD(\"cqg.rtd\",,\"StudyData\",$C$5,\"Bar\",,\"Open\",\"5\",K41,,,,,\"T\"))","v":4331.13},{"$f":"IF(RTD(\"cqg.rtd\",,\"StudyData\",$C$5,\"Bar\",,\"High\",\"5\",K41,,,,,\"T\")=\"\",NA(),RTD(\"cqg.rtd\",,\"StudyData\",$C$5,\"Bar\",,\"High\",\"5\",K41,,,,,\"T\"))","v":4339.99},{"$f":"IF(RTD(\"cqg.rtd\",,\"StudyData\",$C$5,\"Bar\",,\"Low\",\"5\",K41,,,,,\"T\")=\"\",NA(),RTD(\"cqg.rtd\",,\"StudyData\",$C$5,\"Bar\",,\"Low\",\"5\",K41,,,,,\"T\"))","v":4331.13},{"$f":"IF(RTD(\"cqg.rtd\",,\"StudyData\",$C$5,\"Bar\",,\"Close\",\"5\",K41,,,,,\"T\")=\"\",NA(),RTD(\"cqg.rtd\",,\"StudyData\",$C$5,\"Bar\",,\"Close\",\"5\",K41,,,,,\"T\"))","v":4337.79},null,0,{"$f":"RTD(\"cqg.rtd\",,\"StudyData\",$H$5,\"Bar\",,\"Time\",\"5\",R41,,,,,\"T\")","v":44398.354166666664},{"$f":"IF(RTD(\"cqg.rtd\",,\"StudyData\",$H$5,\"Bar\",,\"Open\",\"5\",R41,,,,,\"T\")=\"\",NA(),RTD(\"cqg.rtd\",,\"StudyData\",$H$5,\"Bar\",,\"Open\",\"5\",R41,,,,,\"T\"))","v":14508.75},{"$f":"IF(RTD(\"cqg.rtd\",,\"StudyData\",$H$5,\"Bar\",,\"High\",\"5\",R41,,,,,\"T\")=\"\",NA(),RTD(\"cqg.rtd\",,\"StudyData\",$H$5,\"Bar\",,\"High\",\"5\",R41,,,,,\"T\"))","v":14518.98},{"$f":"IF(RTD(\"cqg.rtd\",,\"StudyData\",$H$5,\"Bar\",,\"Low\",\"5\",R41,,,,,\"T\")=\"\",NA(),RTD(\"cqg.rtd\",,\"StudyData\",$H$5,\"Bar\",,\"Low\",\"5\",R41,,,,,\"T\"))","v":14498.65},{"$f":"IF(RTD(\"cqg.rtd\",,\"StudyData\",$H$5,\"Bar\",,\"Close\",\"5\",R41,,,,,\"T\")=\"\",NA(),RTD(\"cqg.rtd\",,\"StudyData\",$H$5,\"Bar\",,\"Close\",\"5\",R41,,,,,\"T\"))","v":14518.98}]

{"sheet":"NASDAQ100","index":2,"n_rows":508,"n_cols":15,"rows_kept":508,"cut":false,"hidden":true,"merged":[]}
[null,null,"S.US.AAPL",{"$f":"IFERROR(RTD(\"cqg.rtd\", ,\"ContractData\",C1, \"PerCentNetLastTrade\",, \"T\")/100,\"\")","v":-2.8737598357851525E-3},79,{"$f":"IFERROR(E1,\"\")","v":79},{"$f":"C1","v":"S.US.AAPL"},1,{"$f":"IFERROR(VLOOKUP(H1,$F$1:$G$103,2,FALSE),\"\")","v":"S.US.ASML"},{"$f":"IFERROR(RTD(\"cqg.rtd\", ,\"ContractData\",I1, \"PerCentNetLastTrade\",, \"T\")/100,\"\")","v":2.9895475476938823E-2},null,{"$f":"MIN(D1:D102)","v":-2.2699169757993288E-2},{"$f":"VLOOKUP(L1,$D$1:$G$103,2,FALSE)","v":102},{"$f":"VLOOKUP(M1,$F$1:$G$103,2,FALSE)","v":"S.US.NTES"},{"$f":"IFERROR(RTD(\"cqg.rtd\", ,\"ContractData\",N1, \"PerCentNetLastTrade\",, \"T\")/100,\"\")","v":-2.2699169757993288E-2}]
[null,null,"S.US.ADBE",{"$f":"IFERROR(RTD(\"cqg.rtd\", ,\"ContractData\",C2, \"PerCentNetLastTrade\",, \"T\")/100,\"\")","v":-4.1891181495597321E-3},88,{"$f":"IFERROR(E2,\"\")","v":88},{"$f":"C2","v":"S.US.ADBE"},{"$f":"H1+1","v":2},"S.US.CHKP",{"$f":"IFERROR(RTD(\"cqg.rtd\", ,\"ContractData\",I2, \"PerCentNetLastTrade\",, \"T\")/100,\"\")","v":1.7895255294697095E-2},null,null,{"$f":"M1-1","v":101},{"$f":"VLOOKUP(M2,$F$1:$G$103,2,FALSE)","v":"S.US.NFLX"},{"$f":"IFERROR(RTD(\"cqg.rtd\", ,\"ContractData\",N2, \"PerCentNetLastTrade\",, \"T\")/100,\"\")","v":-1.2541191978156483E-2}]
[null,null,"S.US.ADI",{"$f":"IFERROR(RTD(\"cqg.rtd\", ,\"ContractData\",C3, \"PerCentNetLastTrade\",, \"T\")/100,\"\")","v":5.7174818221365983E-3},25,25,{"$f":"C3","v":"S.US.ADI"},{"$f":"H2+1","v":3},"S.US.NVDA",{"$f":"IFERROR(RTD(\"cqg.rtd\", ,\"ContractData\",I3, \"PerCentNetLastTrade\",, \"T\")/100,\"\")","v":1.6118633139909733E-2},null,null,{"$f":"M2-1","v":100},"S.US.ILMN",{"$f":"IFERROR(RTD(\"cqg.rtd\", ,\"ContractData\",N3, \"PerCentNetLastTrade\",, \"T\")/100,\"\")","v":-1.0076962544894819E-2}]
[null,null,"S.US.ADP",{"$f":"IFERROR(RTD(\"cqg.rtd\", ,\"ContractData\",C4, \"PerCentNetLastTrade\",, \"T\")/100,\"\")","v":5.9072560795510483E-4},53,53,"S.US.ADP",4,"S.US.LBTYA",{"$f":"IFERROR(RTD(\"cqg.rtd\", ,\"ContractData\",I4, \"PerCentNetLastTrade\",, \"T\")/100,\"\")","v":1.6323357947920714E-2},null,null,99,"S.US.ZM",{"$f":"IFERROR(RTD(\"cqg.rtd\", ,\"ContractData\",N4, \"PerCentNetLastTrade\",, \"T\")/100,\"\")","v":-7.4477951715803377E-3}]
[null,null,"S.US.ADSK",{"$f":"IFERROR(RTD(\"cqg.rtd\", ,\"ContractData\",C5, \"PerCentNetLastTrade\",, \"T\")/100,\"\")","v":-2.6002971768202083E-3},75,75,"S.US.ADSK",5,"S.US.LBTYK",{"$f":"IFERROR(RTD(\"cqg.rtd\", ,\"ContractData\",I5, \"PerCentNetLastTrade\",, \"T\")/100,\"\")","v":1.6178736517719571E-2},null,null,98,"S.US.REGN",{"$f":"IFERROR(RTD(\"cqg.rtd\", ,\"ContractData\",N5, \"PerCentNetLastTrade\",, \"T\")/100,\"\")","v":-7.2542742320005453E-3}]
[null,null,"S.US.ALGN",{"$f":"IFERROR(RTD(\"cqg.rtd\", ,\"ContractData\",C6, \"PerCentNetLastTrade\",, \"T\")/100,\"\")","v":4.3851813353689238E-3},31,31,"S.US.ALGN",6,"S.US.EXPE",{"$f":"IFERROR(RTD(\"cqg.rtd\", ,\"ContractData\",I6, \"PerCentNetLastTrade\",, \"T\")/100,\"\")","v":1.6141429669485011E-2},null,null,97,"S.US.DOCU",{"$f":"IFERROR(RTD(\"cqg.rtd\", ,\"ContractData\",N6, \"PerCentNetLastTrade\",, \"T\")/100,\"\")","v":-9.293988780827829E-3}]
[null,null,"S.US.ALXN",{"$f":"IFERROR(RTD(\"cqg.rtd\", ,\"ContractData\",C7, \"PerCentNetLastTrade\",, \"T\")/100,\"\")","v":""},{"$error":"#VALUE!"},"","S.US.ALXN",7,"S.US.FOXA",{"$f":"IFERROR(RTD(\"cqg.rtd\", ,\"ContractData\",I7, \"PerCentNetLastTrade\",, \"T\")/100,\"\")","v":1.4583929082070346E-2},null,null,96,"S.US.WDAY",{"$f":"IFERROR(RTD(\"cqg.rtd\", ,\"ContractData\",N7, \"PerCentNetLastTrade\",, \"T\")/100,\"\")","v":-6.9315080362171303E-3}]
[null,null,"S.US.AMAT",{"$f":"IFERROR(RTD(\"cqg.rtd\", ,\"ContractData\",C8, \"PerCentNetLastTrade\",, \"T\")/100,\"\")","v":1.4094112298249601E-2},9,9,"S.US.AMAT",8,"S.US.EA",{"$f":"IFERROR(RTD(\"cqg.rtd\", ,\"ContractData\",I8, \"PerCentNetLastTrade\",, \"T\")/100,\"\")","v":1.4248245551853689E-2},null,null,95,"S.US.SNPS",{"$f":"IFERROR(RTD(\"cqg.rtd\", ,\"ContractData\",N8, \"PerCentNetLastTrade\",, \"T\")/100,\"\")","v":-6.7652668321997907E-3}]
[null,null,"S.US.AMD",{"$f":"IFERROR(RTD(\"cqg.rtd\", ,\"ContractData\",C9, \"PerCentNetLastTrade\",, \"T\")/100,\"\")","v":6.0842612788428417E-3},24,24,"S.US.AMD",9,"S.US.AMAT",{"$f":"IFERROR(RTD(\"cqg.rtd\", ,\"ContractData\",I9, \"PerCentNetLastTrade\",, \"T\")/100,\"\")","v":1.4094112298249601E-2},null,null,94,"S.US.SGEN",{"$f":"IFERROR(RTD(\"cqg.rtd\", ,\"ContractData\",N9, \"PerCentNetLastTrade\",, \"T\")/100,\"\")","v":-5.9876118375774253E-3}]
[null,null,"S.US.AMGN",{"$f":"IFERROR(RTD(\"cqg.rtd\", ,\"ContractData\",C10, \"PerCentNetLastTrade\",, \"T\")/100,\"\")","v":-3.9288752075823238E-3},86,86,"S.US.AMGN",10,"S.US.MAR",{"$f":"IFERROR(RTD(\"cqg.rtd\", ,\"ContractData\",I10, \"PerCentNetLastTrade\",, \"T\")/100,\"\")","v":1.3330371028660297E-2},null,null,93,"S.US.ANSS",{"$f":"IFERROR(RTD(\"cqg.rtd\", ,\"ContractData\",N10, \"PerCentNetLastTrade\",, \"T\")/100,\"\")","v":-5.3011086727277916E-3}]
[null,null,"S.US.AMZN",{"$f":"IFERROR(RTD(\"cqg.rtd\", ,\"ContractData\",C11, \"PerCentNetLastTrade\",, \"T\")/100,\"\")","v":6.3808529633184907E-4},52,52,"S.US.AMZN",11,"S.US.NXPI"]
[null,null,"S.US.ANSS",{"$f":"IFERROR(RTD(\"cqg.rtd\", ,\"ContractData\",C12, \"PerCentNetLastTrade\",, \"T\")/100,\"\")","v":-5.3011086727277916E-3},93,93,"S.US.ANSS",12,"S.US.ULTA"]
[null,null,"S.US.ASML",{"$f":"IFERROR(RTD(\"cqg.rtd\", ,\"ContractData\",C13, \"PerCentNetLastTrade\",, \"T\")/100,\"\")","v":2.9895475476938823E-2},1,1,"S.US.ASML",13,"S.US.KLAC"]
[null,null,"S.US.ATVI",{"$f":"IFERROR(RTD(\"cqg.rtd\", ,\"ContractData\",C14, \"PerCentNetLastTrade\",, \"T\")/100,\"\")","v":3.6061632608458093E-3},36,36,"S.US.ATVI",14,"S.US.LRCX"]
[null,null,"S.US.AVGO",{"$f":"IFERROR(RTD(\"cqg.rtd\", ,\"ContractData\",C15, \"PerCentNetLastTrade\",, \"T\")/100,\"\")","v":2.4968522589043727E-3},42,42,"S.US.AVGO",15,"S.US.SIRI"]
[null,null,"S.US.BIDU",{"$f":"IFERROR(RTD(\"cqg.rtd\", ,\"ContractData\",C16, \"PerCentNetLastTrade\",, \"T\")/100,\"\")","v":-1.0680757771656642E-3},64,64,"S.US.BIDU",16,"S.US.ISRG"]
[null,null,"S.US.BIIB",{"$f":"IFERROR(RTD(\"cqg.rtd\", ,\"ContractData\",C17, \"PerCentNetLastTrade\",, \"T\")/100,\"\")","v":-2.6047319296722375E-3},76,76,"S.US.BIIB",17,"S.US.FOX"]
[null,null,"S.US.BKNG",{"$f":"IFERROR(RTD(\"cqg.rtd\", ,\"ContractData\",C18, \"PerCentNetLastTrade\",, \"T\")/100,\"\")","v":7.388179851015992E-3},21,21,"S.US.BKNG",18,"S.US.TXN"]
[null,null,"S.US.BMRN",{"$f":"IFERROR(RTD(\"cqg.rtd\", ,\"ContractData\",C19, \"PerCentNetLastTrade\",, \"T\")/100,\"\")","v":3.7735849056603772E-4},57,57,"S.US.BMRN",19,"S.US.MCHP"]
[null,null,"S.US.CDNS",{"$f":"IFERROR(RTD(\"cqg.rtd\", ,\"ContractData\",C20, \"PerCentNetLastTrade\",, \"T\")/100,\"\")","v":-3.0760426353816438E-3},80,80,"S.US.CDNS",20,"S.US.ROST"]
[null,null,"S.US.CDW",{"$f":"IFERROR(RTD(\"cqg.rtd\", ,\"ContractData\",C21, \"PerCentNetLastTrade\",, \"T\")/100,\"\")","v":-1.4185201997276443E-3},67,67,"S.US.CDW",21,"S.US.BKNG"]
[null,null,"S.US.CERN",{"$f":"IFERROR(RTD(\"cqg.rtd\", ,\"ContractData\",C22, \"PerCentNetLastTrade\",, \"T\")/100,\"\")","v":-1.2851818532322323E-4},60,60,"S.US.CERN",22,"S.US.SBUX"]
[null,null,"S.US.CHKP",{"$f":"IFERROR(RTD(\"cqg.rtd\", ,\"ContractData\",C23, \"PerCentNetLastTrade\",, \"T\")/100,\"\")","v":1.7895255294697095E-2},2,2,"S.US.CHKP",23,"S.US.CSX"]
[null,null,"S.US.CHTR",{"$f":"IFERROR(RTD(\"cqg.rtd\", ,\"ContractData\",C24, \"PerCentNetLastTrade\",, \"T\")/100,\"\")","v":-5.2590572652902222E-3},85,85,"S.US.CHTR",24,"S.US.AMD"]
[null,null,"S.US.CMCSA",{"$f":"IFERROR(RTD(\"cqg.rtd\", ,\"ContractData\",C25, \"PerCentNetLastTrade\",, \"T\")/100,\"\")","v":5.2557813594954444E-4},50,50,"S.US.CMCSA",25,"S.US.ADI"]
[null,null,"S.US.COST",{"$f":"IFERROR(RTD(\"cqg.rtd\", ,\"ContractData\",C26, \"PerCentNetLastTrade\",, \"T\")/100,\"\")","v":-1.441476071497213E-3},68,68,"S.US.COST",26,"S.US.WBA"]
[null,null,"S.US.CPRT",{"$f":"IFERROR(RTD(\"cqg.rtd\", ,\"ContractData\",C27, \"PerCentNetLastTrade\",, \"T\")/100,\"\")","v":-1.5336354130359008E-3},71,71,"S.US.CPRT",27,"S.US.MXIM"]
[null,null,"S.US.CSCO",{"$f":"IFERROR(RTD(\"cqg.rtd\", ,\"ContractData\",C28, \"PerCentNetLastTrade\",, \"T\")/100,\"\")","v":-9.3318402388951102E-4},65,65,"S.US.CSCO",28,"S.US.TMUS"]
[null,null,"S.US.CSX",{"$f":"IFERROR(RTD(\"cqg.rtd\", ,\"ContractData\",C29, \"PerCentNetLastTrade\",, \"T\")/100,\"\")","v":6.4143681847338039E-3},23,23,"S.US.CSX",29,"S.US.FAST"]
[null,null,"S.US.CTAS",{"$f":"IFERROR(RTD(\"cqg.rtd\", ,\"ContractData\",C30, \"PerCentNetLastTrade\",, \"T\")/100,\"\")","v":4.3679342240493323E-4},56,56,"S.US.CTAS",30,"S.US.TCOM"]
[null,null,"S.US.CTSH",{"$f":"IFERROR(RTD(\"cqg.rtd\", ,\"ContractData\",C31, \"PerCentNetLastTrade\",, \"T\")/100,\"\")","v":1.4790711433219938E-4},59,59,"S.US.CTSH",31,"S.US.ALGN"]
[null,null,"S.US.CTXS",{"$f":"IFERROR(RTD(\"cqg.rtd\", ,\"ContractData\",C32, \"PerCentNetLastTrade\",, \"T\")/100,\"\")","v":-1.0460251046025104E-3},63,63,"S.US.CTXS",32,"S.US.QCOM"]
[null,null,"S.US.DLTR",{"$f":"IFERROR(RTD(\"cqg.rtd\", ,\"ContractData\",C33, \"PerCentNetLastTrade\",, \"T\")/100,\"\")","v":4.03999596000404E-3},34,34,"S.US.DLTR",33,{"$f":"IFERROR(VLOOKUP(H33,$F$1:$G$103,2,FALSE),\"\")","v":"S.US.TTWO"}]
[null,null,"S.US.DOCU",{"$f":"IFERROR(RTD(\"cqg.rtd\", ,\"ContractData\",C34, \"PerCentNetLastTrade\",, \"T\")/100,\"\")","v":-9.293988780827829E-3},97,97,"S.US.DOCU",34,"S.US.DLTR"]
[null,null,"S.US.DXCM",{"$f":"IFERROR(RTD(\"cqg.rtd\", ,\"ContractData\",C35, \"PerCentNetLastTrade\",, \"T\")/100,\"\")","v":-4.6236318963591688E-3},90,90,"S.US.DXCM",35,"S.US.KHC"]
[null,null,"S.US.EA",{"$f":"IFERROR(RTD(\"cqg.rtd\", ,\"ContractData\",C36, \"PerCentNetLastTrade\",, \"T\")/100,\"\")","v":1.4248245551853689E-2},8,8,"S.US.EA",36,"S.US.ATVI"]
[null,null,"S.US.EBAY",{"$f":"IFERROR(RTD(\"cqg.rtd\", ,\"ContractData\",C37, \"PerCentNetLastTrade\",, \"T\")/100,\"\")","v":2.8748023573379328E-3},40,40,"S.US.EBAY",37,"S.US.SWKS"]
[null,null,"S.US.EXC",{"$f":"IFERROR(RTD(\"cqg.rtd\", ,\"ContractData\",C38, \"PerCentNetLastTrade\",, \"T\")/100,\"\")","v":-2.6052974381241857E-3},77,77,"S.US.EXC",38,"S.US.MU"]
[null,null,"S.US.EXPE",{"$f":"IFERROR(RTD(\"cqg.rtd\", ,\"ContractData\",C39, \"PerCentNetLastTrade\",, \"T\")/100,\"\")","v":1.6141429669485011E-2},6,6,"S.US.EXPE",39,"S.US.PCAR"]
[null,null,"S.US.FAST",{"$f":"IFERROR(RTD(\"cqg.rtd\", ,\"ContractData\",C40, \"PerCentNetLastTrade\",, \"T\")/100,\"\")","v":4.6168051708217915E-3},29,29,"S.US.FAST",40,"S.US.EBAY"]
[null,null,"S.US.FB",{"$f":"IFERROR(RTD(\"cqg.rtd\", ,\"ContractData\",C41, \"PerCentNetLastTrade\",, \"T\")/100,\"\")","v":2.4878534215301762E-3},45,45,"S.US.FB",41,"S.US.MNST"]
[null,null,"S.US.FISV",{"$f":"IFERROR(RTD(\"cqg.rtd\", ,\"ContractData\",C42, \"PerCentNetLastTrade\",, \"T\")/100,\"\")","v":4.593899301727306E-4},55,55,"S.US.FISV",42,"S.US.AVGO"]
[null,null,"S.US.FOX",{"$f":"IFERROR(RTD(\"cqg.rtd\", ,\"ContractData\",C43, \"PerCentNetLastTrade\",, \"T\")/100,\"\")","v":1.3386066321874049E-2},17,17,"S.US.FOX",43,"S.US.LULU"]
[null,null,"S.US.FOXA",{"$f":"IFERROR(RTD(\"cqg.rtd\", ,\"ContractData\",C44, \"PerCentNetLastTrade\",, \"T\")/100,\"\")","v":1.4583929082070346E-2},7,7,"S.US.FOXA",44,"S.US.VRSK"]
[null,null,"S.US.GILD",{"$f":"IFERROR(RTD(\"cqg.rtd\", ,\"ContractData\",C45, \"PerCentNetLastTrade\",, \"T\")/100,\"\")","v":-4.048582995951417E-3},87,87,"S.US.GILD",45,"S.US.FB"]
[null,null,"S.US.GOOG",{"$f":"IFERROR(RTD(\"cqg.rtd\", ,\"ContractData\",C46, \"PerCentNetLastTrade\",, \"T\")/100,\"\")","v":-3.2989706448820189E-3},82,82,"S.US.GOOG",46,"S.US.MDLZ"]
[null,null,"S.US.GOOGL",{"$f":"IFERROR(RTD(\"cqg.rtd\", ,\"ContractData\",C47, \"PerCentNetLastTrade\",, \"T\")/100,\"\")","v":-9.9041672774236489E-4},62,62,"S.US.GOOGL",47,"S.US.KDP"]
[null,null,"S.US.IDXX",{"$f":"IFERROR(RTD(\"cqg.rtd\", ,\"ContractData\",C48, \"PerCentNetLastTrade\",, \"T\")/100,\"\")","v":-2.3454189635339637E-3},73,73,"S.US.IDXX",48,"S.US.XLNX"]
[null,null,"S.US.ILMN",{"$f":"IFERROR(RTD(\"cqg.rtd\", ,\"ContractData\",C49, \"PerCentNetLastTrade\",, \"T\")/100,\"\")","v":-1.0076962544894819E-2},100,100,"S.US.ILMN",49,"S.US.PDD"]
[null,null,"S.US.INCY",{"$f":"IFERROR(RTD(\"cqg.rtd\", ,\"ContractData\",C50, \"PerCentNetLastTrade\",, \"T\")/100,\"\")","v":-2.9036737785633126E-3},78,78,"S.US.INCY",50,"S.US.CMCSA"]
[null,null,"S.US.INTC",{"$f":"IFERROR(RTD(\"cqg.rtd\", ,\"ContractData\",C51, \"PerCentNetLastTrade\",, \"T\")/100,\"\")","v":-1.4482259232440262E-3},69,69,"S.US.INTC",51,"S.US.TSLA"]
[null,null,"S.US.INTU",{"$f":"IFERROR(RTD(\"cqg.rtd\", ,\"ContractData\",C52, \"PerCentNetLastTrade\",, \"T\")/100,\"\")","v":-5.2304546169576853E-3},92,92,"S.US.INTU",52,"S.US.AMZN"]
[null,null,"S.US.ISRG",{"$f":"IFERROR(RTD(\"cqg.rtd\", ,\"ContractData\",C53, \"PerCentNetLastTrade\",, \"T\")/100,\"\")","v":1.060677451442333E-2},16,16,"S.US.ISRG",53,"S.US.ADP"]
[null,null,"S.US.JD",{"$f":"IFERROR(RTD(\"cqg.rtd\", ,\"ContractData\",C54, \"PerCentNetLastTrade\",, \"T\")/100,\"\")","v":-9.4761066738865572E-4},61,61,"S.US.JD",54,"S.US.PAYX"]
[null,null,"S.US.KDP",{"$f":"IFERROR(RTD(\"cqg.rtd\", ,\"ContractData\",C55, \"PerCentNetLastTrade\",, \"T\")/100,\"\")","v":1.3931457230426303E-3},47,47,"S.US.KDP",55,"S.US.FISV"]
[null,null,"S.US.KHC",{"$f":"IFERROR(RTD(\"cqg.rtd\", ,\"ContractData\",C56, \"PerCentNetLastTrade\",, \"T\")/100,\"\")","v":3.8071065989847713E-3},35,35,"S.US.KHC",56,"S.US.CTAS"]
[null,null,"S.US.KLAC",{"$f":"IFERROR(RTD(\"cqg.rtd\", ,\"ContractData\",C57, \"PerCentNetLastTrade\",, \"T\")/100,\"\")","v":1.1725071836707733E-2},13,13,"S.US.KLAC",57,"S.US.BMRN"]
[null,null,"S.US.LBTYA",{"$f":"IFERROR(RTD(\"cqg.rtd\", ,\"ContractData\",C58, \"PerCentNetLastTrade\",, \"T\")/100,\"\")","v":1.6323357947920714E-2},4,4,"S.US.LBTYA",58,"S.US.PEP"]
[null,null,"S.US.LBTYK",{"$f":"IFERROR(RTD(\"cqg.rtd\", ,\"ContractData\",C59, \"PerCentNetLastTrade\",, \"T\")/100,\"\")","v":1.6178736517719571E-2},5,5,"S.US.LBTYK",59,"S.US.CTSH"]
[null,null,"S.US.LRCX",{"$f":"IFERROR(RTD(\"cqg.rtd\", ,\"ContractData\",C60, \"PerCentNetLastTrade\",, \"T\")/100,\"\")","v":1.1349223344149961E-2},14,14,"S.US.LRCX",60,"S.US.CERN"]
[null,null,"S.US.LULU",{"$f":"IFERROR(RTD(\"cqg.rtd\", ,\"ContractData\",C61, \"PerCentNetLastTrade\",, \"T\")/100,\"\")","v":2.3219410383511609E-3},43,43,"S.US.LULU",61,"S.US.JD"]
[null,null,"S.US.MAR",{"$f":"IFERROR(RTD(\"cqg.rtd\", ,\"ContractData\",C62, \"PerCentNetLastTrade\",, \"T\")/100,\"\")","v":1.3330371028660297E-2},10,10,"S.US.MAR",62,"S.US.GOOGL"]
[null,null,"S.US.MCHP",{"$f":"IFERROR(RTD(\"cqg.rtd\", ,\"ContractData\",C63, \"PerCentNetLastTrade\",, \"T\")/100,\"\")","v":9.7788805371086616E-3},19,19,"S.US.MCHP",63,"S.US.CTXS"]
[null,null,"S.US.MDLZ",{"$f":"IFERROR(RTD(\"cqg.rtd\", ,\"ContractData\",C64, \"PerCentNetLastTrade\",, \"T\")/100,\"\")","v":1.8630647414997672E-3},46,46,"S.US.MDLZ",64,"S.US.BIDU"]
[null,null,"S.US.MELI",{"$f":"IFERROR(RTD(\"cqg.rtd\", ,\"ContractData\",C65, \"PerCentNetLastTrade\",, \"T\")/100,\"\")","v":-4.4094283954219764E-3},89,89,"S.US.MELI",65,{"$f":"IFERROR(VLOOKUP(H65,$F$1:$G$103,2,FALSE),\"\")","v":"S.US.CSCO"}]
[null,null,"S.US.MNST",{"$f":"IFERROR(RTD(\"cqg.rtd\", ,\"ContractData\",C66, \"PerCentNetLastTrade\",, \"T\")/100,\"\")","v":2.6678049301035105E-3},41,{"$f":"IFERROR(E66,\"\")","v":41},"S.US.MNST",66,"S.US.VRSN"]
[null,null,"S.US.MRNA",{"$f":"IFERROR(RTD(\"cqg.rtd\", ,\"ContractData\",C67, \"PerCentNetLastTrade\",, \"T\")/100,\"\")","v":-2.5379884814368918E-3},83,83,{"$f":"C67","v":"S.US.MRNA"},{"$f":"H66+1","v":67},"S.US.CDW"]
[null,null,"S.US.MSFT",{"$f":"IFERROR(RTD(\"cqg.rtd\", ,\"ContractData\",C68, \"PerCentNetLastTrade\",, \"T\")/100,\"\")","v":-2.5060862093656024E-3},74,74,"S.US.MSFT",68,"S.US.COST"]
[null,null,"S.US.MU",{"$f":"IFERROR(RTD(\"cqg.rtd\", ,\"ContractData\",C69, \"PerCentNetLastTrade\",, \"T\")/100,\"\")","v":3.4487332537471815E-3},38,38,"S.US.MU",69,"S.US.INTC"]
[null,null,"S.US.MXIM",{"$f":"IFERROR(RTD(\"cqg.rtd\", ,\"ContractData\",C70, \"PerCentNetLastTrade\",, \"T\")/100,\"\")","v":5.1271534044298609E-3},27,27,"S.US.MXIM",70,"S.US.ORLY"]
[null,null,"S.US.NFLX",{"$f":"IFERROR(RTD(\"cqg.rtd\", ,\"ContractData\",C71, \"PerCentNetLastTrade\",, \"T\")/100,\"\")","v":-1.2541191978156483E-2},101,101,"S.US.NFLX",71,"S.US.CPRT"]
[null,null,"S.US.NTES",{"$f":"IFERROR(RTD(\"cqg.rtd\", ,\"ContractData\",C72, \"PerCentNetLastTrade\",, \"T\")/100,\"\")","v":-2.2699169757993288E-2},102,102,"S.US.NTES",72,"S.US.PYPL"]
[null,null,"S.US.NVDA",{"$f":"IFERROR(RTD(\"cqg.rtd\", ,\"ContractData\",C73, \"PerCentNetLastTrade\",, \"T\")/100,\"\")","v":1.6118633139909733E-2},3,3,"S.US.NVDA",73,"S.US.IDXX"]
[null,null,"S.US.NXPI",{"$f":"IFERROR(RTD(\"cqg.rtd\", ,\"ContractData\",C74, \"PerCentNetLastTrade\",, \"T\")/100,\"\")","v":1.288086493197455E-2},11,11,"S.US.NXPI",74,"S.US.MSFT"]
[null,null,"S.US.ORLY",{"$f":"IFERROR(RTD(\"cqg.rtd\", ,\"ContractData\",C75, \"PerCentNetLastTrade\",, \"T\")/100,\"\")","v":-1.448845862557213E-3},70,70,"S.US.ORLY",75,"S.US.ADSK"]
[null,null,"S.US.PAYX",{"$f":"IFERROR(RTD(\"cqg.rtd\", ,\"ContractData\",C76, \"PerCentNetLastTrade\",, \"T\")/100,\"\")","v":5.4318305268875617E-4},54,54,"S.US.PAYX",76,"S.US.BIIB"]
[null,null,"S.US.PCAR",{"$f":"IFERROR(RTD(\"cqg.rtd\", ,\"ContractData\",C77, \"PerCentNetLastTrade\",, \"T\")/100,\"\")","v":3.0650471109092974E-3},39,39,"S.US.PCAR",77,"S.US.EXC"]
[null,null,"S.US.PDD",{"$f":"IFERROR(RTD(\"cqg.rtd\", ,\"ContractData\",C78, \"PerCentNetLastTrade\",, \"T\")/100,\"\")","v":9.7799511002445E-4},49,49,"S.US.PDD",78,"S.US.INCY"]
[null,null,"S.US.PEP",{"$f":"IFERROR(RTD(\"cqg.rtd\", ,\"ContractData\",C79, \"PerCentNetLastTrade\",, \"T\")/100,\"\")","v":3.2088307020921572E-4},58,58,"S.US.PEP",79,"S.US.AAPL"]
[null,null,"S.US.PYPL",{"$f":"IFERROR(RTD(\"cqg.rtd\", ,\"ContractData\",C80, \"PerCentNetLastTrade\",, \"T\")/100,\"\")","v":-1.5432616499479986E-3},72,72,"S.US.PYPL",80,"S.US.CDNS"]
[null,null,"S.US.QCOM",{"$f":"IFERROR(RTD(\"cqg.rtd\", ,\"ContractData\",C81, \"PerCentNetLastTrade\",, \"T\")/100,\"\")","v":4.2278753135077032E-3},32,32,"S.US.QCOM",81,"S.US.SPLK"]
[null,null,"S.US.REGN",{"$f":"IFERROR(RTD(\"cqg.rtd\", ,\"ContractData\",C82, \"PerCentNetLastTrade\",, \"T\")/100,\"\")","v":-7.2542742320005453E-3},98,98,"S.US.REGN",82,"S.US.GOOG"]
[null,null,"S.US.ROST",{"$f":"IFERROR(RTD(\"cqg.rtd\", ,\"ContractData\",C83, \"PerCentNetLastTrade\",, \"T\")/100,\"\")","v":9.444303904207774E-3},20,20,"S.US.ROST",83,"S.US.MRNA"]
[null,null,"S.US.SBUX",{"$f":"IFERROR(RTD(\"cqg.rtd\", ,\"ContractData\",C84, \"PerCentNetLastTrade\",, \"T\")/100,\"\")","v":6.7279850110713683E-3},22,22,"S.US.SBUX",84,"S.US.XEL"]
[null,null,"S.US.SGEN",{"$f":"IFERROR(RTD(\"cqg.rtd\", ,\"ContractData\",C85, \"PerCentNetLastTrade\",, \"T\")/100,\"\")","v":-5.9876118375774253E-3},94,94,"S.US.SGEN",85,"S.US.CHTR"]
[null,null,"S.US.SIRI",{"$f":"IFERROR(RTD(\"cqg.rtd\", ,\"ContractData\",C86, \"PerCentNetLastTrade\",, \"T\")/100,\"\")","v":9.1883614088820835E-3},15,15,"S.US.SIRI",86,"S.US.AMGN"]
[null,null,"S.US.SNPS",{"$f":"IFERROR(RTD(\"cqg.rtd\", ,\"ContractData\",C87, \"PerCentNetLastTrade\",, \"T\")/100,\"\")","v":-6.7652668321997907E-3},95,95,"S.US.SNPS",87,"S.US.GILD"]
[null,null,"S.US.SPLK",{"$f":"IFERROR(RTD(\"cqg.rtd\", ,\"ContractData\",C88, \"PerCentNetLastTrade\",, \"T\")/100,\"\")","v":-3.2639442953506926E-3},81,81,"S.US.SPLK",88,"S.US.ADBE"]
[null,null,"S.US.SWKS",{"$f":"IFERROR(RTD(\"cqg.rtd\", ,\"ContractData\",C89, \"PerCentNetLastTrade\",, \"T\")/100,\"\")","v":3.3787350860521592E-3},37,37,"S.US.SWKS",89,"S.US.MELI"]
[null,null,"S.US.TCOM",{"$f":"IFERROR(RTD(\"cqg.rtd\", ,\"ContractData\",C90, \"PerCentNetLastTrade\",, \"T\")/100,\"\")","v":4.4998269297334718E-3},30,30,"S.US.TCOM",90,"S.US.DXCM"]
[null,null,"S.US.TMUS",{"$f":"IFERROR(RTD(\"cqg.rtd\", ,\"ContractData\",C91, \"PerCentNetLastTrade\",, \"T\")/100,\"\")","v":4.6398891966759007E-3},28,28,"S.US.TMUS",91,"S.US.VRTX"]
[null,null,"S.US.TSLA",{"$f":"IFERROR(RTD(\"cqg.rtd\", ,\"ContractData\",C92, \"PerCentNetLastTrade\",, \"T\")/100,\"\")","v":1.438304314912945E-3},51,51,"S.US.TSLA",92,"S.US.INTU"]
[null,null,"S.US.TTWO",{"$f":"IFERROR(RTD(\"cqg.rtd\", ,\"ContractData\",C93, \"PerCentNetLastTrade\",, \"T\")/100,\"\")","v":4.1171626867427362E-3},33,33,"S.US.TTWO",93,"S.US.ANSS"]
[null,null,"S.US.TXN",{"$f":"IFERROR(RTD(\"cqg.rtd\", ,\"ContractData\",C94, \"PerCentNetLastTrade\",, \"T\")/100,\"\")","v":1.0225275603131492E-2},18,18,"S.US.TXN",94,"S.US.SGEN"]
[null,null,"S.US.ULTA",{"$f":"IFERROR(RTD(\"cqg.rtd\", ,\"ContractData\",C95, \"PerCentNetLastTrade\",, \"T\")/100,\"\")","v":1.2825112107623318E-2},12,12,"S.US.ULTA",95,"S.US.SNPS"]
[null,null,"S.US.VRSK",{"$f":"IFERROR(RTD(\"cqg.rtd\", ,\"ContractData\",C96, \"PerCentNetLastTrade\",, \"T\")/100,\"\")","v":2.0807768233473832E-3},44,44,"S.US.VRSK",96,"S.US.WDAY"]
[null,null,"S.US.VRSN",{"$f":"IFERROR(RTD(\"cqg.rtd\", ,\"ContractData\",C97, \"PerCentNetLastTrade\",, \"T\")/100,\"\")","v":-1.2204158131020354E-3},66,66,"S.US.VRSN",97,{"$f":"IFERROR(VLOOKUP(H97,$F$1:$G$103,2,FALSE),\"\")","v":"S.US.DOCU"}]
[null,null,"S.US.VRTX",{"$f":"IFERROR(RTD(\"cqg.rtd\", ,\"ContractData\",C98, \"PerCentNetLastTrade\",, \"T\")/100,\"\")","v":-4.7316204528109898E-3},91,91,"S.US.VRTX",98,"S.US.REGN"]
[null,null,"S.US.WBA",{"$f":"IFERROR(RTD(\"cqg.rtd\", ,\"ContractData\",C99, \"PerCentNetLastTrade\",, \"T\")/100,\"\")","v":5.2105948762483714E-3},26,26,"S.US.WBA",99,"S.US.ZM"]
[null,null,"S.US.WDAY",{"$f":"IFERROR(RTD(\"cqg.rtd\", ,\"ContractData\",C100, \"PerCentNetLastTrade\",, \"T\")/100,\"\")","v":-6.9315080362171303E-3},96,96,"S.US.WDAY",100,"S.US.ILMN"]
[null,null,"S.US.XEL",{"$f":"IFERROR(RTD(\"cqg.rtd\", ,\"ContractData\",C101, \"PerCentNetLastTrade\",, \"T\")/100,\"\")","v":-3.3744131455399062E-3},84,84,"S.US.XEL",101,"S.US.NFLX"]
[null,null,"S.US.XLNX",{"$f":"IFERROR(RTD(\"cqg.rtd\", ,\"ContractData\",C102, \"PerCentNetLastTrade\",, \"T\")/100,\"\")","v":1.2967200610221204E-3},48,48,"S.US.XLNX",102,"S.US.NTES"]
[null,null,"S.US.ZM",{"$f":"IFERROR(RTD(\"cqg.rtd\", ,\"ContractData\",C103, \"PerCentNetLastTrade\",, \"T\")/100,\"\")","v":-7.4477951715803377E-3},99,99,"S.US.ZM",103,{"$f":"IFERROR(VLOOKUP(H103,$F$1:$G$107,2,FALSE),\"\")","v":""}]
[null,null,null,{"$f":"IFERROR(RTD(\"cqg.rtd\", ,\"ContractData\",C104, \"PerCentNetLastTrade\",, \"T\")/100,\"\")","v":""},{"$error":"#VALUE!"},"",0,104,""]
[null,null,null,{"$f":"IFERROR(RTD(\"cqg.rtd\", ,\"ContractData\",C105, \"PerCentNetLastTrade\",, \"T\")/100,\"\")","v":""},{"$error":"#VALUE!"},"",0,105,""]
[null,null,null,{"$f":"IFERROR(RTD(\"cqg.rtd\", ,\"ContractData\",C106, \"PerCentNetLastTrade\",, \"T\")/100,\"\")","v":""},{"$error":"#VALUE!"},"",0,106,""]
[null,null,null,{"$f":"IFERROR(RTD(\"cqg.rtd\", ,\"ContractData\",C107, \"PerCentNetLastTrade\",, \"T\")/100,\"\")","v":""},{"$error":"#VALUE!"},{"$f":"IFERROR(E107,\"\")","v":""},{"$f":"C107","v":0},107,""]
[null,null,null,null,{"$error":"#N/A"}]
[null,null,null,null,{"$error":"#N/A"}]
[null,null,null,null,{"$error":"#N/A"}]
[null,null,null,null,{"$error":"#N/A"}]
[null,null,null,null,{"$error":"#N/A"}]
[null,null,null,null,{"$error":"#N/A"}]
[null,null,null,null,{"$error":"#N/A"}]
[null,null,null,null,{"$error":"#N/A"}]
[null,null,null,null,{"$error":"#N/A"}]
[null,null,null,null,{"$error":"#N/A"}]
[null,null,null,null,{"$error":"#N/A"}]
[null,null,null,null,{"$error":"#N/A"}]
[null,null,null,null,{"$error":"#N/A"}]
[null,null,null,null,{"$error":"#N/A"}]
[null,null,null,null,{"$error":"#N/A"}]
[null,null,null,null,{"$error":"#N/A"}]
[null,null,null,null,{"$error":"#N/A"}]
[null,null,null,null,{"$error":"#N/A"}]
[null,null,null,null,{"$error":"#N/A"}]
[null,null,null,null,{"$error":"#N/A"}]
[null,null,null,null,{"$error":"#N/A"}]
[null,null,null,null,{"$error":"#N/A"}]
[null,null,null,null,{"$error":"#N/A"}]
[null,null,null,null,{"$error":"#N/A"}]
[null,null,null,null,{"$error":"#N/A"}]
[null,null,null,null,{"$error":"#N/A"}]
[null,null,null,null,{"$error":"#N/A"}]
[null,null,null,null,{"$error":"#N/A"}]
[null,null,null,null,{"$error":"#N/A"}]
[null,null,null,null,{"$error":"#N/A"}]
[null,null,null,null,{"$error":"#N/A"}]
[null,null,null,null,{"$error":"#N/A"}]
[null,null,null,null,{"$error":"#N/A"}]
[null,null,null,null,{"$error":"#N/A"}]
[null,null,null,null,{"$error":"#N/A"}]
[null,null,null,null,{"$error":"#N/A"}]
[null,null,null,null,{"$error":"#N/A"}]
[null,null,null,null,{"$error":"#N/A"}]
[null,null,null,null,{"$error":"#N/A"}]
[null,null,null,null,{"$error":"#N/A"}]
[null,null,null,null,{"$error":"#N/A"}]
[null,null,null,null,{"$error":"#N/A"}]
[null,null,null,null,{"$error":"#N/A"}]
[null,null,null,null,{"$error":"#N/A"}]
[null,null,null,null,{"$error":"#N/A"}]
[null,null,null,null,{"$error":"#N/A"}]
[null,null,null,null,{"$error":"#N/A"}]
[null,null,null,null,{"$error":"#N/A"}]
[null,null,null,null,{"$error":"#N/A"}]
[null,null,null,null,{"$error":"#N/A"}]
[null,null,null,null,{"$error":"#N/A"}]
[null,null,null,null,{"$error":"#N/A"}]
[null,null,null,null,{"$error":"#N/A"}]
[null,null,null,null,{"$error":"#N/A"}]
[null,null,null,null,{"$error":"#N/A"}]
[null,null,null,null,{"$error":"#N/A"}]
[null,null,null,null,{"$error":"#N/A"}]
[null,null,null,null,{"$error":"#N/A"}]
[null,null,null,null,{"$error":"#N/A"}]
[null,null,null,null,{"$error":"#N/A"}]
[null,null,null,null,{"$error":"#N/A"}]
[null,null,null,null,{"$error":"#N/A"}]
[null,null,null,null,{"$error":"#N/A"}]
[null,null,null,null,{"$error":"#N/A"}]
[null,null,null,null,{"$error":"#N/A"}]
[null,null,null,null,{"$error":"#N/A"}]
[null,null,null,null,{"$error":"#N/A"}]
[null,null,null,null,{"$error":"#N/A"}]
[null,null,null,null,{"$error":"#N/A"}]
[null,null,null,null,{"$error":"#N/A"}]
[null,null,null,null,{"$error":"#N/A"}]
[null,null,null,null,{"$error":"#N/A"}]
[null,null,null,null,{"$error":"#N/A"}]
[null,null,null,null,{"$error":"#N/A"}]
[null,null,null,null,{"$error":"#N/A"}]
[null,null,null,null,{"$error":"#N/A"}]
[null,null,null,null,{"$error":"#N/A"}]
[null,null,null,null,{"$error":"#N/A"}]
[null,null,null,null,{"$error":"#N/A"}]
[null,null,null,null,{"$error":"#N/A"}]
[null,null,null,null,{"$error":"#N/A"}]
[null,null,null,null,{"$error":"#N/A"}]
[null,null,null,null,{"$error":"#N/A"}]
[null,null,null,null,{"$error":"#N/A"}]
[null,null,null,null,{"$error":"#N/A"}]
[null,null,null,null,{"$error":"#N/A"}]
[null,null,null,null,{"$error":"#N/A"}]
[null,null,null,null,{"$error":"#N/A"}]
[null,null,null,null,{"$error":"#N/A"}]
[null,null,null,null,{"$error":"#N/A"}]
[null,null,null,null,{"$error":"#N/A"}]
[null,null,null,null,{"$error":"#N/A"}]
[null,null,null,null,{"$error":"#N/A"}]
[null,null,null,null,{"$error":"#N/A"}]
[null,null,null,null,{"$error":"#N/A"}]
[null,null,null,null,{"$error":"#N/A"}]
[null,null,null,null,{"$error":"#N/A"}]
[null,null,null,null,{"$error":"#N/A"}]
[null,null,null,null,{"$error":"#N/A"}]
[null,null,null,null,{"$error":"#N/A"}]
[null,null,null,null,{"$error":"#N/A"}]
[null,null,null,null,{"$error":"#N/A"}]
[null,null,null,null,{"$error":"#N/A"}]
[null,null,null,null,{"$error":"#N/A"}]
[null,null,null,null,{"$error":"#N/A"}]
[null,null,null,null,{"$error":"#N/A"}]
[null,null,null,null,{"$error":"#N/A"}]
[null,null,null,null,{"$error":"#N/A"}]
[null,null,null,null,{"$error":"#N/A"}]
[null,null,null,null,{"$error":"#N/A"}]
[null,null,null,null,{"$error":"#N/A"}]
[null,null,null,null,{"$error":"#N/A"}]
[null,null,null,null,{"$error":"#N/A"}]
[null,null,null,null,{"$error":"#N/A"}]
[null,null,null,null,{"$error":"#N/A"}]
[null,null,null,null,{"$error":"#N/A"}]
[null,null,null,null,{"$error":"#N/A"}]
[null,null,null,null,{"$error":"#N/A"}]
[null,null,null,null,{"$error":"#N/A"}]
[null,null,null,null,{"$error":"#N/A"}]
[null,null,null,null,{"$error":"#N/A"}]
[null,null,null,null,{"$error":"#N/A"}]
[null,null,null,null,{"$error":"#N/A"}]
[null,null,null,null,{"$error":"#N/A"}]
[null,null,null,null,{"$error":"#N/A"}]
[null,null,null,null,{"$error":"#N/A"}]
[null,null,null,null,{"$error":"#N/A"}]
[null,null,null,null,{"$error":"#N/A"}]
[null,null,null,null,{"$error":"#N/A"}]
[null,null,null,null,{"$error":"#N/A"}]
[null,null,null,null,{"$error":"#N/A"}]
[null,null,null,null,{"$error":"#N/A"}]
[null,null,null,null,{"$error":"#N/A"}]
[null,null,null,null,{"$error":"#N/A"}]
[null,null,null,null,{"$error":"#N/A"}]
[null,null,null,null,{"$error":"#N/A"}]
[null,null,null,null,{"$error":"#N/A"}]
[null,null,null,null,{"$error":"#N/A"}]
[null,null,null,null,{"$error":"#N/A"}]
[null,null,null,null,{"$error":"#N/A"}]
[null,null,null,null,{"$error":"#N/A"}]
[null,null,null,null,{"$error":"#N/A"}]
[null,null,null,null,{"$error":"#N/A"}]
[null,null,null,null,{"$error":"#N/A"}]
[null,null,null,null,{"$error":"#N/A"}]
[null,null,null,null,{"$error":"#N/A"}]
[null,null,null,null,{"$error":"#N/A"}]
[null,null,null,null,{"$error":"#N/A"}]
[null,null,null,null,{"$error":"#N/A"}]
[null,null,null,null,{"$error":"#N/A"}]
[null,null,null,null,{"$error":"#N/A"}]
[null,null,null,null,{"$error":"#N/A"}]
[null,null,null,null,{"$error":"#N/A"}]
[null,null,null,null,{"$error":"#N/A"}]
[null,null,null,null,{"$error":"#N/A"}]
[null,null,null,null,{"$error":"#N/A"}]
[null,null,null,null,{"$error":"#N/A"}]
[null,null,null,null,{"$error":"#N/A"}]
[null,null,null,null,{"$error":"#N/A"}]
[null,null,null,null,{"$error":"#N/A"}]
[null,null,null,null,{"$error":"#N/A"}]
[null,null,null,null,{"$error":"#N/A"}]
[null,null,null,null,{"$error":"#N/A"}]
[null,null,null,null,{"$error":"#N/A"}]
[null,null,null,null,{"$error":"#N/A"}]
[null,null,null,null,{"$error":"#N/A"}]
[null,null,null,null,{"$error":"#N/A"}]
[null,null,null,null,{"$error":"#N/A"}]
[null,null,null,null,{"$error":"#N/A"}]
[null,null,null,null,{"$error":"#N/A"}]
[null,null,null,null,{"$error":"#N/A"}]
[null,null,null,null,{"$error":"#N/A"}]
[null,null,null,null,{"$error":"#N/A"}]
[null,null,null,null,{"$error":"#N/A"}]
[null,null,null,null,{"$error":"#N/A"}]
[null,null,null,null,{"$error":"#N/A"}]
[null,null,null,null,{"$error":"#N/A"}]
[null,null,null,null,{"$error":"#N/A"}]
[null,null,null,null,{"$error":"#N/A"}]
[null,null,null,null,{"$error":"#N/A"}]
[null,null,null,null,{"$error":"#N/A"}]
[null,null,null,null,{"$error":"#N/A"}]
[null,null,null,null,{"$error":"#N/A"}]
[null,null,null,null,{"$error":"#N/A"}]
[null,null,null,null,{"$error":"#N/A"}]
[null,null,null,null,{"$error":"#N/A"}]
[null,null,null,null,{"$error":"#N/A"}]
[null,null,null,null,{"$error":"#N/A"}]
[null,null,null,null,{"$error":"#N/A"}]
[null,null,null,null,{"$error":"#N/A"}]
[null,null,null,null,{"$error":"#N/A"}]
[null,null,null,null,{"$error":"#N/A"}]
[null,null,null,null,{"$error":"#N/A"}]
[null,null,null,null,{"$error":"#N/A"}]
[null,null,null,null,{"$error":"#N/A"}]
[null,null,null,null,{"$error":"#N/A"}]
[null,null,null,null,{"$error":"#N/A"}]
[null,null,null,null,{"$error":"#N/A"}]
[null,null,null,null,{"$error":"#N/A"}]
[null,null,null,null,{"$error":"#N/A"}]
[null,null,null,null,{"$error":"#N/A"}]
[null,null,null,null,{"$error":"#N/A"}]
[null,null,null,null,{"$error":"#N/A"}]
[null,null,null,null,{"$error":"#N/A"}]
[null,null,null,null,{"$error":"#N/A"}]
[null,null,null,null,{"$error":"#N/A"}]
[null,null,null,null,{"$error":"#N/A"}]
[null,null,null,null,{"$error":"#N/A"}]
[null,null,null,null,{"$error":"#N/A"}]
[null,null,null,null,{"$error":"#N/A"}]
[null,null,null,null,{"$error":"#N/A"}]
[null,null,null,null,{"$error":"#N/A"}]
[null,null,null,null,{"$error":"#N/A"}]
[null,null,null,null,{"$error":"#N/A"}]
[null,null,null,null,{"$error":"#N/A"}]
[null,null,null,null,{"$error":"#N/A"}]
[null,null,null,null,{"$error":"#N/A"}]
[null,null,null,null,{"$error":"#N/A"}]
[null,null,null,null,{"$error":"#N/A"}]
[null,null,null,null,{"$error":"#N/A"}]
[null,null,null,null,{"$error":"#N/A"}]
[null,null,null,null,{"$error":"#N/A"}]
[null,null,null,null,{"$error":"#N/A"}]
[null,null,null,null,{"$error":"#N/A"}]
[null,null,null,null,{"$error":"#N/A"}]
[null,null,null,null,{"$error":"#N/A"}]
[null,null,null,null,{"$error":"#N/A"}]
[null,null,null,null,{"$error":"#N/A"}]
[null,null,null,null,{"$error":"#N/A"}]
[null,null,null,null,{"$error":"#N/A"}]
[null,null,null,null,{"$error":"#N/A"}]
[null,null,null,null,{"$error":"#N/A"}]
[null,null,null,null,{"$error":"#N/A"}]
[null,null,null,null,{"$error":"#N/A"}]
[null,null,null,null,{"$error":"#N/A"}]
[null,null,null,null,{"$error":"#N/A"}]
[null,null,null,null,{"$error":"#N/A"}]
[null,null,null,null,{"$error":"#N/A"}]
[null,null,null,null,{"$error":"#N/A"}]
[null,null,null,null,{"$error":"#N/A"}]
[null,null,null,null,{"$error":"#N/A"}]
[null,null,null,null,{"$error":"#N/A"}]
[null,null,null,null,{"$error":"#N/A"}]
[null,null,null,null,{"$error":"#N/A"}]
[null,null,null,null,{"$error":"#N/A"}]
[null,null,null,null,{"$error":"#N/A"}]
[null,null,null,null,{"$error":"#N/A"}]
[null,null,null,null,{"$error":"#N/A"}]
[null,null,null,null,{"$error":"#N/A"}]
[null,null,null,null,{"$error":"#N/A"}]
[null,null,null,null,{"$error":"#N/A"}]
[null,null,null,null,{"$error":"#N/A"}]
[null,null,null,null,{"$error":"#N/A"}]
[null,null,null,null,{"$error":"#N/A"}]
[null,null,null,null,{"$error":"#N/A"}]
[null,null,null,null,{"$error":"#N/A"}]
[null,null,null,null,{"$error":"#N/A"}]
[null,null,null,null,{"$error":"#N/A"}]
[null,null,null,null,{"$error":"#N/A"}]
[null,null,null,null,{"$error":"#N/A"}]
[null,null,null,null,{"$error":"#N/A"}]
[null,null,null,null,{"$error":"#N/A"}]
[null,null,null,null,{"$error":"#N/A"}]
[null,null,null,null,{"$error":"#N/A"}]
[null,null,null,null,{"$error":"#N/A"}]
[null,null,null,null,{"$error":"#N/A"}]
[null,null,null,null,{"$error":"#N/A"}]
[null,null,null,null,{"$error":"#N/A"}]
[null,null,null,null,{"$error":"#N/A"}]
[null,null,null,null,{"$error":"#N/A"}]
[null,null,null,null,{"$error":"#N/A"}]
[null,null,null,null,{"$error":"#N/A"}]
[null,null,null,null,{"$error":"#N/A"}]
[null,null,null,null,{"$error":"#N/A"}]
[null,null,null,null,{"$error":"#N/A"}]
[null,null,null,null,{"$error":"#N/A"}]
[null,null,null,null,{"$error":"#N/A"}]
[null,null,null,null,{"$error":"#N/A"}]
[null,null,null,null,{"$error":"#N/A"}]
[null,null,null,null,{"$error":"#N/A"}]
[null,null,null,null,{"$error":"#N/A"}]
[null,null,null,null,{"$error":"#N/A"}]
[null,null,null,null,{"$error":"#N/A"}]
[null,null,null,null,{"$error":"#N/A"}]
[null,null,null,null,{"$error":"#N/A"}]
[null,null,null,null,{"$error":"#N/A"}]
[null,null,null,null,{"$error":"#N/A"}]
[null,null,null,null,{"$error":"#N/A"}]
[null,null,null,null,{"$error":"#N/A"}]
[null,null,null,null,{"$error":"#N/A"}]
[null,null,null,null,{"$error":"#N/A"}]
[null,null,null,null,{"$error":"#N/A"}]
[null,null,null,null,{"$error":"#N/A"}]
[null,null,null,null,{"$error":"#N/A"}]
[null,null,null,null,{"$error":"#N/A"}]
[null,null,null,null,{"$error":"#N/A"}]
[null,null,null,null,{"$error":"#N/A"}]
[null,null,null,null,{"$error":"#N/A"}]
[null,null,null,null,{"$error":"#N/A"}]
[null,null,null,null,{"$error":"#N/A"}]
[null,null,null,null,{"$error":"#N/A"}]
[null,null,null,null,{"$error":"#N/A"}]
[null,null,null,null,{"$error":"#N/A"}]
[null,null,null,null,{"$error":"#N/A"}]
[null,null,null,null,{"$error":"#N/A"}]
[null,null,null,null,{"$error":"#N/A"}]
[null,null,null,null,{"$error":"#N/A"}]
[null,null,null,null,{"$error":"#N/A"}]
[null,null,null,null,{"$error":"#N/A"}]
[null,null,null,null,{"$error":"#N/A"}]
[null,null,null,null,{"$error":"#N/A"}]
[null,null,null,null,{"$error":"#N/A"}]
[null,null,null,null,{"$error":"#N/A"}]
[null,null,null,null,{"$error":"#N/A"}]
[null,null,null,null,{"$error":"#N/A"}]
[null,null,null,null,{"$error":"#N/A"}]
[null,null,null,null,{"$error":"#N/A"}]
[null,null,null,null,{"$error":"#N/A"}]
[null,null,null,null,{"$error":"#N/A"}]
[null,null,null,null,{"$error":"#N/A"}]
[null,null,null,null,{"$error":"#N/A"}]
[null,null,null,null,{"$error":"#N/A"}]
[null,null,null,null,{"$error":"#N/A"}]
[null,null,null,null,{"$error":"#N/A"}]
[null,null,null,null,{"$error":"#N/A"}]
[null,null,null,null,{"$error":"#N/A"}]
[null,null,null,null,{"$error":"#N/A"}]
[null,null,null,null,{"$error":"#N/A"}]
[null,null,null,null,{"$error":"#N/A"}]
[null,null,null,null,{"$error":"#N/A"}]
[null,null,null,null,{"$error":"#N/A"}]
[null,null,null,null,{"$error":"#N/A"}]
[null,null,null,null,{"$error":"#N/A"}]
[null,null,null,null,{"$error":"#N/A"}]
[null,null,null,null,{"$error":"#N/A"}]
[null,null,null,null,{"$error":"#N/A"}]
[null,null,null,null,{"$error":"#N/A"}]
[null,null,null,null,{"$error":"#N/A"}]
[null,null,null,null,{"$error":"#N/A"}]
[null,null,null,null,{"$error":"#N/A"}]
[null,null,null,null,{"$error":"#N/A"}]
[null,null,null,null,{"$error":"#N/A"}]
[null,null,null,null,{"$error":"#N/A"}]
[null,null,null,null,{"$error":"#N/A"}]
[null,null,null,null,{"$error":"#N/A"}]
[null,null,null,null,{"$error":"#N/A"}]
[null,null,null,null,{"$error":"#N/A"}]
[null,null,null,null,{"$error":"#N/A"}]
[null,null,null,null,{"$error":"#N/A"}]
[null,null,null,null,{"$error":"#N/A"}]
[null,null,null,null,{"$error":"#N/A"}]
[null,null,null,null,{"$error":"#N/A"}]
[null,null,null,null,{"$error":"#N/A"}]
[null,null,null,null,{"$error":"#N/A"}]
[null,null,null,null,{"$error":"#N/A"}]
[null,null,null,null,{"$error":"#N/A"}]
[null,null,null,null,{"$error":"#N/A"}]
[null,null,null,null,{"$error":"#N/A"}]
[null,null,null,null,{"$error":"#N/A"}]
[null,null,null,null,{"$error":"#N/A"}]
[null,null,null,null,{"$error":"#N/A"}]
[null,null,null,null,{"$error":"#N/A"}]
[null,null,null,null,{"$error":"#N/A"}]
[null,null,null,null,{"$error":"#N/A"}]
[null,null,null,null,{"$error":"#N/A"}]
[null,null,null,null,{"$error":"#N/A"}]
[null,null,null,null,{"$error":"#N/A"}]
[null,null,null,null,{"$error":"#N/A"}]
[null,null,null,null,{"$error":"#N/A"}]
[null,null,null,null,{"$error":"#N/A"}]
[null,null,null,null,{"$error":"#N/A"}]
[null,null,null,null,{"$error":"#N/A"}]
[null,null,null,null,{"$error":"#N/A"}]
[null,null,null,null,{"$error":"#N/A"}]
[null,null,null,null,{"$error":"#N/A"}]
[null,null,null,null,{"$error":"#N/A"}]
[null,null,null,null,{"$error":"#N/A"}]
[null,null,null,null,{"$error":"#N/A"}]
[null,null,null,null,{"$error":"#N/A"}]
[null,null,null,null,{"$error":"#N/A"}]
[null,null,null,null,{"$error":"#N/A"}]
[null,null,null,null,{"$error":"#N/A"}]
[null,null,null,null,{"$error":"#N/A"}]
[null,null,null,null,{"$error":"#N/A"}]
[null,null,null,null,{"$error":"#N/A"}]
[null,null,null,null,{"$error":"#N/A"}]
[null,null,null,null,{"$error":"#N/A"}]
[null,null,null,null,{"$error":"#N/A"}]
[null,null,null,null,{"$error":"#N/A"}]
[null,null,null,null,{"$error":"#N/A"}]
[null,null,null,null,{"$error":"#N/A"}]
[null,null,null,null,{"$error":"#N/A"}]
[null,null,null,null,{"$error":"#N/A"}]
[null,null,null,null,{"$error":"#N/A"}]
[null,null,null,null,{"$error":"#N/A"}]
[null,null,null,null,{"$error":"#N/A"}]
[null,null,null,null,{"$error":"#N/A"}]
[null,null,null,null,{"$error":"#N/A"}]
[null,null,null,null,32]
[null,null,null,null,{"$error":"#N/A"}]
[null,null,null,null,{"$error":"#N/A"}]

{"sheet":"S&P500","index":3,"n_rows":3044,"n_cols":15,"rows_kept":3044,"cut":false,"hidden":true,"merged":[]}
[null,null,"S.US.A",{"$f":"IFERROR(RTD(\"cqg.rtd\", ,\"ContractData\",C1, \"PerCentNetLastTrade\",, \"T\")/100,\"\")","v":-2.6121902210314799E-3},454,{"$f":"IFERROR(E1,\"\")","v":454},{"$f":"C1","v":"S.US.A"},1,{"$f":"IFERROR(VLOOKUP(H1,$F$1:$G$505,2,FALSE),\"\")","v":"S.US.IPG"},{"$f":"IFERROR(RTD(\"cqg.rtd\", ,\"ContractData\",I1, \"PerCentNetLastTrade\",, \"T\")/100,\"\")","v":0.10713143588103614},null,{"$f":"MIN(D1:D505)","v":-6.0474909346122353E-2},{"$f":"VLOOKUP(L1,D1:G505,3,FALSE)","v":504},{"$f":"VLOOKUP(M1,$H$1:$I$505,2,FALSE)","v":"S.US.STX"},{"$f":"IFERROR(RTD(\"cqg.rtd\", ,\"ContractData\",N1, \"PerCentNetLastTrade\",, \"T\")/100,\"\")","v":-6.0474909346122353E-2}]
[null,null,"S.US.AAL",{"$f":"IFERROR(RTD(\"cqg.rtd\", ,\"ContractData\",C2, \"PerCentNetLastTrade\",, \"T\")/100,\"\")","v":1.5077821011673152E-2},76,{"$f":"IFERROR(E2,\"\")","v":76},{"$f":"C2","v":"S.US.AAL"},{"$f":"H1+1","v":2},{"$f":"IFERROR(VLOOKUP(H2,$F$1:$G$505,2,FALSE),\"\")","v":"S.US.CMG"},{"$f":"IFERROR(RTD(\"cqg.rtd\", ,\"ContractData\",I2, \"PerCentNetLastTrade\",, \"T\")/100,\"\")","v":7.1324673674849931E-2},null,null,{"$f":"M1-1","v":503},{"$f":"VLOOKUP(M2,$H$1:$I$505,2,FALSE)","v":"S.US.WDC"},{"$f":"IFERROR(RTD(\"cqg.rtd\", ,\"ContractData\",N2, \"PerCentNetLastTrade\",, \"T\")/100,\"\")","v":-3.6509900990099008E-2}]
[null,null,"S.US.AAP",{"$f":"IFERROR(RTD(\"cqg.rtd\", ,\"ContractData\",C3, \"PerCentNetLastTrade\",, \"T\")/100,\"\")","v":3.9480568900727778E-3},278,278,"S.US.AAP",{"$f":"H2+1","v":3},"S.US.CCL",{"$f":"IFERROR(RTD(\"cqg.rtd\", ,\"ContractData\",I3, \"PerCentNetLastTrade\",, \"T\")/100,\"\")","v":4.2000943841434636E-2},null,null,{"$f":"M2-1","v":502},"S.US.ALLE",{"$f":"IFERROR(RTD(\"cqg.rtd\", ,\"ContractData\",N3, \"PerCentNetLastTrade\",, \"T\")/100,\"\")","v":-1.8889281924301379E-2}]
[null,null,"S.US.AAPL",{"$f":"IFERROR(RTD(\"cqg.rtd\", ,\"ContractData\",C4, \"PerCentNetLastTrade\",, \"T\")/100,\"\")","v":-2.8737598357851525E-3},460,460,"S.US.AAPL",4,"S.US.SLB",{"$f":"IFERROR(RTD(\"cqg.rtd\", ,\"ContractData\",I4, \"PerCentNetLastTrade\",, \"T\")/100,\"\")","v":3.6710719530102791E-2},null,null,501,"S.US.MTB",{"$f":"IFERROR(RTD(\"cqg.rtd\", ,\"ContractData\",N4, \"PerCentNetLastTrade\",, \"T\")/100,\"\")","v":-1.8883293838862558E-2}]
[null,null,"S.US.ABBV",{"$f":"IFERROR(RTD(\"cqg.rtd\", ,\"ContractData\",C5, \"PerCentNetLastTrade\",, \"T\")/100,\"\")","v":3.2744506678155966E-3},298,298,"S.US.ABBV",5,"S.US.OXY",{"$f":"IFERROR(RTD(\"cqg.rtd\", ,\"ContractData\",I5, \"PerCentNetLastTrade\",, \"T\")/100,\"\")","v":3.6657469452108786E-2},null,null,500,"S.US.DHR",{"$f":"IFERROR(RTD(\"cqg.rtd\", ,\"ContractData\",N5, \"PerCentNetLastTrade\",, \"T\")/100,\"\")","v":-1.6184767277856137E-2}]
[null,null,"S.US.ABC",{"$f":"IFERROR(RTD(\"cqg.rtd\", ,\"ContractData\",C6, \"PerCentNetLastTrade\",, \"T\")/100,\"\")","v":7.6401407846167059E-3},199,199,"S.US.ABC",6,"S.US.HAL",{"$f":"IFERROR(RTD(\"cqg.rtd\", ,\"ContractData\",I6, \"PerCentNetLastTrade\",, \"T\")/100,\"\")","v":3.1390134529147982E-2},null,null,499,"S.US.NFLX",{"$f":"IFERROR(RTD(\"cqg.rtd\", ,\"ContractData\",N6, \"PerCentNetLastTrade\",, \"T\")/100,\"\")","v":-1.2541191978156483E-2}]
[null,null,"S.US.ABMD",{"$f":"IFERROR(RTD(\"cqg.rtd\", ,\"ContractData\",C7, \"PerCentNetLastTrade\",, \"T\")/100,\"\")","v":4.882721962977842E-3},256,256,"S.US.ABMD",7,"S.US.CMA",{"$f":"IFERROR(RTD(\"cqg.rtd\", ,\"ContractData\",I7, \"PerCentNetLastTrade\",, \"T\")/100,\"\")","v":3.2287541882424609E-2},null,null,498,"S.US.NVR",{"$f":"IFERROR(RTD(\"cqg.rtd\", ,\"ContractData\",N7, \"PerCentNetLastTrade\",, \"T\")/100,\"\")","v":-1.2301362986121174E-2}]
[null,null,"S.US.ABT",{"$f":"IFERROR(RTD(\"cqg.rtd\", ,\"ContractData\",C8, \"PerCentNetLastTrade\",, \"T\")/100,\"\")","v":4.2112355765181505E-4},389,389,"S.US.ABT",8,"S.US.NOV",{"$f":"IFERROR(RTD(\"cqg.rtd\", ,\"ContractData\",I8, \"PerCentNetLastTrade\",, \"T\")/100,\"\")","v":2.9520295202952029E-2},null,null,497,"S.US.EXR",{"$f":"IFERROR(RTD(\"cqg.rtd\", ,\"ContractData\",N8, \"PerCentNetLastTrade\",, \"T\")/100,\"\")","v":-1.1719894520949313E-2}]
[null,null,"S.US.ACN",{"$f":"IFERROR(RTD(\"cqg.rtd\", ,\"ContractData\",C9, \"PerCentNetLastTrade\",, \"T\")/100,\"\")","v":-6.4090239056591679E-5},410,410,"S.US.ACN",9,"S.US.NCLH",{"$f":"IFERROR(RTD(\"cqg.rtd\", ,\"ContractData\",I9, \"PerCentNetLastTrade\",, \"T\")/100,\"\")","v":2.9138513513513514E-2},null,null,496,"S.US.TMO",{"$f":"IFERROR(RTD(\"cqg.rtd\", ,\"ContractData\",N9, \"PerCentNetLastTrade\",, \"T\")/100,\"\")","v":-1.0467296873206015E-2}]
[null,null,"S.US.ADBE",{"$f":"IFERROR(RTD(\"cqg.rtd\", ,\"ContractData\",C10, \"PerCentNetLastTrade\",, \"T\")/100,\"\")","v":-4.1891181495597321E-3},476,476,"S.US.ADBE",10,"S.US.MRO",{"$f":"IFERROR(RTD(\"cqg.rtd\", ,\"ContractData\",I10, \"PerCentNetLastTrade\",, \"T\")/100,\"\")","v":2.7336860670194002E-2},null,null,495,"S.US.ILMN",{"$f":"IFERROR(RTD(\"cqg.rtd\", ,\"ContractData\",N10, \"PerCentNetLastTrade\",, \"T\")/100,\"\")","v":-1.0076962544894819E-2}]
[null,null,"S.US.ADI",{"$f":"IFERROR(RTD(\"cqg.rtd\", ,\"ContractData\",C11, \"PerCentNetLastTrade\",, \"T\")/100,\"\")","v":5.7174818221365983E-3},237,237,"S.US.ADI",11,"S.US.MHK"]
[null,null,"S.US.ADM",{"$f":"IFERROR(RTD(\"cqg.rtd\", ,\"ContractData\",C12, \"PerCentNetLastTrade\",, \"T\")/100,\"\")","v":3.2741685335171463E-3},299,299,"S.US.ADM",12,"S.US.FANG"]
[null,null,"S.US.ADP",{"$f":"IFERROR(RTD(\"cqg.rtd\", ,\"ContractData\",C13, \"PerCentNetLastTrade\",, \"T\")/100,\"\")","v":5.9072560795510483E-4},380,380,"S.US.ADP",13,"S.US.BKR"]
[null,null,"S.US.ADSK",{"$f":"IFERROR(RTD(\"cqg.rtd\", ,\"ContractData\",C14, \"PerCentNetLastTrade\",, \"T\")/100,\"\")","v":-2.6002971768202083E-3},451,451,"S.US.ADSK",14,"S.US.COP"]
[null,null,"S.US.AEE",{"$f":"IFERROR(RTD(\"cqg.rtd\", ,\"ContractData\",C15, \"PerCentNetLastTrade\",, \"T\")/100,\"\")","v":-1.3098356751607527E-3},425,425,"S.US.AEE",15,"S.US.ALB"]
[null,null,"S.US.AEP",{"$f":"IFERROR(RTD(\"cqg.rtd\", ,\"ContractData\",C16, \"PerCentNetLastTrade\",, \"T\")/100,\"\")","v":3.4989503149055281E-4},392,392,"S.US.AEP",16,"S.US.ZION"]
[null,null,"S.US.AES",{"$f":"IFERROR(RTD(\"cqg.rtd\", ,\"ContractData\",C17, \"PerCentNetLastTrade\",, \"T\")/100,\"\")","v":1.2863070539419088E-2},105,105,"S.US.AES",17,"S.US.LNC"]
[null,null,"S.US.AFL",{"$f":"IFERROR(RTD(\"cqg.rtd\", ,\"ContractData\",C18, \"PerCentNetLastTrade\",, \"T\")/100,\"\")","v":1.0570026425066064E-2},145,145,"S.US.AFL",18,"S.US.APA"]
[null,null,"S.US.AIG",{"$f":"IFERROR(RTD(\"cqg.rtd\", ,\"ContractData\",C19, \"PerCentNetLastTrade\",, \"T\")/100,\"\")","v":1.1856870633072201E-2},124,124,"S.US.AIG",19,"S.US.UNM"]
[null,null,"S.US.AIZ",{"$f":"IFERROR(RTD(\"cqg.rtd\", ,\"ContractData\",C20, \"PerCentNetLastTrade\",, \"T\")/100,\"\")","v":5.9041069227275681E-3},232,232,"S.US.AIZ",20,"S.US.VLO"]
[null,null,"S.US.AJG",{"$f":"IFERROR(RTD(\"cqg.rtd\", ,\"ContractData\",C21, \"PerCentNetLastTrade\",, \"T\")/100,\"\")","v":1.4360594528613484E-4},398,398,"S.US.AJG",21,"S.US.KO"]
[null,null,"S.US.AKAM",{"$f":"IFERROR(RTD(\"cqg.rtd\", ,\"ContractData\",C22, \"PerCentNetLastTrade\",, \"T\")/100,\"\")","v":-2.3821677726731326E-3},447,447,"S.US.AKAM",22,"S.US.PSX"]
[null,null,"S.US.ALB",{"$f":"IFERROR(RTD(\"cqg.rtd\", ,\"ContractData\",C23, \"PerCentNetLastTrade\",, \"T\")/100,\"\")","v":2.5206942590120161E-2},15,15,"S.US.ALB",23,"S.US.CZR"]
[null,null,"S.US.ALGN",{"$f":"IFERROR(RTD(\"cqg.rtd\", ,\"ContractData\",C24, \"PerCentNetLastTrade\",, \"T\")/100,\"\")","v":4.3851813353689238E-3},264,264,"S.US.ALGN",24,"S.US.SIVB"]
[null,null,"S.US.ALK",{"$f":"IFERROR(RTD(\"cqg.rtd\", ,\"ContractData\",C25, \"PerCentNetLastTrade\",, \"T\")/100,\"\")","v":1.5501081470800289E-2},66,66,"S.US.ALK",25,"S.US.FCX"]
[null,null,"S.US.ALL",{"$f":"IFERROR(RTD(\"cqg.rtd\", ,\"ContractData\",C26, \"PerCentNetLastTrade\",, \"T\")/100,\"\")","v":6.727685206915435E-3},214,214,"S.US.ALL",26,"S.US.GPS"]
[null,null,"S.US.ALLE",{"$f":"IFERROR(RTD(\"cqg.rtd\", ,\"ContractData\",C27, \"PerCentNetLastTrade\",, \"T\")/100,\"\")","v":-1.8889281924301379E-2},502,502,"S.US.ALLE",27,"S.US.CFG"]
[null,null,"S.US.AMAT",{"$f":"IFERROR(RTD(\"cqg.rtd\", ,\"ContractData\",C28, \"PerCentNetLastTrade\",, \"T\")/100,\"\")","v":1.4094112298249601E-2},84,84,"S.US.AMAT",28,"S.US.UAA"]
[null,null,"S.US.AMCR",{"$f":"IFERROR(RTD(\"cqg.rtd\", ,\"ContractData\",C29, \"PerCentNetLastTrade\",, \"T\")/100,\"\")","v":2.6642984014209592E-3},318,318,"S.US.AMCR",29,"S.US.WYNN"]
[null,null,"S.US.AMD",{"$f":"IFERROR(RTD(\"cqg.rtd\", ,\"ContractData\",C30, \"PerCentNetLastTrade\",, \"T\")/100,\"\")","v":6.0842612788428417E-3},233,233,"S.US.AMD",30,"S.US.MPC"]
[null,null,"S.US.AME",{"$f":"IFERROR(RTD(\"cqg.rtd\", ,\"ContractData\",C31, \"PerCentNetLastTrade\",, \"T\")/100,\"\")","v":4.60762085862649E-3},260,260,"S.US.AME",31,"S.US.RJF"]
[null,null,"S.US.AMGN",{"$f":"IFERROR(RTD(\"cqg.rtd\", ,\"ContractData\",C32, \"PerCentNetLastTrade\",, \"T\")/100,\"\")","v":-3.9288752075823238E-3},472,472,"S.US.AMGN",32,"S.US.DVN"]
[null,null,"S.US.AMP",{"$f":"IFERROR(RTD(\"cqg.rtd\", ,\"ContractData\",C33, \"PerCentNetLastTrade\",, \"T\")/100,\"\")","v":1.3180375884793752E-2},97,97,"S.US.AMP",33,"S.US.OKE"]
[null,null,"S.US.AMT",{"$f":"IFERROR(RTD(\"cqg.rtd\", ,\"ContractData\",C34, \"PerCentNetLastTrade\",, \"T\")/100,\"\")","v":-4.4522968197879854E-3},477,477,"S.US.AMT",34,"S.US.SCHW"]
[null,null,"S.US.AMZN",{"$f":"IFERROR(RTD(\"cqg.rtd\", ,\"ContractData\",C35, \"PerCentNetLastTrade\",, \"T\")/100,\"\")","v":6.3808529633184907E-4},375,375,"S.US.AMZN",35,"S.US.HES"]
[null,null,"S.US.ANET",{"$f":"IFERROR(RTD(\"cqg.rtd\", ,\"ContractData\",C36, \"PerCentNetLastTrade\",, \"T\")/100,\"\")","v":4.1243916522312962E-4},390,390,"S.US.ANET",36,"S.US.LUV"]
[null,null,"S.US.ANSS",{"$f":"IFERROR(RTD(\"cqg.rtd\", ,\"ContractData\",C37, \"PerCentNetLastTrade\",, \"T\")/100,\"\")","v":-5.3011086727277916E-3},484,484,"S.US.ANSS",37,"S.US.LYB"]
[null,null,"S.US.ANTM",{"$f":"IFERROR(RTD(\"cqg.rtd\", ,\"ContractData\",C38, \"PerCentNetLastTrade\",, \"T\")/100,\"\")","v":1.046314817664256E-2},143,143,"S.US.ANTM",38,"S.US.VZ"]
[null,null,"S.US.AON",{"$f":"IFERROR(RTD(\"cqg.rtd\", ,\"ContractData\",C39, \"PerCentNetLastTrade\",, \"T\")/100,\"\")","v":4.3708204029896417E-3},265,265,"S.US.AON",39,"S.US.PVH"]
[null,null,"S.US.AOS",{"$f":"IFERROR(RTD(\"cqg.rtd\", ,\"ContractData\",C40, \"PerCentNetLastTrade\",, \"T\")/100,\"\")","v":7.8347578347578353E-3},196,196,"S.US.AOS",40,"S.US.HST"]
[null,null,"S.US.APA",{"$f":"IFERROR(RTD(\"cqg.rtd\", ,\"ContractData\",C41, \"PerCentNetLastTrade\",, \"T\")/100,\"\")","v":2.3348519362186789E-2},18,18,"S.US.APA",41,"S.US.RCL"]
[null,null,"S.US.APD",{"$f":"IFERROR(RTD(\"cqg.rtd\", ,\"ContractData\",C42, \"PerCentNetLastTrade\",, \"T\")/100,\"\")","v":-3.4971148802238151E-5},408,408,"S.US.APD",42,"S.US.UAL"]
[null,null,"S.US.APH",{"$f":"IFERROR(RTD(\"cqg.rtd\", ,\"ContractData\",C43, \"PerCentNetLastTrade\",, \"T\")/100,\"\")","v":8.7450808919982519E-3},180,180,"S.US.APH",43,"S.US.XOM"]
[null,null,"S.US.APTV",{"$f":"IFERROR(RTD(\"cqg.rtd\", ,\"ContractData\",C44, \"PerCentNetLastTrade\",, \"T\")/100,\"\")","v":1.3646751550767222E-2},89,89,"S.US.APTV",44,"S.US.DRI"]
[null,null,"S.US.ARE",{"$f":"IFERROR(RTD(\"cqg.rtd\", ,\"ContractData\",C45, \"PerCentNetLastTrade\",, \"T\")/100,\"\")","v":7.1783828129005803E-4},369,369,"S.US.ARE",45,"S.US.DOW"]
[null,null,"S.US.ATO",{"$f":"IFERROR(RTD(\"cqg.rtd\", ,\"ContractData\",C46, \"PerCentNetLastTrade\",, \"T\")/100,\"\")","v":4.2215298019901495E-3},270,270,"S.US.ATO",46,"S.US.RL"]
[null,null,"S.US.ATVI",{"$f":"IFERROR(RTD(\"cqg.rtd\", ,\"ContractData\",C47, \"PerCentNetLastTrade\",, \"T\")/100,\"\")","v":3.6061632608458093E-3},284,284,"S.US.ATVI",47,"S.US.UA"]
[null,null,"S.US.AVB",{"$f":"IFERROR(RTD(\"cqg.rtd\", ,\"ContractData\",C48, \"PerCentNetLastTrade\",, \"T\")/100,\"\")","v":1.6612748098277521E-3},345,345,"S.US.AVB",48,"S.US.FITB"]
[null,null,"S.US.AVGO",{"$f":"IFERROR(RTD(\"cqg.rtd\", ,\"ContractData\",C49, \"PerCentNetLastTrade\",, \"T\")/100,\"\")","v":2.4968522589043727E-3},323,323,"S.US.AVGO",49,"S.US.MGM"]
[null,null,"S.US.AVY",{"$f":"IFERROR(RTD(\"cqg.rtd\", ,\"ContractData\",C50, \"PerCentNetLastTrade\",, \"T\")/100,\"\")","v":5.0311332503113326E-3},252,252,"S.US.AVY",50,"S.US.NVDA"]
[null,null,"S.US.AWK",{"$f":"IFERROR(RTD(\"cqg.rtd\", ,\"ContractData\",C51, \"PerCentNetLastTrade\",, \"T\")/100,\"\")","v":-2.9994001199760045E-3},461,461,"S.US.AWK",51,"S.US.HWM"]
[null,null,"S.US.AXP",{"$f":"IFERROR(RTD(\"cqg.rtd\", ,\"ContractData\",C52, \"PerCentNetLastTrade\",, \"T\")/100,\"\")","v":8.1719666015278025E-3},191,191,"S.US.AXP",52,"S.US.DAL"]
[null,null,"S.US.AZO",{"$f":"IFERROR(RTD(\"cqg.rtd\", ,\"ContractData\",C53, \"PerCentNetLastTrade\",, \"T\")/100,\"\")","v":3.9581707507413766E-3},277,277,"S.US.AZO",53,"S.US.PXD"]
[null,null,"S.US.BA",{"$f":"IFERROR(RTD(\"cqg.rtd\", ,\"ContractData\",C54, \"PerCentNetLastTrade\",, \"T\")/100,\"\")","v":1.5887635275155423E-2},61,61,"S.US.BA",54,"S.US.RF"]
[null,null,"S.US.BAC",{"$f":"IFERROR(RTD(\"cqg.rtd\", ,\"ContractData\",C55, \"PerCentNetLastTrade\",, \"T\")/100,\"\")","v":9.8169275669938976E-3},163,163,"S.US.BAC",55,"S.US.DISCK"]
[null,null,"S.US.BAX",{"$f":"IFERROR(RTD(\"cqg.rtd\", ,\"ContractData\",C56, \"PerCentNetLastTrade\",, \"T\")/100,\"\")","v":7.4497144276136087E-4},367,367,"S.US.BAX",56,"S.US.MOS"]
[null,null,"S.US.BBY",{"$f":"IFERROR(RTD(\"cqg.rtd\", ,\"ContractData\",C57, \"PerCentNetLastTrade\",, \"T\")/100,\"\")","v":7.8654732845131539E-3},195,195,"S.US.BBY",57,"S.US.EXPE"]
[null,null,"S.US.BDX",{"$f":"IFERROR(RTD(\"cqg.rtd\", ,\"ContractData\",C58, \"PerCentNetLastTrade\",, \"T\")/100,\"\")","v":-2.3481781376518216E-3},446,446,"S.US.BDX",58,"S.US.VFC"]
[null,null,"S.US.BEN",{"$f":"IFERROR(RTD(\"cqg.rtd\", ,\"ContractData\",C59, \"PerCentNetLastTrade\",, \"T\")/100,\"\")","v":1.3642564802182811E-2},90,90,"S.US.BEN",59,"S.US.EMN"]
[null,null,"S.US.BFB",{"$f":"IFERROR(RTD(\"cqg.rtd\", ,\"ContractData\",C60, \"PerCentNetLastTrade\",, \"T\")/100,\"\")","v":2.4934201412938079E-3},324,324,"S.US.BFB",60,"S.US.EOG"]
[null,null,"S.US.BIIB",{"$f":"IFERROR(RTD(\"cqg.rtd\", ,\"ContractData\",C61, \"PerCentNetLastTrade\",, \"T\")/100,\"\")","v":-2.6047319296722375E-3},452,452,"S.US.BIIB",61,"S.US.BA"]
[null,null,"S.US.BIO",{"$f":"IFERROR(RTD(\"cqg.rtd\", ,\"ContractData\",C62, \"PerCentNetLastTrade\",, \"T\")/100,\"\")","v":1.2716555459142457E-3},356,356,"S.US.BIO",62,"S.US.GE"]
[null,null,"S.US.BK",{"$f":"IFERROR(RTD(\"cqg.rtd\", ,\"ContractData\",C63, \"PerCentNetLastTrade\",, \"T\")/100,\"\")","v":5.4611650485436895E-3},243,243,"S.US.BK",63,"S.US.VNO"]
[null,null,"S.US.BKNG",{"$f":"IFERROR(RTD(\"cqg.rtd\", ,\"ContractData\",C64, \"PerCentNetLastTrade\",, \"T\")/100,\"\")","v":7.388179851015992E-3},204,204,"S.US.BKNG",64,"S.US.MET"]
[null,null,"S.US.BKR",{"$f":"IFERROR(RTD(\"cqg.rtd\", ,\"ContractData\",C65, \"PerCentNetLastTrade\",, \"T\")/100,\"\")","v":2.6447105788423152E-2},13,13,"S.US.BKR",65,"S.US.PFG"]
[null,null,"S.US.BLK",{"$f":"IFERROR(RTD(\"cqg.rtd\", ,\"ContractData\",C66, \"PerCentNetLastTrade\",, \"T\")/100,\"\")","v":7.0092394520049148E-3},210,{"$f":"IFERROR(E66,\"\")","v":210},{"$f":"C66","v":"S.US.BLK"},66,{"$f":"IFERROR(VLOOKUP(H66,$F$1:$G$505,2,FALSE),\"\")","v":"S.US.ALK"}]
[null,null,"S.US.BLL",{"$f":"IFERROR(RTD(\"cqg.rtd\", ,\"ContractData\",C67, \"PerCentNetLastTrade\",, \"T\")/100,\"\")","v":-3.1982942430703624E-3},464,464,"S.US.BLL",{"$f":"H66+1","v":67},"S.US.SYY"]
[null,null,"S.US.BMY",{"$f":"IFERROR(RTD(\"cqg.rtd\", ,\"ContractData\",C68, \"PerCentNetLastTrade\",, \"T\")/100,\"\")","v":3.1474820143884892E-3},304,304,"S.US.BMY",68,"S.US.NUE"]
[null,null,"S.US.BR",{"$f":"IFERROR(RTD(\"cqg.rtd\", ,\"ContractData\",C69, \"PerCentNetLastTrade\",, \"T\")/100,\"\")","v":3.5471475022169673E-4},391,391,"S.US.BR",69,"S.US.HBAN"]
[null,null,"S.US.BRKB",{"$f":"IFERROR(RTD(\"cqg.rtd\", ,\"ContractData\",C70, \"PerCentNetLastTrade\",, \"T\")/100,\"\")","v":4.0088121636751052E-3},275,275,"S.US.BRKB",70,"S.US.F"]
[null,null,"S.US.BSX",{"$f":"IFERROR(RTD(\"cqg.rtd\", ,\"ContractData\",C71, \"PerCentNetLastTrade\",, \"T\")/100,\"\")","v":1.121757419957934E-2},132,132,"S.US.BSX",71,"S.US.DISCA"]
[null,null,"S.US.BWA",{"$f":"IFERROR(RTD(\"cqg.rtd\", ,\"ContractData\",C72, \"PerCentNetLastTrade\",, \"T\")/100,\"\")","v":1.3820965341271529E-2},87,87,"S.US.BWA",72,"S.US.WRK"]
[null,null,"S.US.BXP",{"$f":"IFERROR(RTD(\"cqg.rtd\", ,\"ContractData\",C73, \"PerCentNetLastTrade\",, \"T\")/100,\"\")","v":9.9965529127886924E-3},153,153,"S.US.BXP",73,"S.US.TXT"]
[null,null,"S.US.C",{"$f":"IFERROR(RTD(\"cqg.rtd\", ,\"ContractData\",C74, \"PerCentNetLastTrade\",, \"T\")/100,\"\")","v":1.252074219339267E-2},115,115,"S.US.C",74,"S.US.CVX"]
[null,null,"S.US.CAG",{"$f":"IFERROR(RTD(\"cqg.rtd\", ,\"ContractData\",C75, \"PerCentNetLastTrade\",, \"T\")/100,\"\")","v":-1.1425307055127106E-3},420,420,"S.US.CAG",75,"S.US.VIAC"]
[null,null,"S.US.CAH",{"$f":"IFERROR(RTD(\"cqg.rtd\", ,\"ContractData\",C76, \"PerCentNetLastTrade\",, \"T\")/100,\"\")","v":7.2802912116484665E-3},206,206,"S.US.CAH",76,"S.US.AAL"]
[null,null,"S.US.CARR",{"$f":"IFERROR(RTD(\"cqg.rtd\", ,\"ContractData\",C77, \"PerCentNetLastTrade\",, \"T\")/100,\"\")","v":1.803607214428858E-3},353,353,"S.US.CARR",77,"S.US.FOXA"]
[null,null,"S.US.CAT",{"$f":"IFERROR(RTD(\"cqg.rtd\", ,\"ContractData\",C78, \"PerCentNetLastTrade\",, \"T\")/100,\"\")","v":6.2512021542604349E-4},377,377,"S.US.CAT",78,"S.US.HLT"]
[null,null,"S.US.CB",{"$f":"IFERROR(RTD(\"cqg.rtd\", ,\"ContractData\",C79, \"PerCentNetLastTrade\",, \"T\")/100,\"\")","v":6.9183515238265634E-3},212,212,"S.US.CB",79,"S.US.CE"]
[null,null,"S.US.CBOE",{"$f":"IFERROR(RTD(\"cqg.rtd\", ,\"ContractData\",C80, \"PerCentNetLastTrade\",, \"T\")/100,\"\")","v":1.4710972654897888E-3},350,350,"S.US.CBOE",80,"S.US.TFX"]
[null,null,"S.US.CBRE",{"$f":"IFERROR(RTD(\"cqg.rtd\", ,\"ContractData\",C81, \"PerCentNetLastTrade\",, \"T\")/100,\"\")","v":9.8974481278321022E-3},156,156,"S.US.CBRE",81,"S.US.PENN"]
[null,null,"S.US.CCI",{"$f":"IFERROR(RTD(\"cqg.rtd\", ,\"ContractData\",C82, \"PerCentNetLastTrade\",, \"T\")/100,\"\")","v":-2.6564344746162925E-3},458,458,"S.US.CCI",82,"S.US.PWR"]
[null,null,"S.US.CCL",{"$f":"IFERROR(RTD(\"cqg.rtd\", ,\"ContractData\",C83, \"PerCentNetLastTrade\",, \"T\")/100,\"\")","v":4.2000943841434636E-2},3,3,"S.US.CCL",83,"S.US.EA"]
[null,null,"S.US.CDNS",{"$f":"IFERROR(RTD(\"cqg.rtd\", ,\"ContractData\",C84, \"PerCentNetLastTrade\",, \"T\")/100,\"\")","v":-3.0760426353816438E-3},462,462,"S.US.CDNS",84,"S.US.AMAT"]
[null,null,"S.US.CDW",{"$f":"IFERROR(RTD(\"cqg.rtd\", ,\"ContractData\",C85, \"PerCentNetLastTrade\",, \"T\")/100,\"\")","v":-1.4185201997276443E-3},427,427,"S.US.CDW",85,"S.US.LYV"]
[null,null,"S.US.CE",{"$f":"IFERROR(RTD(\"cqg.rtd\", ,\"ContractData\",C86, \"PerCentNetLastTrade\",, \"T\")/100,\"\")","v":1.4437086092715233E-2},79,79,"S.US.CE",86,"S.US.URI"]
[null,null,"S.US.CERN",{"$f":"IFERROR(RTD(\"cqg.rtd\", ,\"ContractData\",C87, \"PerCentNetLastTrade\",, \"T\")/100,\"\")","v":-1.2851818532322323E-4},412,412,"S.US.CERN",87,"S.US.BWA"]
[null,null,"S.US.CF",{"$f":"IFERROR(RTD(\"cqg.rtd\", ,\"ContractData\",C88, \"PerCentNetLastTrade\",, \"T\")/100,\"\")","v":1.235356762513312E-2},113,113,"S.US.CF",88,"S.US.DD"]
[null,null,"S.US.CFG",{"$f":"IFERROR(RTD(\"cqg.rtd\", ,\"ContractData\",C89, \"PerCentNetLastTrade\",, \"T\")/100,\"\")","v":2.1326458870400748E-2},27,27,"S.US.CFG",89,"S.US.APTV"]
[null,null,"S.US.CHD",{"$f":"IFERROR(RTD(\"cqg.rtd\", ,\"ContractData\",C90, \"PerCentNetLastTrade\",, \"T\")/100,\"\")","v":-5.173008391769169E-3},482,482,"S.US.CHD",90,"S.US.BEN"]
[null,null,"S.US.CHRW",{"$f":"IFERROR(RTD(\"cqg.rtd\", ,\"ContractData\",C91, \"PerCentNetLastTrade\",, \"T\")/100,\"\")","v":2.8997959402856837E-3},310,310,"S.US.CHRW",91,"S.US.OMC"]
[null,null,"S.US.CHTR",{"$f":"IFERROR(RTD(\"cqg.rtd\", ,\"ContractData\",C92, \"PerCentNetLastTrade\",, \"T\")/100,\"\")","v":-5.2590572652902222E-3},470,470,"S.US.CHTR",92,"S.US.HBI"]
[null,null,"S.US.CI",{"$f":"IFERROR(RTD(\"cqg.rtd\", ,\"ContractData\",C93, \"PerCentNetLastTrade\",, \"T\")/100,\"\")","v":7.3700543056633046E-3},205,205,"S.US.CI",93,"S.US.MAR"]
[null,null,"S.US.CINF",{"$f":"IFERROR(RTD(\"cqg.rtd\", ,\"ContractData\",C94, \"PerCentNetLastTrade\",, \"T\")/100,\"\")","v":6.4009558760774942E-3},222,222,"S.US.CINF",94,"S.US.WHR"]
[null,null,"S.US.CL",{"$f":"IFERROR(RTD(\"cqg.rtd\", ,\"ContractData\",C95, \"PerCentNetLastTrade\",, \"T\")/100,\"\")","v":6.0466803724755112E-4},378,378,"S.US.CL",95,"S.US.COF"]
[null,null,"S.US.CLX",{"$f":"IFERROR(RTD(\"cqg.rtd\", ,\"ContractData\",C96, \"PerCentNetLastTrade\",, \"T\")/100,\"\")","v":-3.4541367399528481E-3},469,469,"S.US.CLX",96,"S.US.SYF"]
[null,null,"S.US.CMA",{"$f":"IFERROR(RTD(\"cqg.rtd\", ,\"ContractData\",C97, \"PerCentNetLastTrade\",, \"T\")/100,\"\")","v":3.2287541882424609E-2},7,7,"S.US.CMA",97,"S.US.AMP"]
[null,null,"S.US.CMCSA",{"$f":"IFERROR(RTD(\"cqg.rtd\", ,\"ContractData\",C98, \"PerCentNetLastTrade\",, \"T\")/100,\"\")","v":5.2557813594954444E-4},371,371,"S.US.CMCSA",98,"S.US.L"]
[null,null,"S.US.CME",{"$f":"IFERROR(RTD(\"cqg.rtd\", ,\"ContractData\",C99, \"PerCentNetLastTrade\",, \"T\")/100,\"\")","v":5.8490746955604566E-3},234,234,"S.US.CME",99,"S.US.KEY"]
[null,null,"S.US.CMG",{"$f":"IFERROR(RTD(\"cqg.rtd\", ,\"ContractData\",C100, \"PerCentNetLastTrade\",, \"T\")/100,\"\")","v":7.1324673674849931E-2},2,2,"S.US.CMG",100,"S.US.UHS"]
[null,null,"S.US.CMI",{"$f":"IFERROR(RTD(\"cqg.rtd\", ,\"ContractData\",C101, \"PerCentNetLastTrade\",, \"T\")/100,\"\")","v":8.615617382533412E-3},182,182,"S.US.CMI",101,"S.US.TFC"]
[null,null,"S.US.CMS",{"$f":"IFERROR(RTD(\"cqg.rtd\", ,\"ContractData\",C102, \"PerCentNetLastTrade\",, \"T\")/100,\"\")","v":9.686793671294801E-4},359,359,"S.US.CMS",102,"S.US.HCA"]
[null,null,"S.US.CNC",{"$f":"IFERROR(RTD(\"cqg.rtd\", ,\"ContractData\",C103, \"PerCentNetLastTrade\",, \"T\")/100,\"\")","v":3.6277382447328032E-3},319,319,"S.US.CNC",103,"S.US.NXPI"]
[null,null,"S.US.CNP",{"$f":"IFERROR(RTD(\"cqg.rtd\", ,\"ContractData\",C104, \"PerCentNetLastTrade\",, \"T\")/100,\"\")","v":3.9619651347068147E-3},302,302,"S.US.CNP",104,"S.US.NTRS"]
[null,null,"S.US.COF",{"$f":"IFERROR(RTD(\"cqg.rtd\", ,\"ContractData\",C105, \"PerCentNetLastTrade\",, \"T\")/100,\"\")","v":1.3735915938726423E-2},95,95,"S.US.COF",105,"S.US.AES"]
[null,null,"S.US.COG",{"$f":"IFERROR(RTD(\"cqg.rtd\", ,\"ContractData\",C106, \"PerCentNetLastTrade\",, \"T\")/100,\"\")","v":1.0296010296010296E-2},147,147,"S.US.COG",106,"S.US.DOV"]
[null,null,"S.US.COO",{"$f":"IFERROR(RTD(\"cqg.rtd\", ,\"ContractData\",C107, \"PerCentNetLastTrade\",, \"T\")/100,\"\")","v":3.5792404056472459E-3},286,286,"S.US.COO",107,"S.US.ULTA"]
[null,null,"S.US.COP",{"$f":"IFERROR(RTD(\"cqg.rtd\", ,\"ContractData\",C108, \"PerCentNetLastTrade\",, \"T\")/100,\"\")","v":2.5702221406278689E-2},14,14,"S.US.COP",108,"S.US.LVS"]
[null,null,"S.US.COST",{"$f":"IFERROR(RTD(\"cqg.rtd\", ,\"ContractData\",C109, \"PerCentNetLastTrade\",, \"T\")/100,\"\")","v":-1.441476071497213E-3},428,428,"S.US.COST",109,"S.US.PH"]
[null,null,"S.US.CPB",{"$f":"IFERROR(RTD(\"cqg.rtd\", ,\"ContractData\",C110, \"PerCentNetLastTrade\",, \"T\")/100,\"\")","v":-2.6501766784452294E-3},457,457,"S.US.CPB",110,"S.US.PNC"]
[null,null,"S.US.CPRT",{"$f":"IFERROR(RTD(\"cqg.rtd\", ,\"ContractData\",C111, \"PerCentNetLastTrade\",, \"T\")/100,\"\")","v":-1.5336354130359008E-3},431,431,"S.US.CPRT",111,"S.US.GS"]
[null,null,"S.US.CRL",{"$f":"IFERROR(RTD(\"cqg.rtd\", ,\"ContractData\",C112, \"PerCentNetLastTrade\",, \"T\")/100,\"\")","v":1.0376673238559718E-4},401,401,"S.US.CRL",112,"S.US.KMI"]
[null,null,"S.US.CRM",{"$f":"IFERROR(RTD(\"cqg.rtd\", ,\"ContractData\",C113, \"PerCentNetLastTrade\",, \"T\")/100,\"\")","v":-2.3739119570196994E-3},448,448,"S.US.CRM",113,"S.US.CF"]
[null,null,"S.US.CSCO",{"$f":"IFERROR(RTD(\"cqg.rtd\", ,\"ContractData\",C114, \"PerCentNetLastTrade\",, \"T\")/100,\"\")","v":-9.3318402388951102E-4},419,419,"S.US.CSCO",114,"S.US.DFS"]
[null,null,"S.US.CSX",{"$f":"IFERROR(RTD(\"cqg.rtd\", ,\"ContractData\",C115, \"PerCentNetLastTrade\",, \"T\")/100,\"\")","v":6.4143681847338039E-3},220,220,"S.US.CSX",115,"S.US.C"]
[null,null,"S.US.CTAS",{"$f":"IFERROR(RTD(\"cqg.rtd\", ,\"ContractData\",C116, \"PerCentNetLastTrade\",, \"T\")/100,\"\")","v":4.3679342240493323E-4},388,388,"S.US.CTAS",116,"S.US.NLSN"]
[null,null,"S.US.CTLT",{"$f":"IFERROR(RTD(\"cqg.rtd\", ,\"ContractData\",C117, \"PerCentNetLastTrade\",, \"T\")/100,\"\")","v":3.1058656491259207E-3},306,306,"S.US.CTLT",117,"S.US.WFC"]
[null,null,"S.US.CTSH",{"$f":"IFERROR(RTD(\"cqg.rtd\", ,\"ContractData\",C118, \"PerCentNetLastTrade\",, \"T\")/100,\"\")","v":1.4790711433219938E-4},397,397,"S.US.CTSH",118,"S.US.JPM"]
[null,null,"S.US.CTVA",{"$f":"IFERROR(RTD(\"cqg.rtd\", ,\"ContractData\",C119, \"PerCentNetLastTrade\",, \"T\")/100,\"\")","v":1.1981787682722263E-2},119,119,"S.US.CTVA",119,"S.US.CTVA"]
[null,null,"S.US.CTXS",{"$f":"IFERROR(RTD(\"cqg.rtd\", ,\"ContractData\",C120, \"PerCentNetLastTrade\",, \"T\")/100,\"\")","v":-1.0460251046025104E-3},417,417,"S.US.CTXS",120,"S.US.MKTX"]
[null,null,"S.US.CVS",{"$f":"IFERROR(RTD(\"cqg.rtd\", ,\"ContractData\",C121, \"PerCentNetLastTrade\",, \"T\")/100,\"\")","v":8.9242053789731039E-3},179,179,"S.US.CVS",121,"S.US.IVZ"]
[null,null,"S.US.CVX",{"$f":"IFERROR(RTD(\"cqg.rtd\", ,\"ContractData\",C122, \"PerCentNetLastTrade\",, \"T\")/100,\"\")","v":1.4710452709002382E-2},74,74,"S.US.CVX",122,"S.US.MS"]
[null,null,"S.US.CZR",{"$f":"IFERROR(RTD(\"cqg.rtd\", ,\"ContractData\",C123, \"PerCentNetLastTrade\",, \"T\")/100,\"\")","v":2.1905805038335158E-2},23,23,"S.US.CZR",123,"S.US.NRG"]
[null,null,"S.US.D",{"$f":"IFERROR(RTD(\"cqg.rtd\", ,\"ContractData\",C124, \"PerCentNetLastTrade\",, \"T\")/100,\"\")","v":7.9291661160301309E-4},364,364,"S.US.D",124,"S.US.AIG"]
[null,null,"S.US.DAL",{"$f":"IFERROR(RTD(\"cqg.rtd\", ,\"ContractData\",C125, \"PerCentNetLastTrade\",, \"T\")/100,\"\")","v":1.6969995081160847E-2},52,52,"S.US.DAL",125,"S.US.HSIC"]
[null,null,"S.US.DD",{"$f":"IFERROR(RTD(\"cqg.rtd\", ,\"ContractData\",C126, \"PerCentNetLastTrade\",, \"T\")/100,\"\")","v":1.3702347035680369E-2},88,88,"S.US.DD",126,"S.US.KLAC"]
[null,null,"S.US.DE",{"$f":"IFERROR(RTD(\"cqg.rtd\", ,\"ContractData\",C127, \"PerCentNetLastTrade\",, \"T\")/100,\"\")","v":1.1407062609545153E-2},128,128,"S.US.DE",127,"S.US.STT"]
[null,null,"S.US.DFS",{"$f":"IFERROR(RTD(\"cqg.rtd\", ,\"ContractData\",C128, \"PerCentNetLastTrade\",, \"T\")/100,\"\")","v":1.2532981530343008E-2},114,114,"S.US.DFS",128,"S.US.DE"]
[null,null,"S.US.DG",{"$f":"IFERROR(RTD(\"cqg.rtd\", ,\"ContractData\",C129, \"PerCentNetLastTrade\",, \"T\")/100,\"\")","v":-2.120047701073274E-3},443,443,"S.US.DG",129,"S.US.LRCX"]
[null,null,"S.US.DGX",{"$f":"IFERROR(RTD(\"cqg.rtd\", ,\"ContractData\",C130, \"PerCentNetLastTrade\",, \"T\")/100,\"\")","v":3.1555001100755853E-3},303,{"$f":"IFERROR(E130,\"\")","v":303},{"$f":"C130","v":"S.US.DGX"},130,{"$f":"IFERROR(VLOOKUP(H130,$F$1:$G$505,2,FALSE),\"\")","v":"S.US.RHI"}]
[null,null,"S.US.DHI",{"$f":"IFERROR(RTD(\"cqg.rtd\", ,\"ContractData\",C131, \"PerCentNetLastTrade\",, \"T\")/100,\"\")","v":6.7370312149112955E-4},374,374,"S.US.DHI",{"$f":"H130+1","v":131},"S.US.FMC"]
[null,null,"S.US.DHR",{"$f":"IFERROR(RTD(\"cqg.rtd\", ,\"ContractData\",C132, \"PerCentNetLastTrade\",, \"T\")/100,\"\")","v":-1.6184767277856137E-2},500,500,"S.US.DHR",132,"S.US.BSX"]
[null,null,"S.US.DIS",{"$f":"IFERROR(RTD(\"cqg.rtd\", ,\"ContractData\",C133, \"PerCentNetLastTrade\",, \"T\")/100,\"\")","v":-1.9801980198019802E-3},438,438,"S.US.DIS",133,"S.US.XRAY"]
[null,null,"S.US.DISCA",{"$f":"IFERROR(RTD(\"cqg.rtd\", ,\"ContractData\",C134, \"PerCentNetLastTrade\",, \"T\")/100,\"\")","v":1.4930678990401706E-2},71,71,"S.US.DISCA",134,"S.US.TAP"]
[null,null,"S.US.DISCK",{"$f":"IFERROR(RTD(\"cqg.rtd\", ,\"ContractData\",C135, \"PerCentNetLastTrade\",, \"T\")/100,\"\")","v":1.6257088846880909E-2},55,55,"S.US.DISCK",135,"S.US.DVA"]
[null,null,"S.US.DISH",{"$f":"IFERROR(RTD(\"cqg.rtd\", ,\"ContractData\",C136, \"PerCentNetLastTrade\",, \"T\")/100,\"\")","v":6.6063126988010765E-3},215,215,"S.US.DISH",136,"S.US.MCK"]
[null,null,"S.US.DLR",{"$f":"IFERROR(RTD(\"cqg.rtd\", ,\"ContractData\",C137, \"PerCentNetLastTrade\",, \"T\")/100,\"\")","v":-5.159235668789809E-3},488,488,"S.US.DLR",137,"S.US.PM"]
[null,null,"S.US.DLTR",{"$f":"IFERROR(RTD(\"cqg.rtd\", ,\"ContractData\",C138, \"PerCentNetLastTrade\",, \"T\")/100,\"\")","v":4.03999596000404E-3},273,273,"S.US.DLTR",138,"S.US.PRU"]
[null,null,"S.US.DOV",{"$f":"IFERROR(RTD(\"cqg.rtd\", ,\"ContractData\",C139, \"PerCentNetLastTrade\",, \"T\")/100,\"\")","v":1.2828419884050821E-2},106,106,"S.US.DOV",139,"S.US.FRC"]
[null,null,"S.US.DOW",{"$f":"IFERROR(RTD(\"cqg.rtd\", ,\"ContractData\",C140, \"PerCentNetLastTrade\",, \"T\")/100,\"\")","v":1.7741385192766974E-2},45,45,"S.US.DOW",140,"S.US.PNR"]
[null,null,"S.US.DPZ",{"$f":"IFERROR(RTD(\"cqg.rtd\", ,\"ContractData\",C141, \"PerCentNetLastTrade\",, \"T\")/100,\"\")","v":2.5685832789439332E-3},320,320,"S.US.DPZ",141,"S.US.ISRG"]
[null,null,"S.US.DRE",{"$f":"IFERROR(RTD(\"cqg.rtd\", ,\"ContractData\",C142, \"PerCentNetLastTrade\",, \"T\")/100,\"\")","v":-1.3706677109849227E-3},426,426,"S.US.DRE",142,"S.US.KIM"]
[null,null,"S.US.DRI",{"$f":"IFERROR(RTD(\"cqg.rtd\", ,\"ContractData\",C143, \"PerCentNetLastTrade\",, \"T\")/100,\"\")","v":1.7762740537111441E-2},44,44,"S.US.DRI",143,"S.US.ANTM"]
[null,null,"S.US.DTE",{"$f":"IFERROR(RTD(\"cqg.rtd\", ,\"ContractData\",C144, \"PerCentNetLastTrade\",, \"T\")/100,\"\")","v":3.7891836031691355E-3},281,281,"S.US.DTE",144,"S.US.GL"]
[null,null,"S.US.DUK",{"$f":"IFERROR(RTD(\"cqg.rtd\", ,\"ContractData\",C145, \"PerCentNetLastTrade\",, \"T\")/100,\"\")","v":9.6394833236938501E-4},360,360,"S.US.DUK",145,"S.US.AFL"]
[null,null,"S.US.DVA",{"$f":"IFERROR(RTD(\"cqg.rtd\", ,\"ContractData\",C146, \"PerCentNetLastTrade\",, \"T\")/100,\"\")","v":1.0970605476928231E-2},135,135,"S.US.DVA",146,"S.US.FOX"]
[null,null,"S.US.DVN",{"$f":"IFERROR(RTD(\"cqg.rtd\", ,\"ContractData\",C147, \"PerCentNetLastTrade\",, \"T\")/100,\"\")","v":2.0134228187919465E-2},32,32,"S.US.DVN",147,"S.US.COG"]
[null,null,"S.US.DXC",{"$f":"IFERROR(RTD(\"cqg.rtd\", ,\"ContractData\",C148, \"PerCentNetLastTrade\",, \"T\")/100,\"\")","v":9.0603158167227547E-3},175,175,"S.US.DXC",148,"S.US.HIG"]
[null,null,"S.US.DXCM",{"$f":"IFERROR(RTD(\"cqg.rtd\", ,\"ContractData\",C149, \"PerCentNetLastTrade\",, \"T\")/100,\"\")","v":-4.6236318963591688E-3},478,478,"S.US.DXCM",149,"S.US.TXN"]
[null,null,"S.US.EA",{"$f":"IFERROR(RTD(\"cqg.rtd\", ,\"ContractData\",C150, \"PerCentNetLastTrade\",, \"T\")/100,\"\")","v":1.4248245551853689E-2},83,83,"S.US.EA",150,"S.US.TROW"]
[null,null,"S.US.EBAY",{"$f":"IFERROR(RTD(\"cqg.rtd\", ,\"ContractData\",C151, \"PerCentNetLastTrade\",, \"T\")/100,\"\")","v":2.8748023573379328E-3},311,311,"S.US.EBAY",151,"S.US.LEG"]
[null,null,"S.US.ECL",{"$f":"IFERROR(RTD(\"cqg.rtd\", ,\"ContractData\",C152, \"PerCentNetLastTrade\",, \"T\")/100,\"\")","v":5.1353874883286639E-3},250,250,"S.US.ECL",152,"S.US.REG"]
[null,null,"S.US.ED",{"$f":"IFERROR(RTD(\"cqg.rtd\", ,\"ContractData\",C153, \"PerCentNetLastTrade\",, \"T\")/100,\"\")","v":6.7962484708440933E-4},373,373,"S.US.ED",153,"S.US.BXP"]
[null,null,"S.US.EFX",{"$f":"IFERROR(RTD(\"cqg.rtd\", ,\"ContractData\",C154, \"PerCentNetLastTrade\",, \"T\")/100,\"\")","v":7.7948398160417802E-4},365,365,"S.US.EFX",154,"S.US.ZBH"]
[null,null,"S.US.EIX",{"$f":"IFERROR(RTD(\"cqg.rtd\", ,\"ContractData\",C155, \"PerCentNetLastTrade\",, \"T\")/100,\"\")","v":7.9155672823218986E-3},193,193,"S.US.EIX",155,"S.US.RTX"]
[null,null,"S.US.EL",{"$f":"IFERROR(RTD(\"cqg.rtd\", ,\"ContractData\",C156, \"PerCentNetLastTrade\",, \"T\")/100,\"\")","v":6.1833359097232957E-3},227,227,"S.US.EL",156,"S.US.CBRE"]
[null,null,"S.US.EMN",{"$f":"IFERROR(RTD(\"cqg.rtd\", ,\"ContractData\",C157, \"PerCentNetLastTrade\",, \"T\")/100,\"\")","v":1.5990387281634162E-2},59,59,"S.US.EMN",157,"S.US.MCD"]
[null,null,"S.US.EMR",{"$f":"IFERROR(RTD(\"cqg.rtd\", ,\"ContractData\",C158, \"PerCentNetLastTrade\",, \"T\")/100,\"\")","v":3.9122825079789978E-3},297,297,"S.US.EMR",158,"S.US.MDT"]
[null,null,"S.US.ENPH",{"$f":"IFERROR(RTD(\"cqg.rtd\", ,\"ContractData\",C159, \"PerCentNetLastTrade\",, \"T\")/100,\"\")","v":9.065024115288511E-3},174,174,"S.US.ENPH",159,"S.US.MCHP"]
[null,null,"S.US.EOG",{"$f":"IFERROR(RTD(\"cqg.rtd\", ,\"ContractData\",C160, \"PerCentNetLastTrade\",, \"T\")/100,\"\")","v":1.5944055944055943E-2},60,60,"S.US.EOG",160,"S.US.SYK"]
[null,null,"S.US.EQIX",{"$f":"IFERROR(RTD(\"cqg.rtd\", ,\"ContractData\",C161, \"PerCentNetLastTrade\",, \"T\")/100,\"\")","v":-8.1186572989851678E-3},493,493,"S.US.EQIX",161,"S.US.WMB"]
[null,null,"S.US.EQR",{"$f":"IFERROR(RTD(\"cqg.rtd\", ,\"ContractData\",C162, \"PerCentNetLastTrade\",, \"T\")/100,\"\")","v":1.4137606032045241E-3},352,352,"S.US.EQR",162,"S.US.IR"]
[null,null,"S.US.ES",{"$f":"IFERROR(RTD(\"cqg.rtd\", ,\"ContractData\",C163, \"PerCentNetLastTrade\",, \"T\")/100,\"\")","v":-3.9562485454968585E-3},473,473,"S.US.ES",163,"S.US.BAC"]
[null,null,"S.US.ESS",{"$f":"IFERROR(RTD(\"cqg.rtd\", ,\"ContractData\",C164, \"PerCentNetLastTrade\",, \"T\")/100,\"\")","v":3.0840867172618148E-3},307,307,"S.US.ESS",164,"S.US.KMX"]
[null,null,"S.US.ETN",{"$f":"IFERROR(RTD(\"cqg.rtd\", ,\"ContractData\",C165, \"PerCentNetLastTrade\",, \"T\")/100,\"\")","v":6.3599195275488348E-3},223,223,"S.US.ETN",165,"S.US.TJX"]
[null,null,"S.US.ETR",{"$f":"IFERROR(RTD(\"cqg.rtd\", ,\"ContractData\",C166, \"PerCentNetLastTrade\",, \"T\")/100,\"\")","v":2.7357107962872494E-3},315,315,"S.US.ETR",166,"S.US.NWSA"]
[null,null,"S.US.ETSY",{"$f":"IFERROR(RTD(\"cqg.rtd\", ,\"ContractData\",C167, \"PerCentNetLastTrade\",, \"T\")/100,\"\")","v":-9.7500898034587162E-3},494,494,"S.US.ETSY",167,"S.US.TER"]
[null,null,"S.US.EVRG",{"$f":"IFERROR(RTD(\"cqg.rtd\", ,\"ContractData\",C168, \"PerCentNetLastTrade\",, \"T\")/100,\"\")","v":0},404,404,"S.US.EVRG",168,"S.US.ROST"]
[null,null,"S.US.EW",{"$f":"IFERROR(RTD(\"cqg.rtd\", ,\"ContractData\",C169, \"PerCentNetLastTrade\",, \"T\")/100,\"\")","v":3.9407018202289364E-3},255,255,"S.US.EW",169,"S.US.GM"]
[null,null,"S.US.EXC",{"$f":"IFERROR(RTD(\"cqg.rtd\", ,\"ContractData\",C170, \"PerCentNetLastTrade\",, \"T\")/100,\"\")","v":-2.6052974381241857E-3},453,453,"S.US.EXC",170,"S.US.SPG"]
[null,null,"S.US.EXPD",{"$f":"IFERROR(RTD(\"cqg.rtd\", ,\"ContractData\",C171, \"PerCentNetLastTrade\",, \"T\")/100,\"\")","v":1.2439744985227803E-3},357,357,"S.US.EXPD",171,"S.US.FBHS"]
[null,null,"S.US.EXPE",{"$f":"IFERROR(RTD(\"cqg.rtd\", ,\"ContractData\",C172, \"PerCentNetLastTrade\",, \"T\")/100,\"\")","v":1.6141429669485011E-2},57,57,"S.US.EXPE",172,"S.US.SNA"]
[null,null,"S.US.EXR",{"$f":"IFERROR(RTD(\"cqg.rtd\", ,\"ContractData\",C173, \"PerCentNetLastTrade\",, \"T\")/100,\"\")","v":-1.1719894520949313E-2},497,497,"S.US.EXR",173,"S.US.LB"]
[null,null,"S.US.F",{"$f":"IFERROR(RTD(\"cqg.rtd\", ,\"ContractData\",C174, \"PerCentNetLastTrade\",, \"T\")/100,\"\")","v":1.5097052480230052E-2},70,70,"S.US.F",174,"S.US.ENPH"]
[null,null,"S.US.FANG",{"$f":"IFERROR(RTD(\"cqg.rtd\", ,\"ContractData\",C175, \"PerCentNetLastTrade\",, \"T\")/100,\"\")","v":2.6695141484249865E-2},12,12,"S.US.FANG",175,"S.US.DXC"]
[null,null,"S.US.FAST",{"$f":"IFERROR(RTD(\"cqg.rtd\", ,\"ContractData\",C176, \"PerCentNetLastTrade\",, \"T\")/100,\"\")","v":4.6168051708217915E-3},259,259,"S.US.FAST",176,"S.US.WLTW"]
[null,null,"S.US.FB",{"$f":"IFERROR(RTD(\"cqg.rtd\", ,\"ContractData\",C177, \"PerCentNetLastTrade\",, \"T\")/100,\"\")","v":2.4878534215301762E-3},340,340,"S.US.FB",177,"S.US.WY"]
[null,null,"S.US.FBHS",{"$f":"IFERROR(RTD(\"cqg.rtd\", ,\"ContractData\",C178, \"PerCentNetLastTrade\",, \"T\")/100,\"\")","v":9.2785654712260208E-3},171,171,"S.US.FBHS",178,"S.US.RE"]
[null,null,"S.US.FCX",{"$f":"IFERROR(RTD(\"cqg.rtd\", ,\"ContractData\",C179, \"PerCentNetLastTrade\",, \"T\")/100,\"\")","v":2.1851289833080424E-2},25,25,"S.US.FCX",179,"S.US.CVS"]
[null,null,"S.US.FDX",{"$f":"IFERROR(RTD(\"cqg.rtd\", ,\"ContractData\",C180, \"PerCentNetLastTrade\",, \"T\")/100,\"\")","v":8.7242466948526942E-4},361,361,"S.US.FDX",180,"S.US.APH"]
[null,null,"S.US.FE",{"$f":"IFERROR(RTD(\"cqg.rtd\", ,\"ContractData\",C181, \"PerCentNetLastTrade\",, \"T\")/100,\"\")","v":1.8607123870281765E-3},341,341,"S.US.FE",181,"S.US.NWS"]
[null,null,"S.US.FFIV",{"$f":"IFERROR(RTD(\"cqg.rtd\", ,\"ContractData\",C182, \"PerCentNetLastTrade\",, \"T\")/100,\"\")","v":-5.3567602314120418E-5},409,409,"S.US.FFIV",182,"S.US.CMI"]
[null,null,"S.US.FIS",{"$f":"IFERROR(RTD(\"cqg.rtd\", ,\"ContractData\",C183, \"PerCentNetLastTrade\",, \"T\")/100,\"\")","v":1.3809293654629565E-4},399,399,"S.US.FIS",183,"S.US.PKG"]
[null,null,"S.US.FISV",{"$f":"IFERROR(RTD(\"cqg.rtd\", ,\"ContractData\",C184, \"PerCentNetLastTrade\",, \"T\")/100,\"\")","v":4.593899301727306E-4},386,386,"S.US.FISV",184,"S.US.MLM"]
[null,null,"S.US.FITB",{"$f":"IFERROR(RTD(\"cqg.rtd\", ,\"ContractData\",C185, \"PerCentNetLastTrade\",, \"T\")/100,\"\")","v":1.7241379310344827E-2},48,48,"S.US.FITB",185,"S.US.USB"]
[null,null,"S.US.FLT",{"$f":"IFERROR(RTD(\"cqg.rtd\", ,\"ContractData\",C186, \"PerCentNetLastTrade\",, \"T\")/100,\"\")","v":5.2276627159902637E-3},247,247,"S.US.FLT",186,"S.US.TEL"]
[null,null,"S.US.FMC",{"$f":"IFERROR(RTD(\"cqg.rtd\", ,\"ContractData\",C187, \"PerCentNetLastTrade\",, \"T\")/100,\"\")","v":1.1225082252757888E-2},131,131,"S.US.FMC",187,"S.US.TRV"]
[null,null,"S.US.FOX",{"$f":"IFERROR(RTD(\"cqg.rtd\", ,\"ContractData\",C188, \"PerCentNetLastTrade\",, \"T\")/100,\"\")","v":1.3386066321874049E-2},146,146,"S.US.FOX",188,"S.US.NSC"]
[null,null,"S.US.FOXA",{"$f":"IFERROR(RTD(\"cqg.rtd\", ,\"ContractData\",C189, \"PerCentNetLastTrade\",, \"T\")/100,\"\")","v":1.4583929082070346E-2},77,77,"S.US.FOXA",189,"S.US.LKQ"]
[null,null,"S.US.FRC",{"$f":"IFERROR(RTD(\"cqg.rtd\", ,\"ContractData\",C190, \"PerCentNetLastTrade\",, \"T\")/100,\"\")","v":1.0854396030392309E-2},139,139,"S.US.FRC",190,"S.US.IEX"]
[null,null,"S.US.FRT",{"$f":"IFERROR(RTD(\"cqg.rtd\", ,\"ContractData\",C191, \"PerCentNetLastTrade\",, \"T\")/100,\"\")","v":7.2749058541595347E-3},207,207,"S.US.FRT",191,"S.US.AXP"]
[null,null,"S.US.FTNT",{"$f":"IFERROR(RTD(\"cqg.rtd\", ,\"ContractData\",C192, \"PerCentNetLastTrade\",, \"T\")/100,\"\")","v":5.3062462098241354E-4},383,383,"S.US.FTNT",192,"S.US.YUM"]
[null,null,"S.US.FTV",{"$f":"IFERROR(RTD(\"cqg.rtd\", ,\"ContractData\",C193, \"PerCentNetLastTrade\",, \"T\")/100,\"\")","v":5.0143266475644703E-3},253,253,"S.US.FTV",193,"S.US.EIX"]
[null,null,"S.US.GD",{"$f":"IFERROR(RTD(\"cqg.rtd\", ,\"ContractData\",C194, \"PerCentNetLastTrade\",, \"T\")/100,\"\")","v":6.9996315983369296E-3},211,{"$f":"IFERROR(E194,\"\")","v":211},{"$f":"C194","v":"S.US.GD"},194,{"$f":"IFERROR(VLOOKUP(H194,$F$1:$G$505,2,FALSE),\"\")","v":"S.US.T"}]
[null,null,"S.US.GE",{"$f":"IFERROR(RTD(\"cqg.rtd\", ,\"ContractData\",C195, \"PerCentNetLastTrade\",, \"T\")/100,\"\")","v":1.6535433070866142E-2},62,62,"S.US.GE",{"$f":"H194+1","v":195},"S.US.BBY"]
[null,null,"S.US.GILD",{"$f":"IFERROR(RTD(\"cqg.rtd\", ,\"ContractData\",C196, \"PerCentNetLastTrade\",, \"T\")/100,\"\")","v":-4.048582995951417E-3},474,474,"S.US.GILD",196,"S.US.AOS"]
[null,null,"S.US.GIS",{"$f":"IFERROR(RTD(\"cqg.rtd\", ,\"ContractData\",C197, \"PerCentNetLastTrade\",, \"T\")/100,\"\")","v":-1.1682242990654205E-3},421,421,"S.US.GIS",197,"S.US.J"]
[null,null,"S.US.GL",{"$f":"IFERROR(RTD(\"cqg.rtd\", ,\"ContractData\",C198, \"PerCentNetLastTrade\",, \"T\")/100,\"\")","v":1.0418904403866809E-2},144,144,"S.US.GL",198,"S.US.ORCL"]
[null,null,"S.US.GLW",{"$f":"IFERROR(RTD(\"cqg.rtd\", ,\"ContractData\",C199, \"PerCentNetLastTrade\",, \"T\")/100,\"\")","v":4.9862877088007983E-3},261,261,"S.US.GLW",199,"S.US.ABC"]
[null,null,"S.US.GM",{"$f":"IFERROR(RTD(\"cqg.rtd\", ,\"ContractData\",C200, \"PerCentNetLastTrade\",, \"T\")/100,\"\")","v":9.4390026714158502E-3},169,169,"S.US.GM",200,"S.US.STZ"]
[null,null,"S.US.GNRC",{"$f":"IFERROR(RTD(\"cqg.rtd\", ,\"ContractData\",C201, \"PerCentNetLastTrade\",, \"T\")/100,\"\")","v":-1.9247513862792722E-3},437,437,"S.US.GNRC",201,"S.US.GPC"]
[null,null,"S.US.GOOG",{"$f":"IFERROR(RTD(\"cqg.rtd\", ,\"ContractData\",C202, \"PerCentNetLastTrade\",, \"T\")/100,\"\")","v":-3.2989706448820189E-3},466,466,"S.US.GOOG",202,"S.US.VMC"]
[null,null,"S.US.GOOGL",{"$f":"IFERROR(RTD(\"cqg.rtd\", ,\"ContractData\",C203, \"PerCentNetLastTrade\",, \"T\")/100,\"\")","v":-9.9041672774236489E-4},416,416,"S.US.GOOGL",203,"S.US.SWK"]
[null,null,"S.US.GPC",{"$f":"IFERROR(RTD(\"cqg.rtd\", ,\"ContractData\",C204, \"PerCentNetLastTrade\",, \"T\")/100,\"\")","v":7.4807137847736306E-3},201,201,"S.US.GPC",204,"S.US.BKNG"]
[null,null,"S.US.GPN",{"$f":"IFERROR(RTD(\"cqg.rtd\", ,\"ContractData\",C205, \"PerCentNetLastTrade\",, \"T\")/100,\"\")","v":7.417218543046358E-4},368,368,"S.US.GPN",205,"S.US.CI"]
[null,null,"S.US.GPS",{"$f":"IFERROR(RTD(\"cqg.rtd\", ,\"ContractData\",C206, \"PerCentNetLastTrade\",, \"T\")/100,\"\")","v":2.1396001403016486E-2},26,26,"S.US.GPS",206,"S.US.CAH"]
[null,null,"S.US.GRMN",{"$f":"IFERROR(RTD(\"cqg.rtd\", ,\"ContractData\",C207, \"PerCentNetLastTrade\",, \"T\")/100,\"\")","v":6.2078632935051066E-3},226,226,"S.US.GRMN",207,"S.US.FRT"]
[null,null,"S.US.GS",{"$f":"IFERROR(RTD(\"cqg.rtd\", ,\"ContractData\",C208, \"PerCentNetLastTrade\",, \"T\")/100,\"\")","v":1.2638447198157692E-2},111,111,"S.US.GS",208,"S.US.IP"]
[null,null,"S.US.GWW",{"$f":"IFERROR(RTD(\"cqg.rtd\", ,\"ContractData\",C209, \"PerCentNetLastTrade\",, \"T\")/100,\"\")","v":3.5688638391399908E-3},287,287,"S.US.GWW",209,"S.US.HII"]
[null,null,"S.US.HAL",{"$f":"IFERROR(RTD(\"cqg.rtd\", ,\"ContractData\",C210, \"PerCentNetLastTrade\",, \"T\")/100,\"\")","v":3.1390134529147982E-2},6,6,"S.US.HAL",210,"S.US.BLK"]
[null,null,"S.US.HAS",{"$f":"IFERROR(RTD(\"cqg.rtd\", ,\"ContractData\",C211, \"PerCentNetLastTrade\",, \"T\")/100,\"\")","v":6.2765957446808511E-3},224,224,"S.US.HAS",211,"S.US.GD"]
[null,null,"S.US.HBAN",{"$f":"IFERROR(RTD(\"cqg.rtd\", ,\"ContractData\",C212, \"PerCentNetLastTrade\",, \"T\")/100,\"\")","v":1.529497450837582E-2},69,69,"S.US.HBAN",212,"S.US.CB"]
[null,null,"S.US.HBI",{"$f":"IFERROR(RTD(\"cqg.rtd\", ,\"ContractData\",C213, \"PerCentNetLastTrade\",, \"T\")/100,\"\")","v":1.3490725126475549E-2},92,92,"S.US.HBI",213,"S.US.SBUX"]
[null,null,"S.US.HCA",{"$f":"IFERROR(RTD(\"cqg.rtd\", ,\"ContractData\",C214, \"PerCentNetLastTrade\",, \"T\")/100,\"\")","v":1.2936922458818802E-2},102,102,"S.US.HCA",214,"S.US.ALL"]
[null,null,"S.US.HD",{"$f":"IFERROR(RTD(\"cqg.rtd\", ,\"ContractData\",C215, \"PerCentNetLastTrade\",, \"T\")/100,\"\")","v":5.0407253726755799E-3},254,254,"S.US.HD",215,"S.US.DISH"]
[null,null,"S.US.HES",{"$f":"IFERROR(RTD(\"cqg.rtd\", ,\"ContractData\",C216, \"PerCentNetLastTrade\",, \"T\")/100,\"\")","v":1.9261853448275863E-2},35,35,"S.US.HES",216,"S.US.MO"]
[null,null,"S.US.HIG",{"$f":"IFERROR(RTD(\"cqg.rtd\", ,\"ContractData\",C217, \"PerCentNetLastTrade\",, \"T\")/100,\"\")","v":1.0267928766244184E-2},148,148,"S.US.HIG",217,"S.US.UNH"]
[null,null,"S.US.HII",{"$f":"IFERROR(RTD(\"cqg.rtd\", ,\"ContractData\",C218, \"PerCentNetLastTrade\",, \"T\")/100,\"\")","v":7.0974419636256102E-3},209,209,"S.US.HII",218,"S.US.PTC"]
[null,null,"S.US.HLT",{"$f":"IFERROR(RTD(\"cqg.rtd\", ,\"ContractData\",C219, \"PerCentNetLastTrade\",, \"T\")/100,\"\")","v":1.4474772539288668E-2},78,78,"S.US.HLT",219,"S.US.VTRS"]
[null,null,"S.US.HOLX",{"$f":"IFERROR(RTD(\"cqg.rtd\", ,\"ContractData\",C220, \"PerCentNetLastTrade\",, \"T\")/100,\"\")","v":-3.705287159754881E-3},471,471,"S.US.HOLX",220,"S.US.CSX"]
[null,null,"S.US.HON",{"$f":"IFERROR(RTD(\"cqg.rtd\", ,\"ContractData\",C221, \"PerCentNetLastTrade\",, \"T\")/100,\"\")","v":1.4369067316903248E-3},351,351,"S.US.HON",221,"S.US.UNP"]
[null,null,"S.US.HPE",{"$f":"IFERROR(RTD(\"cqg.rtd\", ,\"ContractData\",C222, \"PerCentNetLastTrade\",, \"T\")/100,\"\")","v":2.1474588403722263E-3},332,332,"S.US.HPE",222,"S.US.CINF"]
[null,null,"S.US.HPQ",{"$f":"IFERROR(RTD(\"cqg.rtd\", ,\"ContractData\",C223, \"PerCentNetLastTrade\",, \"T\")/100,\"\")","v":-1.0634526763559022E-3},418,418,"S.US.HPQ",223,"S.US.ETN"]
[null,null,"S.US.HRL",{"$f":"IFERROR(RTD(\"cqg.rtd\", ,\"ContractData\",C224, \"PerCentNetLastTrade\",, \"T\")/100,\"\")","v":-1.6711928138709003E-3},434,434,"S.US.HRL",224,"S.US.HAS"]
[null,null,"S.US.HSIC",{"$f":"IFERROR(RTD(\"cqg.rtd\", ,\"ContractData\",C225, \"PerCentNetLastTrade\",, \"T\")/100,\"\")","v":1.1746073643922397E-2},125,125,"S.US.HSIC",225,"S.US.LUMN"]
[null,null,"S.US.HST",{"$f":"IFERROR(RTD(\"cqg.rtd\", ,\"ContractData\",C226, \"PerCentNetLastTrade\",, \"T\")/100,\"\")","v":1.8354430379746836E-2},40,40,"S.US.HST",226,"S.US.GRMN"]
[null,null,"S.US.HSY",{"$f":"IFERROR(RTD(\"cqg.rtd\", ,\"ContractData\",C227, \"PerCentNetLastTrade\",, \"T\")/100,\"\")","v":2.3851786110494783E-3},325,325,"S.US.HSY",227,"S.US.EL"]
[null,null,"S.US.HUM",{"$f":"IFERROR(RTD(\"cqg.rtd\", ,\"ContractData\",C228, \"PerCentNetLastTrade\",, \"T\")/100,\"\")","v":6.0369163952225845E-3},229,229,"S.US.HUM",228,"S.US.MAS"]
[null,null,"S.US.HWM",{"$f":"IFERROR(RTD(\"cqg.rtd\", ,\"ContractData\",C229, \"PerCentNetLastTrade\",, \"T\")/100,\"\")","v":1.6619629978049544E-2},51,51,"S.US.HWM",229,"S.US.HUM"]
[null,null,"S.US.IBM",{"$f":"IFERROR(RTD(\"cqg.rtd\", ,\"ContractData\",C230, \"PerCentNetLastTrade\",, \"T\")/100,\"\")","v":-1.7146531399585628E-3},436,436,"S.US.IBM",230,"S.US.JCI"]
[null,null,"S.US.ICE",{"$f":"IFERROR(RTD(\"cqg.rtd\", ,\"ContractData\",C231, \"PerCentNetLastTrade\",, \"T\")/100,\"\")","v":2.5180459963068656E-3},330,330,"S.US.ICE",231,"S.US.KSU"]
[null,null,"S.US.IDXX",{"$f":"IFERROR(RTD(\"cqg.rtd\", ,\"ContractData\",C232, \"PerCentNetLastTrade\",, \"T\")/100,\"\")","v":-2.3454189635339637E-3},445,445,"S.US.IDXX",232,"S.US.AIZ"]
[null,null,"S.US.IEX",{"$f":"IFERROR(RTD(\"cqg.rtd\", ,\"ContractData\",C233, \"PerCentNetLastTrade\",, \"T\")/100,\"\")","v":8.1913355819352579E-3},190,190,"S.US.IEX",233,"S.US.AMD"]
[null,null,"S.US.IFF",{"$f":"IFERROR(RTD(\"cqg.rtd\", ,\"ContractData\",C234, \"PerCentNetLastTrade\",, \"T\")/100,\"\")","v":3.3382015439182137E-3},293,293,"S.US.IFF",234,"S.US.CME"]
[null,null,"S.US.ILMN",{"$f":"IFERROR(RTD(\"cqg.rtd\", ,\"ContractData\",C235, \"PerCentNetLastTrade\",, \"T\")/100,\"\")","v":-1.0076962544894819E-2},495,495,"S.US.ILMN",235,"S.US.PNW"]
[null,null,"S.US.INCY",{"$f":"IFERROR(RTD(\"cqg.rtd\", ,\"ContractData\",C236, \"PerCentNetLastTrade\",, \"T\")/100,\"\")","v":-2.9036737785633126E-3},459,459,"S.US.INCY",236,"S.US.WAB"]
[null,null,"S.US.INFO",{"$f":"IFERROR(RTD(\"cqg.rtd\", ,\"ContractData\",C237, \"PerCentNetLastTrade\",, \"T\")/100,\"\")","v":1.4799338382519369E-3},349,349,"S.US.INFO",237,"S.US.ADI"]
[null,null,"S.US.INTC",{"$f":"IFERROR(RTD(\"cqg.rtd\", ,\"ContractData\",C238, \"PerCentNetLastTrade\",, \"T\")/100,\"\")","v":-1.4482259232440262E-3},429,429,"S.US.INTC",238,"S.US.XYL"]
[null,null,"S.US.INTU",{"$f":"IFERROR(RTD(\"cqg.rtd\", ,\"ContractData\",C239, \"PerCentNetLastTrade\",, \"T\")/100,\"\")","v":-5.2304546169576853E-3},483,483,"S.US.INTU",239,"S.US.TDY"]
[null,null,"S.US.IP",{"$f":"IFERROR(RTD(\"cqg.rtd\", ,\"ContractData\",C240, \"PerCentNetLastTrade\",, \"T\")/100,\"\")","v":7.2103004291845492E-3},208,208,"S.US.IP",240,"S.US.WU"]
[null,null,"S.US.IPG",{"$f":"IFERROR(RTD(\"cqg.rtd\", ,\"ContractData\",C241, \"PerCentNetLastTrade\",, \"T\")/100,\"\")","v":0.10713143588103614},1,1,"S.US.IPG",241,"S.US.ITW"]
[null,null,"S.US.IPGP",{"$f":"IFERROR(RTD(\"cqg.rtd\", ,\"ContractData\",C242, \"PerCentNetLastTrade\",, \"T\")/100,\"\")","v":3.3631209762659746E-3},292,292,"S.US.IPGP",242,"S.US.MTD"]
[null,null,"S.US.IQV",{"$f":"IFERROR(RTD(\"cqg.rtd\", ,\"ContractData\",C243, \"PerCentNetLastTrade\",, \"T\")/100,\"\")","v":-3.2379487594608809E-4},414,414,"S.US.IQV",243,"S.US.BK"]
[null,null,"S.US.IR",{"$f":"IFERROR(RTD(\"cqg.rtd\", ,\"ContractData\",C244, \"PerCentNetLastTrade\",, \"T\")/100,\"\")","v":9.5534787123572173E-3},162,162,"S.US.IR",244,"S.US.ROK"]
[null,null,"S.US.IRM",{"$f":"IFERROR(RTD(\"cqg.rtd\", ,\"ContractData\",C245, \"PerCentNetLastTrade\",, \"T\")/100,\"\")","v":0},405,405,"S.US.IRM",245,"S.US.NDAQ"]
[null,null,"S.US.ISRG",{"$f":"IFERROR(RTD(\"cqg.rtd\", ,\"ContractData\",C246, \"PerCentNetLastTrade\",, \"T\")/100,\"\")","v":1.060677451442333E-2},141,141,"S.US.ISRG",246,"S.US.QRVO"]
[null,null,"S.US.IT",{"$f":"IFERROR(RTD(\"cqg.rtd\", ,\"ContractData\",C247, \"PerCentNetLastTrade\",, \"T\")/100,\"\")","v":1.486232790988736E-3},348,348,"S.US.IT",247,"S.US.FLT"]
[null,null,"S.US.ITW",{"$f":"IFERROR(RTD(\"cqg.rtd\", ,\"ContractData\",C248, \"PerCentNetLastTrade\",, \"T\")/100,\"\")","v":5.5436727923523508E-3},241,241,"S.US.ITW",248,"S.US.WBA"]
[null,null,"S.US.IVZ",{"$f":"IFERROR(RTD(\"cqg.rtd\", ,\"ContractData\",C249, \"PerCentNetLastTrade\",, \"T\")/100,\"\")","v":1.1937922801432551E-2},121,121,"S.US.IVZ",249,"S.US.SEE"]
[null,null,"S.US.J",{"$f":"IFERROR(RTD(\"cqg.rtd\", ,\"ContractData\",C250, \"PerCentNetLastTrade\",, \"T\")/100,\"\")","v":7.7894577629887317E-3},197,197,"S.US.J",250,"S.US.ECL"]
[null,null,"S.US.JBHT",{"$f":"IFERROR(RTD(\"cqg.rtd\", ,\"ContractData\",C251, \"PerCentNetLastTrade\",, \"T\")/100,\"\")","v":3.2250212973104543E-3},300,300,"S.US.JBHT",251,"S.US.MXIM"]
[null,null,"S.US.JCI",{"$f":"IFERROR(RTD(\"cqg.rtd\", ,\"ContractData\",C252, \"PerCentNetLastTrade\",, \"T\")/100,\"\")","v":6.0223687983940351E-3},230,230,"S.US.JCI",252,"S.US.AVY"]
[null,null,"S.US.JKHY",{"$f":"IFERROR(RTD(\"cqg.rtd\", ,\"ContractData\",C253, \"PerCentNetLastTrade\",, \"T\")/100,\"\")","v":8.0631227322467314E-4},363,363,"S.US.JKHY",253,"S.US.FTV"]
[null,null,"S.US.JNJ",{"$f":"IFERROR(RTD(\"cqg.rtd\", ,\"ContractData\",C254, \"PerCentNetLastTrade\",, \"T\")/100,\"\")","v":8.9047195013357077E-4},366,366,"S.US.JNJ",254,"S.US.HD"]
[null,null,"S.US.JNPR",{"$f":"IFERROR(RTD(\"cqg.rtd\", ,\"ContractData\",C255, \"PerCentNetLastTrade\",, \"T\")/100,\"\")","v":3.3185840707964601E-3},296,296,"S.US.JNPR",255,"S.US.EW"]
[null,null,"S.US.JPM",{"$f":"IFERROR(RTD(\"cqg.rtd\", ,\"ContractData\",C256, \"PerCentNetLastTrade\",, \"T\")/100,\"\")","v":1.2023244940217755E-2},118,118,"S.US.JPM",256,"S.US.ABMD"]
[null,null,"S.US.K",{"$f":"IFERROR(RTD(\"cqg.rtd\", ,\"ContractData\",C257, \"PerCentNetLastTrade\",, \"T\")/100,\"\")","v":0},406,{"$f":"IFERROR(E257,\"\")","v":406},{"$f":"C257","v":"S.US.K"},257,"S.US.TT"]
[null,null,"S.US.KEY",{"$f":"IFERROR(RTD(\"cqg.rtd\", ,\"ContractData\",C258, \"PerCentNetLastTrade\",, \"T\")/100,\"\")","v":1.3089005235602094E-2},99,99,"S.US.KEY",{"$f":"H257+1","v":258},{"$f":"IFERROR(VLOOKUP(H258,$F$1:$G$505,2,FALSE),\"\")","v":"S.US.TMUS"}]
[null,null,"S.US.KEYS",{"$f":"IFERROR(RTD(\"cqg.rtd\", ,\"ContractData\",C259, \"PerCentNetLastTrade\",, \"T\")/100,\"\")","v":4.4064116482534004E-3},263,263,"S.US.KEYS",259,"S.US.FAST"]
[null,null,"S.US.KHC",{"$f":"IFERROR(RTD(\"cqg.rtd\", ,\"ContractData\",C260, \"PerCentNetLastTrade\",, \"T\")/100,\"\")","v":3.8071065989847713E-3},280,280,"S.US.KHC",260,"S.US.AME"]
[null,null,"S.US.KIM",{"$f":"IFERROR(RTD(\"cqg.rtd\", ,\"ContractData\",C261, \"PerCentNetLastTrade\",, \"T\")/100,\"\")","v":1.055662188099808E-2},142,142,"S.US.KIM",261,"S.US.GLW"]
[null,null,"S.US.KLAC",{"$f":"IFERROR(RTD(\"cqg.rtd\", ,\"ContractData\",C262, \"PerCentNetLastTrade\",, \"T\")/100,\"\")","v":1.1725071836707733E-2},126,126,"S.US.KLAC",262,"S.US.NOC"]
[null,null,"S.US.KMB",{"$f":"IFERROR(RTD(\"cqg.rtd\", ,\"ContractData\",C263, \"PerCentNetLastTrade\",, \"T\")/100,\"\")","v":-2.4685979815581211E-3},449,449,"S.US.KMB",263,"S.US.KEYS"]
[null,null,"S.US.KMI",{"$f":"IFERROR(RTD(\"cqg.rtd\", ,\"ContractData\",C264, \"PerCentNetLastTrade\",, \"T\")/100,\"\")","v":1.2593016599885518E-2},112,112,"S.US.KMI",264,"S.US.ALGN"]
[null,null,"S.US.KMX",{"$f":"IFERROR(RTD(\"cqg.rtd\", ,\"ContractData\",C265, \"PerCentNetLastTrade\",, \"T\")/100,\"\")","v":9.5252269682988538E-3},164,164,"S.US.KMX",265,"S.US.AON"]
[null,null,"S.US.KO",{"$f":"IFERROR(RTD(\"cqg.rtd\", ,\"ContractData\",C266, \"PerCentNetLastTrade\",, \"T\")/100,\"\")","v":2.3105857066093499E-2},21,21,"S.US.KO",266,"S.US.TDG"]
[null,null,"S.US.KR",{"$f":"IFERROR(RTD(\"cqg.rtd\", ,\"ContractData\",C267, \"PerCentNetLastTrade\",, \"T\")/100,\"\")","v":2.4648755237860492E-4},395,395,"S.US.KR",267,"S.US.LMT"]
[null,null,"S.US.KSU",{"$f":"IFERROR(RTD(\"cqg.rtd\", ,\"ContractData\",C268, \"PerCentNetLastTrade\",, \"T\")/100,\"\")","v":6.0161684527166755E-3},231,231,"S.US.KSU",268,"S.US.LIN"]
[null,null,"S.US.L",{"$f":"IFERROR(RTD(\"cqg.rtd\", ,\"ContractData\",C269, \"PerCentNetLastTrade\",, \"T\")/100,\"\")","v":1.3125820363772736E-2},98,98,"S.US.L",269,"S.US.QCOM"]
[null,null,"S.US.LB",{"$f":"IFERROR(RTD(\"cqg.rtd\", ,\"ContractData\",C270, \"PerCentNetLastTrade\",, \"T\")/100,\"\")","v":9.1324200913242004E-3},173,173,"S.US.LB",270,"S.US.ATO"]
[null,null,"S.US.LDOS",{"$f":"IFERROR(RTD(\"cqg.rtd\", ,\"ContractData\",C271, \"PerCentNetLastTrade\",, \"T\")/100,\"\")","v":4.0019056693663653E-3},276,276,"S.US.LDOS",271,"S.US.TTWO"]
[null,null,"S.US.LEG",{"$f":"IFERROR(RTD(\"cqg.rtd\", ,\"ContractData\",C272, \"PerCentNetLastTrade\",, \"T\")/100,\"\")","v":1.0101010101010102E-2},151,151,"S.US.LEG",272,"S.US.LW"]
[null,null,"S.US.LEN",{"$f":"IFERROR(RTD(\"cqg.rtd\", ,\"ContractData\",C273, \"PerCentNetLastTrade\",, \"T\")/100,\"\")","v":2.8426395939086298E-3},312,312,"S.US.LEN",273,"S.US.DLTR"]
[null,null,"S.US.LH",{"$f":"IFERROR(RTD(\"cqg.rtd\", ,\"ContractData\",C274, \"PerCentNetLastTrade\",, \"T\")/100,\"\")","v":1.6258400173422935E-3},346,346,"S.US.LH",274,"S.US.MMM"]
[null,null,"S.US.LHX",{"$f":"IFERROR(RTD(\"cqg.rtd\", ,\"ContractData\",C275, \"PerCentNetLastTrade\",, \"T\")/100,\"\")","v":3.3701387965056982E-3},291,291,"S.US.LHX",275,"S.US.BRKB"]
[null,null,"S.US.LIN",{"$f":"IFERROR(RTD(\"cqg.rtd\", ,\"ContractData\",C276, \"PerCentNetLastTrade\",, \"T\")/100,\"\")","v":4.2359747907841725E-3},268,268,"S.US.LIN",276,"S.US.LDOS"]
[null,null,"S.US.LKQ",{"$f":"IFERROR(RTD(\"cqg.rtd\", ,\"ContractData\",C277, \"PerCentNetLastTrade\",, \"T\")/100,\"\")","v":8.1918081918081927E-3},189,189,"S.US.LKQ",277,"S.US.AZO"]
[null,null,"S.US.LLY",{"$f":"IFERROR(RTD(\"cqg.rtd\", ,\"ContractData\",C278, \"PerCentNetLastTrade\",, \"T\")/100,\"\")","v":9.7864011573483103E-4},400,400,"S.US.LLY",278,"S.US.AAP"]
[null,null,"S.US.LMT",{"$f":"IFERROR(RTD(\"cqg.rtd\", ,\"ContractData\",C279, \"PerCentNetLastTrade\",, \"T\")/100,\"\")","v":4.2370651086899311E-3},267,267,"S.US.LMT",279,"S.US.NKE"]
[null,null,"S.US.LNC",{"$f":"IFERROR(RTD(\"cqg.rtd\", ,\"ContractData\",C280, \"PerCentNetLastTrade\",, \"T\")/100,\"\")","v":2.3741370601111301E-2},17,17,"S.US.LNC",280,"S.US.KHC"]
[null,null,"S.US.LNT",{"$f":"IFERROR(RTD(\"cqg.rtd\", ,\"ContractData\",C281, \"PerCentNetLastTrade\",, \"T\")/100,\"\")","v":-1.2004801920768306E-3},423,423,"S.US.LNT",281,"S.US.DTE"]
[null,null,"S.US.LOW",{"$f":"IFERROR(RTD(\"cqg.rtd\", ,\"ContractData\",C282, \"PerCentNetLastTrade\",, \"T\")/100,\"\")","v":4.6365462881871105E-4},385,385,"S.US.LOW",282,"S.US.VTR"]
[null,null,"S.US.LRCX",{"$f":"IFERROR(RTD(\"cqg.rtd\", ,\"ContractData\",C283, \"PerCentNetLastTrade\",, \"T\")/100,\"\")","v":1.1349223344149961E-2},129,129,"S.US.LRCX",283,"S.US.PFE"]
[null,null,"S.US.LUMN",{"$f":"IFERROR(RTD(\"cqg.rtd\", ,\"ContractData\",C284, \"PerCentNetLastTrade\",, \"T\")/100,\"\")","v":6.2256809338521405E-3},225,225,"S.US.LUMN",284,"S.US.ATVI"]
[null,null,"S.US.LUV",{"$f":"IFERROR(RTD(\"cqg.rtd\", ,\"ContractData\",C285, \"PerCentNetLastTrade\",, \"T\")/100,\"\")","v":1.924946529263076E-2},36,36,"S.US.LUV",285,"S.US.TRMB"]
[null,null,"S.US.LVS",{"$f":"IFERROR(RTD(\"cqg.rtd\", ,\"ContractData\",C286, \"PerCentNetLastTrade\",, \"T\")/100,\"\")","v":1.2766848053578903E-2},108,108,"S.US.LVS",286,"S.US.COO"]
[null,null,"S.US.LW",{"$f":"IFERROR(RTD(\"cqg.rtd\", ,\"ContractData\",C287, \"PerCentNetLastTrade\",, \"T\")/100,\"\")","v":4.0800210581732029E-3},272,272,"S.US.LW",287,"S.US.GWW"]
[null,null,"S.US.LYB",{"$f":"IFERROR(RTD(\"cqg.rtd\", ,\"ContractData\",C288, \"PerCentNetLastTrade\",, \"T\")/100,\"\")","v":1.9157894736842106E-2},37,37,"S.US.LYB",288,"S.US.OTIS"]
[null,null,"S.US.LYV",{"$f":"IFERROR(RTD(\"cqg.rtd\", ,\"ContractData\",C289, \"PerCentNetLastTrade\",, \"T\")/100,\"\")","v":1.4937004805818936E-2},85,85,"S.US.LYV",289,"S.US.SWKS"]
[null,null,"S.US.MA",{"$f":"IFERROR(RTD(\"cqg.rtd\", ,\"ContractData\",C290, \"PerCentNetLastTrade\",, \"T\")/100,\"\")","v":2.4840407062154436E-3},335,335,"S.US.MA",290,"S.US.MU"]
[null,null,"S.US.MAA",{"$f":"IFERROR(RTD(\"cqg.rtd\", ,\"ContractData\",C291, \"PerCentNetLastTrade\",, \"T\")/100,\"\")","v":5.8940148957831E-4},381,381,"S.US.MAA",291,"S.US.LHX"]
[null,null,"S.US.MAR",{"$f":"IFERROR(RTD(\"cqg.rtd\", ,\"ContractData\",C292, \"PerCentNetLastTrade\",, \"T\")/100,\"\")","v":1.3330371028660297E-2},93,93,"S.US.MAR",292,"S.US.IPGP"]
[null,null,"S.US.MAS",{"$f":"IFERROR(RTD(\"cqg.rtd\", ,\"ContractData\",C293, \"PerCentNetLastTrade\",, \"T\")/100,\"\")","v":6.0882800608828003E-3},228,228,"S.US.MAS",293,"S.US.IFF"]
[null,null,"S.US.MCD",{"$f":"IFERROR(RTD(\"cqg.rtd\", ,\"ContractData\",C294, \"PerCentNetLastTrade\",, \"T\")/100,\"\")","v":9.8604174670252273E-3},157,157,"S.US.MCD",294,"S.US.TGT"]
[null,null,"S.US.MCHP",{"$f":"IFERROR(RTD(\"cqg.rtd\", ,\"ContractData\",C295, \"PerCentNetLastTrade\",, \"T\")/100,\"\")","v":9.7788805371086616E-3},159,159,"S.US.MCHP",295,"S.US.NWL"]
[null,null,"S.US.MCK",{"$f":"IFERROR(RTD(\"cqg.rtd\", ,\"ContractData\",C296, \"PerCentNetLastTrade\",, \"T\")/100,\"\")","v":1.0959045071002265E-2},136,136,"S.US.MCK",296,"S.US.JNPR"]
[null,null,"S.US.MCO",{"$f":"IFERROR(RTD(\"cqg.rtd\", ,\"ContractData\",C297, \"PerCentNetLastTrade\",, \"T\")/100,\"\")","v":2.1202724550104689E-4},396,396,"S.US.MCO",297,"S.US.EMR"]
[null,null,"S.US.MDLZ",{"$f":"IFERROR(RTD(\"cqg.rtd\", ,\"ContractData\",C298, \"PerCentNetLastTrade\",, \"T\")/100,\"\")","v":1.8630647414997672E-3},343,343,"S.US.MDLZ",298,"S.US.ABBV"]
[null,null,"S.US.MDT",{"$f":"IFERROR(RTD(\"cqg.rtd\", ,\"ContractData\",C299, \"PerCentNetLastTrade\",, \"T\")/100,\"\")","v":9.8000159349852598E-3},158,158,"S.US.MDT",299,"S.US.ADM"]
[null,null,"S.US.MET",{"$f":"IFERROR(RTD(\"cqg.rtd\", ,\"ContractData\",C300, \"PerCentNetLastTrade\",, \"T\")/100,\"\")","v":1.5424610051993068E-2},64,64,"S.US.MET",300,"S.US.JBHT"]
[null,null,"S.US.MGM",{"$f":"IFERROR(RTD(\"cqg.rtd\", ,\"ContractData\",C301, \"PerCentNetLastTrade\",, \"T\")/100,\"\")","v":1.7191977077363897E-2},49,49,"S.US.MGM",301,"S.US.PPL"]
[null,null,"S.US.MHK",{"$f":"IFERROR(RTD(\"cqg.rtd\", ,\"ContractData\",C302, \"PerCentNetLastTrade\",, \"T\")/100,\"\")","v":2.6860390306669524E-2},11,11,"S.US.MHK",302,"S.US.CNP"]
[null,null,"S.US.MKC",{"$f":"IFERROR(RTD(\"cqg.rtd\", ,\"ContractData\",C303, \"PerCentNetLastTrade\",, \"T\")/100,\"\")","v":-4.7890535917901938E-3},480,480,"S.US.MKC",303,"S.US.DGX"]
[null,null,"S.US.MKTX",{"$f":"IFERROR(RTD(\"cqg.rtd\", ,\"ContractData\",C304, \"PerCentNetLastTrade\",, \"T\")/100,\"\")","v":1.1965255157437569E-2},120,120,"S.US.MKTX",304,"S.US.BMY"]
[null,null,"S.US.MLM",{"$f":"IFERROR(RTD(\"cqg.rtd\", ,\"ContractData\",C305, \"PerCentNetLastTrade\",, \"T\")/100,\"\")","v":8.588143750540362E-3},184,184,"S.US.MLM",305,"S.US.UDR"]
[null,null,"S.US.MMC",{"$f":"IFERROR(RTD(\"cqg.rtd\", ,\"ContractData\",C306, \"PerCentNetLastTrade\",, \"T\")/100,\"\")","v":2.1171489061397319E-3},370,370,"S.US.MMC",306,"S.US.CTLT"]
[null,null,"S.US.MMM",{"$f":"IFERROR(RTD(\"cqg.rtd\", ,\"ContractData\",C307, \"PerCentNetLastTrade\",, \"T\")/100,\"\")","v":4.0334628025097104E-3},274,274,"S.US.MMM",307,"S.US.ESS"]
[null,null,"S.US.MNST",{"$f":"IFERROR(RTD(\"cqg.rtd\", ,\"ContractData\",C308, \"PerCentNetLastTrade\",, \"T\")/100,\"\")","v":2.6678049301035105E-3},317,317,"S.US.MNST",308,"S.US.PCAR"]
[null,null,"S.US.MO",{"$f":"IFERROR(RTD(\"cqg.rtd\", ,\"ContractData\",C309, \"PerCentNetLastTrade\",, \"T\")/100,\"\")","v":6.5664054225799615E-3},216,216,"S.US.MO",309,"S.US.SRE"]
[null,null,"S.US.MOS",{"$f":"IFERROR(RTD(\"cqg.rtd\", ,\"ContractData\",C310, \"PerCentNetLastTrade\",, \"T\")/100,\"\")","v":1.6498316498316498E-2},56,56,"S.US.MOS",310,"S.US.CHRW"]
[null,null,"S.US.MPC",{"$f":"IFERROR(RTD(\"cqg.rtd\", ,\"ContractData\",C311, \"PerCentNetLastTrade\",, \"T\")/100,\"\")","v":2.0721412125863394E-2},30,30,"S.US.MPC",311,"S.US.EBAY"]
[null,null,"S.US.MPWR",{"$f":"IFERROR(RTD(\"cqg.rtd\", ,\"ContractData\",C312, \"PerCentNetLastTrade\",, \"T\")/100,\"\")","v":7.646039351615862E-5},402,402,"S.US.MPWR",312,"S.US.LEN"]
[null,null,"S.US.MRK",{"$f":"IFERROR(RTD(\"cqg.rtd\", ,\"ContractData\",C313, \"PerCentNetLastTrade\",, \"T\")/100,\"\")","v":-1.3128528291978469E-4},413,413,"S.US.MRK",313,"S.US.TSN"]
[null,null,"S.US.MRNA",{"$f":"IFERROR(RTD(\"cqg.rtd\", ,\"ContractData\",C314, \"PerCentNetLastTrade\",, \"T\")/100,\"\")","v":-2.5379884814368918E-3},467,467,"S.US.MRNA",314,"S.US.WM"]
[null,null,"S.US.MRO",{"$f":"IFERROR(RTD(\"cqg.rtd\", ,\"ContractData\",C315, \"PerCentNetLastTrade\",, \"T\")/100,\"\")","v":2.7336860670194002E-2},10,10,"S.US.MRO",315,"S.US.ETR"]
[null,null,"S.US.MS",{"$f":"IFERROR(RTD(\"cqg.rtd\", ,\"ContractData\",C316, \"PerCentNetLastTrade\",, \"T\")/100,\"\")","v":1.1915077989601387E-2},122,122,"S.US.MS",316,"S.US.PHM"]
[null,null,"S.US.MSCI",{"$f":"IFERROR(RTD(\"cqg.rtd\", ,\"ContractData\",C317, \"PerCentNetLastTrade\",, \"T\")/100,\"\")","v":2.5373955320545805E-3},322,322,"S.US.MSCI",317,"S.US.MNST"]
[null,null,"S.US.MSFT",{"$f":"IFERROR(RTD(\"cqg.rtd\", ,\"ContractData\",C318, \"PerCentNetLastTrade\",, \"T\")/100,\"\")","v":-2.5060862093656024E-3},450,450,"S.US.MSFT",318,"S.US.AMCR"]
[null,null,"S.US.MSI",{"$f":"IFERROR(RTD(\"cqg.rtd\", ,\"ContractData\",C319, \"PerCentNetLastTrade\",, \"T\")/100,\"\")","v":1.9672431146490988E-3},339,339,"S.US.MSI",319,"S.US.CNC"]
[null,null,"S.US.MTB",{"$f":"IFERROR(RTD(\"cqg.rtd\", ,\"ContractData\",C320, \"PerCentNetLastTrade\",, \"T\")/100,\"\")","v":-1.8883293838862558E-2},501,501,"S.US.MTB",320,"S.US.DPZ"]
[null,null,"S.US.MTD",{"$f":"IFERROR(RTD(\"cqg.rtd\", ,\"ContractData\",C321, \"PerCentNetLastTrade\",, \"T\")/100,\"\")","v":5.4662223484664785E-3},242,{"$f":"IFERROR(E321,\"\")","v":242},{"$f":"C321","v":"S.US.MTD"},321,"S.US.POOL"]
[null,null,"S.US.MU",{"$f":"IFERROR(RTD(\"cqg.rtd\", ,\"ContractData\",C322, \"PerCentNetLastTrade\",, \"T\")/100,\"\")","v":3.4487332537471815E-3},290,290,"S.US.MU",{"$f":"H321+1","v":322},{"$f":"IFERROR(VLOOKUP(H322,$F$1:$G$505,2,FALSE),\"\")","v":"S.US.MSCI"}]
[null,null,"S.US.MXIM",{"$f":"IFERROR(RTD(\"cqg.rtd\", ,\"ContractData\",C323, \"PerCentNetLastTrade\",, \"T\")/100,\"\")","v":5.1271534044298609E-3},251,251,"S.US.MXIM",323,"S.US.AVGO"]
[null,null,"S.US.NCLH",{"$f":"IFERROR(RTD(\"cqg.rtd\", ,\"ContractData\",C324, \"PerCentNetLastTrade\",, \"T\")/100,\"\")","v":2.9138513513513514E-2},9,9,"S.US.NCLH",324,"S.US.BFB"]
[null,null,"S.US.NDAQ",{"$f":"IFERROR(RTD(\"cqg.rtd\", ,\"ContractData\",C325, \"PerCentNetLastTrade\",, \"T\")/100,\"\")","v":5.4173576561636263E-3},245,245,"S.US.NDAQ",325,"S.US.HSY"]
[null,null,"S.US.NEE",{"$f":"IFERROR(RTD(\"cqg.rtd\", ,\"ContractData\",C326, \"PerCentNetLastTrade\",, \"T\")/100,\"\")","v":-7.7750421148114546E-4},415,415,"S.US.NEE",326,"S.US.PG"]
[null,null,"S.US.NEM",{"$f":"IFERROR(RTD(\"cqg.rtd\", ,\"ContractData\",C327, \"PerCentNetLastTrade\",, \"T\")/100,\"\")","v":-6.7835870284579745E-3},490,490,"S.US.NEM",327,"S.US.SJM"]
[null,null,"S.US.NFLX",{"$f":"IFERROR(RTD(\"cqg.rtd\", ,\"ContractData\",C328, \"PerCentNetLastTrade\",, \"T\")/100,\"\")","v":-1.2541191978156483E-2},499,499,"S.US.NFLX",328,"S.US.ROP"]
[null,null,"S.US.NI",{"$f":"IFERROR(RTD(\"cqg.rtd\", ,\"ContractData\",C329, \"PerCentNetLastTrade\",, \"T\")/100,\"\")","v":1.986491855383393E-3},338,338,"S.US.NI",329,"S.US.STE"]
[null,null,"S.US.NKE",{"$f":"IFERROR(RTD(\"cqg.rtd\", ,\"ContractData\",C330, \"PerCentNetLastTrade\",, \"T\")/100,\"\")","v":4.3821209465381246E-3},279,279,"S.US.NKE",330,"S.US.ICE"]
[null,null,"S.US.NLOK",{"$f":"IFERROR(RTD(\"cqg.rtd\", ,\"ContractData\",C331, \"PerCentNetLastTrade\",, \"T\")/100,\"\")","v":-5.036807438977141E-3},481,481,"S.US.NLOK",331,"S.US.RSG"]
[null,null,"S.US.NLSN",{"$f":"IFERROR(RTD(\"cqg.rtd\", ,\"ContractData\",C332, \"PerCentNetLastTrade\",, \"T\")/100,\"\")","v":1.244296972210701E-2},116,116,"S.US.NLSN",332,"S.US.HPE"]
[null,null,"S.US.NOC",{"$f":"IFERROR(RTD(\"cqg.rtd\", ,\"ContractData\",C333, \"PerCentNetLastTrade\",, \"T\")/100,\"\")","v":4.4170347528960747E-3},262,262,"S.US.NOC",333,"S.US.PEG"]
[null,null,"S.US.NOV",{"$f":"IFERROR(RTD(\"cqg.rtd\", ,\"ContractData\",C334, \"PerCentNetLastTrade\",, \"T\")/100,\"\")","v":2.9520295202952029E-2},8,8,"S.US.NOV",334,"S.US.ZBRA"]
[null,null,"S.US.NOW",{"$f":"IFERROR(RTD(\"cqg.rtd\", ,\"ContractData\",C335, \"PerCentNetLastTrade\",, \"T\")/100,\"\")","v":-4.1397611676249448E-3},475,475,"S.US.NOW",335,"S.US.MA"]
[null,null,"S.US.NRG",{"$f":"IFERROR(RTD(\"cqg.rtd\", ,\"ContractData\",C336, \"PerCentNetLastTrade\",, \"T\")/100,\"\")","v":1.191381495564005E-2},123,123,"S.US.NRG",336,"S.US.VRSK"]
[null,null,"S.US.NSC",{"$f":"IFERROR(RTD(\"cqg.rtd\", ,\"ContractData\",C337, \"PerCentNetLastTrade\",, \"T\")/100,\"\")","v":8.3323599267998288E-3},188,188,"S.US.NSC",337,"S.US.OGN"]
[null,null,"S.US.NTAP",{"$f":"IFERROR(RTD(\"cqg.rtd\", ,\"ContractData\",C338, \"PerCentNetLastTrade\",, \"T\")/100,\"\")","v":-1.2781186094069531E-4},411,411,"S.US.NTAP",338,"S.US.NI"]
[null,null,"S.US.NTRS",{"$f":"IFERROR(RTD(\"cqg.rtd\", ,\"ContractData\",C339, \"PerCentNetLastTrade\",, \"T\")/100,\"\")","v":1.2880143112701253E-2},104,104,"S.US.NTRS",339,"S.US.MSI"]
[null,null,"S.US.NUE",{"$f":"IFERROR(RTD(\"cqg.rtd\", ,\"ContractData\",C340, \"PerCentNetLastTrade\",, \"T\")/100,\"\")","v":1.5297202797202798E-2},68,68,"S.US.NUE",340,"S.US.FB"]
[null,null,"S.US.NVDA",{"$f":"IFERROR(RTD(\"cqg.rtd\", ,\"ContractData\",C341, \"PerCentNetLastTrade\",, \"T\")/100,\"\")","v":1.6118633139909733E-2},50,50,"S.US.NVDA",341,"S.US.FE"]
[null,null,"S.US.NVR",{"$f":"IFERROR(RTD(\"cqg.rtd\", ,\"ContractData\",C342, \"PerCentNetLastTrade\",, \"T\")/100,\"\")","v":-1.2301362986121174E-2},498,498,"S.US.NVR",342,"S.US.SPGI"]
[null,null,"S.US.NWL",{"$f":"IFERROR(RTD(\"cqg.rtd\", ,\"ContractData\",C343, \"PerCentNetLastTrade\",, \"T\")/100,\"\")","v":3.328402366863905E-3},295,295,"S.US.NWL",343,"S.US.MDLZ"]
[null,null,"S.US.NWS",{"$f":"IFERROR(RTD(\"cqg.rtd\", ,\"ContractData\",C344, \"PerCentNetLastTrade\",, \"T\")/100,\"\")","v":8.673026886383349E-3},181,181,"S.US.NWS",344,"S.US.WELL"]
[null,null,"S.US.NWSA",{"$f":"IFERROR(RTD(\"cqg.rtd\", ,\"ContractData\",C345, \"PerCentNetLastTrade\",, \"T\")/100,\"\")","v":9.4572368421052631E-3},166,166,"S.US.NWSA",345,"S.US.AVB"]
[null,null,"S.US.NXPI",{"$f":"IFERROR(RTD(\"cqg.rtd\", ,\"ContractData\",C346, \"PerCentNetLastTrade\",, \"T\")/100,\"\")","v":1.288086493197455E-2},103,103,"S.US.NXPI",346,"S.US.LH"]
[null,null,"S.US.O",{"$f":"IFERROR(RTD(\"cqg.rtd\", ,\"ContractData\",C347, \"PerCentNetLastTrade\",, \"T\")/100,\"\")","v":1.2811387900355873E-3},355,355,"S.US.O",347,"S.US.SHW"]
[null,null,"S.US.ODFL",{"$f":"IFERROR(RTD(\"cqg.rtd\", ,\"ContractData\",C348, \"PerCentNetLastTrade\",, \"T\")/100,\"\")","v":5.927916534935188E-4},379,379,"S.US.ODFL",348,"S.US.IT"]
[null,null,"S.US.OGN",{"$f":"IFERROR(RTD(\"cqg.rtd\", ,\"ContractData\",C349, \"PerCentNetLastTrade\",, \"T\")/100,\"\")","v":2.0263424518743665E-3},337,337,"S.US.OGN",349,"S.US.INFO"]
[null,null,"S.US.OKE",{"$f":"IFERROR(RTD(\"cqg.rtd\", ,\"ContractData\",C350, \"PerCentNetLastTrade\",, \"T\")/100,\"\")","v":1.9854906452844597E-2},33,33,"S.US.OKE",350,"S.US.CBOE"]
[null,null,"S.US.OMC",{"$f":"IFERROR(RTD(\"cqg.rtd\", ,\"ContractData\",C351, \"PerCentNetLastTrade\",, \"T\")/100,\"\")","v":1.3548651977555767E-2},91,91,"S.US.OMC",351,"S.US.HON"]
[null,null,"S.US.ORCL",{"$f":"IFERROR(RTD(\"cqg.rtd\", ,\"ContractData\",C352, \"PerCentNetLastTrade\",, \"T\")/100,\"\")","v":7.8953304759756364E-3},198,198,"S.US.ORCL",352,"S.US.EQR"]
[null,null,"S.US.ORLY",{"$f":"IFERROR(RTD(\"cqg.rtd\", ,\"ContractData\",C353, \"PerCentNetLastTrade\",, \"T\")/100,\"\")","v":-1.448845862557213E-3},430,430,"S.US.ORLY",353,"S.US.CARR"]
[null,null,"S.US.OTIS",{"$f":"IFERROR(RTD(\"cqg.rtd\", ,\"ContractData\",C354, \"PerCentNetLastTrade\",, \"T\")/100,\"\")","v":3.4843205574912896E-3},288,288,"S.US.OTIS",354,"S.US.XLNX"]
[null,null,"S.US.OXY",{"$f":"IFERROR(RTD(\"cqg.rtd\", ,\"ContractData\",C355, \"PerCentNetLastTrade\",, \"T\")/100,\"\")","v":3.6657469452108786E-2},5,5,"S.US.OXY",355,"S.US.O"]
[null,null,"S.US.PAYC",{"$f":"IFERROR(RTD(\"cqg.rtd\", ,\"ContractData\",C356, \"PerCentNetLastTrade\",, \"T\")/100,\"\")","v":-3.0904144324995376E-3},463,463,"S.US.PAYC",356,"S.US.BIO"]
[null,null,"S.US.PAYX",{"$f":"IFERROR(RTD(\"cqg.rtd\", ,\"ContractData\",C357, \"PerCentNetLastTrade\",, \"T\")/100,\"\")","v":5.4318305268875617E-4},382,382,"S.US.PAYX",357,"S.US.EXPD"]
[null,null,"S.US.PBCT",{"$f":"IFERROR(RTD(\"cqg.rtd\", ,\"ContractData\",C358, \"PerCentNetLastTrade\",, \"T\")/100,\"\")","v":-6.3411540900443885E-3},486,486,"S.US.PBCT",358,"S.US.PPG"]
[null,null,"S.US.PCAR",{"$f":"IFERROR(RTD(\"cqg.rtd\", ,\"ContractData\",C359, \"PerCentNetLastTrade\",, \"T\")/100,\"\")","v":3.0650471109092974E-3},308,308,"S.US.PCAR",359,"S.US.CMS"]
[null,null,"S.US.PEAK",{"$f":"IFERROR(RTD(\"cqg.rtd\", ,\"ContractData\",C360, \"PerCentNetLastTrade\",, \"T\")/100,\"\")","v":1.1111111111111111E-3},362,362,"S.US.PEAK",360,"S.US.DUK"]
[null,null,"S.US.PEG",{"$f":"IFERROR(RTD(\"cqg.rtd\", ,\"ContractData\",C361, \"PerCentNetLastTrade\",, \"T\")/100,\"\")","v":2.1427394099225315E-3},333,333,"S.US.PEG",361,"S.US.FDX"]
[null,null,"S.US.PENN",{"$f":"IFERROR(RTD(\"cqg.rtd\", ,\"ContractData\",C362, \"PerCentNetLastTrade\",, \"T\")/100,\"\")","v":1.4419610670511895E-2},81,81,"S.US.PENN",362,"S.US.PEAK"]
[null,null,"S.US.PEP",{"$f":"IFERROR(RTD(\"cqg.rtd\", ,\"ContractData\",C363, \"PerCentNetLastTrade\",, \"T\")/100,\"\")","v":3.2088307020921572E-4},393,393,"S.US.PEP",363,"S.US.JKHY"]
[null,null,"S.US.PFE",{"$f":"IFERROR(RTD(\"cqg.rtd\", ,\"ContractData\",C364, \"PerCentNetLastTrade\",, \"T\")/100,\"\")","v":3.6540803897685747E-3},283,283,"S.US.PFE",364,"S.US.D"]
[null,null,"S.US.PFG",{"$f":"IFERROR(RTD(\"cqg.rtd\", ,\"ContractData\",C365, \"PerCentNetLastTrade\",, \"T\")/100,\"\")","v":1.5592009095338638E-2},65,65,"S.US.PFG",365,"S.US.EFX"]
[null,null,"S.US.PG",{"$f":"IFERROR(RTD(\"cqg.rtd\", ,\"ContractData\",C366, \"PerCentNetLastTrade\",, \"T\")/100,\"\")","v":2.2907867420717304E-3},326,326,"S.US.PG",366,"S.US.JNJ"]
[null,null,"S.US.PGR",{"$f":"IFERROR(RTD(\"cqg.rtd\", ,\"ContractData\",C367, \"PerCentNetLastTrade\",, \"T\")/100,\"\")","v":-2.1181952976064393E-3},442,442,"S.US.PGR",367,"S.US.BAX"]
[null,null,"S.US.PH",{"$f":"IFERROR(RTD(\"cqg.rtd\", ,\"ContractData\",C368, \"PerCentNetLastTrade\",, \"T\")/100,\"\")","v":1.2719927887023004E-2},109,109,"S.US.PH",368,"S.US.GPN"]
[null,null,"S.US.PHM",{"$f":"IFERROR(RTD(\"cqg.rtd\", ,\"ContractData\",C369, \"PerCentNetLastTrade\",, \"T\")/100,\"\")","v":2.6814786439379431E-3},316,316,"S.US.PHM",369,"S.US.ARE"]
[null,null,"S.US.PKG",{"$f":"IFERROR(RTD(\"cqg.rtd\", ,\"ContractData\",C370, \"PerCentNetLastTrade\",, \"T\")/100,\"\")","v":8.5985819882335186E-3},183,183,"S.US.PKG",370,"S.US.MMC"]
[null,null,"S.US.PKI",{"$f":"IFERROR(RTD(\"cqg.rtd\", ,\"ContractData\",C371, \"PerCentNetLastTrade\",, \"T\")/100,\"\")","v":-3.2822757111597373E-3},465,465,"S.US.PKI",371,"S.US.CMCSA"]
[null,null,"S.US.PLD",{"$f":"IFERROR(RTD(\"cqg.rtd\", ,\"ContractData\",C372, \"PerCentNetLastTrade\",, \"T\")/100,\"\")","v":-2.0314087038049845E-3},439,439,"S.US.PLD",372,"S.US.TSLA"]
[null,null,"S.US.PM",{"$f":"IFERROR(RTD(\"cqg.rtd\", ,\"ContractData\",C373, \"PerCentNetLastTrade\",, \"T\")/100,\"\")","v":1.0955440851153481E-2},137,137,"S.US.PM",373,"S.US.ED"]
[null,null,"S.US.PNC",{"$f":"IFERROR(RTD(\"cqg.rtd\", ,\"ContractData\",C374, \"PerCentNetLastTrade\",, \"T\")/100,\"\")","v":1.2665198237885462E-2},110,110,"S.US.PNC",374,"S.US.DHI"]
[null,null,"S.US.PNR",{"$f":"IFERROR(RTD(\"cqg.rtd\", ,\"ContractData\",C375, \"PerCentNetLastTrade\",, \"T\")/100,\"\")","v":1.0642887962030778E-2},140,140,"S.US.PNR",375,"S.US.AMZN"]
[null,null,"S.US.PNW",{"$f":"IFERROR(RTD(\"cqg.rtd\", ,\"ContractData\",C376, \"PerCentNetLastTrade\",, \"T\")/100,\"\")","v":5.7735359962295275E-3},235,235,"S.US.PNW",376,"S.US.SO"]
[null,null,"S.US.POOL",{"$f":"IFERROR(RTD(\"cqg.rtd\", ,\"ContractData\",C377, \"PerCentNetLastTrade\",, \"T\")/100,\"\")","v":2.5413803009878234E-3},321,321,"S.US.POOL",377,"S.US.CAT"]
[null,null,"S.US.PPG",{"$f":"IFERROR(RTD(\"cqg.rtd\", ,\"ContractData\",C378, \"PerCentNetLastTrade\",, \"T\")/100,\"\")","v":1.1357183418512209E-3},358,358,"S.US.PPG",378,"S.US.CL"]
[null,null,"S.US.PPL",{"$f":"IFERROR(RTD(\"cqg.rtd\", ,\"ContractData\",C379, \"PerCentNetLastTrade\",, \"T\")/100,\"\")","v":3.5460992907801418E-3},301,301,"S.US.PPL",379,"S.US.ODFL"]
[null,null,"S.US.PRGO",{"$f":"IFERROR(RTD(\"cqg.rtd\", ,\"ContractData\",C380, \"PerCentNetLastTrade\",, \"T\")/100,\"\")","v":-2.6172300981461287E-3},455,455,"S.US.PRGO",380,"S.US.ADP"]
[null,null,"S.US.PRU",{"$f":"IFERROR(RTD(\"cqg.rtd\", ,\"ContractData\",C381, \"PerCentNetLastTrade\",, \"T\")/100,\"\")","v":1.1911972541893802E-2},138,138,"S.US.PRU",381,"S.US.MAA"]
[null,null,"S.US.PSA",{"$f":"IFERROR(RTD(\"cqg.rtd\", ,\"ContractData\",C382, \"PerCentNetLastTrade\",, \"T\")/100,\"\")","v":-6.9829270636471378E-3},491,491,"S.US.PSA",382,"S.US.PAYX"]
[null,null,"S.US.PSX",{"$f":"IFERROR(RTD(\"cqg.rtd\", ,\"ContractData\",C383, \"PerCentNetLastTrade\",, \"T\")/100,\"\")","v":2.2353437368199072E-2},22,22,"S.US.PSX",383,"S.US.FTNT"]
[null,null,"S.US.PTC",{"$f":"IFERROR(RTD(\"cqg.rtd\", ,\"ContractData\",C384, \"PerCentNetLastTrade\",, \"T\")/100,\"\")","v":6.5053161723559036E-3},218,218,"S.US.PTC",384,"S.US.WAT"]
[null,null,"S.US.PVH",{"$f":"IFERROR(RTD(\"cqg.rtd\", ,\"ContractData\",C385, \"PerCentNetLastTrade\",, \"T\")/100,\"\")","v":1.8436873747494989E-2},39,{"$f":"IFERROR(E385,\"\")","v":39},{"$f":"C385","v":"S.US.PVH"},385,"S.US.LOW"]
[null,null,"S.US.PWR",{"$f":"IFERROR(RTD(\"cqg.rtd\", ,\"ContractData\",C386, \"PerCentNetLastTrade\",, \"T\")/100,\"\")","v":1.4269535673839184E-2},82,82,"S.US.PWR",{"$f":"H385+1","v":386},{"$f":"IFERROR(VLOOKUP(H386,$F$1:$G$505,2,FALSE),\"\")","v":"S.US.FISV"}]
[null,null,"S.US.PXD",{"$f":"IFERROR(RTD(\"cqg.rtd\", ,\"ContractData\",C387, \"PerCentNetLastTrade\",, \"T\")/100,\"\")","v":1.6408780136739833E-2},53,53,"S.US.PXD",387,"S.US.V"]
[null,null,"S.US.PYPL",{"$f":"IFERROR(RTD(\"cqg.rtd\", ,\"ContractData\",C388, \"PerCentNetLastTrade\",, \"T\")/100,\"\")","v":-1.5432616499479986E-3},432,432,"S.US.PYPL",388,"S.US.CTAS"]
[null,null,"S.US.QCOM",{"$f":"IFERROR(RTD(\"cqg.rtd\", ,\"ContractData\",C389, \"PerCentNetLastTrade\",, \"T\")/100,\"\")","v":4.2278753135077032E-3},269,269,"S.US.QCOM",389,"S.US.ABT"]
[null,null,"S.US.QRVO",{"$f":"IFERROR(RTD(\"cqg.rtd\", ,\"ContractData\",C390, \"PerCentNetLastTrade\",, \"T\")/100,\"\")","v":5.3241960991038482E-3},246,246,"S.US.QRVO",390,"S.US.ANET"]
[null,null,"S.US.RCL",{"$f":"IFERROR(RTD(\"cqg.rtd\", ,\"ContractData\",C391, \"PerCentNetLastTrade\",, \"T\")/100,\"\")","v":1.8293497129122715E-2},41,41,"S.US.RCL",391,"S.US.BR"]
[null,null,"S.US.RE",{"$f":"IFERROR(RTD(\"cqg.rtd\", ,\"ContractData\",C392, \"PerCentNetLastTrade\",, \"T\")/100,\"\")","v":8.8290155440414516E-3},178,178,"S.US.RE",392,"S.US.AEP"]
[null,null,"S.US.REG",{"$f":"IFERROR(RTD(\"cqg.rtd\", ,\"ContractData\",C393, \"PerCentNetLastTrade\",, \"T\")/100,\"\")","v":1.0075957215935514E-2},152,152,"S.US.REG",393,"S.US.PEP"]
[null,null,"S.US.REGN",{"$f":"IFERROR(RTD(\"cqg.rtd\", ,\"ContractData\",C394, \"PerCentNetLastTrade\",, \"T\")/100,\"\")","v":-7.2542742320005453E-3},492,492,"S.US.REGN",394,"S.US.ROL"]
[null,null,"S.US.RF",{"$f":"IFERROR(RTD(\"cqg.rtd\", ,\"ContractData\",C395, \"PerCentNetLastTrade\",, \"T\")/100,\"\")","v":1.6393442622950821E-2},54,54,"S.US.RF",395,"S.US.KR"]
[null,null,"S.US.RHI",{"$f":"IFERROR(RTD(\"cqg.rtd\", ,\"ContractData\",C396, \"PerCentNetLastTrade\",, \"T\")/100,\"\")","v":1.1333410431363478E-2},130,130,"S.US.RHI",396,"S.US.MCO"]
[null,null,"S.US.RJF",{"$f":"IFERROR(RTD(\"cqg.rtd\", ,\"ContractData\",C397, \"PerCentNetLastTrade\",, \"T\")/100,\"\")","v":2.0610446821900566E-2},31,31,"S.US.RJF",397,"S.US.CTSH"]
[null,null,"S.US.RL",{"$f":"IFERROR(RTD(\"cqg.rtd\", ,\"ContractData\",C398, \"PerCentNetLastTrade\",, \"T\")/100,\"\")","v":1.7516507703595009E-2},46,46,"S.US.RL",398,"S.US.AJG"]
[null,null,"S.US.RMD",{"$f":"IFERROR(RTD(\"cqg.rtd\", ,\"ContractData\",C399, \"PerCentNetLastTrade\",, \"T\")/100,\"\")","v":-2.1155729676787462E-3},441,441,"S.US.RMD",399,"S.US.FIS"]
[null,null,"S.US.ROK",{"$f":"IFERROR(RTD(\"cqg.rtd\", ,\"ContractData\",C400, \"PerCentNetLastTrade\",, \"T\")/100,\"\")","v":5.4406596377399299E-3},244,244,"S.US.ROK",400,"S.US.LLY"]
[null,null,"S.US.ROL",{"$f":"IFERROR(RTD(\"cqg.rtd\", ,\"ContractData\",C401, \"PerCentNetLastTrade\",, \"T\")/100,\"\")","v":2.6795284030010718E-4},394,394,"S.US.ROL",401,"S.US.CRL"]
[null,null,"S.US.ROP",{"$f":"IFERROR(RTD(\"cqg.rtd\", ,\"ContractData\",C402, \"PerCentNetLastTrade\",, \"T\")/100,\"\")","v":2.2377736186833756E-3},328,328,"S.US.ROP",402,"S.US.MPWR"]
[null,null,"S.US.ROST",{"$f":"IFERROR(RTD(\"cqg.rtd\", ,\"ContractData\",C403, \"PerCentNetLastTrade\",, \"T\")/100,\"\")","v":9.444303904207774E-3},168,168,"S.US.ROST",403,"S.US.WMT"]
[null,null,"S.US.RSG",{"$f":"IFERROR(RTD(\"cqg.rtd\", ,\"ContractData\",C404, \"PerCentNetLastTrade\",, \"T\")/100,\"\")","v":2.1720243266724589E-3},331,331,"S.US.RSG",404,"S.US.EVRG"]
[null,null,"S.US.RTX",{"$f":"IFERROR(RTD(\"cqg.rtd\", ,\"ContractData\",C405, \"PerCentNetLastTrade\",, \"T\")/100,\"\")","v":1.0141509433962264E-2},155,155,"S.US.RTX",405,"S.US.IRM"]
[null,null,"S.US.SBAC",{"$f":"IFERROR(RTD(\"cqg.rtd\", ,\"ContractData\",C406, \"PerCentNetLastTrade\",, \"T\")/100,\"\")","v":-5.3683268714583956E-3},485,485,"S.US.SBAC",406,"S.US.K"]
[null,null,"S.US.SBUX",{"$f":"IFERROR(RTD(\"cqg.rtd\", ,\"ContractData\",C407, \"PerCentNetLastTrade\",, \"T\")/100,\"\")","v":6.7279850110713683E-3},213,213,"S.US.SBUX",407,"S.US.UPS"]
[null,null,"S.US.SCHW",{"$f":"IFERROR(RTD(\"cqg.rtd\", ,\"ContractData\",C408, \"PerCentNetLastTrade\",, \"T\")/100,\"\")","v":2.0900794818957905E-2},34,34,"S.US.SCHW",408,"S.US.APD"]
[null,null,"S.US.SEE",{"$f":"IFERROR(RTD(\"cqg.rtd\", ,\"ContractData\",C409, \"PerCentNetLastTrade\",, \"T\")/100,\"\")","v":5.1385575334923841E-3},249,249,"S.US.SEE",409,"S.US.FFIV"]
[null,null,"S.US.SHW",{"$f":"IFERROR(RTD(\"cqg.rtd\", ,\"ContractData\",C410, \"PerCentNetLastTrade\",, \"T\")/100,\"\")","v":1.5645000711136394E-3},347,347,"S.US.SHW",410,"S.US.ACN"]
[null,null,"S.US.SIVB",{"$f":"IFERROR(RTD(\"cqg.rtd\", ,\"ContractData\",C411, \"PerCentNetLastTrade\",, \"T\")/100,\"\")","v":2.1864150271521412E-2},24,24,"S.US.SIVB",411,"S.US.NTAP"]
[null,null,"S.US.SJM",{"$f":"IFERROR(RTD(\"cqg.rtd\", ,\"ContractData\",C412, \"PerCentNetLastTrade\",, \"T\")/100,\"\")","v":2.2639800769753225E-3},327,327,"S.US.SJM",412,"S.US.CERN"]
[null,null,"S.US.SLB",{"$f":"IFERROR(RTD(\"cqg.rtd\", ,\"ContractData\",C413, \"PerCentNetLastTrade\",, \"T\")/100,\"\")","v":3.6710719530102791E-2},4,4,"S.US.SLB",413,"S.US.MRK"]
[null,null,"S.US.SNA",{"$f":"IFERROR(RTD(\"cqg.rtd\", ,\"ContractData\",C414, \"PerCentNetLastTrade\",, \"T\")/100,\"\")","v":9.2269103287646696E-3},172,172,"S.US.SNA",414,"S.US.IQV"]
[null,null,"S.US.SNPS",{"$f":"IFERROR(RTD(\"cqg.rtd\", ,\"ContractData\",C415, \"PerCentNetLastTrade\",, \"T\")/100,\"\")","v":-6.7652668321997907E-3},489,489,"S.US.SNPS",415,"S.US.NEE"]
[null,null,"S.US.SO",{"$f":"IFERROR(RTD(\"cqg.rtd\", ,\"ContractData\",C416, \"PerCentNetLastTrade\",, \"T\")/100,\"\")","v":6.3542494042891182E-4},376,376,"S.US.SO",416,"S.US.GOOGL"]
[null,null,"S.US.SPG",{"$f":"IFERROR(RTD(\"cqg.rtd\", ,\"ContractData\",C417, \"PerCentNetLastTrade\",, \"T\")/100,\"\")","v":9.3130621666799324E-3},170,170,"S.US.SPG",417,"S.US.CTXS"]
[null,null,"S.US.SPGI",{"$f":"IFERROR(RTD(\"cqg.rtd\", ,\"ContractData\",C418, \"PerCentNetLastTrade\",, \"T\")/100,\"\")","v":1.7532062058696382E-3},342,342,"S.US.SPGI",418,"S.US.HPQ"]
[null,null,"S.US.SRE",{"$f":"IFERROR(RTD(\"cqg.rtd\", ,\"ContractData\",C419, \"PerCentNetLastTrade\",, \"T\")/100,\"\")","v":2.9563371740448756E-3},309,309,"S.US.SRE",419,"S.US.CSCO"]
[null,null,"S.US.STE",{"$f":"IFERROR(RTD(\"cqg.rtd\", ,\"ContractData\",C420, \"PerCentNetLastTrade\",, \"T\")/100,\"\")","v":2.2078233741300696E-3},329,329,"S.US.STE",420,"S.US.CAG"]
[null,null,"S.US.STT",{"$f":"IFERROR(RTD(\"cqg.rtd\", ,\"ContractData\",C421, \"PerCentNetLastTrade\",, \"T\")/100,\"\")","v":1.1592802801594011E-2},127,127,"S.US.STT",421,"S.US.GIS"]
[null,null,"S.US.STX",{"$f":"IFERROR(RTD(\"cqg.rtd\", ,\"ContractData\",C422, \"PerCentNetLastTrade\",, \"T\")/100,\"\")","v":-6.0474909346122353E-2},504,504,"S.US.STX",422,"S.US.TSCO"]
[null,null,"S.US.STZ",{"$f":"IFERROR(RTD(\"cqg.rtd\", ,\"ContractData\",C423, \"PerCentNetLastTrade\",, \"T\")/100,\"\")","v":7.5942621130701245E-3},200,200,"S.US.STZ",423,"S.US.LNT"]
[null,null,"S.US.SWK",{"$f":"IFERROR(RTD(\"cqg.rtd\", ,\"ContractData\",C424, \"PerCentNetLastTrade\",, \"T\")/100,\"\")","v":7.4531725017161913E-3},203,203,"S.US.SWK",424,"S.US.VRSN"]
[null,null,"S.US.SWKS",{"$f":"IFERROR(RTD(\"cqg.rtd\", ,\"ContractData\",C425, \"PerCentNetLastTrade\",, \"T\")/100,\"\")","v":3.3787350860521592E-3},289,289,"S.US.SWKS",425,"S.US.AEE"]
[null,null,"S.US.SYF",{"$f":"IFERROR(RTD(\"cqg.rtd\", ,\"ContractData\",C426, \"PerCentNetLastTrade\",, \"T\")/100,\"\")","v":1.326086956521739E-2},96,96,"S.US.SYF",426,"S.US.DRE"]
[null,null,"S.US.SYK",{"$f":"IFERROR(RTD(\"cqg.rtd\", ,\"ContractData\",C427, \"PerCentNetLastTrade\",, \"T\")/100,\"\")","v":9.7186299866760719E-3},160,160,"S.US.SYK",427,"S.US.CDW"]
[null,null,"S.US.SYY",{"$f":"IFERROR(RTD(\"cqg.rtd\", ,\"ContractData\",C428, \"PerCentNetLastTrade\",, \"T\")/100,\"\")","v":1.5136920324755745E-2},67,67,"S.US.SYY",428,"S.US.COST"]
[null,null,"S.US.T",{"$f":"IFERROR(RTD(\"cqg.rtd\", ,\"ContractData\",C429, \"PerCentNetLastTrade\",, \"T\")/100,\"\")","v":7.8824793980652105E-3},194,194,"S.US.T",429,"S.US.INTC"]
[null,null,"S.US.TAP",{"$f":"IFERROR(RTD(\"cqg.rtd\", ,\"ContractData\",C430, \"PerCentNetLastTrade\",, \"T\")/100,\"\")","v":1.0995483997643824E-2},134,134,"S.US.TAP",430,"S.US.ORLY"]
[null,null,"S.US.TDG",{"$f":"IFERROR(RTD(\"cqg.rtd\", ,\"ContractData\",C431, \"PerCentNetLastTrade\",, \"T\")/100,\"\")","v":4.2878683168938872E-3},266,266,"S.US.TDG",431,"S.US.CPRT"]
[null,null,"S.US.TDY",{"$f":"IFERROR(RTD(\"cqg.rtd\", ,\"ContractData\",C432, \"PerCentNetLastTrade\",, \"T\")/100,\"\")","v":5.6590372763305604E-3},239,239,"S.US.TDY",432,"S.US.PYPL"]
[null,null,"S.US.TEL",{"$f":"IFERROR(RTD(\"cqg.rtd\", ,\"ContractData\",C433, \"PerCentNetLastTrade\",, \"T\")/100,\"\")","v":8.4858323494687131E-3},186,186,"S.US.TEL",433,"S.US.WEC"]
[null,null,"S.US.TER",{"$f":"IFERROR(RTD(\"cqg.rtd\", ,\"ContractData\",C434, \"PerCentNetLastTrade\",, \"T\")/100,\"\")","v":9.2098885118759091E-3},167,167,"S.US.TER",434,"S.US.HRL"]
[null,null,"S.US.TFC",{"$f":"IFERROR(RTD(\"cqg.rtd\", ,\"ContractData\",C435, \"PerCentNetLastTrade\",, \"T\")/100,\"\")","v":1.2946180876641391E-2},101,101,"S.US.TFC",435,"S.US.WST"]
[null,null,"S.US.TFX",{"$f":"IFERROR(RTD(\"cqg.rtd\", ,\"ContractData\",C436, \"PerCentNetLastTrade\",, \"T\")/100,\"\")","v":1.4424446458630067E-2},80,80,"S.US.TFX",436,"S.US.IBM"]
[null,null,"S.US.TGT",{"$f":"IFERROR(RTD(\"cqg.rtd\", ,\"ContractData\",C437, \"PerCentNetLastTrade\",, \"T\")/100,\"\")","v":3.3371284990773818E-3},294,294,"S.US.TGT",437,"S.US.GNRC"]
[null,null,"S.US.TJX",{"$f":"IFERROR(RTD(\"cqg.rtd\", ,\"ContractData\",C438, \"PerCentNetLastTrade\",, \"T\")/100,\"\")","v":9.4736842105263147E-3},165,165,"S.US.TJX",438,"S.US.DIS"]
[null,null,"S.US.TMO",{"$f":"IFERROR(RTD(\"cqg.rtd\", ,\"ContractData\",C439, \"PerCentNetLastTrade\",, \"T\")/100,\"\")","v":-1.0467296873206015E-2},496,496,"S.US.TMO",439,"S.US.PLD"]
[null,null,"S.US.TMUS",{"$f":"IFERROR(RTD(\"cqg.rtd\", ,\"ContractData\",C440, \"PerCentNetLastTrade\",, \"T\")/100,\"\")","v":4.6398891966759007E-3},258,258,"S.US.TMUS",440,"S.US.WRB"]
[null,null,"S.US.TPR",{"$f":"IFERROR(RTD(\"cqg.rtd\", ,\"ContractData\",C441, \"PerCentNetLastTrade\",, \"T\")/100,\"\")","v":""},{"$error":"#VALUE!"},"","S.US.TPR",441,"S.US.RMD"]
[null,null,"S.US.TRMB",{"$f":"IFERROR(RTD(\"cqg.rtd\", ,\"ContractData\",C442, \"PerCentNetLastTrade\",, \"T\")/100,\"\")","v":3.5940017350353202E-3},285,285,"S.US.TRMB",442,"S.US.PGR"]
[null,null,"S.US.TROW",{"$f":"IFERROR(RTD(\"cqg.rtd\", ,\"ContractData\",C443, \"PerCentNetLastTrade\",, \"T\")/100,\"\")","v":1.0182102995887996E-2},150,150,"S.US.TROW",443,"S.US.DG"]
[null,null,"S.US.TRV",{"$f":"IFERROR(RTD(\"cqg.rtd\", ,\"ContractData\",C444, \"PerCentNetLastTrade\",, \"T\")/100,\"\")","v":8.3394003574028732E-3},187,187,"S.US.TRV",444,"S.US.ZTS"]
[null,null,"S.US.TSCO",{"$f":"IFERROR(RTD(\"cqg.rtd\", ,\"ContractData\",C445, \"PerCentNetLastTrade\",, \"T\")/100,\"\")","v":-1.1979960792855588E-3},422,422,"S.US.TSCO",445,"S.US.IDXX"]
[null,null,"S.US.TSLA",{"$f":"IFERROR(RTD(\"cqg.rtd\", ,\"ContractData\",C446, \"PerCentNetLastTrade\",, \"T\")/100,\"\")","v":1.438304314912945E-3},372,372,"S.US.TSLA",446,"S.US.BDX"]
[null,null,"S.US.TSN",{"$f":"IFERROR(RTD(\"cqg.rtd\", ,\"ContractData\",C447, \"PerCentNetLastTrade\",, \"T\")/100,\"\")","v":2.8034763106251754E-3},313,313,"S.US.TSN",447,"S.US.AKAM"]
[null,null,"S.US.TT",{"$f":"IFERROR(RTD(\"cqg.rtd\", ,\"ContractData\",C448, \"PerCentNetLastTrade\",, \"T\")/100,\"\")","v":4.8350977198697073E-3},257,257,"S.US.TT",448,"S.US.CRM"]
[null,null,"S.US.TTWO",{"$f":"IFERROR(RTD(\"cqg.rtd\", ,\"ContractData\",C449, \"PerCentNetLastTrade\",, \"T\")/100,\"\")","v":4.1171626867427362E-3},271,{"$f":"IFERROR(E449,\"\")","v":271},{"$f":"C449","v":"S.US.TTWO"},449,"S.US.KMB"]
[null,null,"S.US.TWTR",{"$f":"IFERROR(RTD(\"cqg.rtd\", ,\"ContractData\",C450, \"PerCentNetLastTrade\",, \"T\")/100,\"\")","v":-2.6493965263467765E-3},456,456,"S.US.TWTR",{"$f":"H449+1","v":450},{"$f":"IFERROR(VLOOKUP(H450,$F$1:$G$505,2,FALSE),\"\")","v":"S.US.MSFT"}]
[null,null,"S.US.TXN",{"$f":"IFERROR(RTD(\"cqg.rtd\", ,\"ContractData\",C451, \"PerCentNetLastTrade\",, \"T\")/100,\"\")","v":1.0225275603131492E-2},149,149,"S.US.TXN",451,"S.US.ADSK"]
[null,null,"S.US.TXT",{"$f":"IFERROR(RTD(\"cqg.rtd\", ,\"ContractData\",C452, \"PerCentNetLastTrade\",, \"T\")/100,\"\")","v":1.4760697778440435E-2},73,73,"S.US.TXT",452,"S.US.BIIB"]
[null,null,"S.US.TYL",{"$f":"IFERROR(RTD(\"cqg.rtd\", ,\"ContractData\",C453, \"PerCentNetLastTrade\",, \"T\")/100,\"\")","v":-6.5258880748630173E-3},487,487,"S.US.TYL",453,"S.US.EXC"]
[null,null,"S.US.UA",{"$f":"IFERROR(RTD(\"cqg.rtd\", ,\"ContractData\",C454, \"PerCentNetLastTrade\",, \"T\")/100,\"\")","v":1.7291066282420747E-2},47,47,"S.US.UA",454,"S.US.A"]
[null,null,"S.US.UAA",{"$f":"IFERROR(RTD(\"cqg.rtd\", ,\"ContractData\",C455, \"PerCentNetLastTrade\",, \"T\")/100,\"\")","v":2.0843924758515504E-2},28,28,"S.US.UAA",455,"S.US.PRGO"]
[null,null,"S.US.UAL",{"$f":"IFERROR(RTD(\"cqg.rtd\", ,\"ContractData\",C456, \"PerCentNetLastTrade\",, \"T\")/100,\"\")","v":1.8566493955094993E-2},42,42,"S.US.UAL",456,"S.US.TWTR"]
[null,null,"S.US.UDR",{"$f":"IFERROR(RTD(\"cqg.rtd\", ,\"ContractData\",C457, \"PerCentNetLastTrade\",, \"T\")/100,\"\")","v":3.1382684142514305E-3},305,305,"S.US.UDR",457,"S.US.CPB"]
[null,null,"S.US.UHS",{"$f":"IFERROR(RTD(\"cqg.rtd\", ,\"ContractData\",C458, \"PerCentNetLastTrade\",, \"T\")/100,\"\")","v":1.2992100280733825E-2},100,100,"S.US.UHS",458,"S.US.CCI"]
[null,null,"S.US.ULTA",{"$f":"IFERROR(RTD(\"cqg.rtd\", ,\"ContractData\",C459, \"PerCentNetLastTrade\",, \"T\")/100,\"\")","v":1.2825112107623318E-2},107,107,"S.US.ULTA",459,"S.US.INCY"]
[null,null,"S.US.UNH",{"$f":"IFERROR(RTD(\"cqg.rtd\", ,\"ContractData\",C460, \"PerCentNetLastTrade\",, \"T\")/100,\"\")","v":6.5622200159817902E-3},217,217,"S.US.UNH",460,"S.US.AAPL"]
[null,null,"S.US.UNM",{"$f":"IFERROR(RTD(\"cqg.rtd\", ,\"ContractData\",C461, \"PerCentNetLastTrade\",, \"T\")/100,\"\")","v":2.3281596452328159E-2},19,19,"S.US.UNM",461,"S.US.AWK"]
[null,null,"S.US.UNP",{"$f":"IFERROR(RTD(\"cqg.rtd\", ,\"ContractData\",C462, \"PerCentNetLastTrade\",, \"T\")/100,\"\")","v":6.4043066641915726E-3},221,221,"S.US.UNP",462,"S.US.CDNS"]
[null,null,"S.US.UPS",{"$f":"IFERROR(RTD(\"cqg.rtd\", ,\"ContractData\",C463, \"PerCentNetLastTrade\",, \"T\")/100,\"\")","v":0},407,407,"S.US.UPS",463,"S.US.PAYC"]
[null,null,"S.US.URI",{"$f":"IFERROR(RTD(\"cqg.rtd\", ,\"ContractData\",C464, \"PerCentNetLastTrade\",, \"T\")/100,\"\")","v":1.39602053915276E-2},86,86,"S.US.URI",464,"S.US.BLL"]
[null,null,"S.US.USB",{"$f":"IFERROR(RTD(\"cqg.rtd\", ,\"ContractData\",C465, \"PerCentNetLastTrade\",, \"T\")/100,\"\")","v":8.5576751649135314E-3},185,185,"S.US.USB",465,"S.US.PKI"]
[null,null,"S.US.V",{"$f":"IFERROR(RTD(\"cqg.rtd\", ,\"ContractData\",C466, \"PerCentNetLastTrade\",, \"T\")/100,\"\")","v":4.5323444581788218E-4},387,387,"S.US.V",466,"S.US.GOOG"]
[null,null,"S.US.VFC",{"$f":"IFERROR(RTD(\"cqg.rtd\", ,\"ContractData\",C467, \"PerCentNetLastTrade\",, \"T\")/100,\"\")","v":1.6630420877574516E-2},58,58,"S.US.VFC",467,"S.US.MRNA"]
[null,null,"S.US.VIAC",{"$f":"IFERROR(RTD(\"cqg.rtd\", ,\"ContractData\",C468, \"PerCentNetLastTrade\",, \"T\")/100,\"\")","v":1.4112404060410992E-2},75,75,"S.US.VIAC",468,"S.US.XEL"]
[null,null,"S.US.VLO",{"$f":"IFERROR(RTD(\"cqg.rtd\", ,\"ContractData\",C469, \"PerCentNetLastTrade\",, \"T\")/100,\"\")","v":2.3174045069522132E-2},20,20,"S.US.VLO",469,"S.US.CLX"]
[null,null,"S.US.VMC",{"$f":"IFERROR(RTD(\"cqg.rtd\", ,\"ContractData\",C470, \"PerCentNetLastTrade\",, \"T\")/100,\"\")","v":7.4566938166800503E-3},202,202,"S.US.VMC",470,"S.US.CHTR"]
[null,null,"S.US.VNO",{"$f":"IFERROR(RTD(\"cqg.rtd\", ,\"ContractData\",C471, \"PerCentNetLastTrade\",, \"T\")/100,\"\")","v":1.6280107047279214E-2},63,63,"S.US.VNO",471,"S.US.HOLX"]
[null,null,"S.US.VRSK",{"$f":"IFERROR(RTD(\"cqg.rtd\", ,\"ContractData\",C472, \"PerCentNetLastTrade\",, \"T\")/100,\"\")","v":2.0807768233473832E-3},336,336,"S.US.VRSK",472,"S.US.AMGN"]
[null,null,"S.US.VRSN",{"$f":"IFERROR(RTD(\"cqg.rtd\", ,\"ContractData\",C473, \"PerCentNetLastTrade\",, \"T\")/100,\"\")","v":-1.2204158131020354E-3},424,424,"S.US.VRSN",473,"S.US.ES"]
[null,null,"S.US.VRTX",{"$f":"IFERROR(RTD(\"cqg.rtd\", ,\"ContractData\",C474, \"PerCentNetLastTrade\",, \"T\")/100,\"\")","v":-4.7316204528109898E-3},479,479,"S.US.VRTX",474,"S.US.GILD"]
[null,null,"S.US.VTR",{"$f":"IFERROR(RTD(\"cqg.rtd\", ,\"ContractData\",C475, \"PerCentNetLastTrade\",, \"T\")/100,\"\")","v":3.6617842876165113E-3},282,282,"S.US.VTR",475,"S.US.NOW"]
[null,null,"S.US.VTRS",{"$f":"IFERROR(RTD(\"cqg.rtd\", ,\"ContractData\",C476, \"PerCentNetLastTrade\",, \"T\")/100,\"\")","v":6.4794816414686825E-3},219,219,"S.US.VTRS",476,"S.US.ADBE"]
[null,null,"S.US.VZ",{"$f":"IFERROR(RTD(\"cqg.rtd\", ,\"ContractData\",C477, \"PerCentNetLastTrade\",, \"T\")/100,\"\")","v":1.9071608492263404E-2},38,38,"S.US.VZ",477,"S.US.AMT"]
[null,null,"S.US.WAB",{"$f":"IFERROR(RTD(\"cqg.rtd\", ,\"ContractData\",C478, \"PerCentNetLastTrade\",, \"T\")/100,\"\")","v":5.749938830437974E-3},236,236,"S.US.WAB",478,"S.US.DXCM"]
[null,null,"S.US.WAT",{"$f":"IFERROR(RTD(\"cqg.rtd\", ,\"ContractData\",C479, \"PerCentNetLastTrade\",, \"T\")/100,\"\")","v":4.837149306675266E-4},384,384,"S.US.WAT",479,"S.US.VRTX"]
[null,null,"S.US.WBA",{"$f":"IFERROR(RTD(\"cqg.rtd\", ,\"ContractData\",C480, \"PerCentNetLastTrade\",, \"T\")/100,\"\")","v":5.2105948762483714E-3},248,248,"S.US.WBA",480,"S.US.MKC"]
[null,null,"S.US.WDC",{"$f":"IFERROR(RTD(\"cqg.rtd\", ,\"ContractData\",C481, \"PerCentNetLastTrade\",, \"T\")/100,\"\")","v":-3.6509900990099008E-2},503,503,"S.US.WDC",481,"S.US.NLOK"]
[null,null,"S.US.WEC",{"$f":"IFERROR(RTD(\"cqg.rtd\", ,\"ContractData\",C482, \"PerCentNetLastTrade\",, \"T\")/100,\"\")","v":-1.598806224685568E-3},433,433,"S.US.WEC",482,"S.US.CHD"]
[null,null,"S.US.WELL",{"$f":"IFERROR(RTD(\"cqg.rtd\", ,\"ContractData\",C483, \"PerCentNetLastTrade\",, \"T\")/100,\"\")","v":1.7041581458759373E-3},344,344,"S.US.WELL",483,"S.US.INTU"]
[null,null,"S.US.WFC",{"$f":"IFERROR(RTD(\"cqg.rtd\", ,\"ContractData\",C484, \"PerCentNetLastTrade\",, \"T\")/100,\"\")","v":1.2265834076717217E-2},117,117,"S.US.WFC",484,"S.US.ANSS"]
[null,null,"S.US.WHR",{"$f":"IFERROR(RTD(\"cqg.rtd\", ,\"ContractData\",C485, \"PerCentNetLastTrade\",, \"T\")/100,\"\")","v":1.3322075241579885E-2},94,94,"S.US.WHR",485,"S.US.SBAC"]
[null,null,"S.US.WLTW",{"$f":"IFERROR(RTD(\"cqg.rtd\", ,\"ContractData\",C486, \"PerCentNetLastTrade\",, \"T\")/100,\"\")","v":8.9212562585343647E-3},176,176,"S.US.WLTW",486,"S.US.PBCT"]
[null,null,"S.US.WM",{"$f":"IFERROR(RTD(\"cqg.rtd\", ,\"ContractData\",C487, \"PerCentNetLastTrade\",, \"T\")/100,\"\")","v":2.755390232141627E-3},314,314,"S.US.WM",487,"S.US.TYL"]
[null,null,"S.US.WMB",{"$f":"IFERROR(RTD(\"cqg.rtd\", ,\"ContractData\",C488, \"PerCentNetLastTrade\",, \"T\")/100,\"\")","v":9.5884938074310821E-3},161,161,"S.US.WMB",488,"S.US.DLR"]
[null,null,"S.US.WMT",{"$f":"IFERROR(RTD(\"cqg.rtd\", ,\"ContractData\",C489, \"PerCentNetLastTrade\",, \"T\")/100,\"\")","v":-2.1146119687037428E-4},403,403,"S.US.WMT",489,"S.US.SNPS"]
[null,null,"S.US.WRB",{"$f":"IFERROR(RTD(\"cqg.rtd\", ,\"ContractData\",C490, \"PerCentNetLastTrade\",, \"T\")/100,\"\")","v":-2.109426499670402E-3},440,440,"S.US.WRB",490,"S.US.NEM"]
[null,null,"S.US.WRK",{"$f":"IFERROR(RTD(\"cqg.rtd\", ,\"ContractData\",C491, \"PerCentNetLastTrade\",, \"T\")/100,\"\")","v":1.4845360824742269E-2},72,72,"S.US.WRK",491,"S.US.PSA"]
[null,null,"S.US.WST",{"$f":"IFERROR(RTD(\"cqg.rtd\", ,\"ContractData\",C492, \"PerCentNetLastTrade\",, \"T\")/100,\"\")","v":-1.7977407496847244E-3},435,435,"S.US.WST",492,"S.US.REGN"]
[null,null,"S.US.WU",{"$f":"IFERROR(RTD(\"cqg.rtd\", ,\"ContractData\",C493, \"PerCentNetLastTrade\",, \"T\")/100,\"\")","v":5.6521739130434775E-3},240,240,"S.US.WU",493,"S.US.EQIX"]
[null,null,"S.US.WY",{"$f":"IFERROR(RTD(\"cqg.rtd\", ,\"ContractData\",C494, \"PerCentNetLastTrade\",, \"T\")/100,\"\")","v":8.9153046062407145E-3},177,177,"S.US.WY",494,"S.US.ETSY"]
[null,null,"S.US.WYNN",{"$f":"IFERROR(RTD(\"cqg.rtd\", ,\"ContractData\",C495, \"PerCentNetLastTrade\",, \"T\")/100,\"\")","v":2.073754339870508E-2},29,29,"S.US.WYNN",495,"S.US.ILMN"]
[null,null,"S.US.XEL",{"$f":"IFERROR(RTD(\"cqg.rtd\", ,\"ContractData\",C496, \"PerCentNetLastTrade\",, \"T\")/100,\"\")","v":-3.3744131455399062E-3},468,468,"S.US.XEL",496,"S.US.TMO"]
[null,null,"S.US.XLNX",{"$f":"IFERROR(RTD(\"cqg.rtd\", ,\"ContractData\",C497, \"PerCentNetLastTrade\",, \"T\")/100,\"\")","v":1.2967200610221204E-3},354,354,"S.US.XLNX",497,"S.US.EXR"]
[null,null,"S.US.XOM",{"$f":"IFERROR(RTD(\"cqg.rtd\", ,\"ContractData\",C498, \"PerCentNetLastTrade\",, \"T\")/100,\"\")","v":1.7869907076483203E-2},43,43,"S.US.XOM",498,"S.US.NVR"]
[null,null,"S.US.XRAY",{"$f":"IFERROR(RTD(\"cqg.rtd\", ,\"ContractData\",C499, \"PerCentNetLastTrade\",, \"T\")/100,\"\")","v":1.1185682326621925E-2},133,133,"S.US.XRAY",499,"S.US.NFLX"]
[null,null,"S.US.XYL",{"$f":"IFERROR(RTD(\"cqg.rtd\", ,\"ContractData\",C500, \"PerCentNetLastTrade\",, \"T\")/100,\"\")","v":5.6776104665514689E-3},238,238,"S.US.XYL",500,"S.US.DHR"]
[null,null,"S.US.YUM",{"$f":"IFERROR(RTD(\"cqg.rtd\", ,\"ContractData\",C501, \"PerCentNetLastTrade\",, \"T\")/100,\"\")","v":7.9201101928374658E-3},192,192,"S.US.YUM",501,"S.US.MTB"]
[null,null,"S.US.ZBH",{"$f":"IFERROR(RTD(\"cqg.rtd\", ,\"ContractData\",C502, \"PerCentNetLastTrade\",, \"T\")/100,\"\")","v":9.9595193728715548E-3},154,154,"S.US.ZBH",502,"S.US.ALLE"]
[null,null,"S.US.ZBRA",{"$f":"IFERROR(RTD(\"cqg.rtd\", ,\"ContractData\",C503, \"PerCentNetLastTrade\",, \"T\")/100,\"\")","v":2.116727923489907E-3},334,334,"S.US.ZBRA",503,"S.US.WDC"]
[null,null,"S.US.ZION",{"$f":"IFERROR(RTD(\"cqg.rtd\", ,\"ContractData\",C504, \"PerCentNetLastTrade\",, \"T\")/100,\"\")","v":2.5099601593625499E-2},16,16,"S.US.ZION",504,"S.US.STX"]
[null,null,"S.US.ZTS",{"$f":"IFERROR(RTD(\"cqg.rtd\", ,\"ContractData\",C505, \"PerCentNetLastTrade\",, \"T\")/100,\"\")","v":-2.2987356953675479E-3},444,444,"S.US.ZTS",505,""]
[]
[]
[]
[]
[]
[]
[]
[]
[]
[]
[]
[]
[]
[]
[]
[]
[]
[]
[]
[]
[]
[]
[]
[]
[]
[]
[]
[]
[]
[]
[]
[]
[]
[]
[]
[]
[]
[]
[]
[]
[]
[]
[]
[]
[]
[]
[]
[]
[]
[]
[]
[]
[]
[]
[]
[]
[]
[]
[]
[]
[]
[]
[]
[]
[]
[]
[]
[]
[]
[]
[]
[]
[]
[]
[]
[]
[]
[]
[]
[]
[]
[]
[]
[]
[]
[]
[]
[]
[]
[]
[]
[]
[]
[]
[]
[]
[]
[]
[]
[]
[]
[]
[]
[]
[]
[]
[]
[]
[]
[]
[]
[]
[]
[]
[]
[]
[]
[]
[]
[]
[]
[]
[]
[]
[]
[]
[]
[]
[]
[]
[]
[]
[]
[]
[]
[]
[]
[]
[]
[]
[]
[]
[]
[]
[]
[]
[]
[]
[]
[]
[]
[]
[]
[]
[]
[]
[]
[]
[]
[]
[]
[]
[]
[]
[]
[]
[]
[]
[]
[]
[]
[]
[]
[]
[]
[]
[]
[]
[]
[]
[]
[]
[]
[]
[]
[]
[]
[]
[]
[]
[]
[]
[]
[]
[]
[]
[]
[]
[]
[]
[]
[]
[]
[]
[]
[]
[]
[]
[]
[]
[]
[]
[]
[]
[]
[]
[]
[]
[]
[]
[]
[]
[]
[]
[]
[]
[]
[]
[]
[]
[]
[]
[]
[]
[]
[]
[]
[]
[]
[]
[]
[]
[]
[]
[]
[]
[]
[]
[]
[]
[]
[]
[]
[]
[]
[]
[]
[]
[]
[]
[]
[]
[]
[]
[]
[]
[]
[]
[]
[]
[]
[]
[]
[]
[]
[]
[]
[]
[]
[]
[]
[]
[]
[]
[]
[]
[]
[]
[]
[]
[]
[]
[]
[]
[]
[]
[]
[]
[]
[]
[]
[]
[]
[]
[]
[]
[]
[]
[]
[]
[]
[]
[]
[]
[]
[]
[]
[]
[]
[]
[]
[]
[]
[]
[]
[]
[]
[]
[]
[]
[]
[]
[]
[]
[]
[]
[]
[]
[]
[]
[]
[]
[]
[]
[]
[]
[]
[]
[]
[]
[]
[]
[]
[]
[]
[]
[]
[]
[]
[]
[]
[]
[]
[]
[]
[]
[]
[]
[]
[]
[]
[]
[]
[]
[]
[]
[]
[]
[]
[]
[]
[]
[]
[]
[]
[]
[]
[]
[]
[]
[]
[]
[]
[]
[]
[]
[]
[]
[]
[]
[]
[]
[]
[]
[]
[]
[]
[]
[]
[]
[]
[]
[]
[]
[]
[]
[]
[]
[]
[]
[]
[]
[]
[]
[]
[]
[]
[]
[]
[]
[]
[]
[]
[]
[]
[]
[]
[]
[]
[]
[]
[]
[]
[]
[]
[]
[]
[]
[]
[]
[]
[]
[]
[]
[]
[]
[]
[]
[]
[]
[]
[]
[]
[]
[]
[]
[]
[]
[]
[]
[]
[]
[]
[]
[]
[]
[]
[]
[]
[]
[]
[]
[]
[]
[]
[]
[]
[]
[]
[]
[]
[]
[]
[]
[]
[]
[]
[]
[]
[]
[]
[]
[]
[]
[]
[]
[]
[]
[]
[]
[]
[]
[]
[]
[]
[]
[]
[]
[]
[]
[]
[]
[]
[]
[]
[]
[]
[]
[]
[]
[]
[]
[]
[]
[]
[]
[]
[]
[]
[]
[]
[]
[]
[]
[]
[]
[]
[]
[]
[]
[]
[]
[]
[]
[]
[]
[]
[]
[]
[]
[]
[]
[]
[]
[]
[]
[]
[]
[]
[]
[]
[]
[]
[]
[]
[]
[]
[]
[]
[]
[]
[]
[]
[]
[]
[]
[]
[]
[]
[]
[]
[]
[]
[]
[]
[]
[]
[]
[]
[]
[]
[]
[]
[]
[]
[]
[]
[]
[]
[]
[]
[]
[]
[]
[]
[]
[]
[]
[]
[]
[]
[]
[]
[]
[]
[]
[]
[]
[]
[]
[]
[]
[]
[]
[]
[]
[]
[]
[]
[]
[]
[]
[]
[]
[]
[]
[]
[]
[]
[]
[]
[]
[]
[]
[]
[]
[]
[]
[]
[]
[]
[]
[]
[]
[]
[]
[]
[]
[]
[]
[]
[]
[]
[]
[]
[]
[]
[]
[]
[]
[]
[]
[]
[]
[]
[]
[]
[]
[]
[]
[]
[]
[]
[]
[]
[]
[]
[]
[]
[]
[]
[]
[]
[]
[]
[]
[]
[]
[]
[]
[]
[]
[]
[]
[]
[]
[]
[]
[]
[]
[]
[]
[]
[]
[]
[]
[]
[]
[]
[]
[]
[]
[]
[]
[]
[]
[]
[]
[]
[]
[]
[]
[]
[]
[]
[]
[]
[]
[]
[]
[]
[]
[]
[]
[]
[]
[]
[]
[]
[]
[]
[]
[]
[]
[]
[]
[]
[]
[]
[]
[]
[]
[]
[]
[]
[]
[]
[]
[]
[]
[]
[]
[]
[]
[]
[]
[]
[]
[]
[]
[]
[]
[]
[]
[]
[]
[]
[]
[]
[]
[]
[]
[]
[]
[]
[]
[]
[]
[]
[]
[]
[]
[]
[]
[]
[]
[]
[]
[]
[]
[]
[]
[]
[]
[]
[]
[]
[]
[]
[]
[]
[]
[]
[]
[]
[]
[]
[]
[]
[]
[]
[]
[]
[]
[]
[]
[]
[]
[]
[]
[]
[]
[]
[]
[]
[]
[]
[]
[]
[]
[]
[]
[]
[]
[]
[]
[]
[]
[]
[]
[]
[]
[]
[]
[]
[]
[]
[]
[]
[]
[]
[]
[]
[]
[]
[]
[]
[]
[]
[]
[]
[]
[]
[]
[]
[]
[]
[]
[]
[]
[]
[]
[]
[]
[]
[]
[]
[]
[]
[]
[]
[]
[]
[]
[]
[]
[]
[]
[]
[]
[]
[]
[]
[]
[]
[]
[]
[]
[]
[]
[]
[]
[]
[]
[]
[]
[]
[]
[]
[]
[]
[]
[]
[]
[]
[]
[]
[]
[]
[]
[]
[]
[]
[]
[]
[]
[]
[]
[]
[]
[]
[]
[]
[]
[]
[]
[]
[]
[]
[]
[]
[]
[]
[]
[]
[]
[]
[]
[]
[]
[]
[]
[]
[]
[]
[]
[]
[]
[]
[]
[]
[]
[]
[]
[]
[]
[]
[]
[]
[]
[]
[]
[]
[]
[]
[]
[]
[]
[]
[]
[]
[]
[]
[]
[]
[]
[]
[]
[]
[]
[]
[]
[]
[]
[]
[]
[]
[]
[]
[]
[]
[]
[]
[]
[]
[]
[]
[]
[]
[]
[]
[]
[]
[]
[]
[]
[]
[]
[]
[]
[]
[]
[]
[]
[]
[]
[]
[]
[]
[]
[]
[]
[]
[]
[]
[]
[]
[]
[]
[]
[]
[]
[]
[]
[]
[]
[]
[]
[]
[]
[]
[]
[]
[]
[]
[]
[]
[]
[]
[]
[]
[]
[]
[]
[]
[]
[]
[]
[]
[]
[]
[]
[]
[]
[]
[]
[]
[]
[]
[]
[]
[]
[]
[]
[]
[]
[]
[]
[]
[]
[]
[]
[]
[]
[]
[]
[]
[]
[]
[]
[]
[]
[]
[]
[]
[]
[]
[]
[]
[]
[]
[]
[]
[]
[]
[]
[]
[]
[]
[]
[]
[]
[]
[]
[]
[]
[]
[]
[]
[]
[]
[]
[]
[]
[]
[]
[]
[]
[]
[]
[]
[]
[]
[]
[]
[]
[]
[]
[]
[]
[]
[]
[]
[]
[]
[]
[]
[]
[]
[]
[]
[]
[]
[]
[]
[]
[]
[]
[]
[]
[]
[]
[]
[]
[]
[]
[]
[]
[]
[]
[]
[]
[]
[]
[]
[]
[]
[]
[]
[]
[]
[]
[]
[]
[]
[]
[]
[]
[]
[]
[]
[]
[]
[]
[]
[]
[]
[]
[]
[]
[]
[]
[]
[]
[]
[]
[]
[]
[]
[]
[]
[]
[]
[]
[]
[]
[]
[]
[]
[]
[]
[]
[]
[]
[]
[]
[]
[]
[]
[]
[]
[]
[]
[]
[]
[]
[]
[]
[]
[]
[]
[]
[]
[]
[]
[]
[]
[]
[]
[]
[]
[]
[]
[]
[]
[]
[]
[]
[]
[]
[]
[]
[]
[]
[]
[]
[]
[]
[]
[]
[]
[]
[]
[]
[]
[]
[]
[]
[]
[]
[]
[]
[]
[]
[]
[]
[]
[]
[]
[]
[]
[]
[]
[]
[]
[]
[]
[]
[]
[]
[]
[]
[]
[]
[]
[]
[]
[]
[]
[]
[]
[]
[]
[]
[]
[]
[]
[]
[]
[]
[]
[]
[]
[]
[]
[]
[]
[]
[]
[]
[]
[]
[]
[]
[]
[]
[]
[]
[]
[]
[]
[]
[]
[]
[]
[]
[]
[]
[]
[]
[]
[]
[]
[]
[]
[]
[]
[]
[]
[]
[]
[]
[]
[]
[]
[]
[]
[]
[]
[]
[]
[]
[]
[]
[]
[]
[]
[]
[]
[]
[]
[]
[]
[]
[]
[]
[]
[]
[]
[]
[]
[]
[]
[]
[]
[]
[]
[]
[]
[]
[]
[]
[]
[]
[]
[]
[]
[]
[]
[]
[]
[]
[]
[]
[]
[]
[]
[]
[]
[]
[]
[]
[]
[]
[]
[]
[]
[]
[]
[]
[]
[]
[]
[]
[]
[]
[]
[]
[]
[]
[]
[]
[]
[]
[]
[]
[]
[]
[]
[]
[]
[]
[]
[]
[]
[]
[]
[]
[]
[]
[]
[]
[]
[]
[]
[]
[]
[]
[]
[]
[]
[]
[]
[]
[]
[]
[]
[]
[]
[]
[]
[]
[]
[]
[]
[]
[]
[]
[]
[]
[]
[]
[]
[]
[]
[]
[]
[]
[]
[]
[]
[]
[]
[]
[]
[]
[]
[]
[]
[]
[]
[]
[]
[]
[]
[]
[]
[]
[]
[]
[]
[]
[]
[]
[]
[]
[]
[]
[]
[]
[]
[]
[]
[]
[]
[]
[]
[]
[]
[]
[]
[]
[]
[]
[]
[]
[]
[]
[]
[]
[]
[]
[]
[]
[]
[]
[]
[]
[]
[]
[]
[]
[]
[]
[]
[]
[]
[]
[]
[]
[]
[]
[]
[]
[]
[]
[]
[]
[]
[]
[]
[]
[]
[]
[]
[]
[]
[]
[]
[]
[]
[]
[]
[]
[]
[]
[]
[]
[]
[]
[]
[]
[]
[]
[]
[]
[]
[]
[]
[]
[]
[]
[]
[]
[]
[]
[]
[]
[]
[]
[]
[]
[]
[]
[]
[]
[]
[]
[]
[]
[]
[]
[]
[]
[]
[]
[]
[]
[]
[]
[]
[]
[]
[]
[]
[]
[]
[]
[]
[]
[]
[]
[]
[]
[]
[]
[]
[]
[]
[]
[]
[]
[]
[]
[]
[]
[]
[]
[]
[]
[]
[]
[]
[]
[]
[]
[]
[]
[]
[]
[]
[]
[]
[]
[]
[]
[]
[]
[]
[]
[]
[]
[]
[]
[]
[]
[]
[]
[]
[]
[]
[]
[]
[]
[]
[]
[]
[]
[]
[]
[]
[]
[]
[]
[]
[]
[]
[]
[]
[]
[]
[]
[]
[]
[]
[]
[]
[]
[]
[]
[]
[]
[]
[]
[]
[]
[]
[]
[]
[]
[]
[]
[]
[]
[]
[]
[]
[]
[]
[]
[]
[]
[]
[]
[]
[]
[]
[]
[]
[]
[]
[]
[]
[]
[]
[]
[]
[]
[]
[]
[]
[]
[]
[]
[]
[]
[]
[]
[]
[]
[]
[]
[]
[]
[]
[]
[]
[]
[]
[]
[]
[]
[]
[]
[]
[]
[]
[]
[]
[]
[]
[]
[]
[]
[]
[]
[]
[]
[]
[]
[]
[]
[]
[]
[]
[]
[]
[]
[]
[]
[]
[]
[]
[]
[]
[]
[]
[]
[]
[]
[]
[]
[]
[]
[]
[]
[]
[]
[]
[]
[]
[]
[]
[]
[]
[]
[]
[]
[]
[]
[]
[]
[]
[]
[]
[]
[]
[]
[]
[]
[]
[]
[]
[]
[]
[]
[]
[]
[]
[]
[]
[]
[]
[]
[]
[]
[]
[]
[]
[]
[]
[]
[]
[]
[]
[]
[]
[]
[]
[]
[]
[]
[]
[]
[]
[]
[]
[]
[]
[]
[]
[]
[]
[]
[]
[]
[]
[]
[]
[]
[]
[]
[]
[]
[]
[]
[]
[]
[]
[]
[]
[]
[]
[]
[]
[]
[]
[]
[]
[]
[]
[]
[]
[]
[]
[]
[]
[]
[]
[]
[]
[]
[]
[]
[]
[]
[]
[]
[]
[]
[]
[]
[]
[]
[]
[]
[]
[]
[]
[]
[]
[]
[]
[]
[]
[]
[]
[]
[]
[]
[]
[]
[]
[]
[]
[]
[]
[]
[]
[]
[]
[]
[]
[]
[]
[]
[]
[]
[]
[]
[]
[]
[]
[]
[]
[]
[]
[]
[]
[]
[]
[]
[]
[]
[]
[]
[]
[]
[]
[]
[]
[]
[]
[]
[]
[]
[]
[]
[]
[]
[]
[]
[]
[]
[]
[]
[]
[]
[]
[]
[]
[]
[]
[]
[]
[]
[]
[]
[]
[]
[]
[]
[]
[]
[]
[]
[]
[]
[]
[]
[]
[]
[]
[]
[]
[]
[]
[]
[]
[]
[]
[]
[]
[]
[]
[]
[]
[]
[]
[]
[]
[]
[]
[]
[]
[]
[]
[]
[]
[]
[]
[]
[]
[]
[]
[]
[]
[]
[]
[]
[]
[]
[]
[]
[]
[]
[]
[]
[]
[]
[]
[]
[]
[]
[]
[]
[]
[]
[]
[]
[]
[]
[]
[]
[]
[]
[]
[]
[]
[]
[]
[]
[]
[]
[]
[]
[]
[]
[]
[]
[]
[]
[]
[]
[]
[]
[]
[]
[]
[]
[]
[]
[]
[]
[]
[]
[]
[]
[]
[]
[]
[]
[]
[]
[]
[]
[]
[]
[]
[]
[]
[]
[]
[]
[]
[]
[]
[]
[]
[]
[]
[]
[]
[]
[]
[]
[]
[]
[]
[]
[]
[]
[]
[]
[]
[]
[]
[]
[]
[]
[]
[]
[]
[]
[]
[]
[]
[]
[]
[]
[]
[]
[]
[]
[]
[]
[]
[]
[]
[]
[]
[]
[]
[]
[]
[]
[]
[]
[]
[]
[]
[]
[]
[]
[]
[]
[]
[]
[]
[]
[]
[]
[]
[]
[]
[]
[]
[]
[]
[]
[]
[]
[]
[]
[]
[]
[]
[]
[]
[]
[]
[]
[]
[]
[]
[]
[]
[]
[]
[]
[]
[]
[]
[]
[]
[]
[]
[]
[]
[]
[]
[]
[]
[]
[]
[]
[]
[]
[]
[]
[]
[]
[]
[]
[]
[]
[]
[]
[]
[]
[]
[]
[]
[]
[]
[]
[]
[]
[]
[]
[]
[]
[]
[]
[]
[]
[]
[]
[]
[]
[]
[]
[]
[]
[]
[]
[]
[]
[]
[]
[]
[]
[]
[]
[]
[]
[]
[]
[]
[]
[]
[]
[]
[]
[]
[]
[]
[]
[]
[]
[]
[]
[]
[]
[]
[]
[]
[]
[]
[]
[]
[]
[]
[]
[]
[]
[]
[]
[]
[]
[]
[]
[]
[]
[]
[]
[]
[]
[]
[]
[]
[]
[]
[]
[]
[]
[]
[]
[]
[]
[]
[]
[]
[]
[]
[]
[]
[]
[]
[]
[]
[]
[]
[]
[]
[]
[]
[]
[]
[]
[]
[]
[]
[]
[]
[]
[]
[]
[]
[]
[]
[]
[]
[]
[]
[]
[]
[]
[]
[]
[]
[]
[]
[]
[]
[]
[]
[]
[]
[]
[]
[]
[]
[]
[]
[]
[]
[]
[]
[]
[]
[]
[]
[]
[]
[]
[]
[]
[]
[]
[]
[]
[]
[]
[]
[]
[]
[]
[]
[]
[]
[]
[]
[]
[]
[]
[]
[]
[]
[]
[]
[]
[]
[]
[null,null,null,null,1945]
[null,null,null,null,1945]
[null,null,null,null,1945]
[null,null,null,null,1945]
[null,null,null,null,1945]
[null,null,null,null,1945]
[null,null,null,null,1945]
[null,null,null,null,1945]
[null,null,null,null,1945]
[null,null,null,null,1945]
[null,null,null,null,1945]
[null,null,null,null,1945]
[null,null,null,null,1945]
[null,null,null,null,1945]
[null,null,null,null,1945]
[null,null,null,null,1945]
[null,null,null,null,1945]
[null,null,null,null,1945]
[null,null,null,null,1945]
[null,null,null,null,1945]
[null,null,null,null,1945]
[null,null,null,null,1945]
[null,null,null,null,1945]
[null,null,null,null,1945]
[null,null,null,null,1945]