{"text_format":"1","workbook":"xlsx","n_sheets":3,"sheets":["Display","ARKK","Symbols"],"not_rendered":{"charts":2,"images":4,"macros":1,"external_links":0,"defined_names":1,"comments":0,"pivot_tables":0},"unopened":[],"bounds":{"document_bytes":16777216,"sheet_cells":100000,"rows_first":2000,"rows_last":500,"rows_between":2000,"halvings":0,"cell_chars":16384,"cell_head_chars":4096},"cells_cut":0,"cells_raw":0,"read":"whole","date_system":"1900"}

{"sheet":"Display","index":0,"n_rows":52,"n_cols":28,"rows_kept":52,"cut":false,"hidden":false,"merged":[[26,18,26,30],[6,2,6,6],[7,2,7,6],[8,2,8,6],[14,2,14,6],[10,2,10,6],[11,2,11,6],[12,2,12,6],[13,2,13,6],[8,14,8,15],[7,14,7,15],[6,14,6,15],[20,2,20,6],[20,14,20,15],[21,2,21,6],[21,14,21,15],[1,1,2,4],[1,27,2,30],[1,5,2,26],[4,18,4,30],[17,2,17,6],[17,14,17,15],[15,2,15,6],[5,2,5,6],[15,14,15,15],[14,14,14,15],[13,14,13,15],[12,14,12,15],[11,14,11,15],[10,14,10,15],[9,14,9,15],[9,2,9,6],[5,14,5,15],[4,1,4,16],[18,2,18,6],[18,14,18,15],[19,2,19,6],[19,14,19,15],[16,2,16,6],[16,14,16,15],[22,2,22,6],[22,14,22,15],[23,2,23,6],[23,14,23,15],[24,2,24,6],[24,14,24,15],[25,2,25,6],[25,14,25,15],[26,2,26,6],[26,14,26,15],[27,2,27,6],[27,14,27,15],[28,2,28,6],[28,14,28,15],[29,2,29,6],[29,14,29,15],[30,2,30,6],[30,14,30,15],[31,2,31,6],[31,14,31,15],[33,2,33,6],[33,14,33,15],[34,2,34,6],[34,14,34,15],[32,2,32,6],[32,14,32,15],[44,2,44,6],[44,14,44,15],[45,2,45,6],[45,14,45,15],[40,2,40,6],[40,14,40,15],[42,2,42,6],[42,14,42,15],[41,2,41,6],[41,14,41,15],[43,2,43,6],[43,14,43,15],[48,25,48,30],[35,2,35,6],[35,14,35,15],[36,2,36,6],[36,14,36,15],[48,9,48,24],[46,2,46,6],[46,14,46,15],[47,2,47,6],[47,14,47,15],[37,2,37,6],[37,14,37,15],[38,2,38,6],[38,14,38,15],[39,2,39,6],[39,14,39,15]]}
[]
[null,null,null,null,null,"ARK Blockchain & Fintech Innovation ETF",null,null,null,null,null,null,null,null,null,null,null,null,null,null,null,null,null,null,null,null,null,{"$f":"RTD(\"cqg.rtd\", ,\"SystemInfo\", \"Linetime\")","v":46019.485902777778}]
[]
[]
[null,"Exchange Traded Funds Performance",null,null,null,null,null,null,null,null,null,null,null,null,null,null,null,null,"Top 15 Positive Performing Companies "]
[null,"Symbol","Description",null,null,null,null,"Last","NC","%NC","NC/ATR","Open","High","Low","Volume",null,"Ratio"]
[null,"ARKF",{"$f":"RTD(\"cqg.rtd\", ,\"ContractData\",B7, \"LongDescription\",, \"T\")","v":"ARK Blockchain & Fintech Innovation ETF"},null,null,null,null,{"$f":"RTD(\"cqg.rtd\", ,\"ContractData\",B7, \"LastTradeToday\",, \"T\")","v":48.94},{"$f":"RTD(\"cqg.rtd\", ,\"ContractData\",B7, \"NetLastTradeToday\",, \"T\")","v":-0.28000000000000003},{"$f":"IFERROR(RTD(\"cqg.rtd\", ,\"ContractData\",B7, \"PerCentNetLastTrade\",, \"T\")/100,\"\")","v":-5.6887444128403087E-3},{"$f":"IFERROR(I7/RTD(\"cqg.rtd\",,\"StudyData\",B7, \"ATR\", \"MaType=Sim,Period=10\", \"ATR\",\"D\",\"-1\",\"ALL\",,,\"FALSE\",\"T\")/100,\"\")","v":-2.2875816993464053E-3},{"$f":"RTD(\"cqg.rtd\", ,\"ContractData\",B7, \"OPen\",, \"T\")","v":49.120000000000005},{"$f":"RTD(\"cqg.rtd\", ,\"ContractData\", B7, \"HIgh\",, \"T\")","v":49.18},{"$f":"RTD(\"cqg.rtd\", ,\"ContractData\",B7, \"LOw\",, \"T\")","v":48.7},{"$f":"RTD(\"cqg.rtd\", ,\"ContractData\",B7, \"T_CVol\",, \"T\")","v":152527},null,{"$f":" IFERROR(O7/RTD(\"cqg.rtd\",,\"StudyData\",B7, \"MA\", \"InputChoice=Vol,MAType=Sim,Period=21\", \"MA\",\"D\",\"-1\",\"all\",,,,\"T\"),\"\")","v":0.84194346873978942}]
[null,"SPY",{"$f":"RTD(\"cqg.rtd\", ,\"ContractData\",B8, \"LongDescription\",, \"T\")","v":"SPDR S&P 500"},null,null,null,null,{"$f":"RTD(\"cqg.rtd\", ,\"ContractData\",B8, \"LastTradeToday\",, \"T\")","v":690.06000000000006},{"$f":"RTD(\"cqg.rtd\", ,\"ContractData\",B8, \"NetLastTradeToday\",, \"T\")","v":0.26},{"$f":"IFERROR(RTD(\"cqg.rtd\", ,\"ContractData\",B8, \"PerCentNetLastTrade\",, \"T\")/100,\"\")","v":3.7692084662220934E-4},{"$f":"IFERROR(I8/RTD(\"cqg.rtd\",,\"StudyData\",B8, \"ATR\", \"MaType=Sim,Period=10\", \"ATR\",\"D\",\"-1\",\"ALL\",,,\"FALSE\",\"T\")/100,\"\")","v":3.9956969417550338E-4},{"$f":"RTD(\"cqg.rtd\", ,\"ContractData\",B8, \"OPen\",, \"T\")","v":690.64},{"$f":"RTD(\"cqg.rtd\", ,\"ContractData\", B8, \"HIgh\",, \"T\")","v":691.66},{"$f":"RTD(\"cqg.rtd\", ,\"ContractData\",B8, \"LOw\",, \"T\")","v":689.27},{"$f":"RTD(\"cqg.rtd\", ,\"ContractData\",B8, \"T_CVol\",, \"T\")","v":41613347},null,{"$f":" IFERROR(O8/RTD(\"cqg.rtd\",,\"StudyData\",B8, \"MA\", \"InputChoice=Vol,MAType=Sim,Period=21\", \"MA\",\"D\",\"-1\",\"all\",,,,\"T\"),\"\")","v":0.53517757948161115}]
[null,"XLF",{"$f":"RTD(\"cqg.rtd\", ,\"ContractData\",B9, \"LongDescription\",, \"T\")","v":"Financial Select Sector SPDR"},null,null,null,null,{"$f":"RTD(\"cqg.rtd\", ,\"ContractData\",B9, \"LastTradeToday\",, \"T\")","v":55.61},{"$f":"RTD(\"cqg.rtd\", ,\"ContractData\",B9, \"NetLastTradeToday\",, \"T\")","v":-0.11},{"$f":"IFERROR(RTD(\"cqg.rtd\", ,\"ContractData\",B9, \"PerCentNetLastTrade\",, \"T\")/100,\"\")","v":-1.9738022609007717E-3},{"$f":"IFERROR(I9/RTD(\"cqg.rtd\",,\"StudyData\",B9, \"ATR\", \"MaType=Sim,Period=10\", \"ATR\",\"D\",\"-1\",\"ALL\",,,\"FALSE\",\"T\")/100,\"\")","v":-1.8965517241379313E-3},{"$f":"RTD(\"cqg.rtd\", ,\"ContractData\",B9, \"OPen\",, \"T\")","v":55.71},{"$f":"RTD(\"cqg.rtd\", ,\"ContractData\", B9, \"HIgh\",, \"T\")","v":55.79},{"$f":"RTD(\"cqg.rtd\", ,\"ContractData\",B9, \"LOw\",, \"T\")","v":55.44},{"$f":"RTD(\"cqg.rtd\", ,\"ContractData\",B9, \"T_CVol\",, \"T\")","v":20410062},null,{"$f":" IFERROR(O9/RTD(\"cqg.rtd\",,\"StudyData\",B9, \"MA\", \"InputChoice=Vol,MAType=Sim,Period=21\", \"MA\",\"D\",\"-1\",\"all\",,,,\"T\"),\"\")","v":0.55759497369408229}]
[null,"S.XLY",{"$f":"RTD(\"cqg.rtd\", ,\"ContractData\",B10, \"LongDescription\",, \"T\")","v":"Consumer Discretionary Select SectorSPDR"},null,null,null,null,{"$f":"RTD(\"cqg.rtd\", ,\"ContractData\",B10, \"LastTradeToday\",, \"T\")","v":122.05},{"$f":"RTD(\"cqg.rtd\", ,\"ContractData\",B10, \"NetLastTradeToday\",, \"T\")","v":-0.54},{"$f":"IFERROR(RTD(\"cqg.rtd\", ,\"ContractData\",B10, \"PerCentNetLastTrade\",, \"T\")/100,\"\")","v":-4.4049269924137371E-3},{"$f":"IFERROR(I10/RTD(\"cqg.rtd\",,\"StudyData\",B10, \"ATR\", \"MaType=Sim,Period=10\", \"ATR\",\"D\",\"-1\",\"ALL\",,,\"FALSE\",\"T\")/100,\"\")","v":-3.9215686274509812E-3},{"$f":"RTD(\"cqg.rtd\", ,\"ContractData\",B10, \"OPen\",, \"T\")","v":122.43},{"$f":"RTD(\"cqg.rtd\", ,\"ContractData\", B10, \"HIgh\",, \"T\")","v":122.78},{"$f":"RTD(\"cqg.rtd\", ,\"ContractData\",B10, \"LOw\",, \"T\")","v":121.88},{"$f":"RTD(\"cqg.rtd\", ,\"ContractData\",B10, \"T_CVol\",, \"T\")","v":4197048},null,{"$f":" IFERROR(O10/RTD(\"cqg.rtd\",,\"StudyData\",B10, \"MA\", \"InputChoice=Vol,MAType=Sim,Period=21\", \"MA\",\"D\",\"-1\",\"all\",,,,\"T\"),\"\")","v":0.48237730365133502}]
[null,"S.FXI",{"$f":"RTD(\"cqg.rtd\", ,\"ContractData\",B11, \"LongDescription\",, \"T\")","v":"iShares China Large-Cap ETF"},null,null,null,null,{"$f":"RTD(\"cqg.rtd\", ,\"ContractData\",B11, \"LastTradeToday\",, \"T\")","v":38.93},{"$f":"RTD(\"cqg.rtd\", ,\"ContractData\",B11, \"NetLastTradeToday\",, \"T\")","v":0.38},{"$f":"IFERROR(RTD(\"cqg.rtd\", ,\"ContractData\",B11, \"PerCentNetLastTrade\",, \"T\")/100,\"\")","v":9.8573281452658881E-3},{"$f":"IFERROR(I11/RTD(\"cqg.rtd\",,\"StudyData\",B11, \"ATR\", \"MaType=Sim,Period=10\", \"ATR\",\"D\",\"-1\",\"ALL\",,,\"FALSE\",\"T\")/100,\"\")","v":7.7235772357723579E-3},{"$f":"RTD(\"cqg.rtd\", ,\"ContractData\",B11, \"OPen\",, \"T\")","v":38.69},{"$f":"RTD(\"cqg.rtd\", ,\"ContractData\", B11, \"HIgh\",, \"T\")","v":38.950000000000003},{"$f":"RTD(\"cqg.rtd\", ,\"ContractData\",B11, \"LOw\",, \"T\")","v":38.619999999999997},{"$f":"RTD(\"cqg.rtd\", ,\"ContractData\",B11, \"T_CVol\",, \"T\")","v":19516053},null,{"$f":" IFERROR(O11/RTD(\"cqg.rtd\",,\"StudyData\",B11, \"MA\", \"InputChoice=Vol,MAType=Sim,Period=21\", \"MA\",\"D\",\"-1\",\"all\",,,,\"T\"),\"\")","v":0.74879011873345502}]
[null,"IWF",{"$f":"RTD(\"cqg.rtd\", ,\"ContractData\",B12, \"LongDescription\",, \"T\")","v":"iShares Russell 1000 Growth ETF"},null,null,null,null,{"$f":"RTD(\"cqg.rtd\", ,\"ContractData\",B12, \"LastTradeToday\",, \"T\")","v":480.33},{"$f":"RTD(\"cqg.rtd\", ,\"ContractData\",B12, \"NetLastTradeToday\",, \"T\")","v":-0.14000000000000001},{"$f":"IFERROR(RTD(\"cqg.rtd\", ,\"ContractData\",B12, \"PerCentNetLastTrade\",, \"T\")/100,\"\")","v":-2.9138135575582243E-4},{"$f":"IFERROR(I12/RTD(\"cqg.rtd\",,\"StudyData\",B12, \"ATR\", \"MaType=Sim,Period=10\", \"ATR\",\"D\",\"-1\",\"ALL\",,,\"FALSE\",\"T\")/100,\"\")","v":-2.2650056625141566E-4},{"$f":"RTD(\"cqg.rtd\", ,\"ContractData\",B12, \"OPen\",, \"T\")","v":480.82},{"$f":"RTD(\"cqg.rtd\", ,\"ContractData\", B12, \"HIgh\",, \"T\")","v":481.95},{"$f":"RTD(\"cqg.rtd\", ,\"ContractData\",B12, \"LOw\",, \"T\")","v":479.91},{"$f":"RTD(\"cqg.rtd\", ,\"ContractData\",B12, \"T_CVol\",, \"T\")","v":1317877},null,{"$f":" IFERROR(O12/RTD(\"cqg.rtd\",,\"StudyData\",B12, \"MA\", \"InputChoice=Vol,MAType=Sim,Period=21\", \"MA\",\"D\",\"-1\",\"all\",,,,\"T\"),\"\")","v":0.71283911699225211}]
[null,"IWO",{"$f":"RTD(\"cqg.rtd\", ,\"ContractData\",B13, \"LongDescription\",, \"T\")","v":"iShares Russell 2000 Growth ETF"},null,null,null,null,{"$f":"RTD(\"cqg.rtd\", ,\"ContractData\",B13, \"LastTradeToday\",, \"T\")","v":331.06},{"$f":"RTD(\"cqg.rtd\", ,\"ContractData\",B13, \"NetLastTradeToday\",, \"T\")","v":-1.94},{"$f":"IFERROR(RTD(\"cqg.rtd\", ,\"ContractData\",B13, \"PerCentNetLastTrade\",, \"T\")/100,\"\")","v":-5.8258258258258259E-3},{"$f":"IFERROR(I13/RTD(\"cqg.rtd\",,\"StudyData\",B13, \"ATR\", \"MaType=Sim,Period=10\", \"ATR\",\"D\",\"-1\",\"ALL\",,,\"FALSE\",\"T\")/100,\"\")","v":-3.2959565069656809E-3},{"$f":"RTD(\"cqg.rtd\", ,\"ContractData\",B13, \"OPen\",, \"T\")","v":333.21},{"$f":"RTD(\"cqg.rtd\", ,\"ContractData\", B13, \"HIgh\",, \"T\")","v":333.23},{"$f":"RTD(\"cqg.rtd\", ,\"ContractData\",B13, \"LOw\",, \"T\")","v":329.31},{"$f":"RTD(\"cqg.rtd\", ,\"ContractData\",B13, \"T_CVol\",, \"T\")","v":412773},null,{"$f":" IFERROR(O13/RTD(\"cqg.rtd\",,\"StudyData\",B13, \"MA\", \"InputChoice=Vol,MAType=Sim,Period=21\", \"MA\",\"D\",\"-1\",\"all\",,,,\"T\"),\"\")","v":1.0461123031954571}]
[null,"EP",{"$f":"RTD(\"cqg.rtd\", ,\"ContractData\",B14, \"LongDescription\",, \"T\")","v":"E-Mini S&P 500, Mar 26"},null,null,null,null,{"$f":"RTD(\"cqg.rtd\", ,\"ContractData\",B14, \"LastTradeToday\",, \"T\")","v":6977},{"$f":"RTD(\"cqg.rtd\", ,\"ContractData\",B14, \"NetLastTradeToday\",, \"T\")","v":-5.5},{"$f":"IFERROR(RTD(\"cqg.rtd\", ,\"ContractData\",B14, \"PerCentNetLastTrade\",, \"T\")/100,\"\")","v":-7.8768349445041167E-4},{"$f":"IFERROR(I14/RTD(\"cqg.rtd\",,\"StudyData\",B14, \"ATR\", \"MaType=Sim,Period=10\", \"ATR\",\"D\",\"-1\",\"ALL\",,,\"FALSE\",\"T\")/100,\"\")","v":-7.0153061224489791E-4},{"$f":"RTD(\"cqg.rtd\", ,\"ContractData\",B14, \"OPen\",, \"T\")","v":6979.5},{"$f":"RTD(\"cqg.rtd\", ,\"ContractData\", B14, \"HIgh\",, \"T\")","v":6994},{"$f":"RTD(\"cqg.rtd\", ,\"ContractData\",B14, \"LOw\",, \"T\")","v":6969},{"$f":"RTD(\"cqg.rtd\", ,\"ContractData\",B14, \"T_CVol\",, \"T\")","v":591075},null,{"$f":" IFERROR(O14/RTD(\"cqg.rtd\",,\"StudyData\",B14, \"MA\", \"InputChoice=Vol,MAType=Sim,Period=21\", \"MA\",\"D\",\"-1\",\"all\",,,,\"T\"),\"\")","v":0.34207471213811813}]
[null,"NVDA",{"$f":"RTD(\"cqg.rtd\", ,\"ContractData\",B15, \"LongDescription\",, \"T\")","v":"NVIDIA CORPORATION"},null,null,null,null,{"$f":"RTD(\"cqg.rtd\", ,\"ContractData\",B15, \"LastTradeToday\",, \"T\")","v":190.53},{"$f":"RTD(\"cqg.rtd\", ,\"ContractData\",B15, \"NetLastTradeToday\",, \"T\")","v":1.92},{"$f":"IFERROR(RTD(\"cqg.rtd\", ,\"ContractData\",B15, \"PerCentNetLastTrade\",, \"T\")/100,\"\")","v":1.0179735963098457E-2},{"$f":"IFERROR(I15/RTD(\"cqg.rtd\",,\"StudyData\",B15, \"ATR\", \"MaType=Sim,Period=10\", \"ATR\",\"D\",\"-1\",\"ALL\",,,\"FALSE\",\"T\")/100,\"\")","v":3.5235823086804917E-3},{"$f":"RTD(\"cqg.rtd\", ,\"ContractData\",B15, \"OPen\",, \"T\")","v":189.92000000000002},{"$f":"RTD(\"cqg.rtd\", ,\"ContractData\", B15, \"HIgh\",, \"T\")","v":192.69},{"$f":"RTD(\"cqg.rtd\", ,\"ContractData\",B15, \"LOw\",, \"T\")","v":188},{"$f":"RTD(\"cqg.rtd\", ,\"ContractData\",B15, \"T_CVol\",, \"T\")","v":139740292},null,{"$f":" IFERROR(O15/RTD(\"cqg.rtd\",,\"StudyData\",B15, \"MA\", \"InputChoice=Vol,MAType=Sim,Period=21\", \"MA\",\"D\",\"-1\",\"all\",,,,\"T\"),\"\")","v":0.77675731816927507}]
[null,"USO",{"$f":"RTD(\"cqg.rtd\", ,\"ContractData\",B16, \"LongDescription\",, \"T\")","v":"United States Oil Fund"},null,null,null,null,{"$f":"RTD(\"cqg.rtd\", ,\"ContractData\",B16, \"LastTradeToday\",, \"T\")","v":68.48},{"$f":"RTD(\"cqg.rtd\", ,\"ContractData\",B16, \"NetLastTradeToday\",, \"T\")","v":-1.72},{"$f":"IFERROR(RTD(\"cqg.rtd\", ,\"ContractData\",B16, \"PerCentNetLastTrade\",, \"T\")/100,\"\")","v":-2.45014245014245E-2},{"$f":"IFERROR(I16/RTD(\"cqg.rtd\",,\"StudyData\",B16, \"ATR\", \"MaType=Sim,Period=10\", \"ATR\",\"D\",\"-1\",\"ALL\",,,\"FALSE\",\"T\")/100,\"\")","v":-1.2312097351467431E-2},{"$f":"RTD(\"cqg.rtd\", ,\"ContractData\",B16, \"OPen\",, \"T\")","v":69.8},{"$f":"RTD(\"cqg.rtd\", ,\"ContractData\", B16, \"HIgh\",, \"T\")","v":69.8},{"$f":"RTD(\"cqg.rtd\", ,\"ContractData\",B16, \"LOw\",, \"T\")","v":68.17},{"$f":"RTD(\"cqg.rtd\", ,\"ContractData\",B16, \"T_CVol\",, \"T\")","v":4224452},null,{"$f":" IFERROR(O16/RTD(\"cqg.rtd\",,\"StudyData\",B16, \"MA\", \"InputChoice=Vol,MAType=Sim,Period=21\", \"MA\",\"D\",\"-1\",\"all\",,,,\"T\"),\"\")","v":0.87298133472873651}]
[null,null,"Top 15 Description",null,null,null,null,"Last","NC","%NC","NC/ATR","Open","High","Low","Volume",null,"Ratio"]
[{"$f":"TRIM(ARKK!O1)","v":"S.US.SLMT"},"News",{"$f":"IFERROR(PROPER(RTD(\"cqg.rtd\", ,\"ContractData\",A18, \"LongDescription\",, \"T\"))&\" (\"&RIGHT(A18,LEN(A18)-5)&\")\",\"\")","v":"Brera Holdings B Os (SLMT)"},null,null,null,null,{"$f":"IF(C18=\"\",\"\",IFERROR(RTD(\"cqg.rtd\", ,\"ContractData\",A18, \"LastTradeToday\",, \"T\"),\"\"))","v":2.1},{"$f":"IF(C18=\"\",\"\",IFERROR(RTD(\"cqg.rtd\", ,\"ContractData\",A18, \"NetLastTradeToday\",, \"T\"),\"\"))","v":0.04},{"$f":"IFERROR(RTD(\"cqg.rtd\", ,\"ContractData\",A18, \"PerCentNetLastTrade\",, \"T\")/100,\"\")","v":1.9417475728155342E-2},{"$f":"IFERROR(I18/RTD(\"cqg.rtd\",,\"StudyData\",A18, \"ATR\", \"MaType=Sim,Period=10\", \"ATR\",\"D\",\"-1\",\"ALL\",,,\"FALSE\",\"T\")/100,\"\")","v":1.5564202334630351E-3},{"$f":"IF(C18=\"\",\"\",IFERROR(RTD(\"cqg.rtd\", ,\"ContractData\",A18, \"OPen\",, \"T\"),\"\"))","v":2.08},{"$f":"IF(C18=\"\",\"\",IFERROR(RTD(\"cqg.rtd\", ,\"ContractData\", A18, \"HIgh\",, \"T\"),\"\"))","v":2.13},{"$f":"IF(C18=\"\",\"\",IFERROR(RTD(\"cqg.rtd\", ,\"ContractData\",A18, \"LOw\",, \"T\"),\"\"))","v":2},{"$f":"IF(C18=\"\",\"\",IFERROR(RTD(\"cqg.rtd\", ,\"ContractData\",A18, \"T_CVol\",, \"T\"),\"\"))","v":881435},null,{"$f":" IFERROR(O18/RTD(\"cqg.rtd\",,\"StudyData\",A18, \"MA\", \"InputChoice=Vol,MAType=Sim,Period=21\", \"MA\",\"D\",\"-1\",\"all\",,,,\"T\"),\"\")","v":0.5708027546721528},{"$f":"ARKK!R1","v":"https://finance.yahoo.com/quote/SLMT"}]
[{"$f":"TRIM(ARKK!O2)","v":"S.US.BABA"},"News",{"$f":"IFERROR(PROPER(RTD(\"cqg.rtd\", ,\"ContractData\",A19, \"LongDescription\",, \"T\"))&\" (\"&RIGHT(A19,LEN(A19)-5)&\")\",\"\")","v":"Alibaba Group Holding Ltd (BABA)"},null,null,null,null,{"$f":"IF(C19=\"\",\"\",IFERROR(RTD(\"cqg.rtd\", ,\"ContractData\",A19, \"LastTradeToday\",, \"T\"),\"\"))","v":152.24},{"$f":"IF(C19=\"\",\"\",IFERROR(RTD(\"cqg.rtd\", ,\"ContractData\",A19, \"NetLastTradeToday\",, \"T\"),\"\"))","v":2.1800000000000002},{"$f":"IFERROR(RTD(\"cqg.rtd\", ,\"ContractData\",A19, \"PerCentNetLastTrade\",, \"T\")/100,\"\")","v":1.4527522324403573E-2},{"$f":"IFERROR(I19/RTD(\"cqg.rtd\",,\"StudyData\",A19, \"ATR\", \"MaType=Sim,Period=10\", \"ATR\",\"D\",\"-1\",\"ALL\",,,\"FALSE\",\"T\")/100,\"\")","v":6.0154525386313471E-3},{"$f":"IF(C19=\"\",\"\",IFERROR(RTD(\"cqg.rtd\", ,\"ContractData\",A19, \"OPen\",, \"T\"),\"\"))","v":150.29},{"$f":"IF(C19=\"\",\"\",IFERROR(RTD(\"cqg.rtd\", ,\"ContractData\", A19, \"HIgh\",, \"T\"),\"\"))","v":152.97},{"$f":"IF(C19=\"\",\"\",IFERROR(RTD(\"cqg.rtd\", ,\"ContractData\",A19, \"LOw\",, \"T\"),\"\"))","v":150.06},{"$f":"IF(C19=\"\",\"\",IFERROR(RTD(\"cqg.rtd\", ,\"ContractData\",A19, \"T_CVol\",, \"T\"),\"\"))","v":6037198},null,{"$f":" IFERROR(O19/RTD(\"cqg.rtd\",,\"StudyData\",A19, \"MA\", \"InputChoice=Vol,MAType=Sim,Period=21\", \"MA\",\"D\",\"-1\",\"all\",,,,\"T\"),\"\")","v":0.63378015892799655},{"$f":"ARKK!R2","v":"https://finance.yahoo.com/quote/BABA"}]
[{"$f":"TRIM(ARKK!O3)","v":"S.US.SE"},"News",{"$f":"IFERROR(PROPER(RTD(\"cqg.rtd\", ,\"ContractData\",A20, \"LongDescription\",, \"T\"))&\" (\"&RIGHT(A20,LEN(A20)-5)&\")\",\"\")","v":"Sea Limited (SE)"},null,null,null,null,{"$f":"IF(C20=\"\",\"\",IFERROR(RTD(\"cqg.rtd\", ,\"ContractData\",A20, \"LastTradeToday\",, \"T\"),\"\"))","v":127.85000000000001},{"$f":"IF(C20=\"\",\"\",IFERROR(RTD(\"cqg.rtd\", ,\"ContractData\",A20, \"NetLastTradeToday\",, \"T\"),\"\"))","v":1.6},{"$f":"IFERROR(RTD(\"cqg.rtd\", ,\"ContractData\",A20, \"PerCentNetLastTrade\",, \"T\")/100,\"\")","v":1.2673267326732674E-2},{"$f":"IFERROR(I20/RTD(\"cqg.rtd\",,\"StudyData\",A20, \"ATR\", \"MaType=Sim,Period=10\", \"ATR\",\"D\",\"-1\",\"ALL\",,,\"FALSE\",\"T\")/100,\"\")","v":3.8277511961722493E-3},{"$f":"IF(C20=\"\",\"\",IFERROR(RTD(\"cqg.rtd\", ,\"ContractData\",A20, \"OPen\",, \"T\"),\"\"))","v":126.25},{"$f":"IF(C20=\"\",\"\",IFERROR(RTD(\"cqg.rtd\", ,\"ContractData\", A20, \"HIgh\",, \"T\"),\"\"))","v":128.52000000000001},{"$f":"IF(C20=\"\",\"\",IFERROR(RTD(\"cqg.rtd\", ,\"ContractData\",A20, \"LOw\",, \"T\"),\"\"))","v":125.9},{"$f":"IF(C20=\"\",\"\",IFERROR(RTD(\"cqg.rtd\", ,\"ContractData\",A20, \"T_CVol\",, \"T\"),\"\"))","v":1840549},null,{"$f":" IFERROR(O20/RTD(\"cqg.rtd\",,\"StudyData\",A20, \"MA\", \"InputChoice=Vol,MAType=Sim,Period=21\", \"MA\",\"D\",\"-1\",\"all\",,,,\"T\"),\"\")","v":0.41404981821735981},{"$f":"ARKK!R3","v":"https://finance.yahoo.com/quote/SE"}]
[{"$f":"TRIM(ARKK!O4)","v":"S.US.ROKU"},"News",{"$f":"IFERROR(PROPER(RTD(\"cqg.rtd\", ,\"ContractData\",A21, \"LongDescription\",, \"T\"))&\" (\"&RIGHT(A21,LEN(A21)-5)&\")\",\"\")","v":"Roku, Inc. A Cmn (ROKU)"},null,null,null,null,{"$f":"IF(C21=\"\",\"\",IFERROR(RTD(\"cqg.rtd\", ,\"ContractData\",A21, \"LastTradeToday\",, \"T\"),\"\"))","v":112.08},{"$f":"IF(C21=\"\",\"\",IFERROR(RTD(\"cqg.rtd\", ,\"ContractData\",A21, \"NetLastTradeToday\",, \"T\"),\"\"))","v":1.4000000000000001},{"$f":"IFERROR(RTD(\"cqg.rtd\", ,\"ContractData\",A21, \"PerCentNetLastTrade\",, \"T\")/100,\"\")","v":1.2649078424286231E-2},{"$f":"IFERROR(I21/RTD(\"cqg.rtd\",,\"StudyData\",A21, \"ATR\", \"MaType=Sim,Period=10\", \"ATR\",\"D\",\"-1\",\"ALL\",,,\"FALSE\",\"T\")/100,\"\")","v":3.1035247173575708E-3},{"$f":"IF(C21=\"\",\"\",IFERROR(RTD(\"cqg.rtd\", ,\"ContractData\",A21, \"OPen\",, \"T\"),\"\"))","v":110.60000000000001},{"$f":"IF(C21=\"\",\"\",IFERROR(RTD(\"cqg.rtd\", ,\"ContractData\", A21, \"HIgh\",, \"T\"),\"\"))","v":112.73},{"$f":"IF(C21=\"\",\"\",IFERROR(RTD(\"cqg.rtd\", ,\"ContractData\",A21, \"LOw\",, \"T\"),\"\"))","v":109.82000000000001},{"$f":"IF(C21=\"\",\"\",IFERROR(RTD(\"cqg.rtd\", ,\"ContractData\",A21, \"T_CVol\",, \"T\"),\"\"))","v":1576937},null,{"$f":" IFERROR(O21/RTD(\"cqg.rtd\",,\"StudyData\",A21, \"MA\", \"InputChoice=Vol,MAType=Sim,Period=21\", \"MA\",\"D\",\"-1\",\"all\",,,,\"T\"),\"\")","v":0.5268308940174885},{"$f":"ARKK!R4","v":"https://finance.yahoo.com/quote/ROKU"}]
[{"$f":"TRIM(ARKK!O5)","v":"S.US.DKNG"},"News",{"$f":"IFERROR(PROPER(RTD(\"cqg.rtd\", ,\"ContractData\",A22, \"LongDescription\",, \"T\"))&\" (\"&RIGHT(A22,LEN(A22)-5)&\")\",\"\")","v":"Draftkings Inc. Cl A (DKNG)"},null,null,null,null,{"$f":"IF(C22=\"\",\"\",IFERROR(RTD(\"cqg.rtd\", ,\"ContractData\",A22, \"LastTradeToday\",, \"T\"),\"\"))","v":34.880000000000003},{"$f":"IF(C22=\"\",\"\",IFERROR(RTD(\"cqg.rtd\", ,\"ContractData\",A22, \"NetLastTradeToday\",, \"T\"),\"\"))","v":0.42},{"$f":"IFERROR(RTD(\"cqg.rtd\", ,\"ContractData\",A22, \"PerCentNetLastTrade\",, \"T\")/100,\"\")","v":1.2188044109112013E-2},{"$f":"IFERROR(I22/RTD(\"cqg.rtd\",,\"StudyData\",A22, \"ATR\", \"MaType=Sim,Period=10\", \"ATR\",\"D\",\"-1\",\"ALL\",,,\"FALSE\",\"T\")/100,\"\")","v":3.3762057877813507E-3},{"$f":"IF(C22=\"\",\"\",IFERROR(RTD(\"cqg.rtd\", ,\"ContractData\",A22, \"OPen\",, \"T\"),\"\"))","v":34.380000000000003},{"$f":"IF(C22=\"\",\"\",IFERROR(RTD(\"cqg.rtd\", ,\"ContractData\", A22, \"HIgh\",, \"T\"),\"\"))","v":35.06},{"$f":"IF(C22=\"\",\"\",IFERROR(RTD(\"cqg.rtd\", ,\"ContractData\",A22, \"LOw\",, \"T\"),\"\"))","v":34.31},{"$f":"IF(C22=\"\",\"\",IFERROR(RTD(\"cqg.rtd\", ,\"ContractData\",A22, \"T_CVol\",, \"T\"),\"\"))","v":5487617},null,{"$f":" IFERROR(O22/RTD(\"cqg.rtd\",,\"StudyData\",A22, \"MA\", \"InputChoice=Vol,MAType=Sim,Period=21\", \"MA\",\"D\",\"-1\",\"all\",,,,\"T\"),\"\")","v":0.4870424328355068},{"$f":"ARKK!R5","v":"https://finance.yahoo.com/quote/DKNG"}]
[{"$f":"TRIM(ARKK!O6)","v":"S.US.NVDA"},"News",{"$f":"IFERROR(PROPER(RTD(\"cqg.rtd\", ,\"ContractData\",A23, \"LongDescription\",, \"T\"))&\" (\"&RIGHT(A23,LEN(A23)-5)&\")\",\"\")","v":"Nvidia Corporation (NVDA)"},null,null,null,null,{"$f":"IF(C23=\"\",\"\",IFERROR(RTD(\"cqg.rtd\", ,\"ContractData\",A23, \"LastTradeToday\",, \"T\"),\"\"))","v":190.53},{"$f":"IF(C23=\"\",\"\",IFERROR(RTD(\"cqg.rtd\", ,\"ContractData\",A23, \"NetLastTradeToday\",, \"T\"),\"\"))","v":1.92},{"$f":"IFERROR(RTD(\"cqg.rtd\", ,\"ContractData\",A23, \"PerCentNetLastTrade\",, \"T\")/100,\"\")","v":1.0179735963098457E-2},{"$f":"IFERROR(I23/RTD(\"cqg.rtd\",,\"StudyData\",A23, \"ATR\", \"MaType=Sim,Period=10\", \"ATR\",\"D\",\"-1\",\"ALL\",,,\"FALSE\",\"T\")/100,\"\")","v":3.5235823086804917E-3},{"$f":"IF(C23=\"\",\"\",IFERROR(RTD(\"cqg.rtd\", ,\"ContractData\",A23, \"OPen\",, \"T\"),\"\"))","v":189.92000000000002},{"$f":"IF(C23=\"\",\"\",IFERROR(RTD(\"cqg.rtd\", ,\"ContractData\", A23, \"HIgh\",, \"T\"),\"\"))","v":192.69},{"$f":"IF(C23=\"\",\"\",IFERROR(RTD(\"cqg.rtd\", ,\"ContractData\",A23, \"LOw\",, \"T\"),\"\"))","v":188},{"$f":"IF(C23=\"\",\"\",IFERROR(RTD(\"cqg.rtd\", ,\"ContractData\",A23, \"T_CVol\",, \"T\"),\"\"))","v":139740292},null,{"$f":" IFERROR(O23/RTD(\"cqg.rtd\",,\"StudyData\",A23, \"MA\", \"InputChoice=Vol,MAType=Sim,Period=21\", \"MA\",\"D\",\"-1\",\"all\",,,,\"T\"),\"\")","v":0.77675731816927507},{"$f":"ARKK!R6","v":"https://finance.yahoo.com/quote/NVDA"}]
[{"$f":"TRIM(ARKK!O7)","v":"S.US.CRWD"},"News",{"$f":"IFERROR(PROPER(RTD(\"cqg.rtd\", ,\"ContractData\",A24, \"LongDescription\",, \"T\"))&\" (\"&RIGHT(A24,LEN(A24)-5)&\")\",\"\")","v":"Crowdstrike Hld Cm A (CRWD)"},null,null,null,null,{"$f":"IF(C24=\"\",\"\",IFERROR(RTD(\"cqg.rtd\", ,\"ContractData\",A24, \"LastTradeToday\",, \"T\"),\"\"))","v":481.19},{"$f":"IF(C24=\"\",\"\",IFERROR(RTD(\"cqg.rtd\", ,\"ContractData\",A24, \"NetLastTradeToday\",, \"T\"),\"\"))","v":4.08},{"$f":"IFERROR(RTD(\"cqg.rtd\", ,\"ContractData\",A24, \"PerCentNetLastTrade\",, \"T\")/100,\"\")","v":8.5514870784515109E-3},{"$f":"IFERROR(I24/RTD(\"cqg.rtd\",,\"StudyData\",A24, \"ATR\", \"MaType=Sim,Period=10\", \"ATR\",\"D\",\"-1\",\"ALL\",,,\"FALSE\",\"T\")/100,\"\")","v":2.9259896729776245E-3},{"$f":"IF(C24=\"\",\"\",IFERROR(RTD(\"cqg.rtd\", ,\"ContractData\",A24, \"OPen\",, \"T\"),\"\"))","v":477},{"$f":"IF(C24=\"\",\"\",IFERROR(RTD(\"cqg.rtd\", ,\"ContractData\", A24, \"HIgh\",, \"T\"),\"\"))","v":482.15000000000003},{"$f":"IF(C24=\"\",\"\",IFERROR(RTD(\"cqg.rtd\", ,\"ContractData\",A24, \"LOw\",, \"T\"),\"\"))","v":475.15000000000003},{"$f":"IF(C24=\"\",\"\",IFERROR(RTD(\"cqg.rtd\", ,\"ContractData\",A24, \"T_CVol\",, \"T\"),\"\"))","v":1150652},null,{"$f":" IFERROR(O24/RTD(\"cqg.rtd\",,\"StudyData\",A24, \"MA\", \"InputChoice=Vol,MAType=Sim,Period=21\", \"MA\",\"D\",\"-1\",\"all\",,,,\"T\"),\"\")","v":0.47121875427744647},{"$f":"ARKK!R7","v":"https://finance.yahoo.com/quote/CRWD"}]
[{"$f":"TRIM(ARKK!O8)","v":"S.US.DASH"},"News",{"$f":"IFERROR(PROPER(RTD(\"cqg.rtd\", ,\"ContractData\",A25, \"LongDescription\",, \"T\"))&\" (\"&RIGHT(A25,LEN(A25)-5)&\")\",\"\")","v":"Doordash, Inc. Cl A (DASH)"},null,null,null,null,{"$f":"IF(C25=\"\",\"\",IFERROR(RTD(\"cqg.rtd\", ,\"ContractData\",A25, \"LastTradeToday\",, \"T\"),\"\"))","v":233.95000000000002},{"$f":"IF(C25=\"\",\"\",IFERROR(RTD(\"cqg.rtd\", ,\"ContractData\",A25, \"NetLastTradeToday\",, \"T\"),\"\"))","v":1.8900000000000001},{"$f":"IFERROR(RTD(\"cqg.rtd\", ,\"ContractData\",A25, \"PerCentNetLastTrade\",, \"T\")/100,\"\")","v":8.1444454020511928E-3},{"$f":"IFERROR(I25/RTD(\"cqg.rtd\",,\"StudyData\",A25, \"ATR\", \"MaType=Sim,Period=10\", \"ATR\",\"D\",\"-1\",\"ALL\",,,\"FALSE\",\"T\")/100,\"\")","v":2.7034758975826067E-3},{"$f":"IF(C25=\"\",\"\",IFERROR(RTD(\"cqg.rtd\", ,\"ContractData\",A25, \"OPen\",, \"T\"),\"\"))","v":232.52},{"$f":"IF(C25=\"\",\"\",IFERROR(RTD(\"cqg.rtd\", ,\"ContractData\", A25, \"HIgh\",, \"T\"),\"\"))","v":234.69},{"$f":"IF(C25=\"\",\"\",IFERROR(RTD(\"cqg.rtd\", ,\"ContractData\",A25, \"LOw\",, \"T\"),\"\"))","v":231.76},{"$f":"IF(C25=\"\",\"\",IFERROR(RTD(\"cqg.rtd\", ,\"ContractData\",A25, \"T_CVol\",, \"T\"),\"\"))","v":1706729},null,{"$f":" IFERROR(O25/RTD(\"cqg.rtd\",,\"StudyData\",A25, \"MA\", \"InputChoice=Vol,MAType=Sim,Period=21\", \"MA\",\"D\",\"-1\",\"all\",,,,\"T\"),\"\")","v":0.34879098948516263},{"$f":"ARKK!R8","v":"https://finance.yahoo.com/quote/DASH"}]
[{"$f":"TRIM(ARKK!O9)","v":"S.US.SHOP"},"News",{"$f":"IFERROR(PROPER(RTD(\"cqg.rtd\", ,\"ContractData\",A26, \"LongDescription\",, \"T\"))&\" (\"&RIGHT(A26,LEN(A26)-5)&\")\",\"\")","v":"Shopify Inc. (SHOP)"},null,null,null,null,{"$f":"IF(C26=\"\",\"\",IFERROR(RTD(\"cqg.rtd\", ,\"ContractData\",A26, \"LastTradeToday\",, \"T\"),\"\"))","v":170.83},{"$f":"IF(C26=\"\",\"\",IFERROR(RTD(\"cqg.rtd\", ,\"ContractData\",A26, \"NetLastTradeToday\",, \"T\"),\"\"))","v":1.3800000000000001},{"$f":"IFERROR(RTD(\"cqg.rtd\", ,\"ContractData\",A26, \"PerCentNetLastTrade\",, \"T\")/100,\"\")","v":8.1439952788433176E-3},{"$f":"IFERROR(I26/RTD(\"cqg.rtd\",,\"StudyData\",A26, \"ATR\", \"MaType=Sim,Period=10\", \"ATR\",\"D\",\"-1\",\"ALL\",,,\"FALSE\",\"T\")/100,\"\")","v":2.1904761904761906E-3},{"$f":"IF(C26=\"\",\"\",IFERROR(RTD(\"cqg.rtd\", ,\"ContractData\",A26, \"OPen\",, \"T\"),\"\"))","v":169.05},{"$f":"IF(C26=\"\",\"\",IFERROR(RTD(\"cqg.rtd\", ,\"ContractData\", A26, \"HIgh\",, \"T\"),\"\"))","v":171.07},{"$f":"IF(C26=\"\",\"\",IFERROR(RTD(\"cqg.rtd\", ,\"ContractData\",A26, \"LOw\",, \"T\"),\"\"))","v":168.09},{"$f":"IF(C26=\"\",\"\",IFERROR(RTD(\"cqg.rtd\", ,\"ContractData\",A26, \"T_CVol\",, \"T\"),\"\"))","v":2574362},null,{"$f":" IFERROR(O26/RTD(\"cqg.rtd\",,\"StudyData\",A26, \"MA\", \"InputChoice=Vol,MAType=Sim,Period=21\", \"MA\",\"D\",\"-1\",\"all\",,,,\"T\"),\"\")","v":0.39247163558106557},{"$f":"ARKK!R9","v":"https://finance.yahoo.com/quote/SHOP"}]
[{"$f":"TRIM(ARKK!O10)","v":"S.US.Z"},"News",{"$f":"IFERROR(PROPER(RTD(\"cqg.rtd\", ,\"ContractData\",A27, \"LongDescription\",, \"T\"))&\" (\"&RIGHT(A27,LEN(A27)-5)&\")\",\"\")","v":"Zillow Group Cl C (Z)"},null,null,null,null,{"$f":"IF(C27=\"\",\"\",IFERROR(RTD(\"cqg.rtd\", ,\"ContractData\",A27, \"LastTradeToday\",, \"T\"),\"\"))","v":69.81},{"$f":"IF(C27=\"\",\"\",IFERROR(RTD(\"cqg.rtd\", ,\"ContractData\",A27, \"NetLastTradeToday\",, \"T\"),\"\"))","v":0.55000000000000004},{"$f":"IFERROR(RTD(\"cqg.rtd\", ,\"ContractData\",A27, \"PerCentNetLastTrade\",, \"T\")/100,\"\")","v":7.9410915391279237E-3},{"$f":"IFERROR(I27/RTD(\"cqg.rtd\",,\"StudyData\",A27, \"ATR\", \"MaType=Sim,Period=10\", \"ATR\",\"D\",\"-1\",\"ALL\",,,\"FALSE\",\"T\")/100,\"\")","v":1.876492664619584E-3},{"$f":"IF(C27=\"\",\"\",IFERROR(RTD(\"cqg.rtd\", ,\"ContractData\",A27, \"OPen\",, \"T\"),\"\"))","v":69.17},{"$f":"IF(C27=\"\",\"\",IFERROR(RTD(\"cqg.rtd\", ,\"ContractData\", A27, \"HIgh\",, \"T\"),\"\"))","v":70},{"$f":"IF(C27=\"\",\"\",IFERROR(RTD(\"cqg.rtd\", ,\"ContractData\",A27, \"LOw\",, \"T\"),\"\"))","v":69.17},{"$f":"IF(C27=\"\",\"\",IFERROR(RTD(\"cqg.rtd\", ,\"ContractData\",A27, \"T_CVol\",, \"T\"),\"\"))","v":1158996},null,{"$f":" IFERROR(O27/RTD(\"cqg.rtd\",,\"StudyData\",A27, \"MA\", \"InputChoice=Vol,MAType=Sim,Period=21\", \"MA\",\"D\",\"-1\",\"all\",,,,\"T\"),\"\")","v":0.4560657231594491},{"$f":"ARKK!R10","v":"https://finance.yahoo.com/quote/Z"},"Bottom 15 Negative Performing Companies "]
[{"$f":"TRIM(ARKK!O11)","v":"S.US.ICE"},"News",{"$f":"IFERROR(PROPER(RTD(\"cqg.rtd\", ,\"ContractData\",A28, \"LongDescription\",, \"T\"))&\" (\"&RIGHT(A28,LEN(A28)-5)&\")\",\"\")","v":"Intercontinental, Inc. (ICE)"},null,null,null,null,{"$f":"IF(C28=\"\",\"\",IFERROR(RTD(\"cqg.rtd\", ,\"ContractData\",A28, \"LastTradeToday\",, \"T\"),\"\"))","v":163.52000000000001},{"$f":"IF(C28=\"\",\"\",IFERROR(RTD(\"cqg.rtd\", ,\"ContractData\",A28, \"NetLastTradeToday\",, \"T\"),\"\"))","v":0.89},{"$f":"IFERROR(RTD(\"cqg.rtd\", ,\"ContractData\",A28, \"PerCentNetLastTrade\",, \"T\")/100,\"\")","v":5.4725450408903645E-3},{"$f":"IFERROR(I28/RTD(\"cqg.rtd\",,\"StudyData\",A28, \"ATR\", \"MaType=Sim,Period=10\", \"ATR\",\"D\",\"-1\",\"ALL\",,,\"FALSE\",\"T\")/100,\"\")","v":4.2644944896981308E-3},{"$f":"IF(C28=\"\",\"\",IFERROR(RTD(\"cqg.rtd\", ,\"ContractData\",A28, \"OPen\",, \"T\"),\"\"))","v":162.45000000000002},{"$f":"IF(C28=\"\",\"\",IFERROR(RTD(\"cqg.rtd\", ,\"ContractData\", A28, \"HIgh\",, \"T\"),\"\"))","v":163.55000000000001},{"$f":"IF(C28=\"\",\"\",IFERROR(RTD(\"cqg.rtd\", ,\"ContractData\",A28, \"LOw\",, \"T\"),\"\"))","v":162.19},{"$f":"IF(C28=\"\",\"\",IFERROR(RTD(\"cqg.rtd\", ,\"ContractData\",A28, \"T_CVol\",, \"T\"),\"\"))","v":1045099},null,{"$f":" IFERROR(O28/RTD(\"cqg.rtd\",,\"StudyData\",A28, \"MA\", \"InputChoice=Vol,MAType=Sim,Period=21\", \"MA\",\"D\",\"-1\",\"all\",,,,\"T\"),\"\")","v":0.32111909756304002},{"$f":"ARKK!R11","v":"https://finance.yahoo.com/quote/ICE"}]
[{"$f":"TRIM(ARKK!O12)","v":"S.US.RBLX"},"News",{"$f":"IFERROR(PROPER(RTD(\"cqg.rtd\", ,\"ContractData\",A29, \"LongDescription\",, \"T\"))&\" (\"&RIGHT(A29,LEN(A29)-5)&\")\",\"\")","v":"Roblox Corp (RBLX)"},null,null,null,null,{"$f":"IF(C29=\"\",\"\",IFERROR(RTD(\"cqg.rtd\", ,\"ContractData\",A29, \"LastTradeToday\",, \"T\"),\"\"))","v":82.22},{"$f":"IF(C29=\"\",\"\",IFERROR(RTD(\"cqg.rtd\", ,\"ContractData\",A29, \"NetLastTradeToday\",, \"T\"),\"\"))","v":0.34},{"$f":"IFERROR(RTD(\"cqg.rtd\", ,\"ContractData\",A29, \"PerCentNetLastTrade\",, \"T\")/100,\"\")","v":4.1524181729360038E-3},{"$f":"IFERROR(I29/RTD(\"cqg.rtd\",,\"StudyData\",A29, \"ATR\", \"MaType=Sim,Period=10\", \"ATR\",\"D\",\"-1\",\"ALL\",,,\"FALSE\",\"T\")/100,\"\")","v":1.1459386585776878E-3},{"$f":"IF(C29=\"\",\"\",IFERROR(RTD(\"cqg.rtd\", ,\"ContractData\",A29, \"OPen\",, \"T\"),\"\"))","v":81.72},{"$f":"IF(C29=\"\",\"\",IFERROR(RTD(\"cqg.rtd\", ,\"ContractData\", A29, \"HIgh\",, \"T\"),\"\"))","v":82.34},{"$f":"IF(C29=\"\",\"\",IFERROR(RTD(\"cqg.rtd\", ,\"ContractData\",A29, \"LOw\",, \"T\"),\"\"))","v":80.87},{"$f":"IF(C29=\"\",\"\",IFERROR(RTD(\"cqg.rtd\", ,\"ContractData\",A29, \"T_CVol\",, \"T\"),\"\"))","v":3863678},null,{"$f":" IFERROR(O29/RTD(\"cqg.rtd\",,\"StudyData\",A29, \"MA\", \"InputChoice=Vol,MAType=Sim,Period=21\", \"MA\",\"D\",\"-1\",\"all\",,,,\"T\"),\"\")","v":0.55055581668755083},{"$f":"ARKK!R12","v":"https://finance.yahoo.com/quote/RBLX"}]
[{"$f":"TRIM(ARKK!O13)","v":"S.US.MELI"},"News",{"$f":"IFERROR(PROPER(RTD(\"cqg.rtd\", ,\"ContractData\",A30, \"LongDescription\",, \"T\"))&\" (\"&RIGHT(A30,LEN(A30)-5)&\")\",\"\")","v":"Mercadolibre, Inc. (MELI)"},null,null,null,null,{"$f":"IF(C30=\"\",\"\",IFERROR(RTD(\"cqg.rtd\", ,\"ContractData\",A30, \"LastTradeToday\",, \"T\"),\"\"))","v":2005.71},{"$f":"IF(C30=\"\",\"\",IFERROR(RTD(\"cqg.rtd\", ,\"ContractData\",A30, \"NetLastTradeToday\",, \"T\"),\"\"))","v":7.5},{"$f":"IFERROR(RTD(\"cqg.rtd\", ,\"ContractData\",A30, \"PerCentNetLastTrade\",, \"T\")/100,\"\")","v":3.7533592565345986E-3},{"$f":"IFERROR(I30/RTD(\"cqg.rtd\",,\"StudyData\",A30, \"ATR\", \"MaType=Sim,Period=10\", \"ATR\",\"D\",\"-1\",\"ALL\",,,\"FALSE\",\"T\")/100,\"\")","v":1.3760962900444022E-3},{"$f":"IF(C30=\"\",\"\",IFERROR(RTD(\"cqg.rtd\", ,\"ContractData\",A30, \"OPen\",, \"T\"),\"\"))","v":1998.0800000000002},{"$f":"IF(C30=\"\",\"\",IFERROR(RTD(\"cqg.rtd\", ,\"ContractData\", A30, \"HIgh\",, \"T\"),\"\"))","v":2012},{"$f":"IF(C30=\"\",\"\",IFERROR(RTD(\"cqg.rtd\", ,\"ContractData\",A30, \"LOw\",, \"T\"),\"\"))","v":1994.01},{"$f":"IF(C30=\"\",\"\",IFERROR(RTD(\"cqg.rtd\", ,\"ContractData\",A30, \"T_CVol\",, \"T\"),\"\"))","v":192536},null,{"$f":" IFERROR(O30/RTD(\"cqg.rtd\",,\"StudyData\",A30, \"MA\", \"InputChoice=Vol,MAType=Sim,Period=21\", \"MA\",\"D\",\"-1\",\"all\",,,,\"T\"),\"\")","v":0.37263167382498724},{"$f":"ARKK!R13","v":"https://finance.yahoo.com/quote/MELI"}]
[{"$f":"TRIM(ARKK!O14)","v":"S.US.XYZ"},"News",{"$f":"IFERROR(PROPER(RTD(\"cqg.rtd\", ,\"ContractData\",A31, \"LongDescription\",, \"T\"))&\" (\"&RIGHT(A31,LEN(A31)-5)&\")\",\"\")","v":"Square, Inc (XYZ)"},null,null,null,null,{"$f":"IF(C31=\"\",\"\",IFERROR(RTD(\"cqg.rtd\", ,\"ContractData\",A31, \"LastTradeToday\",, \"T\"),\"\"))","v":66.27},{"$f":"IF(C31=\"\",\"\",IFERROR(RTD(\"cqg.rtd\", ,\"ContractData\",A31, \"NetLastTradeToday\",, \"T\"),\"\"))","v":0.22},{"$f":"IFERROR(RTD(\"cqg.rtd\", ,\"ContractData\",A31, \"PerCentNetLastTrade\",, \"T\")/100,\"\")","v":3.3308099924299773E-3},{"$f":"IFERROR(I31/RTD(\"cqg.rtd\",,\"StudyData\",A31, \"ATR\", \"MaType=Sim,Period=10\", \"ATR\",\"D\",\"-1\",\"ALL\",,,\"FALSE\",\"T\")/100,\"\")","v":1.1950027159152634E-3},{"$f":"IF(C31=\"\",\"\",IFERROR(RTD(\"cqg.rtd\", ,\"ContractData\",A31, \"OPen\",, \"T\"),\"\"))","v":65.87},{"$f":"IF(C31=\"\",\"\",IFERROR(RTD(\"cqg.rtd\", ,\"ContractData\", A31, \"HIgh\",, \"T\"),\"\"))","v":66.47},{"$f":"IF(C31=\"\",\"\",IFERROR(RTD(\"cqg.rtd\", ,\"ContractData\",A31, \"LOw\",, \"T\"),\"\"))","v":65.34},{"$f":"IF(C31=\"\",\"\",IFERROR(RTD(\"cqg.rtd\", ,\"ContractData\",A31, \"T_CVol\",, \"T\"),\"\"))","v":3118434},null,{"$f":" IFERROR(O31/RTD(\"cqg.rtd\",,\"StudyData\",A31, \"MA\", \"InputChoice=Vol,MAType=Sim,Period=21\", \"MA\",\"D\",\"-1\",\"all\",,,,\"T\"),\"\")","v":0.43788751852904501},{"$f":"ARKK!R14","v":"https://finance.yahoo.com/quote/XYZ"}]
[{"$f":"TRIM(ARKK!O15)","v":"S.US.FUTU"},"News",{"$f":"IFERROR(PROPER(RTD(\"cqg.rtd\", ,\"ContractData\",A32, \"LongDescription\",, \"T\"))&\" (\"&RIGHT(A32,LEN(A32)-5)&\")\",\"\")","v":"Futu Holdings Ads (FUTU)"},null,null,null,null,{"$f":"IF(C32=\"\",\"\",IFERROR(RTD(\"cqg.rtd\", ,\"ContractData\",A32, \"LastTradeToday\",, \"T\"),\"\"))","v":165.19},{"$f":"IF(C32=\"\",\"\",IFERROR(RTD(\"cqg.rtd\", ,\"ContractData\",A32, \"NetLastTradeToday\",, \"T\"),\"\"))","v":0.52},{"$f":"IFERROR(RTD(\"cqg.rtd\", ,\"ContractData\",A32, \"PerCentNetLastTrade\",, \"T\")/100,\"\")","v":3.1578308131414348E-3},{"$f":"IFERROR(I32/RTD(\"cqg.rtd\",,\"StudyData\",A32, \"ATR\", \"MaType=Sim,Period=10\", \"ATR\",\"D\",\"-1\",\"ALL\",,,\"FALSE\",\"T\")/100,\"\")","v":9.7946882652100208E-4},{"$f":"IF(C32=\"\",\"\",IFERROR(RTD(\"cqg.rtd\", ,\"ContractData\",A32, \"OPen\",, \"T\"),\"\"))","v":164.15},{"$f":"IF(C32=\"\",\"\",IFERROR(RTD(\"cqg.rtd\", ,\"ContractData\", A32, \"HIgh\",, \"T\"),\"\"))","v":166.17000000000002},{"$f":"IF(C32=\"\",\"\",IFERROR(RTD(\"cqg.rtd\", ,\"ContractData\",A32, \"LOw\",, \"T\"),\"\"))","v":163.66},{"$f":"IF(C32=\"\",\"\",IFERROR(RTD(\"cqg.rtd\", ,\"ContractData\",A32, \"T_CVol\",, \"T\"),\"\"))","v":402378},null,{"$f":" IFERROR(O32/RTD(\"cqg.rtd\",,\"StudyData\",A32, \"MA\", \"InputChoice=Vol,MAType=Sim,Period=21\", \"MA\",\"D\",\"-1\",\"all\",,,,\"T\"),\"\")","v":0.40646426265422703},{"$f":"ARKK!R15","v":"https://finance.yahoo.com/quote/FUTU"}]
[null,null,"Bottom 15 Description",null,null,null,null,"Last","NC","%NC","NC/ATR","Open","High","Low","Volume",null,"Ratio"]
[{"$f":"TRIM(ARKK!AC1)","v":"S.US.BLSH"},"News",{"$f":"IFERROR(PROPER(RTD(\"cqg.rtd\", ,\"ContractData\",A34, \"LongDescription\",, \"T\"))&\" (\"&RIGHT(A34,LEN(A34)-5)&\")\",\"\")","v":"Bullish (BLSH)"},null,null,null,null,{"$f":"IF(C34=\"\",\"\",IFERROR(RTD(\"cqg.rtd\", ,\"ContractData\",A34, \"LastTradeToday\",, \"T\"),\"\"))","v":41.14},{"$f":"IF(C34=\"\",\"\",IFERROR(RTD(\"cqg.rtd\", ,\"ContractData\",A34, \"NetLastTradeToday\",, \"T\"),\"\"))","v":-1.72},{"$f":"IFERROR(RTD(\"cqg.rtd\", ,\"ContractData\",A34, \"PerCentNetLastTrade\",, \"T\")/100,\"\")","v":-4.0130657956136261E-2},{"$f":"IFERROR(I34/RTD(\"cqg.rtd\",,\"StudyData\",A34, \"ATR\", \"MaType=Sim,Period=10\", \"ATR\",\"D\",\"-1\",\"ALL\",,,\"FALSE\",\"T\")/100,\"\")","v":-7.0261437908496734E-3},{"$f":"IF(C34=\"\",\"\",IFERROR(RTD(\"cqg.rtd\", ,\"ContractData\",A34, \"OPen\",, \"T\"),\"\"))","v":42.800000000000004},{"$f":"IF(C34=\"\",\"\",IFERROR(RTD(\"cqg.rtd\", ,\"ContractData\", A34, \"HIgh\",, \"T\"),\"\"))","v":42.800000000000004},{"$f":"IF(C34=\"\",\"\",IFERROR(RTD(\"cqg.rtd\", ,\"ContractData\",A34, \"LOw\",, \"T\"),\"\"))","v":40.78},{"$f":"IF(C34=\"\",\"\",IFERROR(RTD(\"cqg.rtd\", ,\"ContractData\",A34, \"T_CVol\",, \"T\"),\"\"))","v":994981},null,{"$f":" IFERROR(O34/RTD(\"cqg.rtd\",,\"StudyData\",A34, \"MA\", \"InputChoice=Vol,MAType=Sim,Period=21\", \"MA\",\"D\",\"-1\",\"all\",,,,\"T\"),\"\")","v":0.63276498777690893},{"$f":"ARKK!AH1","v":"https://finance.yahoo.com/quote/BLSH"}]
[{"$f":"TRIM(ARKK!AC2)","v":"S.US.BMNR"},"News",{"$f":"IFERROR(PROPER(RTD(\"cqg.rtd\", ,\"ContractData\",A35, \"LongDescription\",, \"T\"))&\" (\"&RIGHT(A35,LEN(A35)-5)&\")\",\"\")","v":"Bitmine Immersion Technologies Inc. (BMNR)"},null,null,null,null,{"$f":"IF(C35=\"\",\"\",IFERROR(RTD(\"cqg.rtd\", ,\"ContractData\",A35, \"LastTradeToday\",, \"T\"),\"\"))","v":28.310000000000002},{"$f":"IF(C35=\"\",\"\",IFERROR(RTD(\"cqg.rtd\", ,\"ContractData\",A35, \"NetLastTradeToday\",, \"T\"),\"\"))","v":-1.04},{"$f":"IFERROR(RTD(\"cqg.rtd\", ,\"ContractData\",A35, \"PerCentNetLastTrade\",, \"T\")/100,\"\")","v":-3.5434412265758095E-2},{"$f":"IFERROR(I35/RTD(\"cqg.rtd\",,\"StudyData\",A35, \"ATR\", \"MaType=Sim,Period=10\", \"ATR\",\"D\",\"-1\",\"ALL\",,,\"FALSE\",\"T\")/100,\"\")","v":-3.80534211489206E-3},{"$f":"IF(C35=\"\",\"\",IFERROR(RTD(\"cqg.rtd\", ,\"ContractData\",A35, \"OPen\",, \"T\"),\"\"))","v":29.47},{"$f":"IF(C35=\"\",\"\",IFERROR(RTD(\"cqg.rtd\", ,\"ContractData\", A35, \"HIgh\",, \"T\"),\"\"))","v":29.5},{"$f":"IF(C35=\"\",\"\",IFERROR(RTD(\"cqg.rtd\", ,\"ContractData\",A35, \"LOw\",, \"T\"),\"\"))","v":27.900000000000002},{"$f":"IF(C35=\"\",\"\",IFERROR(RTD(\"cqg.rtd\", ,\"ContractData\",A35, \"T_CVol\",, \"T\"),\"\"))","v":32663972},null,{"$f":" IFERROR(O35/RTD(\"cqg.rtd\",,\"StudyData\",A35, \"MA\", \"InputChoice=Vol,MAType=Sim,Period=21\", \"MA\",\"D\",\"-1\",\"all\",,,,\"T\"),\"\")","v":0.65173564150952434},{"$f":"ARKK!AH2","v":"https://finance.yahoo.com/quote/BMNR"}]
[{"$f":"TRIM(ARKK!AC3)","v":"S.US.DSY"},"News",{"$f":"IFERROR(PROPER(RTD(\"cqg.rtd\", ,\"ContractData\",A36, \"LongDescription\",, \"T\"))&\" (\"&RIGHT(A36,LEN(A36)-5)&\")\",\"\")","v":"Big Tr Cld Hd Ld Ord (DSY)"},null,null,null,null,{"$f":"IF(C36=\"\",\"\",IFERROR(RTD(\"cqg.rtd\", ,\"ContractData\",A36, \"LastTradeToday\",, \"T\"),\"\"))","v":0.3},{"$f":"IF(C36=\"\",\"\",IFERROR(RTD(\"cqg.rtd\", ,\"ContractData\",A36, \"NetLastTradeToday\",, \"T\"),\"\"))","v":-0.01},{"$f":"IFERROR(RTD(\"cqg.rtd\", ,\"ContractData\",A36, \"PerCentNetLastTrade\",, \"T\")/100,\"\")","v":-3.2258064516129031E-2},{"$f":"IFERROR(I36/RTD(\"cqg.rtd\",,\"StudyData\",A36, \"ATR\", \"MaType=Sim,Period=10\", \"ATR\",\"D\",\"-1\",\"ALL\",,,\"FALSE\",\"T\")/100,\"\")","v":-3.448275862068965E-3},{"$f":"IF(C36=\"\",\"\",IFERROR(RTD(\"cqg.rtd\", ,\"ContractData\",A36, \"OPen\",, \"T\"),\"\"))","v":0.31},{"$f":"IF(C36=\"\",\"\",IFERROR(RTD(\"cqg.rtd\", ,\"ContractData\", A36, \"HIgh\",, \"T\"),\"\"))","v":0.31},{"$f":"IF(C36=\"\",\"\",IFERROR(RTD(\"cqg.rtd\", ,\"ContractData\",A36, \"LOw\",, \"T\"),\"\"))","v":0.28999999999999998},{"$f":"IF(C36=\"\",\"\",IFERROR(RTD(\"cqg.rtd\", ,\"ContractData\",A36, \"T_CVol\",, \"T\"),\"\"))","v":68073},null,{"$f":" IFERROR(O36/RTD(\"cqg.rtd\",,\"StudyData\",A36, \"MA\", \"InputChoice=Vol,MAType=Sim,Period=21\", \"MA\",\"D\",\"-1\",\"all\",,,,\"T\"),\"\")","v":0.44151722757672401},{"$f":"ARKK!AH3","v":"https://finance.yahoo.com/quote/DSY"}]
[{"$f":"TRIM(ARKK!AC4)","v":"S.US.PLTR"},"News",{"$f":"IFERROR(PROPER(RTD(\"cqg.rtd\", ,\"ContractData\",A37, \"LongDescription\",, \"T\"))&\" (\"&RIGHT(A37,LEN(A37)-5)&\")\",\"\")","v":"Palantir Tech Cl A (PLTR)"},null,null,null,null,{"$f":"IF(C37=\"\",\"\",IFERROR(RTD(\"cqg.rtd\", ,\"ContractData\",A37, \"LastTradeToday\",, \"T\"),\"\"))","v":188.71},{"$f":"IF(C37=\"\",\"\",IFERROR(RTD(\"cqg.rtd\", ,\"ContractData\",A37, \"NetLastTradeToday\",, \"T\"),\"\"))","v":-5.46},{"$f":"IFERROR(RTD(\"cqg.rtd\", ,\"ContractData\",A37, \"PerCentNetLastTrade\",, \"T\")/100,\"\")","v":-2.8119688932378845E-2},{"$f":"IFERROR(I37/RTD(\"cqg.rtd\",,\"StudyData\",A37, \"ATR\", \"MaType=Sim,Period=10\", \"ATR\",\"D\",\"-1\",\"ALL\",,,\"FALSE\",\"T\")/100,\"\")","v":-7.197469021882414E-3},{"$f":"IF(C37=\"\",\"\",IFERROR(RTD(\"cqg.rtd\", ,\"ContractData\",A37, \"OPen\",, \"T\"),\"\"))","v":195.01},{"$f":"IF(C37=\"\",\"\",IFERROR(RTD(\"cqg.rtd\", ,\"ContractData\", A37, \"HIgh\",, \"T\"),\"\"))","v":196.35},{"$f":"IF(C37=\"\",\"\",IFERROR(RTD(\"cqg.rtd\", ,\"ContractData\",A37, \"LOw\",, \"T\"),\"\"))","v":188.62},{"$f":"IF(C37=\"\",\"\",IFERROR(RTD(\"cqg.rtd\", ,\"ContractData\",A37, \"T_CVol\",, \"T\"),\"\"))","v":26261988},null,{"$f":" IFERROR(O37/RTD(\"cqg.rtd\",,\"StudyData\",A37, \"MA\", \"InputChoice=Vol,MAType=Sim,Period=21\", \"MA\",\"D\",\"-1\",\"all\",,,,\"T\"),\"\")","v":0.73901939287539542},{"$f":"ARKK!AH4","v":"https://finance.yahoo.com/quote/PLTR"}]
[{"$f":"TRIM(ARKK!AC5)","v":"S.US.KLAR"},"News",{"$f":"IFERROR(PROPER(RTD(\"cqg.rtd\", ,\"ContractData\",A38, \"LongDescription\",, \"T\"))&\" (\"&RIGHT(A38,LEN(A38)-5)&\")\",\"\")","v":"Klarna Group Plc (KLAR)"},null,null,null,null,{"$f":"IF(C38=\"\",\"\",IFERROR(RTD(\"cqg.rtd\", ,\"ContractData\",A38, \"LastTradeToday\",, \"T\"),\"\"))","v":29.59},{"$f":"IF(C38=\"\",\"\",IFERROR(RTD(\"cqg.rtd\", ,\"ContractData\",A38, \"NetLastTradeToday\",, \"T\"),\"\"))","v":-0.83000000000000007},{"$f":"IFERROR(RTD(\"cqg.rtd\", ,\"ContractData\",A38, \"PerCentNetLastTrade\",, \"T\")/100,\"\")","v":-2.7284681130834976E-2},{"$f":"IFERROR(I38/RTD(\"cqg.rtd\",,\"StudyData\",A38, \"ATR\", \"MaType=Sim,Period=10\", \"ATR\",\"D\",\"-1\",\"ALL\",,,\"FALSE\",\"T\")/100,\"\")","v":-5.5892255892255891E-3},{"$f":"IF(C38=\"\",\"\",IFERROR(RTD(\"cqg.rtd\", ,\"ContractData\",A38, \"OPen\",, \"T\"),\"\"))","v":30.43},{"$f":"IF(C38=\"\",\"\",IFERROR(RTD(\"cqg.rtd\", ,\"ContractData\", A38, \"HIgh\",, \"T\"),\"\"))","v":30.43},{"$f":"IF(C38=\"\",\"\",IFERROR(RTD(\"cqg.rtd\", ,\"ContractData\",A38, \"LOw\",, \"T\"),\"\"))","v":29.47},{"$f":"IF(C38=\"\",\"\",IFERROR(RTD(\"cqg.rtd\", ,\"ContractData\",A38, \"T_CVol\",, \"T\"),\"\"))","v":1981959},null,{"$f":" IFERROR(O38/RTD(\"cqg.rtd\",,\"StudyData\",A38, \"MA\", \"InputChoice=Vol,MAType=Sim,Period=21\", \"MA\",\"D\",\"-1\",\"all\",,,,\"T\"),\"\")","v":0.91489729448841106},{"$f":"ARKK!AH5","v":"https://finance.yahoo.com/quote/KLAR"}]
[{"$f":"TRIM(ARKK!AC6)","v":"S.US.HOOD"},"News",{"$f":"IFERROR(PROPER(RTD(\"cqg.rtd\", ,\"ContractData\",A39, \"LongDescription\",, \"T\"))&\" (\"&RIGHT(A39,LEN(A39)-5)&\")\",\"\")","v":"Robinhood Mk Cl A Cs (HOOD)"},null,null,null,null,{"$f":"IF(C39=\"\",\"\",IFERROR(RTD(\"cqg.rtd\", ,\"ContractData\",A39, \"LastTradeToday\",, \"T\"),\"\"))","v":118.13},{"$f":"IF(C39=\"\",\"\",IFERROR(RTD(\"cqg.rtd\", ,\"ContractData\",A39, \"NetLastTradeToday\",, \"T\"),\"\"))","v":-2.31},{"$f":"IFERROR(RTD(\"cqg.rtd\", ,\"ContractData\",A39, \"PerCentNetLastTrade\",, \"T\")/100,\"\")","v":-1.9179674526735305E-2},{"$f":"IFERROR(I39/RTD(\"cqg.rtd\",,\"StudyData\",A39, \"ATR\", \"MaType=Sim,Period=10\", \"ATR\",\"D\",\"-1\",\"ALL\",,,\"FALSE\",\"T\")/100,\"\")","v":-3.4232365145228216E-3},{"$f":"IF(C39=\"\",\"\",IFERROR(RTD(\"cqg.rtd\", ,\"ContractData\",A39, \"OPen\",, \"T\"),\"\"))","v":120.71000000000001},{"$f":"IF(C39=\"\",\"\",IFERROR(RTD(\"cqg.rtd\", ,\"ContractData\", A39, \"HIgh\",, \"T\"),\"\"))","v":121.03},{"$f":"IF(C39=\"\",\"\",IFERROR(RTD(\"cqg.rtd\", ,\"ContractData\",A39, \"LOw\",, \"T\"),\"\"))","v":117.7},{"$f":"IF(C39=\"\",\"\",IFERROR(RTD(\"cqg.rtd\", ,\"ContractData\",A39, \"T_CVol\",, \"T\"),\"\"))","v":12959108},null,{"$f":" IFERROR(O39/RTD(\"cqg.rtd\",,\"StudyData\",A39, \"MA\", \"InputChoice=Vol,MAType=Sim,Period=21\", \"MA\",\"D\",\"-1\",\"all\",,,,\"T\"),\"\")","v":0.52037328201322453},{"$f":"ARKK!AH6","v":"https://finance.yahoo.com/quote/HOOD"}]
[{"$f":"TRIM(ARKK!AC7)","v":"S.CA.SOLQ"},"News",{"$f":"IFERROR(PROPER(RTD(\"cqg.rtd\", ,\"ContractData\",A40, \"LongDescription\",, \"T\"))&\" (\"&RIGHT(A40,LEN(A40)-5)&\")\",\"\")","v":"3Iq Solana Staking Etf (SOLQ)"},null,null,null,null,{"$f":"IF(C40=\"\",\"\",IFERROR(RTD(\"cqg.rtd\", ,\"ContractData\",A40, \"LastTradeToday\",, \"T\"),\"\"))","v":13.32},{"$f":"IF(C40=\"\",\"\",IFERROR(RTD(\"cqg.rtd\", ,\"ContractData\",A40, \"NetLastTradeToday\",, \"T\"),\"\"))","v":-0.26},{"$f":"IFERROR(RTD(\"cqg.rtd\", ,\"ContractData\",A40, \"PerCentNetLastTrade\",, \"T\")/100,\"\")","v":-1.9145802650957292E-2},{"$f":"IFERROR(I40/RTD(\"cqg.rtd\",,\"StudyData\",A40, \"ATR\", \"MaType=Sim,Period=10\", \"ATR\",\"D\",\"-1\",\"ALL\",,,\"FALSE\",\"T\")/100,\"\")","v":-2.9988465974625147E-3},{"$f":"IF(C40=\"\",\"\",IFERROR(RTD(\"cqg.rtd\", ,\"ContractData\",A40, \"OPen\",, \"T\"),\"\"))","v":13.3},{"$f":"IF(C40=\"\",\"\",IFERROR(RTD(\"cqg.rtd\", ,\"ContractData\", A40, \"HIgh\",, \"T\"),\"\"))","v":13.42},{"$f":"IF(C40=\"\",\"\",IFERROR(RTD(\"cqg.rtd\", ,\"ContractData\",A40, \"LOw\",, \"T\"),\"\"))","v":13.24},{"$f":"IF(C40=\"\",\"\",IFERROR(RTD(\"cqg.rtd\", ,\"ContractData\",A40, \"T_CVol\",, \"T\"),\"\"))","v":14744},null,{"$f":" IFERROR(O40/RTD(\"cqg.rtd\",,\"StudyData\",A40, \"MA\", \"InputChoice=Vol,MAType=Sim,Period=21\", \"MA\",\"D\",\"-1\",\"all\",,,,\"T\"),\"\")","v":0.19798513308288704},{"$f":"ARKK!AH7","v":"https://finance.yahoo.com/quote/SOLQ"}]
[{"$f":"TRIM(ARKK!AC8)","v":"S.US.CRCL"},"News",{"$f":"IFERROR(PROPER(RTD(\"cqg.rtd\", ,\"ContractData\",A41, \"LongDescription\",, \"T\"))&\" (\"&RIGHT(A41,LEN(A41)-5)&\")\",\"\")","v":"Circle Internet Group (CRCL)"},null,null,null,null,{"$f":"IF(C41=\"\",\"\",IFERROR(RTD(\"cqg.rtd\", ,\"ContractData\",A41, \"LastTradeToday\",, \"T\"),\"\"))","v":81.27},{"$f":"IF(C41=\"\",\"\",IFERROR(RTD(\"cqg.rtd\", ,\"ContractData\",A41, \"NetLastTradeToday\",, \"T\"),\"\"))","v":-1.37},{"$f":"IFERROR(RTD(\"cqg.rtd\", ,\"ContractData\",A41, \"PerCentNetLastTrade\",, \"T\")/100,\"\")","v":-1.6577928363988383E-2},{"$f":"IFERROR(I41/RTD(\"cqg.rtd\",,\"StudyData\",A41, \"ATR\", \"MaType=Sim,Period=10\", \"ATR\",\"D\",\"-1\",\"ALL\",,,\"FALSE\",\"T\")/100,\"\")","v":-2.1352867830423941E-3},{"$f":"IF(C41=\"\",\"\",IFERROR(RTD(\"cqg.rtd\", ,\"ContractData\",A41, \"OPen\",, \"T\"),\"\"))","v":82.39},{"$f":"IF(C41=\"\",\"\",IFERROR(RTD(\"cqg.rtd\", ,\"ContractData\", A41, \"HIgh\",, \"T\"),\"\"))","v":82.5},{"$f":"IF(C41=\"\",\"\",IFERROR(RTD(\"cqg.rtd\", ,\"ContractData\",A41, \"LOw\",, \"T\"),\"\"))","v":79.710000000000008},{"$f":"IF(C41=\"\",\"\",IFERROR(RTD(\"cqg.rtd\", ,\"ContractData\",A41, \"T_CVol\",, \"T\"),\"\"))","v":6140584},null,{"$f":" IFERROR(O41/RTD(\"cqg.rtd\",,\"StudyData\",A41, \"MA\", \"InputChoice=Vol,MAType=Sim,Period=21\", \"MA\",\"D\",\"-1\",\"all\",,,,\"T\"),\"\")","v":0.45610489754505779},{"$f":"ARKK!AH8","v":"https://finance.yahoo.com/quote/CRCL"}]
[{"$f":"TRIM(ARKK!AC9)","v":"S.US.SOFI"},"News",{"$f":"IFERROR(PROPER(RTD(\"cqg.rtd\", ,\"ContractData\",A42, \"LongDescription\",, \"T\"))&\" (\"&RIGHT(A42,LEN(A42)-5)&\")\",\"\")","v":"Sofi Tech Cmn (SOFI)"},null,null,null,null,{"$f":"IF(C42=\"\",\"\",IFERROR(RTD(\"cqg.rtd\", ,\"ContractData\",A42, \"LastTradeToday\",, \"T\"),\"\"))","v":27.07},{"$f":"IF(C42=\"\",\"\",IFERROR(RTD(\"cqg.rtd\", ,\"ContractData\",A42, \"NetLastTradeToday\",, \"T\"),\"\"))","v":-0.41000000000000003},{"$f":"IFERROR(RTD(\"cqg.rtd\", ,\"ContractData\",A42, \"PerCentNetLastTrade\",, \"T\")/100,\"\")","v":-1.4919941775836974E-2},{"$f":"IFERROR(I42/RTD(\"cqg.rtd\",,\"StudyData\",A42, \"ATR\", \"MaType=Sim,Period=10\", \"ATR\",\"D\",\"-1\",\"ALL\",,,\"FALSE\",\"T\")/100,\"\")","v":-3.9084842707340327E-3},{"$f":"IF(C42=\"\",\"\",IFERROR(RTD(\"cqg.rtd\", ,\"ContractData\",A42, \"OPen\",, \"T\"),\"\"))","v":27.54},{"$f":"IF(C42=\"\",\"\",IFERROR(RTD(\"cqg.rtd\", ,\"ContractData\", A42, \"HIgh\",, \"T\"),\"\"))","v":27.55},{"$f":"IF(C42=\"\",\"\",IFERROR(RTD(\"cqg.rtd\", ,\"ContractData\",A42, \"LOw\",, \"T\"),\"\"))","v":27.03},{"$f":"IF(C42=\"\",\"\",IFERROR(RTD(\"cqg.rtd\", ,\"ContractData\",A42, \"T_CVol\",, \"T\"),\"\"))","v":24735553},null,{"$f":" IFERROR(O42/RTD(\"cqg.rtd\",,\"StudyData\",A42, \"MA\", \"InputChoice=Vol,MAType=Sim,Period=21\", \"MA\",\"D\",\"-1\",\"all\",,,,\"T\"),\"\")","v":0.47516431647326579},{"$f":"ARKK!AH9","v":"https://finance.yahoo.com/quote/SOFI"}]
[{"$f":"TRIM(ARKK!AC10)","v":"S.US.COIN"},"News",{"$f":"IFERROR(PROPER(RTD(\"cqg.rtd\", ,\"ContractData\",A43, \"LongDescription\",, \"T\"))&\" (\"&RIGHT(A43,LEN(A43)-5)&\")\",\"\")","v":"Coinbase Glb Cl A Cm (COIN)"},null,null,null,null,{"$f":"IF(C43=\"\",\"\",IFERROR(RTD(\"cqg.rtd\", ,\"ContractData\",A43, \"LastTradeToday\",, \"T\"),\"\"))","v":236.9},{"$f":"IF(C43=\"\",\"\",IFERROR(RTD(\"cqg.rtd\", ,\"ContractData\",A43, \"NetLastTradeToday\",, \"T\"),\"\"))","v":-2.83},{"$f":"IFERROR(RTD(\"cqg.rtd\", ,\"ContractData\",A43, \"PerCentNetLastTrade\",, \"T\")/100,\"\")","v":-1.1804947232303006E-2},{"$f":"IFERROR(I43/RTD(\"cqg.rtd\",,\"StudyData\",A43, \"ATR\", \"MaType=Sim,Period=10\", \"ATR\",\"D\",\"-1\",\"ALL\",,,\"FALSE\",\"T\")/100,\"\")","v":-2.2852067183462533E-3},{"$f":"IF(C43=\"\",\"\",IFERROR(RTD(\"cqg.rtd\", ,\"ContractData\",A43, \"OPen\",, \"T\"),\"\"))","v":240.4},{"$f":"IF(C43=\"\",\"\",IFERROR(RTD(\"cqg.rtd\", ,\"ContractData\", A43, \"HIgh\",, \"T\"),\"\"))","v":240.49},{"$f":"IF(C43=\"\",\"\",IFERROR(RTD(\"cqg.rtd\", ,\"ContractData\",A43, \"LOw\",, \"T\"),\"\"))","v":232.8},{"$f":"IF(C43=\"\",\"\",IFERROR(RTD(\"cqg.rtd\", ,\"ContractData\",A43, \"T_CVol\",, \"T\"),\"\"))","v":5925726},null,{"$f":" IFERROR(O43/RTD(\"cqg.rtd\",,\"StudyData\",A43, \"MA\", \"InputChoice=Vol,MAType=Sim,Period=21\", \"MA\",\"D\",\"-1\",\"all\",,,,\"T\"),\"\")","v":0.72460209181333146},{"$f":"ARKK!AH10","v":"https://finance.yahoo.com/quote/COIN"}]
[{"$f":"TRIM(ARKK!AC11)","v":"S.CA.ETHQ"},"News",{"$f":"IFERROR(PROPER(RTD(\"cqg.rtd\", ,\"ContractData\",A44, \"LongDescription\",, \"T\"))&\" (\"&RIGHT(A44,LEN(A44)-5)&\")\",\"\")","v":"3Iq Ether Staking Etf (ETHQ)"},null,null,null,null,{"$f":"IF(C44=\"\",\"\",IFERROR(RTD(\"cqg.rtd\", ,\"ContractData\",A44, \"LastTradeToday\",, \"T\"),\"\"))","v":15.68},{"$f":"IF(C44=\"\",\"\",IFERROR(RTD(\"cqg.rtd\", ,\"ContractData\",A44, \"NetLastTradeToday\",, \"T\"),\"\"))","v":-0.18},{"$f":"IFERROR(RTD(\"cqg.rtd\", ,\"ContractData\",A44, \"PerCentNetLastTrade\",, \"T\")/100,\"\")","v":-1.1349306431273645E-2},{"$f":"IFERROR(I44/RTD(\"cqg.rtd\",,\"StudyData\",A44, \"ATR\", \"MaType=Sim,Period=10\", \"ATR\",\"D\",\"-1\",\"ALL\",,,\"FALSE\",\"T\")/100,\"\")","v":-2.0954598370197903E-3},{"$f":"IF(C44=\"\",\"\",IFERROR(RTD(\"cqg.rtd\", ,\"ContractData\",A44, \"OPen\",, \"T\"),\"\"))","v":15.620000000000001},{"$f":"IF(C44=\"\",\"\",IFERROR(RTD(\"cqg.rtd\", ,\"ContractData\", A44, \"HIgh\",, \"T\"),\"\"))","v":15.73},{"$f":"IF(C44=\"\",\"\",IFERROR(RTD(\"cqg.rtd\", ,\"ContractData\",A44, \"LOw\",, \"T\"),\"\"))","v":15.47},{"$f":"IF(C44=\"\",\"\",IFERROR(RTD(\"cqg.rtd\", ,\"ContractData\",A44, \"T_CVol\",, \"T\"),\"\"))","v":2676},null,{"$f":" IFERROR(O44/RTD(\"cqg.rtd\",,\"StudyData\",A44, \"MA\", \"InputChoice=Vol,MAType=Sim,Period=21\", \"MA\",\"D\",\"-1\",\"all\",,,,\"T\"),\"\")","v":0.33263093095937035},{"$f":"ARKK!AH11","v":"https://finance.yahoo.com/quote/ETHQ"}]
[{"$f":"TRIM(ARKK!AC12)","v":"S.US.META"},"News",{"$f":"IFERROR(PROPER(RTD(\"cqg.rtd\", ,\"ContractData\",A45, \"LongDescription\",, \"T\"))&\" (\"&RIGHT(A45,LEN(A45)-5)&\")\",\"\")","v":"Meta Platforms, Inc. (META)"},null,null,null,null,{"$f":"IF(C45=\"\",\"\",IFERROR(RTD(\"cqg.rtd\", ,\"ContractData\",A45, \"LastTradeToday\",, \"T\"),\"\"))","v":663.29},{"$f":"IF(C45=\"\",\"\",IFERROR(RTD(\"cqg.rtd\", ,\"ContractData\",A45, \"NetLastTradeToday\",, \"T\"),\"\"))","v":-4.26},{"$f":"IFERROR(RTD(\"cqg.rtd\", ,\"ContractData\",A45, \"PerCentNetLastTrade\",, \"T\")/100,\"\")","v":-6.3815444535989816E-3},{"$f":"IFERROR(I45/RTD(\"cqg.rtd\",,\"StudyData\",A45, \"ATR\", \"MaType=Sim,Period=10\", \"ATR\",\"D\",\"-1\",\"ALL\",,,\"FALSE\",\"T\")/100,\"\")","v":-3.0691642651296826E-3},{"$f":"IF(C45=\"\",\"\",IFERROR(RTD(\"cqg.rtd\", ,\"ContractData\",A45, \"OPen\",, \"T\"),\"\"))","v":668.06000000000006},{"$f":"IF(C45=\"\",\"\",IFERROR(RTD(\"cqg.rtd\", ,\"ContractData\", A45, \"HIgh\",, \"T\"),\"\"))","v":668.94},{"$f":"IF(C45=\"\",\"\",IFERROR(RTD(\"cqg.rtd\", ,\"ContractData\",A45, \"LOw\",, \"T\"),\"\"))","v":661.32},{"$f":"IF(C45=\"\",\"\",IFERROR(RTD(\"cqg.rtd\", ,\"ContractData\",A45, \"T_CVol\",, \"T\"),\"\"))","v":7133813},null,{"$f":" IFERROR(O45/RTD(\"cqg.rtd\",,\"StudyData\",A45, \"MA\", \"InputChoice=Vol,MAType=Sim,Period=21\", \"MA\",\"D\",\"-1\",\"all\",,,,\"T\"),\"\")","v":0.4232476368364933},{"$f":"ARKK!AH12","v":"https://finance.yahoo.com/quote/META"}]
[{"$f":"TRIM(ARKK!AC13)","v":"S.US.ARKF"},"News",{"$f":"IFERROR(PROPER(RTD(\"cqg.rtd\", ,\"ContractData\",A46, \"LongDescription\",, \"T\"))&\" (\"&RIGHT(A46,LEN(A46)-5)&\")\",\"\")","v":"Ark Blockchain & Fintech Innovation Etf (ARKF)"},null,null,null,null,{"$f":"IF(C46=\"\",\"\",IFERROR(RTD(\"cqg.rtd\", ,\"ContractData\",A46, \"LastTradeToday\",, \"T\"),\"\"))","v":48.94},{"$f":"IF(C46=\"\",\"\",IFERROR(RTD(\"cqg.rtd\", ,\"ContractData\",A46, \"NetLastTradeToday\",, \"T\"),\"\"))","v":-0.28000000000000003},{"$f":"IFERROR(RTD(\"cqg.rtd\", ,\"ContractData\",A46, \"PerCentNetLastTrade\",, \"T\")/100,\"\")","v":-5.6887444128403087E-3},{"$f":"IFERROR(I46/RTD(\"cqg.rtd\",,\"StudyData\",A46, \"ATR\", \"MaType=Sim,Period=10\", \"ATR\",\"D\",\"-1\",\"ALL\",,,\"FALSE\",\"T\")/100,\"\")","v":-2.2875816993464053E-3},{"$f":"IF(C46=\"\",\"\",IFERROR(RTD(\"cqg.rtd\", ,\"ContractData\",A46, \"OPen\",, \"T\"),\"\"))","v":49.120000000000005},{"$f":"IF(C46=\"\",\"\",IFERROR(RTD(\"cqg.rtd\", ,\"ContractData\", A46, \"HIgh\",, \"T\"),\"\"))","v":49.18},{"$f":"IF(C46=\"\",\"\",IFERROR(RTD(\"cqg.rtd\", ,\"ContractData\",A46, \"LOw\",, \"T\"),\"\"))","v":48.7},{"$f":"IF(C46=\"\",\"\",IFERROR(RTD(\"cqg.rtd\", ,\"ContractData\",A46, \"T_CVol\",, \"T\"),\"\"))","v":152527},null,{"$f":" IFERROR(O46/RTD(\"cqg.rtd\",,\"StudyData\",A46, \"MA\", \"InputChoice=Vol,MAType=Sim,Period=21\", \"MA\",\"D\",\"-1\",\"all\",,,,\"T\"),\"\")","v":0.84194346873978942},{"$f":"ARKK!AH13","v":"https://finance.yahoo.com/quote/ARKF"}]
[{"$f":"TRIM(ARKK!AC14)","v":"S.US.SPOT"},"News",{"$f":"IFERROR(PROPER(RTD(\"cqg.rtd\", ,\"ContractData\",A47, \"LongDescription\",, \"T\"))&\" (\"&RIGHT(A47,LEN(A47)-5)&\")\",\"\")","v":"Spotify Technology S.A. (SPOT)"},null,null,null,null,{"$f":"IF(C47=\"\",\"\",IFERROR(RTD(\"cqg.rtd\", ,\"ContractData\",A47, \"LastTradeToday\",, \"T\"),\"\"))","v":584.35},{"$f":"IF(C47=\"\",\"\",IFERROR(RTD(\"cqg.rtd\", ,\"ContractData\",A47, \"NetLastTradeToday\",, \"T\"),\"\"))","v":-2.2200000000000002},{"$f":"IFERROR(RTD(\"cqg.rtd\", ,\"ContractData\",A47, \"PerCentNetLastTrade\",, \"T\")/100,\"\")","v":-3.7847145268254429E-3},{"$f":"IFERROR(I47/RTD(\"cqg.rtd\",,\"StudyData\",A47, \"ATR\", \"MaType=Sim,Period=10\", \"ATR\",\"D\",\"-1\",\"ALL\",,,\"FALSE\",\"T\")/100,\"\")","v":-1.3631339801056122E-3},{"$f":"IF(C47=\"\",\"\",IFERROR(RTD(\"cqg.rtd\", ,\"ContractData\",A47, \"OPen\",, \"T\"),\"\"))","v":585.07000000000005},{"$f":"IF(C47=\"\",\"\",IFERROR(RTD(\"cqg.rtd\", ,\"ContractData\", A47, \"HIgh\",, \"T\"),\"\"))","v":588.52},{"$f":"IF(C47=\"\",\"\",IFERROR(RTD(\"cqg.rtd\", ,\"ContractData\",A47, \"LOw\",, \"T\"),\"\"))","v":580.02},{"$f":"IF(C47=\"\",\"\",IFERROR(RTD(\"cqg.rtd\", ,\"ContractData\",A47, \"T_CVol\",, \"T\"),\"\"))","v":565251},null,{"$f":" IFERROR(O47/RTD(\"cqg.rtd\",,\"StudyData\",A47, \"MA\", \"InputChoice=Vol,MAType=Sim,Period=21\", \"MA\",\"D\",\"-1\",\"all\",,,,\"T\"),\"\")","v":0.29741239087444354},{"$f":"ARKK!AH14","v":"https://finance.yahoo.com/quote/SPOT"}]
[{"$f":"TRIM(ARKK!AC15)","v":"S.US.GLBE"},"News",{"$f":"IFERROR(PROPER(RTD(\"cqg.rtd\", ,\"ContractData\",A48, \"LongDescription\",, \"T\"))&\" (\"&RIGHT(A48,LEN(A48)-5)&\")\",\"\")","v":"Global-E Online Cm (GLBE)"},null,null,null,null,{"$f":"IF(C48=\"\",\"\",IFERROR(RTD(\"cqg.rtd\", ,\"ContractData\",A48, \"LastTradeToday\",, \"T\"),\"\"))","v":39.6},{"$f":"IF(C48=\"\",\"\",IFERROR(RTD(\"cqg.rtd\", ,\"ContractData\",A48, \"NetLastTradeToday\",, \"T\"),\"\"))","v":-0.13},{"$f":"IFERROR(RTD(\"cqg.rtd\", ,\"ContractData\",A48, \"PerCentNetLastTrade\",, \"T\")/100,\"\")","v":-3.2720865844450037E-3},{"$f":"IFERROR(I48/RTD(\"cqg.rtd\",,\"StudyData\",A48, \"ATR\", \"MaType=Sim,Period=10\", \"ATR\",\"D\",\"-1\",\"ALL\",,,\"FALSE\",\"T\")/100,\"\")","v":-9.4066570188133152E-4},{"$f":"IF(C48=\"\",\"\",IFERROR(RTD(\"cqg.rtd\", ,\"ContractData\",A48, \"OPen\",, \"T\"),\"\"))","v":39.94},{"$f":"IF(C48=\"\",\"\",IFERROR(RTD(\"cqg.rtd\", ,\"ContractData\", A48, \"HIgh\",, \"T\"),\"\"))","v":39.94},{"$f":"IF(C48=\"\",\"\",IFERROR(RTD(\"cqg.rtd\", ,\"ContractData\",A48, \"LOw\",, \"T\"),\"\"))","v":39.300000000000004},{"$f":"IF(C48=\"\",\"\",IFERROR(RTD(\"cqg.rtd\", ,\"ContractData\",A48, \"T_CVol\",, \"T\"),\"\"))","v":372292},null,{"$f":" IFERROR(O48/RTD(\"cqg.rtd\",,\"StudyData\",A48, \"MA\", \"InputChoice=Vol,MAType=Sim,Period=21\", \"MA\",\"D\",\"-1\",\"all\",,,,\"T\"),\"\")","v":0.30738442640962449},{"$f":"ARKK!AH15","v":"https://finance.yahoo.com/quote/GLBE"}]
[null,null,"CQG Inc.,   Copyright © 2025",null,null,null,"Designed by Thom Hartle",null,null,"From their website: \"invests at least 80% of its assets in equity securities of companies engaged in the Fund’s investment theme of blockchain and fintech innovation.\"",null,null,null,null,null,null,null,null,null,null,null,null,null,null,null,{"$f":"Z52","v":"52% of the stocks in the ETF are higher today"}]
[]
[null,null,null,null,null,null,null,null,null,null,null,null,null,null,null,null,null,null,null,null,null,null,null,null,null,{"$f":"ARKK!B103","v":0.52380952380952384},"of the stocks in the ETF are higher today"]
[null,null,null,null,null,null,null,null,null,null,null,null,null,null,null,null,null,null,null,null,null,null,null,null,null,{"$f":"TEXT(Display!Z51,\"0%\")&\" \"&Display!AA51","v":"52% of the stocks in the ETF are higher today"}]

{"sheet":"ARKK","index":1,"n_rows":104,"n_cols":34,"rows_kept":104,"cut":false,"hidden":true,"merged":[]}
[{"$f":"IF(Symbols!A1=\"\",\"\",Symbols!A1)","v":"S.CA.ETHQ"},{"$f":"IF(A1=\"\",\"\",IF(J1>0,1,0))","v":0},{"$f":"A1","v":"S.CA.ETHQ"},{"$f":"IF(A1=\"\",\"\",RTD(\"cqg.rtd\", ,\"ContractData\",C1, \"LongDescription\",, \"T\"))","v":"3iQ Ether Staking ETF"},null,{"$f":"(\"$J$\"&\"1\"&\":$J$\"&A103)","v":"$J$1:$J$42"},null,{"$f":"IF(A1=\"\",\"\",RTD(\"cqg.rtd\", ,\"ContractData\",C1, \"LastTradeToday\",, \"T\"))","v":15.68},{"$f":"IF(A1=\"\",\"\",RTD(\"cqg.rtd\", ,\"ContractData\",C1, \"NetLastTradeToday\",, \"T\"))","v":-0.18},{"$f":"IF(A1=\"\",\"\",IFERROR(RTD(\"cqg.rtd\", ,\"ContractData\",C1, \"PerCentNetLastTrade\",, \"T\")/100,\"\"))","v":-1.1349306431273645E-2},{"$f":"IF(A1=\"\",\"\",RTD(\"cqg.rtd\", ,\"ContractData\", C1, \"T_CVol\",, \"T\"))","v":2676},1,{"$f":"IFERROR(RANK($J1,INDIRECT((\"$J$\"&\"1\"&\":$J$\"&$A$103)))+COUNTIF($J$1:J1,J1)-1,\"\")","v":31},{"$f":"C1","v":"S.CA.ETHQ"},{"$f":"IFERROR(VLOOKUP($L1,$M$1:$N$101,2,FALSE),\"\")","v":"S.US.SLMT"},{"$f":"IF(O1=\"\",\"\",PROPER(RTD(\"cqg.rtd\", ,\"ContractData\",O1, \"LongDescription\",, \"T\")))","v":"Brera Holdings B Os"},{"$f":"IFERROR(RTD(\"cqg.rtd\", ,\"ContractData\",O1, \"PerCentNetLastTrade\",, \"T\")/100,\"\")","v":1.9417475728155342E-2},{"$f":"IFERROR(\"https://finance.yahoo.com/quote/\"&RIGHT(O1,(LEN(O1)-5)),\"\")","v":"https://finance.yahoo.com/quote/SLMT"},null,{"$f":"IF(Q1>=0,Q1,NA())","v":1.9417475728155342E-2},{"$f":"IFERROR(IF(Q1>=0,NA(),-1*Q1),\"\")","v":""},null,{"$f":"IF(Q1=\"\",\"\",IF(Q1<0,\"\",IFERROR(PROPER(RTD(\"cqg.rtd\", ,\"ContractData\",O1, \"LongDescription\",, \"T\")),\"\")))","v":"Brera Holdings B Os"},null,null,{"$f":"IF(W1=\"\",\"\",IFERROR(T1,Q1))","v":1.9417475728155342E-2},{"$f":"MIN(J1:J101)","v":-4.0130657956136261E-2},{"$f":"IFERROR(VLOOKUP(AA1,J1:O98,4,FALSE),\"\")","v":41},{"$f":"IF(AB1=\"\",\"\",VLOOKUP($AB1,$M$1:$N$101,2,FALSE))","v":"S.US.BLSH"},{"$f":"IF(RTD(\"cqg.rtd\", ,\"ContractData\",AC1, \"PerCentNetLastTrade\",, \"T\")>0,\"\",IFERROR(RTD(\"cqg.rtd\", ,\"ContractData\",AC1, \"PerCentNetLastTrade\",, \"T\")/100,\"\"))","v":-4.0130657956136261E-2},{"$f":"IF(AD1>0,\"\",IFERROR(PROPER(RTD(\"cqg.rtd\", ,\"ContractData\",AC1, \"LongDescription\",, \"T\")),\"\"))","v":"Bullish"},{"$f":"\"\"","v":""},{"$f":"IF(AD1>0,\"\",IFERROR(AD1*-1,\"\"))","v":4.0130657956136261E-2},{"$f":"IFERROR(\"https://finance.yahoo.com/quote/\"&RIGHT(AC1,(LEN(AC1)-5)),\"\")","v":"https://finance.yahoo.com/quote/BLSH"}]
[{"$f":"IF(Symbols!A2=\"\",\"\",Symbols!A2)","v":"S.CA.SOLQ"},{"$f":"IF(A2=\"\",\"\",IF(J2>0,1,0))","v":0},{"$f":"A2","v":"S.CA.SOLQ"},{"$f":"IF(A2=\"\",\"\",RTD(\"cqg.rtd\", ,\"ContractData\",C2, \"LongDescription\",, \"T\"))","v":"3IQ SOLANA STAKING ETF"},null,null,null,{"$f":"IF(A2=\"\",\"\",RTD(\"cqg.rtd\", ,\"ContractData\",C2, \"LastTradeToday\",, \"T\"))","v":13.32},{"$f":"IF(A2=\"\",\"\",RTD(\"cqg.rtd\", ,\"ContractData\",C2, \"NetLastTradeToday\",, \"T\"))","v":-0.26},{"$f":"IF(A2=\"\",\"\",IFERROR(RTD(\"cqg.rtd\", ,\"ContractData\",C2, \"PerCentNetLastTrade\",, \"T\")/100,\"\"))","v":-1.9145802650957292E-2},{"$f":"IF(A2=\"\",\"\",RTD(\"cqg.rtd\", ,\"ContractData\", C2, \"T_CVol\",, \"T\"))","v":14744},{"$f":"L1+1","v":2},{"$f":"IFERROR(RANK($J2,INDIRECT((\"$J$\"&\"1\"&\":$J$\"&$A$103)))+COUNTIF($J$1:J2,J2)-1,\"\")","v":35},{"$f":"C2","v":"S.CA.SOLQ"},{"$f":"IFERROR(VLOOKUP($L2,$M$1:$N$101,2,FALSE),\"\")","v":"S.US.BABA"},{"$f":"IF(O2=\"\",\"\",PROPER(RTD(\"cqg.rtd\", ,\"ContractData\",O2, \"LongDescription\",, \"T\")))","v":"Alibaba Group Holding Ltd"},{"$f":"IFERROR(RTD(\"cqg.rtd\", ,\"ContractData\",O2, \"PerCentNetLastTrade\",, \"T\")/100,\"\")","v":1.4527522324403573E-2},{"$f":"IFERROR(\"https://finance.yahoo.com/quote/\"&RIGHT(O2,(LEN(O2)-5)),\"\")","v":"https://finance.yahoo.com/quote/BABA"},null,{"$f":"IF(Q2>=0,Q2,NA())","v":1.4527522324403573E-2},{"$f":"IFERROR(IF(Q2>=0,NA(),-1*Q2),\"\")","v":""},null,{"$f":"IF(Q2=\"\",\"\",IF(Q2<0,\"\",IFERROR(PROPER(RTD(\"cqg.rtd\", ,\"ContractData\",O2, \"LongDescription\",, \"T\")),\"\")))","v":"Alibaba Group Holding Ltd"},null,null,{"$f":"IF(W2=\"\",\"\",IFERROR(T2,Q2))","v":1.4527522324403573E-2},null,{"$f":"IFERROR(AB1-1,\"\")","v":40},{"$f":"IFERROR(IF(AB2=\"\",\"\",VLOOKUP($AB2,$M$1:$N$101,2,FALSE)),\"\")","v":"S.US.BMNR"},{"$f":"IF(RTD(\"cqg.rtd\", ,\"ContractData\",AC2, \"PerCentNetLastTrade\",, \"T\")>0,\"\",IFERROR(RTD(\"cqg.rtd\", ,\"ContractData\",AC2, \"PerCentNetLastTrade\",, \"T\")/100,\"\"))","v":-3.5434412265758095E-2},{"$f":"IF(AD2>0,\"\",IFERROR(PROPER(RTD(\"cqg.rtd\", ,\"ContractData\",AC2, \"LongDescription\",, \"T\")),\"\"))","v":"Bitmine Immersion Technologies Inc."},{"$f":"\"\"","v":""},{"$f":"IF(AD2>0,\"\",IFERROR(AD2*-1,\"\"))","v":3.5434412265758095E-2},{"$f":"IFERROR(\"https://finance.yahoo.com/quote/\"&RIGHT(AC2,(LEN(AC2)-5)),\"\")","v":"https://finance.yahoo.com/quote/BMNR"}]
[{"$f":"IF(Symbols!A3=\"\",\"\",Symbols!A3)","v":"S.JP.J4689"},0,"S.JP.J4689",{"$f":"IF(A3=\"\",\"\",RTD(\"cqg.rtd\", ,\"ContractData\",C3, \"LongDescription\",, \"T\"))","v":"Yahoo Japan Corp"},null,null,null,{"$f":"IF(A3=\"\",\"\",RTD(\"cqg.rtd\", ,\"ContractData\",C3, \"LastTradeToday\",, \"T\"))","v":413},{"$f":"IF(A3=\"\",\"\",RTD(\"cqg.rtd\", ,\"ContractData\",C3, \"NetLastTradeToday\",, \"T\"))","v":0},{"$f":"IF(A3=\"\",\"\",IFERROR(RTD(\"cqg.rtd\", ,\"ContractData\",C3, \"PerCentNetLastTrade\",, \"T\")/100,\"\"))","v":0},{"$f":"IF(A3=\"\",\"\",RTD(\"cqg.rtd\", ,\"ContractData\", C3, \"T_CVol\",, \"T\"))","v":105834},{"$f":"L2+1","v":3},{"$f":"IFERROR(RANK($J3,INDIRECT((\"$J$\"&\"1\"&\":$J$\"&$A$103)))+COUNTIF($J$1:J3,J3)-1,\"\")","v":22},"S.JP.J4689","S.US.SE",{"$f":"IF(O3=\"\",\"\",PROPER(RTD(\"cqg.rtd\", ,\"ContractData\",O3, \"LongDescription\",, \"T\")))","v":"Sea Limited"},{"$f":"IFERROR(RTD(\"cqg.rtd\", ,\"ContractData\",O3, \"PerCentNetLastTrade\",, \"T\")/100,\"\")","v":1.2673267326732674E-2},"https://finance.yahoo.com/quote/SE",null,1.2673267326732674E-2,"",null,{"$f":"IF(Q3=\"\",\"\",IF(Q3<0,\"\",IFERROR(PROPER(RTD(\"cqg.rtd\", ,\"ContractData\",O3, \"LongDescription\",, \"T\")),\"\")))","v":"Sea Limited"},null,null,1.2673267326732674E-2,null,{"$f":"IFERROR(AB2-1,\"\")","v":39},{"$f":"IFERROR(IF(AB3=\"\",\"\",VLOOKUP($AB3,$M$1:$N$101,2,FALSE)),\"\")","v":"S.US.DSY"},{"$f":"IF(RTD(\"cqg.rtd\", ,\"ContractData\",AC3, \"PerCentNetLastTrade\",, \"T\")>0,\"\",IFERROR(RTD(\"cqg.rtd\", ,\"ContractData\",AC3, \"PerCentNetLastTrade\",, \"T\")/100,\"\"))","v":-3.2258064516129031E-2},{"$f":"IF(AD3>0,\"\",IFERROR(PROPER(RTD(\"cqg.rtd\", ,\"ContractData\",AC3, \"LongDescription\",, \"T\")),\"\"))","v":"Big Tr Cld Hd Ld Ord"},{"$f":"\"\"","v":""},3.2258064516129031E-2,"https://finance.yahoo.com/quote/DSY"]
[{"$f":"IF(Symbols!A4=\"\",\"\",Symbols!A4)","v":"S.NL.ADYEN"},1,"S.NL.ADYEN",{"$f":"IF(A4=\"\",\"\",RTD(\"cqg.rtd\", ,\"ContractData\",C4, \"LongDescription\",, \"T\"))","v":"Adyen N.V."},null,null,null,{"$f":"IF(A4=\"\",\"\",RTD(\"cqg.rtd\", ,\"ContractData\",C4, \"LastTradeToday\",, \"T\"))","v":""},{"$f":"IF(A4=\"\",\"\",RTD(\"cqg.rtd\", ,\"ContractData\",C4, \"NetLastTradeToday\",, \"T\"))","v":""},{"$f":"IF(A4=\"\",\"\",IFERROR(RTD(\"cqg.rtd\", ,\"ContractData\",C4, \"PerCentNetLastTrade\",, \"T\")/100,\"\"))","v":""},{"$f":"IF(A4=\"\",\"\",RTD(\"cqg.rtd\", ,\"ContractData\", C4, \"T_CVol\",, \"T\"))","v":6869},4,{"$f":"IFERROR(RANK($J4,INDIRECT((\"$J$\"&\"1\"&\":$J$\"&$A$103)))+COUNTIF($J$1:J4,J4)-1,\"\")","v":""},"S.NL.ADYEN","S.US.ROKU",{"$f":"IF(O4=\"\",\"\",PROPER(RTD(\"cqg.rtd\", ,\"ContractData\",O4, \"LongDescription\",, \"T\")))","v":"Roku, Inc. A Cmn"},{"$f":"IFERROR(RTD(\"cqg.rtd\", ,\"ContractData\",O4, \"PerCentNetLastTrade\",, \"T\")/100,\"\")","v":1.2649078424286231E-2},"https://finance.yahoo.com/quote/ROKU",null,1.2649078424286231E-2,"",null,{"$f":"IF(Q4=\"\",\"\",IF(Q4<0,\"\",IFERROR(PROPER(RTD(\"cqg.rtd\", ,\"ContractData\",O4, \"LongDescription\",, \"T\")),\"\")))","v":"Roku, Inc. A Cmn"},null,null,1.2649078424286231E-2,null,38,"S.US.PLTR",{"$f":"IF(RTD(\"cqg.rtd\", ,\"ContractData\",AC4, \"PerCentNetLastTrade\",, \"T\")>0,\"\",IFERROR(RTD(\"cqg.rtd\", ,\"ContractData\",AC4, \"PerCentNetLastTrade\",, \"T\")/100,\"\"))","v":-2.8119688932378845E-2},{"$f":"IF(AD4>0,\"\",IFERROR(PROPER(RTD(\"cqg.rtd\", ,\"ContractData\",AC4, \"LongDescription\",, \"T\")),\"\"))","v":"Palantir Tech Cl A"},{"$f":"\"\"","v":""},2.8119688932378845E-2,"https://finance.yahoo.com/quote/PLTR"]
[{"$f":"IF(Symbols!A5=\"\",\"\",Symbols!A5)","v":"S.US.ABNB"},1,"S.US.ABNB",{"$f":"IF(A5=\"\",\"\",RTD(\"cqg.rtd\", ,\"ContractData\",C5, \"LongDescription\",, \"T\"))","v":"Airbnb, Inc. Class A"},null,null,null,{"$f":"IF(A5=\"\",\"\",RTD(\"cqg.rtd\", ,\"ContractData\",C5, \"LastTradeToday\",, \"T\"))","v":136.82},{"$f":"IF(A5=\"\",\"\",RTD(\"cqg.rtd\", ,\"ContractData\",C5, \"NetLastTradeToday\",, \"T\"))","v":0.04},{"$f":"IF(A5=\"\",\"\",IFERROR(RTD(\"cqg.rtd\", ,\"ContractData\",C5, \"PerCentNetLastTrade\",, \"T\")/100,\"\"))","v":2.9244041526538966E-4},{"$f":"IF(A5=\"\",\"\",RTD(\"cqg.rtd\", ,\"ContractData\", C5, \"T_CVol\",, \"T\"))","v":1776009},5,{"$f":"IFERROR(RANK($J5,INDIRECT((\"$J$\"&\"1\"&\":$J$\"&$A$103)))+COUNTIF($J$1:J5,J5)-1,\"\")","v":21},"S.US.ABNB","S.US.DKNG",{"$f":"IF(O5=\"\",\"\",PROPER(RTD(\"cqg.rtd\", ,\"ContractData\",O5, \"LongDescription\",, \"T\")))","v":"Draftkings Inc. Cl A"},{"$f":"IFERROR(RTD(\"cqg.rtd\", ,\"ContractData\",O5, \"PerCentNetLastTrade\",, \"T\")/100,\"\")","v":1.2188044109112013E-2},"https://finance.yahoo.com/quote/DKNG",null,1.2188044109112013E-2,"",null,{"$f":"IF(Q5=\"\",\"\",IF(Q5<0,\"\",IFERROR(PROPER(RTD(\"cqg.rtd\", ,\"ContractData\",O5, \"LongDescription\",, \"T\")),\"\")))","v":"Draftkings Inc. Cl A"},null,null,1.2188044109112013E-2,null,37,"S.US.KLAR",{"$f":"IF(RTD(\"cqg.rtd\", ,\"ContractData\",AC5, \"PerCentNetLastTrade\",, \"T\")>0,\"\",IFERROR(RTD(\"cqg.rtd\", ,\"ContractData\",AC5, \"PerCentNetLastTrade\",, \"T\")/100,\"\"))","v":-2.7284681130834976E-2},{"$f":"IF(AD5>0,\"\",IFERROR(PROPER(RTD(\"cqg.rtd\", ,\"ContractData\",AC5, \"LongDescription\",, \"T\")),\"\"))","v":"Klarna Group Plc"},{"$f":"\"\"","v":""},2.7284681130834976E-2,"https://finance.yahoo.com/quote/KLAR"]
[{"$f":"IF(Symbols!A6=\"\",\"\",Symbols!A6)","v":"S.US.AMD"},0,"S.US.AMD",{"$f":"IF(A6=\"\",\"\",RTD(\"cqg.rtd\", ,\"ContractData\",C6, \"LongDescription\",, \"T\"))","v":"ADV MICRO DEVICES"},null,null,null,{"$f":"IF(A6=\"\",\"\",RTD(\"cqg.rtd\", ,\"ContractData\",C6, \"LastTradeToday\",, \"T\"))","v":214.99},{"$f":"IF(A6=\"\",\"\",RTD(\"cqg.rtd\", ,\"ContractData\",C6, \"NetLastTradeToday\",, \"T\"))","v":-0.05},{"$f":"IF(A6=\"\",\"\",IFERROR(RTD(\"cqg.rtd\", ,\"ContractData\",C6, \"PerCentNetLastTrade\",, \"T\")/100,\"\"))","v":-2.3251488095238097E-4},{"$f":"IF(A6=\"\",\"\",RTD(\"cqg.rtd\", ,\"ContractData\", C6, \"T_CVol\",, \"T\"))","v":15792558},6,{"$f":"IFERROR(RANK($J6,INDIRECT((\"$J$\"&\"1\"&\":$J$\"&$A$103)))+COUNTIF($J$1:J6,J6)-1,\"\")","v":23},"S.US.AMD","S.US.NVDA",{"$f":"IF(O6=\"\",\"\",PROPER(RTD(\"cqg.rtd\", ,\"ContractData\",O6, \"LongDescription\",, \"T\")))","v":"Nvidia Corporation"},{"$f":"IFERROR(RTD(\"cqg.rtd\", ,\"ContractData\",O6, \"PerCentNetLastTrade\",, \"T\")/100,\"\")","v":1.0179735963098457E-2},"https://finance.yahoo.com/quote/NVDA",null,1.0179735963098457E-2,"",null,{"$f":"IF(Q6=\"\",\"\",IF(Q6<0,\"\",IFERROR(PROPER(RTD(\"cqg.rtd\", ,\"ContractData\",O6, \"LongDescription\",, \"T\")),\"\")))","v":"Nvidia Corporation"},null,null,1.0179735963098457E-2,null,36,"S.US.HOOD",{"$f":"IF(RTD(\"cqg.rtd\", ,\"ContractData\",AC6, \"PerCentNetLastTrade\",, \"T\")>0,\"\",IFERROR(RTD(\"cqg.rtd\", ,\"ContractData\",AC6, \"PerCentNetLastTrade\",, \"T\")/100,\"\"))","v":-1.9179674526735305E-2},{"$f":"IF(AD6>0,\"\",IFERROR(PROPER(RTD(\"cqg.rtd\", ,\"ContractData\",AC6, \"LongDescription\",, \"T\")),\"\"))","v":"Robinhood Mk Cl A Cs"},{"$f":"\"\"","v":""},1.9179674526735305E-2,"https://finance.yahoo.com/quote/HOOD"]
[{"$f":"IF(Symbols!A7=\"\",\"\",Symbols!A7)","v":"S.US.AMZN"},1,"S.US.AMZN",{"$f":"IF(A7=\"\",\"\",RTD(\"cqg.rtd\", ,\"ContractData\",C7, \"LongDescription\",, \"T\"))","v":"Amazon.com Inc"},null,null,null,{"$f":"IF(A7=\"\",\"\",RTD(\"cqg.rtd\", ,\"ContractData\",C7, \"LastTradeToday\",, \"T\"))","v":232.52},{"$f":"IF(A7=\"\",\"\",RTD(\"cqg.rtd\", ,\"ContractData\",C7, \"NetLastTradeToday\",, \"T\"))","v":0.14000000000000001},{"$f":"IF(A7=\"\",\"\",IFERROR(RTD(\"cqg.rtd\", ,\"ContractData\",C7, \"PerCentNetLastTrade\",, \"T\")/100,\"\"))","v":6.0246148549789134E-4},{"$f":"IF(A7=\"\",\"\",RTD(\"cqg.rtd\", ,\"ContractData\", C7, \"T_CVol\",, \"T\"))","v":15994726},7,{"$f":"IFERROR(RANK($J7,INDIRECT((\"$J$\"&\"1\"&\":$J$\"&$A$103)))+COUNTIF($J$1:J7,J7)-1,\"\")","v":19},"S.US.AMZN","S.US.CRWD",{"$f":"IF(O7=\"\",\"\",PROPER(RTD(\"cqg.rtd\", ,\"ContractData\",O7, \"LongDescription\",, \"T\")))","v":"Crowdstrike Hld Cm A"},{"$f":"IFERROR(RTD(\"cqg.rtd\", ,\"ContractData\",O7, \"PerCentNetLastTrade\",, \"T\")/100,\"\")","v":8.5514870784515109E-3},"https://finance.yahoo.com/quote/CRWD",null,8.5514870784515109E-3,"",null,{"$f":"IF(Q7=\"\",\"\",IF(Q7<0,\"\",IFERROR(PROPER(RTD(\"cqg.rtd\", ,\"ContractData\",O7, \"LongDescription\",, \"T\")),\"\")))","v":"Crowdstrike Hld Cm A"},null,null,8.5514870784515109E-3,null,35,"S.CA.SOLQ",{"$f":"IF(RTD(\"cqg.rtd\", ,\"ContractData\",AC7, \"PerCentNetLastTrade\",, \"T\")>0,\"\",IFERROR(RTD(\"cqg.rtd\", ,\"ContractData\",AC7, \"PerCentNetLastTrade\",, \"T\")/100,\"\"))","v":-1.9145802650957292E-2},{"$f":"IF(AD7>0,\"\",IFERROR(PROPER(RTD(\"cqg.rtd\", ,\"ContractData\",AC7, \"LongDescription\",, \"T\")),\"\"))","v":"3Iq Solana Staking Etf"},{"$f":"\"\"","v":""},1.9145802650957292E-2,"https://finance.yahoo.com/quote/SOLQ"]
[{"$f":"IF(Symbols!A8=\"\",\"\",Symbols!A8)","v":"S.US.ARKF"},0,"S.US.ARKF",{"$f":"IF(A8=\"\",\"\",RTD(\"cqg.rtd\", ,\"ContractData\",C8, \"LongDescription\",, \"T\"))","v":"ARK Blockchain & Fintech Innovation ETF"},null,null,null,{"$f":"IF(A8=\"\",\"\",RTD(\"cqg.rtd\", ,\"ContractData\",C8, \"LastTradeToday\",, \"T\"))","v":48.94},{"$f":"IF(A8=\"\",\"\",RTD(\"cqg.rtd\", ,\"ContractData\",C8, \"NetLastTradeToday\",, \"T\"))","v":-0.28000000000000003},{"$f":"IF(A8=\"\",\"\",IFERROR(RTD(\"cqg.rtd\", ,\"ContractData\",C8, \"PerCentNetLastTrade\",, \"T\")/100,\"\"))","v":-5.6887444128403087E-3},{"$f":"IF(A8=\"\",\"\",RTD(\"cqg.rtd\", ,\"ContractData\", C8, \"T_CVol\",, \"T\"))","v":152527},8,{"$f":"IFERROR(RANK($J8,INDIRECT((\"$J$\"&\"1\"&\":$J$\"&$A$103)))+COUNTIF($J$1:J8,J8)-1,\"\")","v":29},"S.US.ARKF","S.US.DASH",{"$f":"IF(O8=\"\",\"\",PROPER(RTD(\"cqg.rtd\", ,\"ContractData\",O8, \"LongDescription\",, \"T\")))","v":"Doordash, Inc. Cl A"},{"$f":"IFERROR(RTD(\"cqg.rtd\", ,\"ContractData\",O8, \"PerCentNetLastTrade\",, \"T\")/100,\"\")","v":8.1444454020511928E-3},"https://finance.yahoo.com/quote/DASH",null,8.1444454020511928E-3,"",null,{"$f":"IF(Q8=\"\",\"\",IF(Q8<0,\"\",IFERROR(PROPER(RTD(\"cqg.rtd\", ,\"ContractData\",O8, \"LongDescription\",, \"T\")),\"\")))","v":"Doordash, Inc. Cl A"},null,null,8.1444454020511928E-3,null,34,"S.US.CRCL",{"$f":"IF(RTD(\"cqg.rtd\", ,\"ContractData\",AC8, \"PerCentNetLastTrade\",, \"T\")>0,\"\",IFERROR(RTD(\"cqg.rtd\", ,\"ContractData\",AC8, \"PerCentNetLastTrade\",, \"T\")/100,\"\"))","v":-1.6577928363988383E-2},{"$f":"IF(AD8>0,\"\",IFERROR(PROPER(RTD(\"cqg.rtd\", ,\"ContractData\",AC8, \"LongDescription\",, \"T\")),\"\"))","v":"Circle Internet Group"},{"$f":"\"\"","v":""},1.6577928363988383E-2,"https://finance.yahoo.com/quote/CRCL"]
[{"$f":"IF(Symbols!A9=\"\",\"\",Symbols!A9)","v":"S.US.BABA"},1,"S.US.BABA",{"$f":"IF(A9=\"\",\"\",RTD(\"cqg.rtd\", ,\"ContractData\",C9, \"LongDescription\",, \"T\"))","v":"Alibaba Group Holding Ltd"},null,null,null,{"$f":"IF(A9=\"\",\"\",RTD(\"cqg.rtd\", ,\"ContractData\",C9, \"LastTradeToday\",, \"T\"))","v":152.24},{"$f":"IF(A9=\"\",\"\",RTD(\"cqg.rtd\", ,\"ContractData\",C9, \"NetLastTradeToday\",, \"T\"))","v":2.1800000000000002},{"$f":"IF(A9=\"\",\"\",IFERROR(RTD(\"cqg.rtd\", ,\"ContractData\",C9, \"PerCentNetLastTrade\",, \"T\")/100,\"\"))","v":1.4527522324403573E-2},{"$f":"IF(A9=\"\",\"\",RTD(\"cqg.rtd\", ,\"ContractData\", C9, \"T_CVol\",, \"T\"))","v":6037198},9,{"$f":"IFERROR(RANK($J9,INDIRECT((\"$J$\"&\"1\"&\":$J$\"&$A$103)))+COUNTIF($J$1:J9,J9)-1,\"\")","v":2},"S.US.BABA","S.US.SHOP",{"$f":"IF(O9=\"\",\"\",PROPER(RTD(\"cqg.rtd\", ,\"ContractData\",O9, \"LongDescription\",, \"T\")))","v":"Shopify Inc."},{"$f":"IFERROR(RTD(\"cqg.rtd\", ,\"ContractData\",O9, \"PerCentNetLastTrade\",, \"T\")/100,\"\")","v":8.1439952788433176E-3},"https://finance.yahoo.com/quote/SHOP",null,8.1439952788433176E-3,"",null,{"$f":"IF(Q9=\"\",\"\",IF(Q9<0,\"\",IFERROR(PROPER(RTD(\"cqg.rtd\", ,\"ContractData\",O9, \"LongDescription\",, \"T\")),\"\")))","v":"Shopify Inc."},null,null,8.1439952788433176E-3,null,33,"S.US.SOFI",{"$f":"IF(RTD(\"cqg.rtd\", ,\"ContractData\",AC9, \"PerCentNetLastTrade\",, \"T\")>0,\"\",IFERROR(RTD(\"cqg.rtd\", ,\"ContractData\",AC9, \"PerCentNetLastTrade\",, \"T\")/100,\"\"))","v":-1.4919941775836974E-2},{"$f":"IF(AD9>0,\"\",IFERROR(PROPER(RTD(\"cqg.rtd\", ,\"ContractData\",AC9, \"LongDescription\",, \"T\")),\"\"))","v":"Sofi Tech Cmn"},{"$f":"\"\"","v":""},1.4919941775836974E-2,"https://finance.yahoo.com/quote/SOFI"]
[{"$f":"IF(Symbols!A10=\"\",\"\",Symbols!A10)","v":"S.US.BLSH"},0,"S.US.BLSH",{"$f":"IF(A10=\"\",\"\",RTD(\"cqg.rtd\", ,\"ContractData\",C10, \"LongDescription\",, \"T\"))","v":"Bullish"},null,null,null,{"$f":"IF(A10=\"\",\"\",RTD(\"cqg.rtd\", ,\"ContractData\",C10, \"LastTradeToday\",, \"T\"))","v":41.14},{"$f":"IF(A10=\"\",\"\",RTD(\"cqg.rtd\", ,\"ContractData\",C10, \"NetLastTradeToday\",, \"T\"))","v":-1.72},{"$f":"IF(A10=\"\",\"\",IFERROR(RTD(\"cqg.rtd\", ,\"ContractData\",C10, \"PerCentNetLastTrade\",, \"T\")/100,\"\"))","v":-4.0130657956136261E-2},{"$f":"IF(A10=\"\",\"\",RTD(\"cqg.rtd\", ,\"ContractData\", C10, \"T_CVol\",, \"T\"))","v":994981},10,{"$f":"IFERROR(RANK($J10,INDIRECT((\"$J$\"&\"1\"&\":$J$\"&$A$103)))+COUNTIF($J$1:J10,J10)-1,\"\")","v":41},"S.US.BLSH","S.US.Z",{"$f":"IF(O10=\"\",\"\",PROPER(RTD(\"cqg.rtd\", ,\"ContractData\",O10, \"LongDescription\",, \"T\")))","v":"Zillow Group Cl C"},{"$f":"IFERROR(RTD(\"cqg.rtd\", ,\"ContractData\",O10, \"PerCentNetLastTrade\",, \"T\")/100,\"\")","v":7.9410915391279237E-3},"https://finance.yahoo.com/quote/Z",null,7.9410915391279237E-3,"",null,{"$f":"IF(Q10=\"\",\"\",IF(Q10<0,\"\",IFERROR(PROPER(RTD(\"cqg.rtd\", ,\"ContractData\",O10, \"LongDescription\",, \"T\")),\"\")))","v":"Zillow Group Cl C"},null,null,7.9410915391279237E-3,null,32,"S.US.COIN",{"$f":"IF(RTD(\"cqg.rtd\", ,\"ContractData\",AC10, \"PerCentNetLastTrade\",, \"T\")>0,\"\",IFERROR(RTD(\"cqg.rtd\", ,\"ContractData\",AC10, \"PerCentNetLastTrade\",, \"T\")/100,\"\"))","v":-1.1804947232303006E-2},{"$f":"IF(AD10>0,\"\",IFERROR(PROPER(RTD(\"cqg.rtd\", ,\"ContractData\",AC10, \"LongDescription\",, \"T\")),\"\"))","v":"Coinbase Glb Cl A Cm"},{"$f":"\"\"","v":""},1.1804947232303006E-2,"https://finance.yahoo.com/quote/COIN"]
[{"$f":"IF(Symbols!A11=\"\",\"\",Symbols!A11)","v":"S.US.BMNR"},0,"S.US.BMNR",{"$f":"IF(A11=\"\",\"\",RTD(\"cqg.rtd\", ,\"ContractData\",C11, \"LongDescription\",, \"T\"))","v":"BitMine Immersion Technologies Inc."},null,null,null,{"$f":"IF(A11=\"\",\"\",RTD(\"cqg.rtd\", ,\"ContractData\",C11, \"LastTradeToday\",, \"T\"))","v":28.310000000000002},{"$f":"IF(A11=\"\",\"\",RTD(\"cqg.rtd\", ,\"ContractData\",C11, \"NetLastTradeToday\",, \"T\"))","v":-1.04},{"$f":"IF(A11=\"\",\"\",IFERROR(RTD(\"cqg.rtd\", ,\"ContractData\",C11, \"PerCentNetLastTrade\",, \"T\")/100,\"\"))","v":-3.5434412265758095E-2},{"$f":"IF(A11=\"\",\"\",RTD(\"cqg.rtd\", ,\"ContractData\", C11, \"T_CVol\",, \"T\"))","v":32663972},11,{"$f":"IFERROR(RANK($J11,INDIRECT((\"$J$\"&\"1\"&\":$J$\"&$A$103)))+COUNTIF($J$1:J11,J11)-1,\"\")","v":40},"S.US.BMNR","S.US.ICE",{"$f":"IF(O11=\"\",\"\",PROPER(RTD(\"cqg.rtd\", ,\"ContractData\",O11, \"LongDescription\",, \"T\")))","v":"Intercontinental, Inc."},{"$f":"IFERROR(RTD(\"cqg.rtd\", ,\"ContractData\",O11, \"PerCentNetLastTrade\",, \"T\")/100,\"\")","v":5.4725450408903645E-3},"https://finance.yahoo.com/quote/ICE",null,5.4725450408903645E-3,"",null,{"$f":"IF(Q11=\"\",\"\",IF(Q11<0,\"\",IFERROR(PROPER(RTD(\"cqg.rtd\", ,\"ContractData\",O11, \"LongDescription\",, \"T\")),\"\")))","v":"Intercontinental, Inc."},null,null,5.4725450408903645E-3,null,31,"S.CA.ETHQ",{"$f":"IF(RTD(\"cqg.rtd\", ,\"ContractData\",AC11, \"PerCentNetLastTrade\",, \"T\")>0,\"\",IFERROR(RTD(\"cqg.rtd\", ,\"ContractData\",AC11, \"PerCentNetLastTrade\",, \"T\")/100,\"\"))","v":-1.1349306431273645E-2},{"$f":"IF(AD11>0,\"\",IFERROR(PROPER(RTD(\"cqg.rtd\", ,\"ContractData\",AC11, \"LongDescription\",, \"T\")),\"\"))","v":"3Iq Ether Staking Etf"},{"$f":"\"\"","v":""},1.1349306431273645E-2,"https://finance.yahoo.com/quote/ETHQ"]
[{"$f":"IF(Symbols!A12=\"\",\"\",Symbols!A12)","v":"S.US.COIN"},0,"S.US.COIN",{"$f":"IF(A12=\"\",\"\",RTD(\"cqg.rtd\", ,\"ContractData\",C12, \"LongDescription\",, \"T\"))","v":"COINBASE GLB CL A CM"},null,null,null,{"$f":"IF(A12=\"\",\"\",RTD(\"cqg.rtd\", ,\"ContractData\",C12, \"LastTradeToday\",, \"T\"))","v":236.9},{"$f":"IF(A12=\"\",\"\",RTD(\"cqg.rtd\", ,\"ContractData\",C12, \"NetLastTradeToday\",, \"T\"))","v":-2.83},{"$f":"IF(A12=\"\",\"\",IFERROR(RTD(\"cqg.rtd\", ,\"ContractData\",C12, \"PerCentNetLastTrade\",, \"T\")/100,\"\"))","v":-1.1804947232303006E-2},{"$f":"IF(A12=\"\",\"\",RTD(\"cqg.rtd\", ,\"ContractData\", C12, \"T_CVol\",, \"T\"))","v":5925726},12,{"$f":"IFERROR(RANK($J12,INDIRECT((\"$J$\"&\"1\"&\":$J$\"&$A$103)))+COUNTIF($J$1:J12,J12)-1,\"\")","v":32},"S.US.COIN","S.US.RBLX",{"$f":"IF(O12=\"\",\"\",PROPER(RTD(\"cqg.rtd\", ,\"ContractData\",O12, \"LongDescription\",, \"T\")))","v":"Roblox Corp"},{"$f":"IFERROR(RTD(\"cqg.rtd\", ,\"ContractData\",O12, \"PerCentNetLastTrade\",, \"T\")/100,\"\")","v":4.1524181729360038E-3},"https://finance.yahoo.com/quote/RBLX",null,4.1524181729360038E-3,"",null,{"$f":"IF(Q12=\"\",\"\",IF(Q12<0,\"\",IFERROR(PROPER(RTD(\"cqg.rtd\", ,\"ContractData\",O12, \"LongDescription\",, \"T\")),\"\")))","v":"Roblox Corp"},null,null,4.1524181729360038E-3,null,30,"S.US.META",{"$f":"IF(RTD(\"cqg.rtd\", ,\"ContractData\",AC12, \"PerCentNetLastTrade\",, \"T\")>0,\"\",IFERROR(RTD(\"cqg.rtd\", ,\"ContractData\",AC12, \"PerCentNetLastTrade\",, \"T\")/100,\"\"))","v":-6.3815444535989816E-3},{"$f":"IF(AD12>0,\"\",IFERROR(PROPER(RTD(\"cqg.rtd\", ,\"ContractData\",AC12, \"LongDescription\",, \"T\")),\"\"))","v":"Meta Platforms, Inc."},{"$f":"\"\"","v":""},6.3815444535989816E-3,"https://finance.yahoo.com/quote/META"]
[{"$f":"IF(Symbols!A13=\"\",\"\",Symbols!A13)","v":"S.US.CRCL"},0,"S.US.CRCL",{"$f":"IF(A13=\"\",\"\",RTD(\"cqg.rtd\", ,\"ContractData\",C13, \"LongDescription\",, \"T\"))","v":"Circle Internet Group"},null,null,null,{"$f":"IF(A13=\"\",\"\",RTD(\"cqg.rtd\", ,\"ContractData\",C13, \"LastTradeToday\",, \"T\"))","v":81.27},{"$f":"IF(A13=\"\",\"\",RTD(\"cqg.rtd\", ,\"ContractData\",C13, \"NetLastTradeToday\",, \"T\"))","v":-1.37},{"$f":"IF(A13=\"\",\"\",IFERROR(RTD(\"cqg.rtd\", ,\"ContractData\",C13, \"PerCentNetLastTrade\",, \"T\")/100,\"\"))","v":-1.6577928363988383E-2},{"$f":"IF(A13=\"\",\"\",RTD(\"cqg.rtd\", ,\"ContractData\", C13, \"T_CVol\",, \"T\"))","v":6140584},13,{"$f":"IFERROR(RANK($J13,INDIRECT((\"$J$\"&\"1\"&\":$J$\"&$A$103)))+COUNTIF($J$1:J13,J13)-1,\"\")","v":34},"S.US.CRCL","S.US.MELI",{"$f":"IF(O13=\"\",\"\",PROPER(RTD(\"cqg.rtd\", ,\"ContractData\",O13, \"LongDescription\",, \"T\")))","v":"Mercadolibre, Inc."},{"$f":"IFERROR(RTD(\"cqg.rtd\", ,\"ContractData\",O13, \"PerCentNetLastTrade\",, \"T\")/100,\"\")","v":3.7533592565345986E-3},"https://finance.yahoo.com/quote/MELI",null,3.7533592565345986E-3,"",null,{"$f":"IF(Q13=\"\",\"\",IF(Q13<0,\"\",IFERROR(PROPER(RTD(\"cqg.rtd\", ,\"ContractData\",O13, \"LongDescription\",, \"T\")),\"\")))","v":"Mercadolibre, Inc."},null,null,3.7533592565345986E-3,null,29,"S.US.ARKF",{"$f":"IF(RTD(\"cqg.rtd\", ,\"ContractData\",AC13, \"PerCentNetLastTrade\",, \"T\")>0,\"\",IFERROR(RTD(\"cqg.rtd\", ,\"ContractData\",AC13, \"PerCentNetLastTrade\",, \"T\")/100,\"\"))","v":-5.6887444128403087E-3},{"$f":"IF(AD13>0,\"\",IFERROR(PROPER(RTD(\"cqg.rtd\", ,\"ContractData\",AC13, \"LongDescription\",, \"T\")),\"\"))","v":"Ark Blockchain & Fintech Innovation Etf"},{"$f":"\"\"","v":""},5.6887444128403087E-3,"https://finance.yahoo.com/quote/ARKF"]
[{"$f":"IF(Symbols!A14=\"\",\"\",Symbols!A14)","v":"S.US.CRWD"},1,"S.US.CRWD",{"$f":"IF(A14=\"\",\"\",RTD(\"cqg.rtd\", ,\"ContractData\",C14, \"LongDescription\",, \"T\"))","v":"CROWDSTRIKE HLD CM A"},null,null,null,{"$f":"IF(A14=\"\",\"\",RTD(\"cqg.rtd\", ,\"ContractData\",C14, \"LastTradeToday\",, \"T\"))","v":481.19},{"$f":"IF(A14=\"\",\"\",RTD(\"cqg.rtd\", ,\"ContractData\",C14, \"NetLastTradeToday\",, \"T\"))","v":4.08},{"$f":"IF(A14=\"\",\"\",IFERROR(RTD(\"cqg.rtd\", ,\"ContractData\",C14, \"PerCentNetLastTrade\",, \"T\")/100,\"\"))","v":8.5514870784515109E-3},{"$f":"IF(A14=\"\",\"\",RTD(\"cqg.rtd\", ,\"ContractData\", C14, \"T_CVol\",, \"T\"))","v":1150652},14,{"$f":"IFERROR(RANK($J14,INDIRECT((\"$J$\"&\"1\"&\":$J$\"&$A$103)))+COUNTIF($J$1:J14,J14)-1,\"\")","v":7},"S.US.CRWD","S.US.XYZ",{"$f":"IF(O14=\"\",\"\",PROPER(RTD(\"cqg.rtd\", ,\"ContractData\",O14, \"LongDescription\",, \"T\")))","v":"Square, Inc"},{"$f":"IFERROR(RTD(\"cqg.rtd\", ,\"ContractData\",O14, \"PerCentNetLastTrade\",, \"T\")/100,\"\")","v":3.3308099924299773E-3},"https://finance.yahoo.com/quote/XYZ",null,3.3308099924299773E-3,"",null,{"$f":"IF(Q14=\"\",\"\",IF(Q14<0,\"\",IFERROR(PROPER(RTD(\"cqg.rtd\", ,\"ContractData\",O14, \"LongDescription\",, \"T\")),\"\")))","v":"Square, Inc"},null,null,3.3308099924299773E-3,null,28,"S.US.SPOT",{"$f":"IF(RTD(\"cqg.rtd\", ,\"ContractData\",AC14, \"PerCentNetLastTrade\",, \"T\")>0,\"\",IFERROR(RTD(\"cqg.rtd\", ,\"ContractData\",AC14, \"PerCentNetLastTrade\",, \"T\")/100,\"\"))","v":-3.7847145268254429E-3},{"$f":"IF(AD14>0,\"\",IFERROR(PROPER(RTD(\"cqg.rtd\", ,\"ContractData\",AC14, \"LongDescription\",, \"T\")),\"\"))","v":"Spotify Technology S.A."},{"$f":"\"\"","v":""},3.7847145268254429E-3,"https://finance.yahoo.com/quote/SPOT"]
[{"$f":"IF(Symbols!A15=\"\",\"\",Symbols!A15)","v":"S.US.DASH"},1,"S.US.DASH",{"$f":"IF(A15=\"\",\"\",RTD(\"cqg.rtd\", ,\"ContractData\",C15, \"LongDescription\",, \"T\"))","v":"DOORDASH, INC. CL A"},null,null,null,{"$f":"IF(A15=\"\",\"\",RTD(\"cqg.rtd\", ,\"ContractData\",C15, \"LastTradeToday\",, \"T\"))","v":233.95000000000002},{"$f":"IF(A15=\"\",\"\",RTD(\"cqg.rtd\", ,\"ContractData\",C15, \"NetLastTradeToday\",, \"T\"))","v":1.8900000000000001},{"$f":"IF(A15=\"\",\"\",IFERROR(RTD(\"cqg.rtd\", ,\"ContractData\",C15, \"PerCentNetLastTrade\",, \"T\")/100,\"\"))","v":8.1444454020511928E-3},{"$f":"IF(A15=\"\",\"\",RTD(\"cqg.rtd\", ,\"ContractData\", C15, \"T_CVol\",, \"T\"))","v":1706729},15,{"$f":"IFERROR(RANK($J15,INDIRECT((\"$J$\"&\"1\"&\":$J$\"&$A$103)))+COUNTIF($J$1:J15,J15)-1,\"\")","v":8},"S.US.DASH","S.US.FUTU",{"$f":"IF(O15=\"\",\"\",PROPER(RTD(\"cqg.rtd\", ,\"ContractData\",O15, \"LongDescription\",, \"T\")))","v":"Futu Holdings Ads"},{"$f":"IFERROR(RTD(\"cqg.rtd\", ,\"ContractData\",O15, \"PerCentNetLastTrade\",, \"T\")/100,\"\")","v":3.1578308131414348E-3},"https://finance.yahoo.com/quote/FUTU",null,3.1578308131414348E-3,"",null,{"$f":"IF(Q15=\"\",\"\",IF(Q15<0,\"\",IFERROR(PROPER(RTD(\"cqg.rtd\", ,\"ContractData\",O15, \"LongDescription\",, \"T\")),\"\")))","v":"Futu Holdings Ads"},null,null,3.1578308131414348E-3,null,27,"S.US.GLBE",{"$f":"IF(RTD(\"cqg.rtd\", ,\"ContractData\",AC15, \"PerCentNetLastTrade\",, \"T\")>0,\"\",IFERROR(RTD(\"cqg.rtd\", ,\"ContractData\",AC15, \"PerCentNetLastTrade\",, \"T\")/100,\"\"))","v":-3.2720865844450037E-3},{"$f":"IF(AD15>0,\"\",IFERROR(PROPER(RTD(\"cqg.rtd\", ,\"ContractData\",AC15, \"LongDescription\",, \"T\")),\"\"))","v":"Global-E Online Cm"},{"$f":"\"\"","v":""},3.2720865844450037E-3,"https://finance.yahoo.com/quote/GLBE"]
[{"$f":"IF(Symbols!A16=\"\",\"\",Symbols!A16)","v":"S.US.DKNG"},1,"S.US.DKNG",{"$f":"IF(A16=\"\",\"\",RTD(\"cqg.rtd\", ,\"ContractData\",C16, \"LongDescription\",, \"T\"))","v":"DRAFTKINGS INC. CL A"},null,null,null,{"$f":"IF(A16=\"\",\"\",RTD(\"cqg.rtd\", ,\"ContractData\",C16, \"LastTradeToday\",, \"T\"))","v":34.880000000000003},{"$f":"IF(A16=\"\",\"\",RTD(\"cqg.rtd\", ,\"ContractData\",C16, \"NetLastTradeToday\",, \"T\"))","v":0.42},{"$f":"IF(A16=\"\",\"\",IFERROR(RTD(\"cqg.rtd\", ,\"ContractData\",C16, \"PerCentNetLastTrade\",, \"T\")/100,\"\"))","v":1.2188044109112013E-2},{"$f":"IF(A16=\"\",\"\",RTD(\"cqg.rtd\", ,\"ContractData\", C16, \"T_CVol\",, \"T\"))","v":5487617},16,{"$f":"IFERROR(RANK($J16,INDIRECT((\"$J$\"&\"1\"&\":$J$\"&$A$103)))+COUNTIF($J$1:J16,J16)-1,\"\")","v":5},"S.US.DKNG","S.US.KSPI"]
[{"$f":"IF(Symbols!A17=\"\",\"\",Symbols!A17)","v":"S.US.DSY"},0,"S.US.DSY",{"$f":"IF(A17=\"\",\"\",RTD(\"cqg.rtd\", ,\"ContractData\",C17, \"LongDescription\",, \"T\"))","v":"BIG TR CLD HD LD ORD"},null,null,null,{"$f":"IF(A17=\"\",\"\",RTD(\"cqg.rtd\", ,\"ContractData\",C17, \"LastTradeToday\",, \"T\"))","v":0.3},{"$f":"IF(A17=\"\",\"\",RTD(\"cqg.rtd\", ,\"ContractData\",C17, \"NetLastTradeToday\",, \"T\"))","v":-0.01},{"$f":"IF(A17=\"\",\"\",IFERROR(RTD(\"cqg.rtd\", ,\"ContractData\",C17, \"PerCentNetLastTrade\",, \"T\")/100,\"\"))","v":-3.2258064516129031E-2},{"$f":"IF(A17=\"\",\"\",RTD(\"cqg.rtd\", ,\"ContractData\", C17, \"T_CVol\",, \"T\"))","v":68073},17,{"$f":"IFERROR(RANK($J17,INDIRECT((\"$J$\"&\"1\"&\":$J$\"&$A$103)))+COUNTIF($J$1:J17,J17)-1,\"\")","v":39},"S.US.DSY","S.US.INTU"]
[{"$f":"IF(Symbols!A18=\"\",\"\",Symbols!A18)","v":"S.US.ETOR"},0,"S.US.ETOR",{"$f":"IF(A18=\"\",\"\",RTD(\"cqg.rtd\", ,\"ContractData\",C18, \"LongDescription\",, \"T\"))","v":"eToro Group Ltd."},null,null,null,{"$f":"IF(A18=\"\",\"\",RTD(\"cqg.rtd\", ,\"ContractData\",C18, \"LastTradeToday\",, \"T\"))","v":35.86},{"$f":"IF(A18=\"\",\"\",RTD(\"cqg.rtd\", ,\"ContractData\",C18, \"NetLastTradeToday\",, \"T\"))","v":-0.09},{"$f":"IF(A18=\"\",\"\",IFERROR(RTD(\"cqg.rtd\", ,\"ContractData\",C18, \"PerCentNetLastTrade\",, \"T\")/100,\"\"))","v":-2.5034770514603616E-3},{"$f":"IF(A18=\"\",\"\",RTD(\"cqg.rtd\", ,\"ContractData\", C18, \"T_CVol\",, \"T\"))","v":610796},18,{"$f":"IFERROR(RANK($J18,INDIRECT((\"$J$\"&\"1\"&\":$J$\"&$A$103)))+COUNTIF($J$1:J18,J18)-1,\"\")","v":26},"S.US.ETOR","S.US.NU"]
[{"$f":"IF(Symbols!A19=\"\",\"\",Symbols!A19)","v":"S.US.FUTU"},1,"S.US.FUTU",{"$f":"IF(A19=\"\",\"\",RTD(\"cqg.rtd\", ,\"ContractData\",C19, \"LongDescription\",, \"T\"))","v":"FUTU HOLDINGS ADS"},null,null,null,{"$f":"IF(A19=\"\",\"\",RTD(\"cqg.rtd\", ,\"ContractData\",C19, \"LastTradeToday\",, \"T\"))","v":165.19},{"$f":"IF(A19=\"\",\"\",RTD(\"cqg.rtd\", ,\"ContractData\",C19, \"NetLastTradeToday\",, \"T\"))","v":0.52},{"$f":"IF(A19=\"\",\"\",IFERROR(RTD(\"cqg.rtd\", ,\"ContractData\",C19, \"PerCentNetLastTrade\",, \"T\")/100,\"\"))","v":3.1578308131414348E-3},{"$f":"IF(A19=\"\",\"\",RTD(\"cqg.rtd\", ,\"ContractData\", C19, \"T_CVol\",, \"T\"))","v":402378},19,{"$f":"IFERROR(RANK($J19,INDIRECT((\"$J$\"&\"1\"&\":$J$\"&$A$103)))+COUNTIF($J$1:J19,J19)-1,\"\")","v":15},"S.US.FUTU","S.US.AMZN"]
[{"$f":"IF(Symbols!A20=\"\",\"\",Symbols!A20)","v":"S.US.GLBE"},0,"S.US.GLBE",{"$f":"IF(A20=\"\",\"\",RTD(\"cqg.rtd\", ,\"ContractData\",C20, \"LongDescription\",, \"T\"))","v":"GLOBAL-E ONLINE CM"},null,null,null,{"$f":"IF(A20=\"\",\"\",RTD(\"cqg.rtd\", ,\"ContractData\",C20, \"LastTradeToday\",, \"T\"))","v":39.6},{"$f":"IF(A20=\"\",\"\",RTD(\"cqg.rtd\", ,\"ContractData\",C20, \"NetLastTradeToday\",, \"T\"))","v":-0.13},{"$f":"IF(A20=\"\",\"\",IFERROR(RTD(\"cqg.rtd\", ,\"ContractData\",C20, \"PerCentNetLastTrade\",, \"T\")/100,\"\"))","v":-3.2720865844450037E-3},{"$f":"IF(A20=\"\",\"\",RTD(\"cqg.rtd\", ,\"ContractData\", C20, \"T_CVol\",, \"T\"))","v":372292},20,{"$f":"IFERROR(RANK($J20,INDIRECT((\"$J$\"&\"1\"&\":$J$\"&$A$103)))+COUNTIF($J$1:J20,J20)-1,\"\")","v":27},"S.US.GLBE","S.US.PINS"]
[{"$f":"IF(Symbols!A21=\"\",\"\",Symbols!A21)","v":"S.US.HOOD"},0,"S.US.HOOD",{"$f":"IF(A21=\"\",\"\",RTD(\"cqg.rtd\", ,\"ContractData\",C21, \"LongDescription\",, \"T\"))","v":"ROBINHOOD MK CL A CS"},null,null,null,{"$f":"IF(A21=\"\",\"\",RTD(\"cqg.rtd\", ,\"ContractData\",C21, \"LastTradeToday\",, \"T\"))","v":118.13},{"$f":"IF(A21=\"\",\"\",RTD(\"cqg.rtd\", ,\"ContractData\",C21, \"NetLastTradeToday\",, \"T\"))","v":-2.31},{"$f":"IF(A21=\"\",\"\",IFERROR(RTD(\"cqg.rtd\", ,\"ContractData\",C21, \"PerCentNetLastTrade\",, \"T\")/100,\"\"))","v":-1.9179674526735305E-2},{"$f":"IF(A21=\"\",\"\",RTD(\"cqg.rtd\", ,\"ContractData\", C21, \"T_CVol\",, \"T\"))","v":12959108},21,{"$f":"IFERROR(RANK($J21,INDIRECT((\"$J$\"&\"1\"&\":$J$\"&$A$103)))+COUNTIF($J$1:J21,J21)-1,\"\")","v":36},"S.US.HOOD","S.US.ABNB"]
[{"$f":"IF(Symbols!A22=\"\",\"\",Symbols!A22)","v":"S.US.ICE"},1,"S.US.ICE",{"$f":"IF(A22=\"\",\"\",RTD(\"cqg.rtd\", ,\"ContractData\",C22, \"LongDescription\",, \"T\"))","v":"Intercontinental, Inc."},null,null,null,{"$f":"IF(A22=\"\",\"\",RTD(\"cqg.rtd\", ,\"ContractData\",C22, \"LastTradeToday\",, \"T\"))","v":163.52000000000001},{"$f":"IF(A22=\"\",\"\",RTD(\"cqg.rtd\", ,\"ContractData\",C22, \"NetLastTradeToday\",, \"T\"))","v":0.89},{"$f":"IF(A22=\"\",\"\",IFERROR(RTD(\"cqg.rtd\", ,\"ContractData\",C22, \"PerCentNetLastTrade\",, \"T\")/100,\"\"))","v":5.4725450408903645E-3},{"$f":"IF(A22=\"\",\"\",RTD(\"cqg.rtd\", ,\"ContractData\", C22, \"T_CVol\",, \"T\"))","v":1045099},22,{"$f":"IFERROR(RANK($J22,INDIRECT((\"$J$\"&\"1\"&\":$J$\"&$A$103)))+COUNTIF($J$1:J22,J22)-1,\"\")","v":11},"S.US.ICE","S.JP.J4689"]
[{"$f":"IF(Symbols!A23=\"\",\"\",Symbols!A23)","v":"S.US.INTU"},1,"S.US.INTU",{"$f":"IF(A23=\"\",\"\",RTD(\"cqg.rtd\", ,\"ContractData\",C23, \"LongDescription\",, \"T\"))","v":"INTUIT INC"},null,null,null,{"$f":"IF(A23=\"\",\"\",RTD(\"cqg.rtd\", ,\"ContractData\",C23, \"LastTradeToday\",, \"T\"))","v":676.55000000000007},{"$f":"IF(A23=\"\",\"\",RTD(\"cqg.rtd\", ,\"ContractData\",C23, \"NetLastTradeToday\",, \"T\"))","v":1.72},{"$f":"IF(A23=\"\",\"\",IFERROR(RTD(\"cqg.rtd\", ,\"ContractData\",C23, \"PerCentNetLastTrade\",, \"T\")/100,\"\"))","v":2.5487900656461625E-3},{"$f":"IF(A23=\"\",\"\",RTD(\"cqg.rtd\", ,\"ContractData\", C23, \"T_CVol\",, \"T\"))","v":555034},23,{"$f":"IFERROR(RANK($J23,INDIRECT((\"$J$\"&\"1\"&\":$J$\"&$A$103)))+COUNTIF($J$1:J23,J23)-1,\"\")","v":17},"S.US.INTU","S.US.AMD"]
[{"$f":"IF(Symbols!A24=\"\",\"\",Symbols!A24)","v":"S.US.KLAR"},0,"S.US.KLAR",{"$f":"IF(A24=\"\",\"\",RTD(\"cqg.rtd\", ,\"ContractData\",C24, \"LongDescription\",, \"T\"))","v":"Klarna Group plc"},null,null,null,{"$f":"IF(A24=\"\",\"\",RTD(\"cqg.rtd\", ,\"ContractData\",C24, \"LastTradeToday\",, \"T\"))","v":29.59},{"$f":"IF(A24=\"\",\"\",RTD(\"cqg.rtd\", ,\"ContractData\",C24, \"NetLastTradeToday\",, \"T\"))","v":-0.83000000000000007},{"$f":"IF(A24=\"\",\"\",IFERROR(RTD(\"cqg.rtd\", ,\"ContractData\",C24, \"PerCentNetLastTrade\",, \"T\")/100,\"\"))","v":-2.7284681130834976E-2},{"$f":"IF(A24=\"\",\"\",RTD(\"cqg.rtd\", ,\"ContractData\", C24, \"T_CVol\",, \"T\"))","v":1981959},24,{"$f":"IFERROR(RANK($J24,INDIRECT((\"$J$\"&\"1\"&\":$J$\"&$A$103)))+COUNTIF($J$1:J24,J24)-1,\"\")","v":37},"S.US.KLAR","S.US.PYPL"]
[{"$f":"IF(Symbols!A25=\"\",\"\",Symbols!A25)","v":"S.US.KSPI"},1,"S.US.KSPI",{"$f":"IF(A25=\"\",\"\",RTD(\"cqg.rtd\", ,\"ContractData\",C25, \"LongDescription\",, \"T\"))","v":"JOINT STOCK CO ADS"},null,null,null,{"$f":"IF(A25=\"\",\"\",RTD(\"cqg.rtd\", ,\"ContractData\",C25, \"LastTradeToday\",, \"T\"))","v":78.650000000000006},{"$f":"IF(A25=\"\",\"\",RTD(\"cqg.rtd\", ,\"ContractData\",C25, \"NetLastTradeToday\",, \"T\"))","v":0.24},{"$f":"IF(A25=\"\",\"\",IFERROR(RTD(\"cqg.rtd\", ,\"ContractData\",C25, \"PerCentNetLastTrade\",, \"T\")/100,\"\"))","v":3.0608340772860605E-3},{"$f":"IF(A25=\"\",\"\",RTD(\"cqg.rtd\", ,\"ContractData\", C25, \"T_CVol\",, \"T\"))","v":221366},25,{"$f":"IFERROR(RANK($J25,INDIRECT((\"$J$\"&\"1\"&\":$J$\"&$A$103)))+COUNTIF($J$1:J25,J25)-1,\"\")","v":16},"S.US.KSPI","S.US.TOST"]
[{"$f":"IF(Symbols!A26=\"\",\"\",Symbols!A26)","v":"S.US.MELI"},1,"S.US.MELI",{"$f":"IF(A26=\"\",\"\",RTD(\"cqg.rtd\", ,\"ContractData\",C26, \"LongDescription\",, \"T\"))","v":"MERCADOLIBRE, INC."},null,null,null,{"$f":"IF(A26=\"\",\"\",RTD(\"cqg.rtd\", ,\"ContractData\",C26, \"LastTradeToday\",, \"T\"))","v":2005.71},{"$f":"IF(A26=\"\",\"\",RTD(\"cqg.rtd\", ,\"ContractData\",C26, \"NetLastTradeToday\",, \"T\"))","v":7.5},{"$f":"IF(A26=\"\",\"\",IFERROR(RTD(\"cqg.rtd\", ,\"ContractData\",C26, \"PerCentNetLastTrade\",, \"T\")/100,\"\"))","v":3.7533592565345986E-3},{"$f":"IF(A26=\"\",\"\",RTD(\"cqg.rtd\", ,\"ContractData\", C26, \"T_CVol\",, \"T\"))","v":192536},26,{"$f":"IFERROR(RANK($J26,INDIRECT((\"$J$\"&\"1\"&\":$J$\"&$A$103)))+COUNTIF($J$1:J26,J26)-1,\"\")","v":13},"S.US.MELI","S.US.ETOR"]
[{"$f":"IF(Symbols!A27=\"\",\"\",Symbols!A27)","v":"S.US.META"},0,"S.US.META",{"$f":"IF(A27=\"\",\"\",RTD(\"cqg.rtd\", ,\"ContractData\",C27, \"LongDescription\",, \"T\"))","v":"Meta Platforms, Inc."},null,null,null,{"$f":"IF(A27=\"\",\"\",RTD(\"cqg.rtd\", ,\"ContractData\",C27, \"LastTradeToday\",, \"T\"))","v":663.29},{"$f":"IF(A27=\"\",\"\",RTD(\"cqg.rtd\", ,\"ContractData\",C27, \"NetLastTradeToday\",, \"T\"))","v":-4.26},{"$f":"IF(A27=\"\",\"\",IFERROR(RTD(\"cqg.rtd\", ,\"ContractData\",C27, \"PerCentNetLastTrade\",, \"T\")/100,\"\"))","v":-6.3815444535989816E-3},{"$f":"IF(A27=\"\",\"\",RTD(\"cqg.rtd\", ,\"ContractData\", C27, \"T_CVol\",, \"T\"))","v":7133813},27,{"$f":"IFERROR(RANK($J27,INDIRECT((\"$J$\"&\"1\"&\":$J$\"&$A$103)))+COUNTIF($J$1:J27,J27)-1,\"\")","v":30},"S.US.META","S.US.GLBE"]
[{"$f":"IF(Symbols!A28=\"\",\"\",Symbols!A28)","v":"S.US.NU"},1,"S.US.NU",{"$f":"IF(A28=\"\",\"\",RTD(\"cqg.rtd\", ,\"ContractData\",C28, \"LongDescription\",, \"T\"))","v":"Nu Holdings Ltd."},null,null,null,{"$f":"IF(A28=\"\",\"\",RTD(\"cqg.rtd\", ,\"ContractData\",C28, \"LastTradeToday\",, \"T\"))","v":16.760000000000002},{"$f":"IF(A28=\"\",\"\",RTD(\"cqg.rtd\", ,\"ContractData\",C28, \"NetLastTradeToday\",, \"T\"))","v":0.02},{"$f":"IF(A28=\"\",\"\",IFERROR(RTD(\"cqg.rtd\", ,\"ContractData\",C28, \"PerCentNetLastTrade\",, \"T\")/100,\"\"))","v":1.1947431302270011E-3},{"$f":"IF(A28=\"\",\"\",RTD(\"cqg.rtd\", ,\"ContractData\", C28, \"T_CVol\",, \"T\"))","v":11809694},28,{"$f":"IFERROR(RANK($J28,INDIRECT((\"$J$\"&\"1\"&\":$J$\"&$A$103)))+COUNTIF($J$1:J28,J28)-1,\"\")","v":18},"S.US.NU","S.US.SPOT"]
[{"$f":"IF(Symbols!A29=\"\",\"\",Symbols!A29)","v":"S.US.NVDA"},1,"S.US.NVDA",{"$f":"IF(A29=\"\",\"\",RTD(\"cqg.rtd\", ,\"ContractData\",C29, \"LongDescription\",, \"T\"))","v":"NVIDIA CORPORATION"},null,null,null,{"$f":"IF(A29=\"\",\"\",RTD(\"cqg.rtd\", ,\"ContractData\",C29, \"LastTradeToday\",, \"T\"))","v":190.53},{"$f":"IF(A29=\"\",\"\",RTD(\"cqg.rtd\", ,\"ContractData\",C29, \"NetLastTradeToday\",, \"T\"))","v":1.92},{"$f":"IF(A29=\"\",\"\",IFERROR(RTD(\"cqg.rtd\", ,\"ContractData\",C29, \"PerCentNetLastTrade\",, \"T\")/100,\"\"))","v":1.0179735963098457E-2},{"$f":"IF(A29=\"\",\"\",RTD(\"cqg.rtd\", ,\"ContractData\", C29, \"T_CVol\",, \"T\"))","v":139740292},29,{"$f":"IFERROR(RANK($J29,INDIRECT((\"$J$\"&\"1\"&\":$J$\"&$A$103)))+COUNTIF($J$1:J29,J29)-1,\"\")","v":6},"S.US.NVDA","S.US.ARKF"]
[{"$f":"IF(Symbols!A30=\"\",\"\",Symbols!A30)","v":"S.US.PINS"},1,"S.US.PINS",{"$f":"IF(A30=\"\",\"\",RTD(\"cqg.rtd\", ,\"ContractData\",C30, \"LongDescription\",, \"T\"))","v":"Pinterest, Inc."},null,null,null,{"$f":"IF(A30=\"\",\"\",RTD(\"cqg.rtd\", ,\"ContractData\",C30, \"LastTradeToday\",, \"T\"))","v":26.14},{"$f":"IF(A30=\"\",\"\",RTD(\"cqg.rtd\", ,\"ContractData\",C30, \"NetLastTradeToday\",, \"T\"))","v":0.01},{"$f":"IF(A30=\"\",\"\",IFERROR(RTD(\"cqg.rtd\", ,\"ContractData\",C30, \"PerCentNetLastTrade\",, \"T\")/100,\"\"))","v":3.8270187523918863E-4},{"$f":"IF(A30=\"\",\"\",RTD(\"cqg.rtd\", ,\"ContractData\", C30, \"T_CVol\",, \"T\"))","v":5425554},30,{"$f":"IFERROR(RANK($J30,INDIRECT((\"$J$\"&\"1\"&\":$J$\"&$A$103)))+COUNTIF($J$1:J30,J30)-1,\"\")","v":20},"S.US.PINS","S.US.META"]
[{"$f":"IF(Symbols!A31=\"\",\"\",Symbols!A31)","v":"S.US.PLTR"},0,"S.US.PLTR",{"$f":"IF(A31=\"\",\"\",RTD(\"cqg.rtd\", ,\"ContractData\",C31, \"LongDescription\",, \"T\"))","v":"PALANTIR TECH CL A"},null,null,null,{"$f":"IF(A31=\"\",\"\",RTD(\"cqg.rtd\", ,\"ContractData\",C31, \"LastTradeToday\",, \"T\"))","v":188.71},{"$f":"IF(A31=\"\",\"\",RTD(\"cqg.rtd\", ,\"ContractData\",C31, \"NetLastTradeToday\",, \"T\"))","v":-5.46},{"$f":"IF(A31=\"\",\"\",IFERROR(RTD(\"cqg.rtd\", ,\"ContractData\",C31, \"PerCentNetLastTrade\",, \"T\")/100,\"\"))","v":-2.8119688932378845E-2},{"$f":"IF(A31=\"\",\"\",RTD(\"cqg.rtd\", ,\"ContractData\", C31, \"T_CVol\",, \"T\"))","v":26261988},31,{"$f":"IFERROR(RANK($J31,INDIRECT((\"$J$\"&\"1\"&\":$J$\"&$A$103)))+COUNTIF($J$1:J31,J31)-1,\"\")","v":38},"S.US.PLTR","S.CA.ETHQ"]
[{"$f":"IF(Symbols!A32=\"\",\"\",Symbols!A32)","v":"S.US.PYPL"},0,"S.US.PYPL",{"$f":"IF(A32=\"\",\"\",RTD(\"cqg.rtd\", ,\"ContractData\",C32, \"LongDescription\",, \"T\"))","v":"PAYPAL HOLDINGS"},null,null,null,{"$f":"IF(A32=\"\",\"\",RTD(\"cqg.rtd\", ,\"ContractData\",C32, \"LastTradeToday\",, \"T\"))","v":59.97},{"$f":"IF(A32=\"\",\"\",RTD(\"cqg.rtd\", ,\"ContractData\",C32, \"NetLastTradeToday\",, \"T\"))","v":-7.0000000000000007E-2},{"$f":"IF(A32=\"\",\"\",IFERROR(RTD(\"cqg.rtd\", ,\"ContractData\",C32, \"PerCentNetLastTrade\",, \"T\")/100,\"\"))","v":-1.1658894070619586E-3},{"$f":"IF(A32=\"\",\"\",RTD(\"cqg.rtd\", ,\"ContractData\", C32, \"T_CVol\",, \"T\"))","v":7537808},32,{"$f":"IFERROR(RANK($J32,INDIRECT((\"$J$\"&\"1\"&\":$J$\"&$A$103)))+COUNTIF($J$1:J32,J32)-1,\"\")","v":24},"S.US.PYPL","S.US.COIN"]
[{"$f":"IF(Symbols!A33=\"\",\"\",Symbols!A33)","v":"S.US.RBLX"},1,"S.US.RBLX",{"$f":"IF(A33=\"\",\"\",RTD(\"cqg.rtd\", ,\"ContractData\",C33, \"LongDescription\",, \"T\"))","v":"Roblox Corp"},null,null,null,{"$f":"IF(A33=\"\",\"\",RTD(\"cqg.rtd\", ,\"ContractData\",C33, \"LastTradeToday\",, \"T\"))","v":82.22},{"$f":"IF(A33=\"\",\"\",RTD(\"cqg.rtd\", ,\"ContractData\",C33, \"NetLastTradeToday\",, \"T\"))","v":0.34},{"$f":"IF(A33=\"\",\"\",IFERROR(RTD(\"cqg.rtd\", ,\"ContractData\",C33, \"PerCentNetLastTrade\",, \"T\")/100,\"\"))","v":4.1524181729360038E-3},{"$f":"IF(A33=\"\",\"\",RTD(\"cqg.rtd\", ,\"ContractData\", C33, \"T_CVol\",, \"T\"))","v":3863678},33,{"$f":"IFERROR(RANK($J33,INDIRECT((\"$J$\"&\"1\"&\":$J$\"&$A$103)))+COUNTIF($J$1:J33,J33)-1,\"\")","v":12},"S.US.RBLX","S.US.SOFI"]
[{"$f":"IF(Symbols!A34=\"\",\"\",Symbols!A34)","v":"S.US.ROKU"},1,"S.US.ROKU",{"$f":"IF(A34=\"\",\"\",RTD(\"cqg.rtd\", ,\"ContractData\",C34, \"LongDescription\",, \"T\"))","v":"ROKU, INC. A CMN"},null,null,null,{"$f":"IF(A34=\"\",\"\",RTD(\"cqg.rtd\", ,\"ContractData\",C34, \"LastTradeToday\",, \"T\"))","v":112.08},{"$f":"IF(A34=\"\",\"\",RTD(\"cqg.rtd\", ,\"ContractData\",C34, \"NetLastTradeToday\",, \"T\"))","v":1.4000000000000001},{"$f":"IF(A34=\"\",\"\",IFERROR(RTD(\"cqg.rtd\", ,\"ContractData\",C34, \"PerCentNetLastTrade\",, \"T\")/100,\"\"))","v":1.2649078424286231E-2},{"$f":"IF(A34=\"\",\"\",RTD(\"cqg.rtd\", ,\"ContractData\", C34, \"T_CVol\",, \"T\"))","v":1576937},34,{"$f":"IFERROR(RANK($J34,INDIRECT((\"$J$\"&\"1\"&\":$J$\"&$A$103)))+COUNTIF($J$1:J34,J34)-1,\"\")","v":4},"S.US.ROKU","S.US.CRCL"]
[{"$f":"IF(Symbols!A35=\"\",\"\",Symbols!A35)","v":"S.US.SE"},1,"S.US.SE",{"$f":"IF(A35=\"\",\"\",RTD(\"cqg.rtd\", ,\"ContractData\",C35, \"LongDescription\",, \"T\"))","v":"Sea Limited"},null,null,null,{"$f":"IF(A35=\"\",\"\",RTD(\"cqg.rtd\", ,\"ContractData\",C35, \"LastTradeToday\",, \"T\"))","v":127.85000000000001},{"$f":"IF(A35=\"\",\"\",RTD(\"cqg.rtd\", ,\"ContractData\",C35, \"NetLastTradeToday\",, \"T\"))","v":1.6},{"$f":"IF(A35=\"\",\"\",IFERROR(RTD(\"cqg.rtd\", ,\"ContractData\",C35, \"PerCentNetLastTrade\",, \"T\")/100,\"\"))","v":1.2673267326732674E-2},{"$f":"IF(A35=\"\",\"\",RTD(\"cqg.rtd\", ,\"ContractData\", C35, \"T_CVol\",, \"T\"))","v":1840549},35,{"$f":"IFERROR(RANK($J35,INDIRECT((\"$J$\"&\"1\"&\":$J$\"&$A$103)))+COUNTIF($J$1:J35,J35)-1,\"\")","v":3},"S.US.SE","S.CA.SOLQ"]
[{"$f":"IF(Symbols!A36=\"\",\"\",Symbols!A36)","v":"S.US.SHOP"},1,"S.US.SHOP",{"$f":"IF(A36=\"\",\"\",RTD(\"cqg.rtd\", ,\"ContractData\",C36, \"LongDescription\",, \"T\"))","v":"Shopify Inc."},null,null,null,{"$f":"IF(A36=\"\",\"\",RTD(\"cqg.rtd\", ,\"ContractData\",C36, \"LastTradeToday\",, \"T\"))","v":170.83},{"$f":"IF(A36=\"\",\"\",RTD(\"cqg.rtd\", ,\"ContractData\",C36, \"NetLastTradeToday\",, \"T\"))","v":1.3800000000000001},{"$f":"IF(A36=\"\",\"\",IFERROR(RTD(\"cqg.rtd\", ,\"ContractData\",C36, \"PerCentNetLastTrade\",, \"T\")/100,\"\"))","v":8.1439952788433176E-3},{"$f":"IF(A36=\"\",\"\",RTD(\"cqg.rtd\", ,\"ContractData\", C36, \"T_CVol\",, \"T\"))","v":2574362},36,{"$f":"IFERROR(RANK($J36,INDIRECT((\"$J$\"&\"1\"&\":$J$\"&$A$103)))+COUNTIF($J$1:J36,J36)-1,\"\")","v":9},"S.US.SHOP","S.US.HOOD"]
[{"$f":"IF(Symbols!A37=\"\",\"\",Symbols!A37)","v":"S.US.SLMT"},1,"S.US.SLMT",{"$f":"IF(A37=\"\",\"\",RTD(\"cqg.rtd\", ,\"ContractData\",C37, \"LongDescription\",, \"T\"))","v":"BRERA HOLDINGS B OS"},null,null,null,{"$f":"IF(A37=\"\",\"\",RTD(\"cqg.rtd\", ,\"ContractData\",C37, \"LastTradeToday\",, \"T\"))","v":2.1},{"$f":"IF(A37=\"\",\"\",RTD(\"cqg.rtd\", ,\"ContractData\",C37, \"NetLastTradeToday\",, \"T\"))","v":0.04},{"$f":"IF(A37=\"\",\"\",IFERROR(RTD(\"cqg.rtd\", ,\"ContractData\",C37, \"PerCentNetLastTrade\",, \"T\")/100,\"\"))","v":1.9417475728155342E-2},{"$f":"IF(A37=\"\",\"\",RTD(\"cqg.rtd\", ,\"ContractData\", C37, \"T_CVol\",, \"T\"))","v":881435},37,{"$f":"IFERROR(RANK($J37,INDIRECT((\"$J$\"&\"1\"&\":$J$\"&$A$103)))+COUNTIF($J$1:J37,J37)-1,\"\")","v":1},"S.US.SLMT","S.US.KLAR"]
[{"$f":"IF(Symbols!A38=\"\",\"\",Symbols!A38)","v":"S.US.SOFI"},0,"S.US.SOFI",{"$f":"IF(A38=\"\",\"\",RTD(\"cqg.rtd\", ,\"ContractData\",C38, \"LongDescription\",, \"T\"))","v":"SOFI TECH CMN"},null,null,null,{"$f":"IF(A38=\"\",\"\",RTD(\"cqg.rtd\", ,\"ContractData\",C38, \"LastTradeToday\",, \"T\"))","v":27.07},{"$f":"IF(A38=\"\",\"\",RTD(\"cqg.rtd\", ,\"ContractData\",C38, \"NetLastTradeToday\",, \"T\"))","v":-0.41000000000000003},{"$f":"IF(A38=\"\",\"\",IFERROR(RTD(\"cqg.rtd\", ,\"ContractData\",C38, \"PerCentNetLastTrade\",, \"T\")/100,\"\"))","v":-1.4919941775836974E-2},{"$f":"IF(A38=\"\",\"\",RTD(\"cqg.rtd\", ,\"ContractData\", C38, \"T_CVol\",, \"T\"))","v":24735553},38,{"$f":"IFERROR(RANK($J38,INDIRECT((\"$J$\"&\"1\"&\":$J$\"&$A$103)))+COUNTIF($J$1:J38,J38)-1,\"\")","v":33},"S.US.SOFI","S.US.PLTR"]
[{"$f":"IF(Symbols!A39=\"\",\"\",Symbols!A39)","v":"S.US.SPOT"},0,"S.US.SPOT",{"$f":"IF(A39=\"\",\"\",RTD(\"cqg.rtd\", ,\"ContractData\",C39, \"LongDescription\",, \"T\"))","v":"Spotify Technology S.A."},null,null,null,{"$f":"IF(A39=\"\",\"\",RTD(\"cqg.rtd\", ,\"ContractData\",C39, \"LastTradeToday\",, \"T\"))","v":584.35},{"$f":"IF(A39=\"\",\"\",RTD(\"cqg.rtd\", ,\"ContractData\",C39, \"NetLastTradeToday\",, \"T\"))","v":-2.2200000000000002},{"$f":"IF(A39=\"\",\"\",IFERROR(RTD(\"cqg.rtd\", ,\"ContractData\",C39, \"PerCentNetLastTrade\",, \"T\")/100,\"\"))","v":-3.7847145268254429E-3},{"$f":"IF(A39=\"\",\"\",RTD(\"cqg.rtd\", ,\"ContractData\", C39, \"T_CVol\",, \"T\"))","v":565251},39,{"$f":"IFERROR(RANK($J39,INDIRECT((\"$J$\"&\"1\"&\":$J$\"&$A$103)))+COUNTIF($J$1:J39,J39)-1,\"\")","v":28},"S.US.SPOT","S.US.DSY"]
[{"$f":"IF(Symbols!A40=\"\",\"\",Symbols!A40)","v":"S.US.TOST"},0,"S.US.TOST",{"$f":"IF(A40=\"\",\"\",RTD(\"cqg.rtd\", ,\"ContractData\",C40, \"LongDescription\",, \"T\"))","v":"Toast, Inc."},null,null,null,{"$f":"IF(A40=\"\",\"\",RTD(\"cqg.rtd\", ,\"ContractData\",C40, \"LastTradeToday\",, \"T\"))","v":36.44},{"$f":"IF(A40=\"\",\"\",RTD(\"cqg.rtd\", ,\"ContractData\",C40, \"NetLastTradeToday\",, \"T\"))","v":-0.05},{"$f":"IF(A40=\"\",\"\",IFERROR(RTD(\"cqg.rtd\", ,\"ContractData\",C40, \"PerCentNetLastTrade\",, \"T\")/100,\"\"))","v":-1.3702384214853386E-3},{"$f":"IF(A40=\"\",\"\",RTD(\"cqg.rtd\", ,\"ContractData\", C40, \"T_CVol\",, \"T\"))","v":2950428},40,{"$f":"IFERROR(RANK($J40,INDIRECT((\"$J$\"&\"1\"&\":$J$\"&$A$103)))+COUNTIF($J$1:J40,J40)-1,\"\")","v":25},"S.US.TOST","S.US.BMNR"]
[{"$f":"IF(Symbols!A41=\"\",\"\",Symbols!A41)","v":"S.US.XYZ"},1,"S.US.XYZ",{"$f":"IF(A41=\"\",\"\",RTD(\"cqg.rtd\", ,\"ContractData\",C41, \"LongDescription\",, \"T\"))","v":"Square, Inc"},null,null,null,{"$f":"IF(A41=\"\",\"\",RTD(\"cqg.rtd\", ,\"ContractData\",C41, \"LastTradeToday\",, \"T\"))","v":66.27},{"$f":"IF(A41=\"\",\"\",RTD(\"cqg.rtd\", ,\"ContractData\",C41, \"NetLastTradeToday\",, \"T\"))","v":0.22},{"$f":"IF(A41=\"\",\"\",IFERROR(RTD(\"cqg.rtd\", ,\"ContractData\",C41, \"PerCentNetLastTrade\",, \"T\")/100,\"\"))","v":3.3308099924299773E-3},{"$f":"IF(A41=\"\",\"\",RTD(\"cqg.rtd\", ,\"ContractData\", C41, \"T_CVol\",, \"T\"))","v":3118434},41,{"$f":"IFERROR(RANK($J41,INDIRECT((\"$J$\"&\"1\"&\":$J$\"&$A$103)))+COUNTIF($J$1:J41,J41)-1,\"\")","v":14},"S.US.XYZ","S.US.BLSH"]
[{"$f":"IF(Symbols!A42=\"\",\"\",Symbols!A42)","v":"S.US.Z"},1,"S.US.Z",{"$f":"IF(A42=\"\",\"\",RTD(\"cqg.rtd\", ,\"ContractData\",C42, \"LongDescription\",, \"T\"))","v":"ZILLOW GROUP CL C"},null,null,null,{"$f":"IF(A42=\"\",\"\",RTD(\"cqg.rtd\", ,\"ContractData\",C42, \"LastTradeToday\",, \"T\"))","v":69.81},{"$f":"IF(A42=\"\",\"\",RTD(\"cqg.rtd\", ,\"ContractData\",C42, \"NetLastTradeToday\",, \"T\"))","v":0.55000000000000004},{"$f":"IF(A42=\"\",\"\",IFERROR(RTD(\"cqg.rtd\", ,\"ContractData\",C42, \"PerCentNetLastTrade\",, \"T\")/100,\"\"))","v":7.9410915391279237E-3},{"$f":"IF(A42=\"\",\"\",RTD(\"cqg.rtd\", ,\"ContractData\", C42, \"T_CVol\",, \"T\"))","v":1158996},42,{"$f":"IFERROR(RANK($J42,INDIRECT((\"$J$\"&\"1\"&\":$J$\"&$A$103)))+COUNTIF($J$1:J42,J42)-1,\"\")","v":10},"S.US.Z",""]
[{"$f":"IF(Symbols!A43=\"\",\"\",Symbols!A43)","v":""},"","",{"$f":"IF(A43=\"\",\"\",RTD(\"cqg.rtd\", ,\"ContractData\",C43, \"LongDescription\",, \"T\"))","v":""},null,null,null,{"$f":"IF(A43=\"\",\"\",RTD(\"cqg.rtd\", ,\"ContractData\",C43, \"LastTradeToday\",, \"T\"))","v":""},{"$f":"IF(A43=\"\",\"\",RTD(\"cqg.rtd\", ,\"ContractData\",C43, \"NetLastTradeToday\",, \"T\"))","v":""},{"$f":"IF(A43=\"\",\"\",IFERROR(RTD(\"cqg.rtd\", ,\"ContractData\",C43, \"PerCentNetLastTrade\",, \"T\")/100,\"\"))","v":""},{"$f":"IF(A43=\"\",\"\",RTD(\"cqg.rtd\", ,\"ContractData\", C43, \"T_CVol\",, \"T\"))","v":""},43,{"$f":"IFERROR(RANK($J43,INDIRECT((\"$J$\"&\"1\"&\":$J$\"&$A$103)))+COUNTIF($J$1:J43,J43)-1,\"\")","v":""},"",""]
[{"$f":"IF(Symbols!A44=\"\",\"\",Symbols!A44)","v":""},"","",{"$f":"IF(A44=\"\",\"\",RTD(\"cqg.rtd\", ,\"ContractData\",C44, \"LongDescription\",, \"T\"))","v":""},null,null,null,{"$f":"IF(A44=\"\",\"\",RTD(\"cqg.rtd\", ,\"ContractData\",C44, \"LastTradeToday\",, \"T\"))","v":""},{"$f":"IF(A44=\"\",\"\",RTD(\"cqg.rtd\", ,\"ContractData\",C44, \"NetLastTradeToday\",, \"T\"))","v":""},{"$f":"IF(A44=\"\",\"\",IFERROR(RTD(\"cqg.rtd\", ,\"ContractData\",C44, \"PerCentNetLastTrade\",, \"T\")/100,\"\"))","v":""},{"$f":"IF(A44=\"\",\"\",RTD(\"cqg.rtd\", ,\"ContractData\", C44, \"T_CVol\",, \"T\"))","v":""},44,{"$f":"IFERROR(RANK($J44,INDIRECT((\"$J$\"&\"1\"&\":$J$\"&$A$103)))+COUNTIF($J$1:J44,J44)-1,\"\")","v":""},"",""]
[{"$f":"IF(Symbols!A45=\"\",\"\",Symbols!A45)","v":""},"","",{"$f":"IF(A45=\"\",\"\",RTD(\"cqg.rtd\", ,\"ContractData\",C45, \"LongDescription\",, \"T\"))","v":""},null,null,null,{"$f":"IF(A45=\"\",\"\",RTD(\"cqg.rtd\", ,\"ContractData\",C45, \"LastTradeToday\",, \"T\"))","v":""},{"$f":"IF(A45=\"\",\"\",RTD(\"cqg.rtd\", ,\"ContractData\",C45, \"NetLastTradeToday\",, \"T\"))","v":""},{"$f":"IF(A45=\"\",\"\",IFERROR(RTD(\"cqg.rtd\", ,\"ContractData\",C45, \"PerCentNetLastTrade\",, \"T\")/100,\"\"))","v":""},{"$f":"IF(A45=\"\",\"\",RTD(\"cqg.rtd\", ,\"ContractData\", C45, \"T_CVol\",, \"T\"))","v":""},45,{"$f":"IFERROR(RANK($J45,INDIRECT((\"$J$\"&\"1\"&\":$J$\"&$A$103)))+COUNTIF($J$1:J45,J45)-1,\"\")","v":""},"",""]
[{"$f":"IF(Symbols!A46=\"\",\"\",Symbols!A46)","v":""},"","",{"$f":"IF(A46=\"\",\"\",RTD(\"cqg.rtd\", ,\"ContractData\",C46, \"LongDescription\",, \"T\"))","v":""},null,null,null,{"$f":"IF(A46=\"\",\"\",RTD(\"cqg.rtd\", ,\"ContractData\",C46, \"LastTradeToday\",, \"T\"))","v":""},{"$f":"IF(A46=\"\",\"\",RTD(\"cqg.rtd\", ,\"ContractData\",C46, \"NetLastTradeToday\",, \"T\"))","v":""},{"$f":"IF(A46=\"\",\"\",IFERROR(RTD(\"cqg.rtd\", ,\"ContractData\",C46, \"PerCentNetLastTrade\",, \"T\")/100,\"\"))","v":""},{"$f":"IF(A46=\"\",\"\",RTD(\"cqg.rtd\", ,\"ContractData\", C46, \"T_CVol\",, \"T\"))","v":""},46,{"$f":"IFERROR(RANK($J46,INDIRECT((\"$J$\"&\"1\"&\":$J$\"&$A$103)))+COUNTIF($J$1:J46,J46)-1,\"\")","v":""},"",""]
[{"$f":"IF(Symbols!A47=\"\",\"\",Symbols!A47)","v":""},"","",{"$f":"IF(A47=\"\",\"\",RTD(\"cqg.rtd\", ,\"ContractData\",C47, \"LongDescription\",, \"T\"))","v":""},null,null,null,{"$f":"IF(A47=\"\",\"\",RTD(\"cqg.rtd\", ,\"ContractData\",C47, \"LastTradeToday\",, \"T\"))","v":""},{"$f":"IF(A47=\"\",\"\",RTD(\"cqg.rtd\", ,\"ContractData\",C47, \"NetLastTradeToday\",, \"T\"))","v":""},{"$f":"IF(A47=\"\",\"\",IFERROR(RTD(\"cqg.rtd\", ,\"ContractData\",C47, \"PerCentNetLastTrade\",, \"T\")/100,\"\"))","v":""},{"$f":"IF(A47=\"\",\"\",RTD(\"cqg.rtd\", ,\"ContractData\", C47, \"T_CVol\",, \"T\"))","v":""},47,{"$f":"IFERROR(RANK($J47,INDIRECT((\"$J$\"&\"1\"&\":$J$\"&$A$103)))+COUNTIF($J$1:J47,J47)-1,\"\")","v":""},"",""]
[{"$f":"IF(Symbols!A48=\"\",\"\",Symbols!A48)","v":""},"","",{"$f":"IF(A48=\"\",\"\",RTD(\"cqg.rtd\", ,\"ContractData\",C48, \"LongDescription\",, \"T\"))","v":""},null,null,null,{"$f":"IF(A48=\"\",\"\",RTD(\"cqg.rtd\", ,\"ContractData\",C48, \"LastTradeToday\",, \"T\"))","v":""},{"$f":"IF(A48=\"\",\"\",RTD(\"cqg.rtd\", ,\"ContractData\",C48, \"NetLastTradeToday\",, \"T\"))","v":""},{"$f":"IF(A48=\"\",\"\",IFERROR(RTD(\"cqg.rtd\", ,\"ContractData\",C48, \"PerCentNetLastTrade\",, \"T\")/100,\"\"))","v":""},{"$f":"IF(A48=\"\",\"\",RTD(\"cqg.rtd\", ,\"ContractData\", C48, \"T_CVol\",, \"T\"))","v":""},48,{"$f":"IFERROR(RANK($J48,INDIRECT((\"$J$\"&\"1\"&\":$J$\"&$A$103)))+COUNTIF($J$1:J48,J48)-1,\"\")","v":""},"",""]
[{"$f":"IF(Symbols!A49=\"\",\"\",Symbols!A49)","v":""},"","",{"$f":"IF(A49=\"\",\"\",RTD(\"cqg.rtd\", ,\"ContractData\",C49, \"LongDescription\",, \"T\"))","v":""},null,null,null,{"$f":"IF(A49=\"\",\"\",RTD(\"cqg.rtd\", ,\"ContractData\",C49, \"LastTradeToday\",, \"T\"))","v":""},{"$f":"IF(A49=\"\",\"\",RTD(\"cqg.rtd\", ,\"ContractData\",C49, \"NetLastTradeToday\",, \"T\"))","v":""},{"$f":"IF(A49=\"\",\"\",IFERROR(RTD(\"cqg.rtd\", ,\"ContractData\",C49, \"PerCentNetLastTrade\",, \"T\")/100,\"\"))","v":""},{"$f":"IF(A49=\"\",\"\",RTD(\"cqg.rtd\", ,\"ContractData\", C49, \"T_CVol\",, \"T\"))","v":""},49,{"$f":"IFERROR(RANK($J49,INDIRECT((\"$J$\"&\"1\"&\":$J$\"&$A$103)))+COUNTIF($J$1:J49,J49)-1,\"\")","v":""},"",""]
[{"$f":"IF(Symbols!A50=\"\",\"\",Symbols!A50)","v":""},"","",{"$f":"IF(A50=\"\",\"\",RTD(\"cqg.rtd\", ,\"ContractData\",C50, \"LongDescription\",, \"T\"))","v":""},null,null,null,{"$f":"IF(A50=\"\",\"\",RTD(\"cqg.rtd\", ,\"ContractData\",C50, \"LastTradeToday\",, \"T\"))","v":""},{"$f":"IF(A50=\"\",\"\",RTD(\"cqg.rtd\", ,\"ContractData\",C50, \"NetLastTradeToday\",, \"T\"))","v":""},{"$f":"IF(A50=\"\",\"\",IFERROR(RTD(\"cqg.rtd\", ,\"ContractData\",C50, \"PerCentNetLastTrade\",, \"T\")/100,\"\"))","v":""},{"$f":"IF(A50=\"\",\"\",RTD(\"cqg.rtd\", ,\"ContractData\", C50, \"T_CVol\",, \"T\"))","v":""},50,{"$f":"IFERROR(RANK($J50,INDIRECT((\"$J$\"&\"1\"&\":$J$\"&$A$103)))+COUNTIF($J$1:J50,J50)-1,\"\")","v":""},"",""]
[{"$f":"IF(Symbols!A51=\"\",\"\",Symbols!A51)","v":""},"","",{"$f":"IF(A51=\"\",\"\",RTD(\"cqg.rtd\", ,\"ContractData\",C51, \"LongDescription\",, \"T\"))","v":""},null,null,null,{"$f":"IF(A51=\"\",\"\",RTD(\"cqg.rtd\", ,\"ContractData\",C51, \"LastTradeToday\",, \"T\"))","v":""},{"$f":"IF(A51=\"\",\"\",RTD(\"cqg.rtd\", ,\"ContractData\",C51, \"NetLastTradeToday\",, \"T\"))","v":""},{"$f":"IF(A51=\"\",\"\",IFERROR(RTD(\"cqg.rtd\", ,\"ContractData\",C51, \"PerCentNetLastTrade\",, \"T\")/100,\"\"))","v":""},{"$f":"IF(A51=\"\",\"\",RTD(\"cqg.rtd\", ,\"ContractData\", C51, \"T_CVol\",, \"T\"))","v":""},51,{"$f":"IFERROR(RANK($J51,INDIRECT((\"$J$\"&\"1\"&\":$J$\"&$A$103)))+COUNTIF($J$1:J51,J51)-1,\"\")","v":""},"",""]
[{"$f":"IF(Symbols!A52=\"\",\"\",Symbols!A52)","v":""},"","",{"$f":"IF(A52=\"\",\"\",RTD(\"cqg.rtd\", ,\"ContractData\",C52, \"LongDescription\",, \"T\"))","v":""},null,null,null,{"$f":"IF(A52=\"\",\"\",RTD(\"cqg.rtd\", ,\"ContractData\",C52, \"LastTradeToday\",, \"T\"))","v":""},{"$f":"IF(A52=\"\",\"\",RTD(\"cqg.rtd\", ,\"ContractData\",C52, \"NetLastTradeToday\",, \"T\"))","v":""},{"$f":"IF(A52=\"\",\"\",IFERROR(RTD(\"cqg.rtd\", ,\"ContractData\",C52, \"PerCentNetLastTrade\",, \"T\")/100,\"\"))","v":""},{"$f":"IF(A52=\"\",\"\",RTD(\"cqg.rtd\", ,\"ContractData\", C52, \"T_CVol\",, \"T\"))","v":""},52,{"$f":"IFERROR(RANK($J52,INDIRECT((\"$J$\"&\"1\"&\":$J$\"&$A$103)))+COUNTIF($J$1:J52,J52)-1,\"\")","v":""},"",""]
[{"$f":"IF(Symbols!A53=\"\",\"\",Symbols!A53)","v":""},"","",{"$f":"IF(A53=\"\",\"\",RTD(\"cqg.rtd\", ,\"ContractData\",C53, \"LongDescription\",, \"T\"))","v":""},null,null,null,{"$f":"IF(A53=\"\",\"\",RTD(\"cqg.rtd\", ,\"ContractData\",C53, \"LastTradeToday\",, \"T\"))","v":""},{"$f":"IF(A53=\"\",\"\",RTD(\"cqg.rtd\", ,\"ContractData\",C53, \"NetLastTradeToday\",, \"T\"))","v":""},{"$f":"IF(A53=\"\",\"\",IFERROR(RTD(\"cqg.rtd\", ,\"ContractData\",C53, \"PerCentNetLastTrade\",, \"T\")/100,\"\"))","v":""},{"$f":"IF(A53=\"\",\"\",RTD(\"cqg.rtd\", ,\"ContractData\", C53, \"T_CVol\",, \"T\"))","v":""},53,{"$f":"IFERROR(RANK($J53,INDIRECT((\"$J$\"&\"1\"&\":$J$\"&$A$103)))+COUNTIF($J$1:J53,J53)-1,\"\")","v":""},"",""]
[{"$f":"IF(Symbols!A54=\"\",\"\",Symbols!A54)","v":""},"","",{"$f":"IF(A54=\"\",\"\",RTD(\"cqg.rtd\", ,\"ContractData\",C54, \"LongDescription\",, \"T\"))","v":""},null,null,null,{"$f":"IF(A54=\"\",\"\",RTD(\"cqg.rtd\", ,\"ContractData\",C54, \"LastTradeToday\",, \"T\"))","v":""},{"$f":"IF(A54=\"\",\"\",RTD(\"cqg.rtd\", ,\"ContractData\",C54, \"NetLastTradeToday\",, \"T\"))","v":""},{"$f":"IF(A54=\"\",\"\",IFERROR(RTD(\"cqg.rtd\", ,\"ContractData\",C54, \"PerCentNetLastTrade\",, \"T\")/100,\"\"))","v":""},{"$f":"IF(A54=\"\",\"\",RTD(\"cqg.rtd\", ,\"ContractData\", C54, \"T_CVol\",, \"T\"))","v":""},54,{"$f":"IFERROR(RANK($J54,INDIRECT((\"$J$\"&\"1\"&\":$J$\"&$A$103)))+COUNTIF($J$1:J54,J54)-1,\"\")","v":""},"",""]
[{"$f":"IF(Symbols!A55=\"\",\"\",Symbols!A55)","v":""},"","",{"$f":"IF(A55=\"\",\"\",RTD(\"cqg.rtd\", ,\"ContractData\",C55, \"LongDescription\",, \"T\"))","v":""},null,null,null,{"$f":"IF(A55=\"\",\"\",RTD(\"cqg.rtd\", ,\"ContractData\",C55, \"LastTradeToday\",, \"T\"))","v":""},{"$f":"IF(A55=\"\",\"\",RTD(\"cqg.rtd\", ,\"ContractData\",C55, \"NetLastTradeToday\",, \"T\"))","v":""},{"$f":"IF(A55=\"\",\"\",IFERROR(RTD(\"cqg.rtd\", ,\"ContractData\",C55, \"PerCentNetLastTrade\",, \"T\")/100,\"\"))","v":""},{"$f":"IF(A55=\"\",\"\",RTD(\"cqg.rtd\", ,\"ContractData\", C55, \"T_CVol\",, \"T\"))","v":""},55,{"$f":"IFERROR(RANK($J55,INDIRECT((\"$J$\"&\"1\"&\":$J$\"&$A$103)))+COUNTIF($J$1:J55,J55)-1,\"\")","v":""},"",""]
[{"$f":"IF(Symbols!A56=\"\",\"\",Symbols!A56)","v":""},"","",{"$f":"IF(A56=\"\",\"\",RTD(\"cqg.rtd\", ,\"ContractData\",C56, \"LongDescription\",, \"T\"))","v":""},null,null,null,{"$f":"IF(A56=\"\",\"\",RTD(\"cqg.rtd\", ,\"ContractData\",C56, \"LastTradeToday\",, \"T\"))","v":""},{"$f":"IF(A56=\"\",\"\",RTD(\"cqg.rtd\", ,\"ContractData\",C56, \"NetLastTradeToday\",, \"T\"))","v":""},{"$f":"IF(A56=\"\",\"\",IFERROR(RTD(\"cqg.rtd\", ,\"ContractData\",C56, \"PerCentNetLastTrade\",, \"T\")/100,\"\"))","v":""},{"$f":"IF(A56=\"\",\"\",RTD(\"cqg.rtd\", ,\"ContractData\", C56, \"T_CVol\",, \"T\"))","v":""},56,{"$f":"IFERROR(RANK($J56,INDIRECT((\"$J$\"&\"1\"&\":$J$\"&$A$103)))+COUNTIF($J$1:J56,J56)-1,\"\")","v":""},"",""]
[{"$f":"IF(Symbols!A57=\"\",\"\",Symbols!A57)","v":""},"","",{"$f":"IF(A57=\"\",\"\",RTD(\"cqg.rtd\", ,\"ContractData\",C57, \"LongDescription\",, \"T\"))","v":""},null,null,null,{"$f":"IF(A57=\"\",\"\",RTD(\"cqg.rtd\", ,\"ContractData\",C57, \"LastTradeToday\",, \"T\"))","v":""},{"$f":"IF(A57=\"\",\"\",RTD(\"cqg.rtd\", ,\"ContractData\",C57, \"NetLastTradeToday\",, \"T\"))","v":""},{"$f":"IF(A57=\"\",\"\",IFERROR(RTD(\"cqg.rtd\", ,\"ContractData\",C57, \"PerCentNetLastTrade\",, \"T\")/100,\"\"))","v":""},{"$f":"IF(A57=\"\",\"\",RTD(\"cqg.rtd\", ,\"ContractData\", C57, \"T_CVol\",, \"T\"))","v":""},57,{"$f":"IFERROR(RANK($J57,INDIRECT((\"$J$\"&\"1\"&\":$J$\"&$A$103)))+COUNTIF($J$1:J57,J57)-1,\"\")","v":""},"",""]
[{"$f":"IF(Symbols!A58=\"\",\"\",Symbols!A58)","v":""},"","",{"$f":"IF(A58=\"\",\"\",RTD(\"cqg.rtd\", ,\"ContractData\",C58, \"LongDescription\",, \"T\"))","v":""},null,null,null,{"$f":"IF(A58=\"\",\"\",RTD(\"cqg.rtd\", ,\"ContractData\",C58, \"LastTradeToday\",, \"T\"))","v":""},{"$f":"IF(A58=\"\",\"\",RTD(\"cqg.rtd\", ,\"ContractData\",C58, \"NetLastTradeToday\",, \"T\"))","v":""},{"$f":"IF(A58=\"\",\"\",IFERROR(RTD(\"cqg.rtd\", ,\"ContractData\",C58, \"PerCentNetLastTrade\",, \"T\")/100,\"\"))","v":""},{"$f":"IF(A58=\"\",\"\",RTD(\"cqg.rtd\", ,\"ContractData\", C58, \"T_CVol\",, \"T\"))","v":""},58,{"$f":"IFERROR(RANK($J58,INDIRECT((\"$J$\"&\"1\"&\":$J$\"&$A$103)))+COUNTIF($J$1:J58,J58)-1,\"\")","v":""},"",""]
[{"$f":"IF(Symbols!A59=\"\",\"\",Symbols!A59)","v":""},"","",{"$f":"IF(A59=\"\",\"\",RTD(\"cqg.rtd\", ,\"ContractData\",C59, \"LongDescription\",, \"T\"))","v":""},null,null,null,{"$f":"IF(A59=\"\",\"\",RTD(\"cqg.rtd\", ,\"ContractData\",C59, \"LastTradeToday\",, \"T\"))","v":""},{"$f":"IF(A59=\"\",\"\",RTD(\"cqg.rtd\", ,\"ContractData\",C59, \"NetLastTradeToday\",, \"T\"))","v":""},{"$f":"IF(A59=\"\",\"\",IFERROR(RTD(\"cqg.rtd\", ,\"ContractData\",C59, \"PerCentNetLastTrade\",, \"T\")/100,\"\"))","v":""},{"$f":"IF(A59=\"\",\"\",RTD(\"cqg.rtd\", ,\"ContractData\", C59, \"T_CVol\",, \"T\"))","v":""},59,{"$f":"IFERROR(RANK($J59,INDIRECT((\"$J$\"&\"1\"&\":$J$\"&$A$103)))+COUNTIF($J$1:J59,J59)-1,\"\")","v":""},"",""]
[{"$f":"IF(Symbols!A60=\"\",\"\",Symbols!A60)","v":""},"","",{"$f":"IF(A60=\"\",\"\",RTD(\"cqg.rtd\", ,\"ContractData\",C60, \"LongDescription\",, \"T\"))","v":""},null,null,null,{"$f":"IF(A60=\"\",\"\",RTD(\"cqg.rtd\", ,\"ContractData\",C60, \"LastTradeToday\",, \"T\"))","v":""},{"$f":"IF(A60=\"\",\"\",RTD(\"cqg.rtd\", ,\"ContractData\",C60, \"NetLastTradeToday\",, \"T\"))","v":""},{"$f":"IF(A60=\"\",\"\",IFERROR(RTD(\"cqg.rtd\", ,\"ContractData\",C60, \"PerCentNetLastTrade\",, \"T\")/100,\"\"))","v":""},{"$f":"IF(A60=\"\",\"\",RTD(\"cqg.rtd\", ,\"ContractData\", C60, \"T_CVol\",, \"T\"))","v":""},60,{"$f":"IFERROR(RANK($J60,INDIRECT((\"$J$\"&\"1\"&\":$J$\"&$A$103)))+COUNTIF($J$1:J60,J60)-1,\"\")","v":""},"",""]
[]
[]
[]
[]
[]
[]
[]
[]
[]
[]
[]
[]
[]
[]
[]
[]
[]
[]
[]
[]
[]
[]
[]
[]
[]
[]
[]
[]
[]
[]
[]
[]
[]
[]
[]
[]
[]
[]
[]
[]
[]
[]
[{"$f":"60-COUNTIF(A1:A60,\"\")","v":42},{"$f":"SUM(B1:B101)/A103","v":0.52380952380952384}]
[{"$f":"\"$J$1:$J$\"&A103","v":"$J$1:$J$42"}]

{"sheet":"Symbols","index":2,"n_rows":60,"n_cols":13,"rows_kept":60,"cut":false,"hidden":false,"merged":[[0,6,0,10]]}
["S.CA.ETHQ",{"$f":"IF(A1=\"\",\"\",RTD(\"cqg.rtd\", ,\"ContractData\",A1, \"LongDescription\",, \"T\"))","v":"3iQ Ether Staking ETF"},null,null,null,null,"https://www.ark-funds.com/funds/arkf#hold",null,null,null,null,null,"Last Symbol update was 12/24/2025"]
["S.CA.SOLQ",{"$f":"IF(A2=\"\",\"\",RTD(\"cqg.rtd\", ,\"ContractData\",A2, \"LongDescription\",, \"T\"))","v":"3IQ SOLANA STAKING ETF"}]
["S.JP.J4689",{"$f":"IF(A3=\"\",\"\",RTD(\"cqg.rtd\", ,\"ContractData\",A3, \"LongDescription\",, \"T\"))","v":"Yahoo Japan Corp"}]
["S.NL.ADYEN",{"$f":"IF(A4=\"\",\"\",RTD(\"cqg.rtd\", ,\"ContractData\",A4, \"LongDescription\",, \"T\"))","v":"Adyen N.V."}]
["S.US.ABNB",{"$f":"IF(A5=\"\",\"\",RTD(\"cqg.rtd\", ,\"ContractData\",A5, \"LongDescription\",, \"T\"))","v":"Airbnb, Inc. Class A"}]
["S.US.AMD",{"$f":"IF(A6=\"\",\"\",RTD(\"cqg.rtd\", ,\"ContractData\",A6, \"LongDescription\",, \"T\"))","v":"ADV MICRO DEVICES"}]
["S.US.AMZN",{"$f":"IF(A7=\"\",\"\",RTD(\"cqg.rtd\", ,\"ContractData\",A7, \"LongDescription\",, \"T\"))","v":"Amazon.com Inc"}]
["S.US.ARKF",{"$f":"IF(A8=\"\",\"\",RTD(\"cqg.rtd\", ,\"ContractData\",A8, \"LongDescription\",, \"T\"))","v":"ARK Blockchain & Fintech Innovation ETF"}]
["S.US.BABA",{"$f":"IF(A9=\"\",\"\",RTD(\"cqg.rtd\", ,\"ContractData\",A9, \"LongDescription\",, \"T\"))","v":"Alibaba Group Holding Ltd"}]
["S.US.BLSH",{"$f":"IF(A10=\"\",\"\",RTD(\"cqg.rtd\", ,\"ContractData\",A10, \"LongDescription\",, \"T\"))","v":"Bullish"}]
["S.US.BMNR",{"$f":"IF(A11=\"\",\"\",RTD(\"cqg.rtd\", ,\"ContractData\",A11, \"LongDescription\",, \"T\"))","v":"BitMine Immersion Technologies Inc."}]
["S.US.COIN",{"$f":"IF(A12=\"\",\"\",RTD(\"cqg.rtd\", ,\"ContractData\",A12, \"LongDescription\",, \"T\"))","v":"COINBASE GLB CL A CM"}]
["S.US.CRCL",{"$f":"IF(A13=\"\",\"\",RTD(\"cqg.rtd\", ,\"ContractData\",A13, \"LongDescription\",, \"T\"))","v":"Circle Internet Group"}]
["S.US.CRWD",{"$f":"IF(A14=\"\",\"\",RTD(\"cqg.rtd\", ,\"ContractData\",A14, \"LongDescription\",, \"T\"))","v":"CROWDSTRIKE HLD CM A"}]
["S.US.DASH",{"$f":"IF(A15=\"\",\"\",RTD(\"cqg.rtd\", ,\"ContractData\",A15, \"LongDescription\",, \"T\"))","v":"DOORDASH, INC. CL A"}]
["S.US.DKNG",{"$f":"IF(A16=\"\",\"\",RTD(\"cqg.rtd\", ,\"ContractData\",A16, \"LongDescription\",, \"T\"))","v":"DRAFTKINGS INC. CL A"}]
["S.US.DSY",{"$f":"IF(A17=\"\",\"\",RTD(\"cqg.rtd\", ,\"ContractData\",A17, \"LongDescription\",, \"T\"))","v":"BIG TR CLD HD LD ORD"}]
["S.US.ETOR",{"$f":"IF(A18=\"\",\"\",RTD(\"cqg.rtd\", ,\"ContractData\",A18, \"LongDescription\",, \"T\"))","v":"eToro Group Ltd."},"To update the Ticker List:"]
["S.US.FUTU",{"$f":"IF(A19=\"\",\"\",RTD(\"cqg.rtd\", ,\"ContractData\",A19, \"LongDescription\",, \"T\"))","v":"FUTU HOLDINGS ADS"}]
["S.US.GLBE",{"$f":"IF(A20=\"\",\"\",RTD(\"cqg.rtd\", ,\"ContractData\",A20, \"LongDescription\",, \"T\"))","v":"GLOBAL-E ONLINE CM"}]
["S.US.HOOD",{"$f":"IF(A21=\"\",\"\",RTD(\"cqg.rtd\", ,\"ContractData\",A21, \"LongDescription\",, \"T\"))","v":"ROBINHOOD MK CL A CS"},"1) From their Web site download"]
["S.US.ICE",{"$f":"IF(A22=\"\",\"\",RTD(\"cqg.rtd\", ,\"ContractData\",A22, \"LongDescription\",, \"T\"))","v":"Intercontinental, Inc."},"the CSV File."]
["S.US.INTU",{"$f":"IF(A23=\"\",\"\",RTD(\"cqg.rtd\", ,\"ContractData\",A23, \"LongDescription\",, \"T\"))","v":"INTUIT INC"}]
["S.US.KLAR",{"$f":"IF(A24=\"\",\"\",RTD(\"cqg.rtd\", ,\"ContractData\",A24, \"LongDescription\",, \"T\"))","v":"Klarna Group plc"}]
["S.US.KSPI",{"$f":"IF(A25=\"\",\"\",RTD(\"cqg.rtd\", ,\"ContractData\",A25, \"LongDescription\",, \"T\"))","v":"JOINT STOCK CO ADS"},"2) Copy the Tickers from the file."]
["S.US.MELI",{"$f":"IF(A26=\"\",\"\",RTD(\"cqg.rtd\", ,\"ContractData\",A26, \"LongDescription\",, \"T\"))","v":"MERCADOLIBRE, INC."},"Merge \"S.US.\" to the Tickers. =\"S.US.\"&H26",null,null,null,null,"NVDA"]
["S.US.META",{"$f":"IF(A27=\"\",\"\",RTD(\"cqg.rtd\", ,\"ContractData\",A27, \"LongDescription\",, \"T\"))","v":"Meta Platforms, Inc."},null,null,null,null,{"$f":"\"S.US.\"&H26","v":"S.US.NVDA"}]
["S.US.NU",{"$f":"IF(A28=\"\",\"\",RTD(\"cqg.rtd\", ,\"ContractData\",A28, \"LongDescription\",, \"T\"))","v":"Nu Holdings Ltd."}]
["S.US.NVDA",{"$f":"IF(A29=\"\",\"\",RTD(\"cqg.rtd\", ,\"ContractData\",A29, \"LongDescription\",, \"T\"))","v":"NVIDIA CORPORATION"},"3) Remove money market fund tickers."]
["S.US.PINS",{"$f":"IF(A30=\"\",\"\",RTD(\"cqg.rtd\", ,\"ContractData\",A30, \"LongDescription\",, \"T\"))","v":"Pinterest, Inc."}]
["S.US.PLTR",{"$f":"IF(A31=\"\",\"\",RTD(\"cqg.rtd\", ,\"ContractData\",A31, \"LongDescription\",, \"T\"))","v":"PALANTIR TECH CL A"}]
["S.US.PYPL",{"$f":"IF(A32=\"\",\"\",RTD(\"cqg.rtd\", ,\"ContractData\",A32, \"LongDescription\",, \"T\"))","v":"PAYPAL HOLDINGS"},"4) Copy and Paste \"As Values\" the updated Ticker List to column A."]
["S.US.RBLX",{"$f":"IF(A33=\"\",\"\",RTD(\"cqg.rtd\", ,\"ContractData\",A33, \"LongDescription\",, \"T\"))","v":"Roblox Corp"}]
["S.US.ROKU",{"$f":"IF(A34=\"\",\"\",RTD(\"cqg.rtd\", ,\"ContractData\",A34, \"LongDescription\",, \"T\"))","v":"ROKU, INC. A CMN"}]
["S.US.SE",{"$f":"IF(A35=\"\",\"\",RTD(\"cqg.rtd\", ,\"ContractData\",A35, \"LongDescription\",, \"T\"))","v":"Sea Limited"},"This fund is actively managed and holdings change."]
["S.US.SHOP",{"$f":"IF(A36=\"\",\"\",RTD(\"cqg.rtd\", ,\"ContractData\",A36, \"LongDescription\",, \"T\"))","v":"Shopify Inc."}]
["S.US.SLMT",{"$f":"IF(A37=\"\",\"\",RTD(\"cqg.rtd\", ,\"ContractData\",A37, \"LongDescription\",, \"T\"))","v":"BRERA HOLDINGS B OS"}]
["S.US.SOFI",{"$f":"IF(A38=\"\",\"\",RTD(\"cqg.rtd\", ,\"ContractData\",A38, \"LongDescription\",, \"T\"))","v":"SOFI TECH CMN"}]
["S.US.SPOT",{"$f":"IF(A39=\"\",\"\",RTD(\"cqg.rtd\", ,\"ContractData\",A39, \"LongDescription\",, \"T\"))","v":"Spotify Technology S.A."}]
["S.US.TOST",{"$f":"IF(A40=\"\",\"\",RTD(\"cqg.rtd\", ,\"ContractData\",A40, \"LongDescription\",, \"T\"))","v":"Toast, Inc."}]
["S.US.XYZ",{"$f":"IF(A41=\"\",\"\",RTD(\"cqg.rtd\", ,\"ContractData\",A41, \"LongDescription\",, \"T\"))","v":"Square, Inc"}]
["S.US.Z",{"$f":"IF(A42=\"\",\"\",RTD(\"cqg.rtd\", ,\"ContractData\",A42, \"LongDescription\",, \"T\"))","v":"ZILLOW GROUP CL C"}]
[null,{"$f":"IF(A43=\"\",\"\",RTD(\"cqg.rtd\", ,\"ContractData\",A43, \"LongDescription\",, \"T\"))","v":""}]
[null,{"$f":"IF(A44=\"\",\"\",RTD(\"cqg.rtd\", ,\"ContractData\",A44, \"LongDescription\",, \"T\"))","v":""}]
[null,{"$f":"IF(A45=\"\",\"\",RTD(\"cqg.rtd\", ,\"ContractData\",A45, \"LongDescription\",, \"T\"))","v":""}]
[null,{"$f":"IF(A46=\"\",\"\",RTD(\"cqg.rtd\", ,\"ContractData\",A46, \"LongDescription\",, \"T\"))","v":""}]
[null,{"$f":"IF(A47=\"\",\"\",RTD(\"cqg.rtd\", ,\"ContractData\",A47, \"LongDescription\",, \"T\"))","v":""}]
[null,{"$f":"IF(A48=\"\",\"\",RTD(\"cqg.rtd\", ,\"ContractData\",A48, \"LongDescription\",, \"T\"))","v":""}]
[null,{"$f":"IF(A49=\"\",\"\",RTD(\"cqg.rtd\", ,\"ContractData\",A49, \"LongDescription\",, \"T\"))","v":""}]
[null,{"$f":"IF(A50=\"\",\"\",RTD(\"cqg.rtd\", ,\"ContractData\",A50, \"LongDescription\",, \"T\"))","v":""}]
[null,{"$f":"IF(A51=\"\",\"\",RTD(\"cqg.rtd\", ,\"ContractData\",A51, \"LongDescription\",, \"T\"))","v":""}]
[null,{"$f":"IF(A52=\"\",\"\",RTD(\"cqg.rtd\", ,\"ContractData\",A52, \"LongDescription\",, \"T\"))","v":""}]
[null,{"$f":"IF(A53=\"\",\"\",RTD(\"cqg.rtd\", ,\"ContractData\",A53, \"LongDescription\",, \"T\"))","v":""}]
[null,{"$f":"IF(A54=\"\",\"\",RTD(\"cqg.rtd\", ,\"ContractData\",A54, \"LongDescription\",, \"T\"))","v":""}]
[null,{"$f":"IF(A55=\"\",\"\",RTD(\"cqg.rtd\", ,\"ContractData\",A55, \"LongDescription\",, \"T\"))","v":""}]
[null,{"$f":"IF(A56=\"\",\"\",RTD(\"cqg.rtd\", ,\"ContractData\",A56, \"LongDescription\",, \"T\"))","v":""}]
[null,{"$f":"IF(A57=\"\",\"\",RTD(\"cqg.rtd\", ,\"ContractData\",A57, \"LongDescription\",, \"T\"))","v":""}]
[null,{"$f":"IF(A58=\"\",\"\",RTD(\"cqg.rtd\", ,\"ContractData\",A58, \"LongDescription\",, \"T\"))","v":""}]
[null,{"$f":"IF(A59=\"\",\"\",RTD(\"cqg.rtd\", ,\"ContractData\",A59, \"LongDescription\",, \"T\"))","v":""}]
[null,{"$f":"IF(A60=\"\",\"\",RTD(\"cqg.rtd\", ,\"ContractData\",A60, \"LongDescription\",, \"T\"))","v":""}]