{"text_format":"1","workbook":"xlsx","n_sheets":3,"sheets":["Display","ITA","Symbols"],"not_rendered":{"charts":2,"images":2,"macros":1,"external_links":0,"defined_names":2,"comments":0,"pivot_tables":0},"unopened":[],"bounds":{"document_bytes":16777216,"sheet_cells":100000,"rows_first":2000,"rows_last":500,"rows_between":2000,"halvings":0,"cell_chars":16384,"cell_head_chars":4096},"cells_cut":0,"cells_raw":0,"read":"whole","date_system":"1900"}

{"sheet":"Display","index":0,"n_rows":52,"n_cols":28,"rows_kept":52,"cut":false,"hidden":false,"merged":[[48,7,48,24],[26,18,26,30],[6,2,6,6],[7,2,7,6],[8,2,8,6],[14,2,14,6],[10,2,10,6],[11,2,11,6],[12,2,12,6],[13,2,13,6],[8,14,8,15],[7,14,7,15],[6,14,6,15],[20,2,20,6],[20,14,20,15],[21,2,21,6],[1,1,2,4],[1,27,2,30],[1,5,2,26],[4,18,4,30],[17,2,17,6],[17,14,17,15],[15,2,15,6],[5,2,5,6],[15,14,15,15],[14,14,14,15],[13,14,13,15],[12,14,12,15],[11,14,11,15],[10,14,10,15],[9,14,9,15],[9,2,9,6],[5,14,5,15],[4,1,4,16],[18,2,18,6],[18,14,18,15],[19,2,19,6],[19,14,19,15],[16,2,16,6],[16,14,16,15],[22,2,22,6],[22,14,22,15],[21,14,21,15],[23,2,23,6],[23,14,23,15],[24,2,24,6],[24,14,24,15],[25,2,25,6],[25,14,25,15],[26,2,26,6],[26,14,26,15],[27,2,27,6],[27,14,27,15],[28,2,28,6],[28,14,28,15],[29,2,29,6],[29,14,29,15],[30,2,30,6],[30,14,30,15],[31,2,31,6],[31,14,31,15],[33,2,33,6],[33,14,33,15],[34,2,34,6],[34,14,34,15],[32,2,32,6],[32,14,32,15],[44,14,44,15],[44,2,44,6],[45,2,45,6],[45,14,45,15],[40,2,40,6],[40,14,40,15],[42,2,42,6],[42,14,42,15],[41,2,41,6],[41,14,41,15],[43,2,43,6],[43,14,43,15],[48,1,48,6],[48,25,48,30],[35,2,35,6],[35,14,35,15],[36,2,36,6],[36,14,36,15],[46,2,46,6],[46,14,46,15],[47,2,47,6],[47,14,47,15],[37,2,37,6],[37,14,37,15],[38,2,38,6],[38,14,38,15],[39,2,39,6],[39,14,39,15]]}
[]
[null,null,null,null,null,"CQG iShares U.S. Aerospace & Defense ETF",null,null,null,null,null,null,null,null,null,null,null,null,null,null,null,null,null,null,null,null,null,{"$f":"RTD(\"cqg.rtd\", ,\"SystemInfo\", \"Linetime\")","v":46097.272731481484}]
[]
[]
[null,"Exchange Traded Funds Performance",null,null,null,null,null,null,null,null,null,null,null,null,null,null,null,null,"Top 15 Positive Performing Companies "]
[null,"Symbol","Description",null,null,null,null,"Last","NC","%NC","NC/ATR","Open","High","Low","Volume",null,"Ratio"]
[null,"ITA",{"$f":"RTD(\"cqg.rtd\", ,\"ContractData\",B7, \"LongDescription\",, \"T\")","v":"iShares U.S. Aerospace & Defense ETF"},null,null,null,null,{"$f":"RTD(\"cqg.rtd\", ,\"ContractData\",B7, \"LastTradeToday\",, \"T\")","v":""},{"$f":"RTD(\"cqg.rtd\", ,\"ContractData\",B7, \"NetLastTradeToday\",, \"T\")","v":""},{"$f":"IFERROR(RTD(\"cqg.rtd\", ,\"ContractData\",B7, \"PerCentNetLastTrade\",, \"T\")/100,\"\")","v":""},{"$f":"IFERROR(I7/RTD(\"cqg.rtd\",,\"StudyData\",B7, \"ATR\", \"MaType=Sim,Period=10\", \"ATR\",\"D\",\"-1\",\"ALL\",,,\"FALSE\",\"T\")/100,\"\")","v":""},{"$f":"RTD(\"cqg.rtd\", ,\"ContractData\",B7, \"OPen\",, \"T\")","v":""},{"$f":"RTD(\"cqg.rtd\", ,\"ContractData\", B7, \"HIgh\",, \"T\")","v":""},{"$f":"RTD(\"cqg.rtd\", ,\"ContractData\",B7, \"LOw\",, \"T\")","v":""},{"$f":"RTD(\"cqg.rtd\", ,\"ContractData\",B7, \"T_CVol\",, \"T\")","v":1140},null,{"$f":" IFERROR(O7/RTD(\"cqg.rtd\",,\"StudyData\",B7, \"MA\", \"InputChoice=Vol,MAType=Sim,Period=21\", \"MA\",\"D\",\"-1\",\"all\",,,,\"T\"),\"\")","v":7.0143774449067079E-4}]
[null,"DJI",{"$f":"RTD(\"cqg.rtd\", ,\"ContractData\",B8, \"LongDescription\",, \"T\")","v":"DJ Industrial Average"},null,null,null,null,{"$f":"RTD(\"cqg.rtd\", ,\"ContractData\",B8, \"LastTradeToday\",, \"T\")","v":46558.400000000001},{"$f":"RTD(\"cqg.rtd\", ,\"ContractData\",B8, \"NetLastTradeToday\",, \"T\")","v":""},{"$f":"IFERROR(RTD(\"cqg.rtd\", ,\"ContractData\",B8, \"PerCentNetLastTrade\",, \"T\")/100,\"\")","v":""},{"$f":"IFERROR(I8/RTD(\"cqg.rtd\",,\"StudyData\",B8, \"ATR\", \"MaType=Sim,Period=10\", \"ATR\",\"D\",\"-1\",\"ALL\",,,\"FALSE\",\"T\")/100,\"\")","v":""},{"$f":"RTD(\"cqg.rtd\", ,\"ContractData\",B8, \"OPen\",, \"T\")","v":""},{"$f":"RTD(\"cqg.rtd\", ,\"ContractData\", B8, \"HIgh\",, \"T\")","v":""},{"$f":"RTD(\"cqg.rtd\", ,\"ContractData\",B8, \"LOw\",, \"T\")","v":""},{"$f":"RTD(\"cqg.rtd\", ,\"ContractData\",B8, \"T_CVol\",, \"T\")","v":0},null,{"$f":" IFERROR(O8/RTD(\"cqg.rtd\",,\"StudyData\",B8, \"MA\", \"InputChoice=Vol,MAType=Sim,Period=21\", \"MA\",\"D\",\"-1\",\"all\",,,,\"T\"),\"\")","v":0}]
[null,"EP",{"$f":"RTD(\"cqg.rtd\", ,\"ContractData\",B9, \"LongDescription\",, \"T\")","v":"E-Mini S&P 500, Mar 26"},null,null,null,null,{"$f":"RTD(\"cqg.rtd\", ,\"ContractData\",B9, \"LastTradeToday\",, \"T\")","v":6679.25},{"$f":"RTD(\"cqg.rtd\", ,\"ContractData\",B9, \"NetLastTradeToday\",, \"T\")","v":43.25},{"$f":"IFERROR(RTD(\"cqg.rtd\", ,\"ContractData\",B9, \"PerCentNetLastTrade\",, \"T\")/100,\"\")","v":6.5174804098854736E-3},{"$f":"IFERROR(I9/RTD(\"cqg.rtd\",,\"StudyData\",B9, \"ATR\", \"MaType=Sim,Period=10\", \"ATR\",\"D\",\"-1\",\"ALL\",,,\"FALSE\",\"T\")/100,\"\")","v":3.2983794089609152E-3},{"$f":"RTD(\"cqg.rtd\", ,\"ContractData\",B9, \"OPen\",, \"T\")","v":6608.5},{"$f":"RTD(\"cqg.rtd\", ,\"ContractData\", B9, \"HIgh\",, \"T\")","v":6688},{"$f":"RTD(\"cqg.rtd\", ,\"ContractData\",B9, \"LOw\",, \"T\")","v":6608.5},{"$f":"RTD(\"cqg.rtd\", ,\"ContractData\",B9, \"T_CVol\",, \"T\")","v":223981},null,{"$f":" IFERROR(O9/RTD(\"cqg.rtd\",,\"StudyData\",B9, \"MA\", \"InputChoice=Vol,MAType=Sim,Period=21\", \"MA\",\"D\",\"-1\",\"all\",,,,\"T\"),\"\")","v":0.12260419640637571}]
[null,"S.IYY",{"$f":"RTD(\"cqg.rtd\", ,\"ContractData\",B10, \"LongDescription\",, \"T\")","v":"iShares DJ US Total Market Idx Fd"},null,null,null,null,{"$f":"RTD(\"cqg.rtd\", ,\"ContractData\",B10, \"LastTradeToday\",, \"T\")","v":""},{"$f":"RTD(\"cqg.rtd\", ,\"ContractData\",B10, \"NetLastTradeToday\",, \"T\")","v":""},{"$f":"IFERROR(RTD(\"cqg.rtd\", ,\"ContractData\",B10, \"PerCentNetLastTrade\",, \"T\")/100,\"\")","v":""},{"$f":"IFERROR(I10/RTD(\"cqg.rtd\",,\"StudyData\",B10, \"ATR\", \"MaType=Sim,Period=10\", \"ATR\",\"D\",\"-1\",\"ALL\",,,\"FALSE\",\"T\")/100,\"\")","v":""},{"$f":"RTD(\"cqg.rtd\", ,\"ContractData\",B10, \"OPen\",, \"T\")","v":""},{"$f":"RTD(\"cqg.rtd\", ,\"ContractData\", B10, \"HIgh\",, \"T\")","v":""},{"$f":"RTD(\"cqg.rtd\", ,\"ContractData\",B10, \"LOw\",, \"T\")","v":""},{"$f":"RTD(\"cqg.rtd\", ,\"ContractData\",B10, \"T_CVol\",, \"T\")","v":0},null,{"$f":" IFERROR(O10/RTD(\"cqg.rtd\",,\"StudyData\",B10, \"MA\", \"InputChoice=Vol,MAType=Sim,Period=21\", \"MA\",\"D\",\"-1\",\"all\",,,,\"T\"),\"\")","v":0}]
[null,"S.XLE",{"$f":"RTD(\"cqg.rtd\", ,\"ContractData\",B11, \"LongDescription\",, \"T\")","v":"Energy Select Sector SPDR"},null,null,null,null,{"$f":"RTD(\"cqg.rtd\", ,\"ContractData\",B11, \"LastTradeToday\",, \"T\")","v":""},{"$f":"RTD(\"cqg.rtd\", ,\"ContractData\",B11, \"NetLastTradeToday\",, \"T\")","v":""},{"$f":"IFERROR(RTD(\"cqg.rtd\", ,\"ContractData\",B11, \"PerCentNetLastTrade\",, \"T\")/100,\"\")","v":""},{"$f":"IFERROR(I11/RTD(\"cqg.rtd\",,\"StudyData\",B11, \"ATR\", \"MaType=Sim,Period=10\", \"ATR\",\"D\",\"-1\",\"ALL\",,,\"FALSE\",\"T\")/100,\"\")","v":""},{"$f":"RTD(\"cqg.rtd\", ,\"ContractData\",B11, \"OPen\",, \"T\")","v":""},{"$f":"RTD(\"cqg.rtd\", ,\"ContractData\", B11, \"HIgh\",, \"T\")","v":""},{"$f":"RTD(\"cqg.rtd\", ,\"ContractData\",B11, \"LOw\",, \"T\")","v":""},{"$f":"RTD(\"cqg.rtd\", ,\"ContractData\",B11, \"T_CVol\",, \"T\")","v":242931},null,{"$f":" IFERROR(O11/RTD(\"cqg.rtd\",,\"StudyData\",B11, \"MA\", \"InputChoice=Vol,MAType=Sim,Period=21\", \"MA\",\"D\",\"-1\",\"all\",,,,\"T\"),\"\")","v":3.5883800352282044E-3}]
[null,"S.ARTY",{"$f":"RTD(\"cqg.rtd\", ,\"ContractData\",B12, \"LongDescription\",, \"T\")","v":"iShares Robotics and Artificial Intelligence ETF"},null,null,null,null,{"$f":"RTD(\"cqg.rtd\", ,\"ContractData\",B12, \"LastTradeToday\",, \"T\")","v":""},{"$f":"RTD(\"cqg.rtd\", ,\"ContractData\",B12, \"NetLastTradeToday\",, \"T\")","v":""},{"$f":"IFERROR(RTD(\"cqg.rtd\", ,\"ContractData\",B12, \"PerCentNetLastTrade\",, \"T\")/100,\"\")","v":""},{"$f":"IFERROR(I12/RTD(\"cqg.rtd\",,\"StudyData\",B12, \"ATR\", \"MaType=Sim,Period=10\", \"ATR\",\"D\",\"-1\",\"ALL\",,,\"FALSE\",\"T\")/100,\"\")","v":""},{"$f":"RTD(\"cqg.rtd\", ,\"ContractData\",B12, \"OPen\",, \"T\")","v":""},{"$f":"RTD(\"cqg.rtd\", ,\"ContractData\", B12, \"HIgh\",, \"T\")","v":""},{"$f":"RTD(\"cqg.rtd\", ,\"ContractData\",B12, \"LOw\",, \"T\")","v":""},{"$f":"RTD(\"cqg.rtd\", ,\"ContractData\",B12, \"T_CVol\",, \"T\")","v":187},null,{"$f":" IFERROR(O12/RTD(\"cqg.rtd\",,\"StudyData\",B12, \"MA\", \"InputChoice=Vol,MAType=Sim,Period=21\", \"MA\",\"D\",\"-1\",\"all\",,,,\"T\"),\"\")","v":3.4400883045840726E-4}]
[null,"S.ARKQ",{"$f":"RTD(\"cqg.rtd\", ,\"ContractData\",B13, \"LongDescription\",, \"T\")","v":"ARK Autonomous Technology & Robotics ETF"},null,null,null,null,{"$f":"RTD(\"cqg.rtd\", ,\"ContractData\",B13, \"LastTradeToday\",, \"T\")","v":""},{"$f":"RTD(\"cqg.rtd\", ,\"ContractData\",B13, \"NetLastTradeToday\",, \"T\")","v":""},{"$f":"IFERROR(RTD(\"cqg.rtd\", ,\"ContractData\",B13, \"PerCentNetLastTrade\",, \"T\")/100,\"\")","v":""},{"$f":"IFERROR(I13/RTD(\"cqg.rtd\",,\"StudyData\",B13, \"ATR\", \"MaType=Sim,Period=10\", \"ATR\",\"D\",\"-1\",\"ALL\",,,\"FALSE\",\"T\")/100,\"\")","v":""},{"$f":"RTD(\"cqg.rtd\", ,\"ContractData\",B13, \"OPen\",, \"T\")","v":""},{"$f":"RTD(\"cqg.rtd\", ,\"ContractData\", B13, \"HIgh\",, \"T\")","v":""},{"$f":"RTD(\"cqg.rtd\", ,\"ContractData\",B13, \"LOw\",, \"T\")","v":""},{"$f":"RTD(\"cqg.rtd\", ,\"ContractData\",B13, \"T_CVol\",, \"T\")","v":275},null,{"$f":" IFERROR(O13/RTD(\"cqg.rtd\",,\"StudyData\",B13, \"MA\", \"InputChoice=Vol,MAType=Sim,Period=21\", \"MA\",\"D\",\"-1\",\"all\",,,,\"T\"),\"\")","v":1.4978738250420657E-3}]
[null,"S.ROBO",{"$f":"RTD(\"cqg.rtd\", ,\"ContractData\",B14, \"LongDescription\",, \"T\")","v":"Robo-Stox Global Robotics&Automation ETF"},null,null,null,null,{"$f":"RTD(\"cqg.rtd\", ,\"ContractData\",B14, \"LastTradeToday\",, \"T\")","v":""},{"$f":"RTD(\"cqg.rtd\", ,\"ContractData\",B14, \"NetLastTradeToday\",, \"T\")","v":""},{"$f":"IFERROR(RTD(\"cqg.rtd\", ,\"ContractData\",B14, \"PerCentNetLastTrade\",, \"T\")/100,\"\")","v":""},{"$f":"IFERROR(I14/RTD(\"cqg.rtd\",,\"StudyData\",B14, \"ATR\", \"MaType=Sim,Period=10\", \"ATR\",\"D\",\"-1\",\"ALL\",,,\"FALSE\",\"T\")/100,\"\")","v":""},{"$f":"RTD(\"cqg.rtd\", ,\"ContractData\",B14, \"OPen\",, \"T\")","v":""},{"$f":"RTD(\"cqg.rtd\", ,\"ContractData\", B14, \"HIgh\",, \"T\")","v":""},{"$f":"RTD(\"cqg.rtd\", ,\"ContractData\",B14, \"LOw\",, \"T\")","v":""},{"$f":"RTD(\"cqg.rtd\", ,\"ContractData\",B14, \"T_CVol\",, \"T\")","v":114},null,{"$f":" IFERROR(O14/RTD(\"cqg.rtd\",,\"StudyData\",B14, \"MA\", \"InputChoice=Vol,MAType=Sim,Period=21\", \"MA\",\"D\",\"-1\",\"all\",,,,\"T\"),\"\")","v":5.3382414648682269E-4}]
[null,"S.CHAT",{"$f":"RTD(\"cqg.rtd\", ,\"ContractData\",B15, \"LongDescription\",, \"T\")","v":"Roundhill Generative AI & Technology ETF"},null,null,null,null,{"$f":"RTD(\"cqg.rtd\", ,\"ContractData\",B15, \"LastTradeToday\",, \"T\")","v":""},{"$f":"RTD(\"cqg.rtd\", ,\"ContractData\",B15, \"NetLastTradeToday\",, \"T\")","v":""},{"$f":"IFERROR(RTD(\"cqg.rtd\", ,\"ContractData\",B15, \"PerCentNetLastTrade\",, \"T\")/100,\"\")","v":""},{"$f":"IFERROR(I15/RTD(\"cqg.rtd\",,\"StudyData\",B15, \"ATR\", \"MaType=Sim,Period=10\", \"ATR\",\"D\",\"-1\",\"ALL\",,,\"FALSE\",\"T\")/100,\"\")","v":""},{"$f":"RTD(\"cqg.rtd\", ,\"ContractData\",B15, \"OPen\",, \"T\")","v":""},{"$f":"RTD(\"cqg.rtd\", ,\"ContractData\", B15, \"HIgh\",, \"T\")","v":""},{"$f":"RTD(\"cqg.rtd\", ,\"ContractData\",B15, \"LOw\",, \"T\")","v":""},{"$f":"RTD(\"cqg.rtd\", ,\"ContractData\",B15, \"T_CVol\",, \"T\")","v":285},null,{"$f":" IFERROR(O15/RTD(\"cqg.rtd\",,\"StudyData\",B15, \"MA\", \"InputChoice=Vol,MAType=Sim,Period=21\", \"MA\",\"D\",\"-1\",\"all\",,,,\"T\"),\"\")","v":8.9049802004506206E-4}]
[null,"S.IETC",{"$f":"RTD(\"cqg.rtd\", ,\"ContractData\",B16, \"LongDescription\",, \"T\")","v":"iShares U.S. Tech Independence Focused ETF"},null,null,null,null,{"$f":"RTD(\"cqg.rtd\", ,\"ContractData\",B16, \"LastTradeToday\",, \"T\")","v":""},{"$f":"RTD(\"cqg.rtd\", ,\"ContractData\",B16, \"NetLastTradeToday\",, \"T\")","v":""},{"$f":"IFERROR(RTD(\"cqg.rtd\", ,\"ContractData\",B16, \"PerCentNetLastTrade\",, \"T\")/100,\"\")","v":""},{"$f":"IFERROR(I16/RTD(\"cqg.rtd\",,\"StudyData\",B16, \"ATR\", \"MaType=Sim,Period=10\", \"ATR\",\"D\",\"-1\",\"ALL\",,,\"FALSE\",\"T\")/100,\"\")","v":""},{"$f":"RTD(\"cqg.rtd\", ,\"ContractData\",B16, \"OPen\",, \"T\")","v":""},{"$f":"RTD(\"cqg.rtd\", ,\"ContractData\", B16, \"HIgh\",, \"T\")","v":""},{"$f":"RTD(\"cqg.rtd\", ,\"ContractData\",B16, \"LOw\",, \"T\")","v":""},{"$f":"RTD(\"cqg.rtd\", ,\"ContractData\",B16, \"T_CVol\",, \"T\")","v":38},null,{"$f":" IFERROR(O16/RTD(\"cqg.rtd\",,\"StudyData\",B16, \"MA\", \"InputChoice=Vol,MAType=Sim,Period=21\", \"MA\",\"D\",\"-1\",\"all\",,,,\"T\"),\"\")","v":3.967329710223552E-4}]
[null,null,"Top 15 Description",null,null,null,null,"Last","NC","%NC","NC/ATR","Open","High","Low","Volume",null,"Ratio"]
[{"$f":"TRIM(ITA!O1)","v":""},"News",{"$f":"IFERROR(PROPER(RTD(\"cqg.rtd\", ,\"ContractData\",A18, \"LongDescription\",, \"T\"))&\" (\"&RIGHT(A18,LEN(A18)-5)&\")\",\"\")","v":""},null,null,null,null,{"$f":"IF(C18=\"\",\"\",IFERROR(RTD(\"cqg.rtd\", ,\"ContractData\",A18, \"LastTradeToday\",, \"T\"),\"\"))","v":""},{"$f":"IF(C18=\"\",\"\",IFERROR(RTD(\"cqg.rtd\", ,\"ContractData\",A18, \"NetLastTradeToday\",, \"T\"),\"\"))","v":""},{"$f":"IFERROR(RTD(\"cqg.rtd\", ,\"ContractData\",A18, \"PerCentNetLastTrade\",, \"T\")/100,\"\")","v":""},{"$f":"IFERROR(I18/RTD(\"cqg.rtd\",,\"StudyData\",A18, \"ATR\", \"MaType=Sim,Period=10\", \"ATR\",\"D\",\"-1\",\"ALL\",,,\"FALSE\",\"T\")/100,\"\")","v":""},{"$f":"IF(C18=\"\",\"\",IFERROR(RTD(\"cqg.rtd\", ,\"ContractData\",A18, \"OPen\",, \"T\"),\"\"))","v":""},{"$f":"IF(C18=\"\",\"\",IFERROR(RTD(\"cqg.rtd\", ,\"ContractData\", A18, \"HIgh\",, \"T\"),\"\"))","v":""},{"$f":"IF(C18=\"\",\"\",IFERROR(RTD(\"cqg.rtd\", ,\"ContractData\",A18, \"LOw\",, \"T\"),\"\"))","v":""},{"$f":"IF(C18=\"\",\"\",IFERROR(RTD(\"cqg.rtd\", ,\"ContractData\",A18, \"T_CVol\",, \"T\"),\"\"))","v":""},null,{"$f":" IFERROR(O18/RTD(\"cqg.rtd\",,\"StudyData\",A18, \"MA\", \"InputChoice=Vol,MAType=Sim,Period=21\", \"MA\",\"D\",\"-1\",\"all\",,,,\"T\"),\"\")","v":""},{"$f":"ITA!R1","v":""}]
[{"$f":"TRIM(ITA!O2)","v":""},"News",{"$f":"IFERROR(PROPER(RTD(\"cqg.rtd\", ,\"ContractData\",A19, \"LongDescription\",, \"T\"))&\" (\"&RIGHT(A19,LEN(A19)-5)&\")\",\"\")","v":""},null,null,null,null,{"$f":"IF(C19=\"\",\"\",IFERROR(RTD(\"cqg.rtd\", ,\"ContractData\",A19, \"LastTradeToday\",, \"T\"),\"\"))","v":""},{"$f":"IF(C19=\"\",\"\",IFERROR(RTD(\"cqg.rtd\", ,\"ContractData\",A19, \"NetLastTradeToday\",, \"T\"),\"\"))","v":""},{"$f":"IFERROR(RTD(\"cqg.rtd\", ,\"ContractData\",A19, \"PerCentNetLastTrade\",, \"T\")/100,\"\")","v":""},{"$f":"IFERROR(I19/RTD(\"cqg.rtd\",,\"StudyData\",A19, \"ATR\", \"MaType=Sim,Period=10\", \"ATR\",\"D\",\"-1\",\"ALL\",,,\"FALSE\",\"T\")/100,\"\")","v":""},{"$f":"IF(C19=\"\",\"\",IFERROR(RTD(\"cqg.rtd\", ,\"ContractData\",A19, \"OPen\",, \"T\"),\"\"))","v":""},{"$f":"IF(C19=\"\",\"\",IFERROR(RTD(\"cqg.rtd\", ,\"ContractData\", A19, \"HIgh\",, \"T\"),\"\"))","v":""},{"$f":"IF(C19=\"\",\"\",IFERROR(RTD(\"cqg.rtd\", ,\"ContractData\",A19, \"LOw\",, \"T\"),\"\"))","v":""},{"$f":"IF(C19=\"\",\"\",IFERROR(RTD(\"cqg.rtd\", ,\"ContractData\",A19, \"T_CVol\",, \"T\"),\"\"))","v":""},null,{"$f":" IFERROR(O19/RTD(\"cqg.rtd\",,\"StudyData\",A19, \"MA\", \"InputChoice=Vol,MAType=Sim,Period=21\", \"MA\",\"D\",\"-1\",\"all\",,,,\"T\"),\"\")","v":""},{"$f":"ITA!R2","v":""}]
[{"$f":"TRIM(ITA!O3)","v":""},"News",{"$f":"IFERROR(PROPER(RTD(\"cqg.rtd\", ,\"ContractData\",A20, \"LongDescription\",, \"T\"))&\" (\"&RIGHT(A20,LEN(A20)-5)&\")\",\"\")","v":""},null,null,null,null,{"$f":"IF(C20=\"\",\"\",IFERROR(RTD(\"cqg.rtd\", ,\"ContractData\",A20, \"LastTradeToday\",, \"T\"),\"\"))","v":""},{"$f":"IF(C20=\"\",\"\",IFERROR(RTD(\"cqg.rtd\", ,\"ContractData\",A20, \"NetLastTradeToday\",, \"T\"),\"\"))","v":""},{"$f":"IFERROR(RTD(\"cqg.rtd\", ,\"ContractData\",A20, \"PerCentNetLastTrade\",, \"T\")/100,\"\")","v":""},{"$f":"IFERROR(I20/RTD(\"cqg.rtd\",,\"StudyData\",A20, \"ATR\", \"MaType=Sim,Period=10\", \"ATR\",\"D\",\"-1\",\"ALL\",,,\"FALSE\",\"T\")/100,\"\")","v":""},{"$f":"IF(C20=\"\",\"\",IFERROR(RTD(\"cqg.rtd\", ,\"ContractData\",A20, \"OPen\",, \"T\"),\"\"))","v":""},{"$f":"IF(C20=\"\",\"\",IFERROR(RTD(\"cqg.rtd\", ,\"ContractData\", A20, \"HIgh\",, \"T\"),\"\"))","v":""},{"$f":"IF(C20=\"\",\"\",IFERROR(RTD(\"cqg.rtd\", ,\"ContractData\",A20, \"LOw\",, \"T\"),\"\"))","v":""},{"$f":"IF(C20=\"\",\"\",IFERROR(RTD(\"cqg.rtd\", ,\"ContractData\",A20, \"T_CVol\",, \"T\"),\"\"))","v":""},null,{"$f":" IFERROR(O20/RTD(\"cqg.rtd\",,\"StudyData\",A20, \"MA\", \"InputChoice=Vol,MAType=Sim,Period=21\", \"MA\",\"D\",\"-1\",\"all\",,,,\"T\"),\"\")","v":""},{"$f":"ITA!R3","v":""}]
[{"$f":"TRIM(ITA!O4)","v":""},"News",{"$f":"IFERROR(PROPER(RTD(\"cqg.rtd\", ,\"ContractData\",A21, \"LongDescription\",, \"T\"))&\" (\"&RIGHT(A21,LEN(A21)-5)&\")\",\"\")","v":""},null,null,null,null,{"$f":"IF(C21=\"\",\"\",IFERROR(RTD(\"cqg.rtd\", ,\"ContractData\",A21, \"LastTradeToday\",, \"T\"),\"\"))","v":""},{"$f":"IF(C21=\"\",\"\",IFERROR(RTD(\"cqg.rtd\", ,\"ContractData\",A21, \"NetLastTradeToday\",, \"T\"),\"\"))","v":""},{"$f":"IFERROR(RTD(\"cqg.rtd\", ,\"ContractData\",A21, \"PerCentNetLastTrade\",, \"T\")/100,\"\")","v":""},{"$f":"IFERROR(I21/RTD(\"cqg.rtd\",,\"StudyData\",A21, \"ATR\", \"MaType=Sim,Period=10\", \"ATR\",\"D\",\"-1\",\"ALL\",,,\"FALSE\",\"T\")/100,\"\")","v":""},{"$f":"IF(C21=\"\",\"\",IFERROR(RTD(\"cqg.rtd\", ,\"ContractData\",A21, \"OPen\",, \"T\"),\"\"))","v":""},{"$f":"IF(C21=\"\",\"\",IFERROR(RTD(\"cqg.rtd\", ,\"ContractData\", A21, \"HIgh\",, \"T\"),\"\"))","v":""},{"$f":"IF(C21=\"\",\"\",IFERROR(RTD(\"cqg.rtd\", ,\"ContractData\",A21, \"LOw\",, \"T\"),\"\"))","v":""},{"$f":"IF(C21=\"\",\"\",IFERROR(RTD(\"cqg.rtd\", ,\"ContractData\",A21, \"T_CVol\",, \"T\"),\"\"))","v":""},null,{"$f":" IFERROR(O21/RTD(\"cqg.rtd\",,\"StudyData\",A21, \"MA\", \"InputChoice=Vol,MAType=Sim,Period=21\", \"MA\",\"D\",\"-1\",\"all\",,,,\"T\"),\"\")","v":""},{"$f":"ITA!R4","v":""}]
[{"$f":"TRIM(ITA!O5)","v":""},"News",{"$f":"IFERROR(PROPER(RTD(\"cqg.rtd\", ,\"ContractData\",A22, \"LongDescription\",, \"T\"))&\" (\"&RIGHT(A22,LEN(A22)-5)&\")\",\"\")","v":""},null,null,null,null,{"$f":"IF(C22=\"\",\"\",IFERROR(RTD(\"cqg.rtd\", ,\"ContractData\",A22, \"LastTradeToday\",, \"T\"),\"\"))","v":""},{"$f":"IF(C22=\"\",\"\",IFERROR(RTD(\"cqg.rtd\", ,\"ContractData\",A22, \"NetLastTradeToday\",, \"T\"),\"\"))","v":""},{"$f":"IFERROR(RTD(\"cqg.rtd\", ,\"ContractData\",A22, \"PerCentNetLastTrade\",, \"T\")/100,\"\")","v":""},{"$f":"IFERROR(I22/RTD(\"cqg.rtd\",,\"StudyData\",A22, \"ATR\", \"MaType=Sim,Period=10\", \"ATR\",\"D\",\"-1\",\"ALL\",,,\"FALSE\",\"T\")/100,\"\")","v":""},{"$f":"IF(C22=\"\",\"\",IFERROR(RTD(\"cqg.rtd\", ,\"ContractData\",A22, \"OPen\",, \"T\"),\"\"))","v":""},{"$f":"IF(C22=\"\",\"\",IFERROR(RTD(\"cqg.rtd\", ,\"ContractData\", A22, \"HIgh\",, \"T\"),\"\"))","v":""},{"$f":"IF(C22=\"\",\"\",IFERROR(RTD(\"cqg.rtd\", ,\"ContractData\",A22, \"LOw\",, \"T\"),\"\"))","v":""},{"$f":"IF(C22=\"\",\"\",IFERROR(RTD(\"cqg.rtd\", ,\"ContractData\",A22, \"T_CVol\",, \"T\"),\"\"))","v":""},null,{"$f":" IFERROR(O22/RTD(\"cqg.rtd\",,\"StudyData\",A22, \"MA\", \"InputChoice=Vol,MAType=Sim,Period=21\", \"MA\",\"D\",\"-1\",\"all\",,,,\"T\"),\"\")","v":""},{"$f":"ITA!R5","v":""}]
[{"$f":"TRIM(ITA!O6)","v":""},"News",{"$f":"IFERROR(PROPER(RTD(\"cqg.rtd\", ,\"ContractData\",A23, \"LongDescription\",, \"T\"))&\" (\"&RIGHT(A23,LEN(A23)-5)&\")\",\"\")","v":""},null,null,null,null,{"$f":"IF(C23=\"\",\"\",IFERROR(RTD(\"cqg.rtd\", ,\"ContractData\",A23, \"LastTradeToday\",, \"T\"),\"\"))","v":""},{"$f":"IF(C23=\"\",\"\",IFERROR(RTD(\"cqg.rtd\", ,\"ContractData\",A23, \"NetLastTradeToday\",, \"T\"),\"\"))","v":""},{"$f":"IFERROR(RTD(\"cqg.rtd\", ,\"ContractData\",A23, \"PerCentNetLastTrade\",, \"T\")/100,\"\")","v":""},{"$f":"IFERROR(I23/RTD(\"cqg.rtd\",,\"StudyData\",A23, \"ATR\", \"MaType=Sim,Period=10\", \"ATR\",\"D\",\"-1\",\"ALL\",,,\"FALSE\",\"T\")/100,\"\")","v":""},{"$f":"IF(C23=\"\",\"\",IFERROR(RTD(\"cqg.rtd\", ,\"ContractData\",A23, \"OPen\",, \"T\"),\"\"))","v":""},{"$f":"IF(C23=\"\",\"\",IFERROR(RTD(\"cqg.rtd\", ,\"ContractData\", A23, \"HIgh\",, \"T\"),\"\"))","v":""},{"$f":"IF(C23=\"\",\"\",IFERROR(RTD(\"cqg.rtd\", ,\"ContractData\",A23, \"LOw\",, \"T\"),\"\"))","v":""},{"$f":"IF(C23=\"\",\"\",IFERROR(RTD(\"cqg.rtd\", ,\"ContractData\",A23, \"T_CVol\",, \"T\"),\"\"))","v":""},null,{"$f":" IFERROR(O23/RTD(\"cqg.rtd\",,\"StudyData\",A23, \"MA\", \"InputChoice=Vol,MAType=Sim,Period=21\", \"MA\",\"D\",\"-1\",\"all\",,,,\"T\"),\"\")","v":""},{"$f":"ITA!R6","v":""}]
[{"$f":"TRIM(ITA!O7)","v":""},"News",{"$f":"IFERROR(PROPER(RTD(\"cqg.rtd\", ,\"ContractData\",A24, \"LongDescription\",, \"T\"))&\" (\"&RIGHT(A24,LEN(A24)-5)&\")\",\"\")","v":""},null,null,null,null,{"$f":"IF(C24=\"\",\"\",IFERROR(RTD(\"cqg.rtd\", ,\"ContractData\",A24, \"LastTradeToday\",, \"T\"),\"\"))","v":""},{"$f":"IF(C24=\"\",\"\",IFERROR(RTD(\"cqg.rtd\", ,\"ContractData\",A24, \"NetLastTradeToday\",, \"T\"),\"\"))","v":""},{"$f":"IFERROR(RTD(\"cqg.rtd\", ,\"ContractData\",A24, \"PerCentNetLastTrade\",, \"T\")/100,\"\")","v":""},{"$f":"IFERROR(I24/RTD(\"cqg.rtd\",,\"StudyData\",A24, \"ATR\", \"MaType=Sim,Period=10\", \"ATR\",\"D\",\"-1\",\"ALL\",,,\"FALSE\",\"T\")/100,\"\")","v":""},{"$f":"IF(C24=\"\",\"\",IFERROR(RTD(\"cqg.rtd\", ,\"ContractData\",A24, \"OPen\",, \"T\"),\"\"))","v":""},{"$f":"IF(C24=\"\",\"\",IFERROR(RTD(\"cqg.rtd\", ,\"ContractData\", A24, \"HIgh\",, \"T\"),\"\"))","v":""},{"$f":"IF(C24=\"\",\"\",IFERROR(RTD(\"cqg.rtd\", ,\"ContractData\",A24, \"LOw\",, \"T\"),\"\"))","v":""},{"$f":"IF(C24=\"\",\"\",IFERROR(RTD(\"cqg.rtd\", ,\"ContractData\",A24, \"T_CVol\",, \"T\"),\"\"))","v":""},null,{"$f":" IFERROR(O24/RTD(\"cqg.rtd\",,\"StudyData\",A24, \"MA\", \"InputChoice=Vol,MAType=Sim,Period=21\", \"MA\",\"D\",\"-1\",\"all\",,,,\"T\"),\"\")","v":""},{"$f":"ITA!R7","v":""}]
[{"$f":"TRIM(ITA!O8)","v":""},"News",{"$f":"IFERROR(PROPER(RTD(\"cqg.rtd\", ,\"ContractData\",A25, \"LongDescription\",, \"T\"))&\" (\"&RIGHT(A25,LEN(A25)-5)&\")\",\"\")","v":""},null,null,null,null,{"$f":"IF(C25=\"\",\"\",IFERROR(RTD(\"cqg.rtd\", ,\"ContractData\",A25, \"LastTradeToday\",, \"T\"),\"\"))","v":""},{"$f":"IF(C25=\"\",\"\",IFERROR(RTD(\"cqg.rtd\", ,\"ContractData\",A25, \"NetLastTradeToday\",, \"T\"),\"\"))","v":""},{"$f":"IFERROR(RTD(\"cqg.rtd\", ,\"ContractData\",A25, \"PerCentNetLastTrade\",, \"T\")/100,\"\")","v":""},{"$f":"IFERROR(I25/RTD(\"cqg.rtd\",,\"StudyData\",A25, \"ATR\", \"MaType=Sim,Period=10\", \"ATR\",\"D\",\"-1\",\"ALL\",,,\"FALSE\",\"T\")/100,\"\")","v":""},{"$f":"IF(C25=\"\",\"\",IFERROR(RTD(\"cqg.rtd\", ,\"ContractData\",A25, \"OPen\",, \"T\"),\"\"))","v":""},{"$f":"IF(C25=\"\",\"\",IFERROR(RTD(\"cqg.rtd\", ,\"ContractData\", A25, \"HIgh\",, \"T\"),\"\"))","v":""},{"$f":"IF(C25=\"\",\"\",IFERROR(RTD(\"cqg.rtd\", ,\"ContractData\",A25, \"LOw\",, \"T\"),\"\"))","v":""},{"$f":"IF(C25=\"\",\"\",IFERROR(RTD(\"cqg.rtd\", ,\"ContractData\",A25, \"T_CVol\",, \"T\"),\"\"))","v":""},null,{"$f":" IFERROR(O25/RTD(\"cqg.rtd\",,\"StudyData\",A25, \"MA\", \"InputChoice=Vol,MAType=Sim,Period=21\", \"MA\",\"D\",\"-1\",\"all\",,,,\"T\"),\"\")","v":""},{"$f":"ITA!R8","v":""}]
[{"$f":"TRIM(ITA!O9)","v":""},"News",{"$f":"IFERROR(PROPER(RTD(\"cqg.rtd\", ,\"ContractData\",A26, \"LongDescription\",, \"T\"))&\" (\"&RIGHT(A26,LEN(A26)-5)&\")\",\"\")","v":""},null,null,null,null,{"$f":"IF(C26=\"\",\"\",IFERROR(RTD(\"cqg.rtd\", ,\"ContractData\",A26, \"LastTradeToday\",, \"T\"),\"\"))","v":""},{"$f":"IF(C26=\"\",\"\",IFERROR(RTD(\"cqg.rtd\", ,\"ContractData\",A26, \"NetLastTradeToday\",, \"T\"),\"\"))","v":""},{"$f":"IFERROR(RTD(\"cqg.rtd\", ,\"ContractData\",A26, \"PerCentNetLastTrade\",, \"T\")/100,\"\")","v":""},{"$f":"IFERROR(I26/RTD(\"cqg.rtd\",,\"StudyData\",A26, \"ATR\", \"MaType=Sim,Period=10\", \"ATR\",\"D\",\"-1\",\"ALL\",,,\"FALSE\",\"T\")/100,\"\")","v":""},{"$f":"IF(C26=\"\",\"\",IFERROR(RTD(\"cqg.rtd\", ,\"ContractData\",A26, \"OPen\",, \"T\"),\"\"))","v":""},{"$f":"IF(C26=\"\",\"\",IFERROR(RTD(\"cqg.rtd\", ,\"ContractData\", A26, \"HIgh\",, \"T\"),\"\"))","v":""},{"$f":"IF(C26=\"\",\"\",IFERROR(RTD(\"cqg.rtd\", ,\"ContractData\",A26, \"LOw\",, \"T\"),\"\"))","v":""},{"$f":"IF(C26=\"\",\"\",IFERROR(RTD(\"cqg.rtd\", ,\"ContractData\",A26, \"T_CVol\",, \"T\"),\"\"))","v":""},null,{"$f":" IFERROR(O26/RTD(\"cqg.rtd\",,\"StudyData\",A26, \"MA\", \"InputChoice=Vol,MAType=Sim,Period=21\", \"MA\",\"D\",\"-1\",\"all\",,,,\"T\"),\"\")","v":""},{"$f":"ITA!R9","v":""}]
[{"$f":"TRIM(ITA!O10)","v":""},"News",{"$f":"IFERROR(PROPER(RTD(\"cqg.rtd\", ,\"ContractData\",A27, \"LongDescription\",, \"T\"))&\" (\"&RIGHT(A27,LEN(A27)-5)&\")\",\"\")","v":""},null,null,null,null,{"$f":"IF(C27=\"\",\"\",IFERROR(RTD(\"cqg.rtd\", ,\"ContractData\",A27, \"LastTradeToday\",, \"T\"),\"\"))","v":""},{"$f":"IF(C27=\"\",\"\",IFERROR(RTD(\"cqg.rtd\", ,\"ContractData\",A27, \"NetLastTradeToday\",, \"T\"),\"\"))","v":""},{"$f":"IFERROR(RTD(\"cqg.rtd\", ,\"ContractData\",A27, \"PerCentNetLastTrade\",, \"T\")/100,\"\")","v":""},{"$f":"IFERROR(I27/RTD(\"cqg.rtd\",,\"StudyData\",A27, \"ATR\", \"MaType=Sim,Period=10\", \"ATR\",\"D\",\"-1\",\"ALL\",,,\"FALSE\",\"T\")/100,\"\")","v":""},{"$f":"IF(C27=\"\",\"\",IFERROR(RTD(\"cqg.rtd\", ,\"ContractData\",A27, \"OPen\",, \"T\"),\"\"))","v":""},{"$f":"IF(C27=\"\",\"\",IFERROR(RTD(\"cqg.rtd\", ,\"ContractData\", A27, \"HIgh\",, \"T\"),\"\"))","v":""},{"$f":"IF(C27=\"\",\"\",IFERROR(RTD(\"cqg.rtd\", ,\"ContractData\",A27, \"LOw\",, \"T\"),\"\"))","v":""},{"$f":"IF(C27=\"\",\"\",IFERROR(RTD(\"cqg.rtd\", ,\"ContractData\",A27, \"T_CVol\",, \"T\"),\"\"))","v":""},null,{"$f":" IFERROR(O27/RTD(\"cqg.rtd\",,\"StudyData\",A27, \"MA\", \"InputChoice=Vol,MAType=Sim,Period=21\", \"MA\",\"D\",\"-1\",\"all\",,,,\"T\"),\"\")","v":""},{"$f":"ITA!R10","v":""},"Bottom 15 Negative Performing Companies "]
[{"$f":"TRIM(ITA!O11)","v":""},"News",{"$f":"IFERROR(PROPER(RTD(\"cqg.rtd\", ,\"ContractData\",A28, \"LongDescription\",, \"T\"))&\" (\"&RIGHT(A28,LEN(A28)-5)&\")\",\"\")","v":""},null,null,null,null,{"$f":"IF(C28=\"\",\"\",IFERROR(RTD(\"cqg.rtd\", ,\"ContractData\",A28, \"LastTradeToday\",, \"T\"),\"\"))","v":""},{"$f":"IF(C28=\"\",\"\",IFERROR(RTD(\"cqg.rtd\", ,\"ContractData\",A28, \"NetLastTradeToday\",, \"T\"),\"\"))","v":""},{"$f":"IFERROR(RTD(\"cqg.rtd\", ,\"ContractData\",A28, \"PerCentNetLastTrade\",, \"T\")/100,\"\")","v":""},{"$f":"IFERROR(I28/RTD(\"cqg.rtd\",,\"StudyData\",A28, \"ATR\", \"MaType=Sim,Period=10\", \"ATR\",\"D\",\"-1\",\"ALL\",,,\"FALSE\",\"T\")/100,\"\")","v":""},{"$f":"IF(C28=\"\",\"\",IFERROR(RTD(\"cqg.rtd\", ,\"ContractData\",A28, \"OPen\",, \"T\"),\"\"))","v":""},{"$f":"IF(C28=\"\",\"\",IFERROR(RTD(\"cqg.rtd\", ,\"ContractData\", A28, \"HIgh\",, \"T\"),\"\"))","v":""},{"$f":"IF(C28=\"\",\"\",IFERROR(RTD(\"cqg.rtd\", ,\"ContractData\",A28, \"LOw\",, \"T\"),\"\"))","v":""},{"$f":"IF(C28=\"\",\"\",IFERROR(RTD(\"cqg.rtd\", ,\"ContractData\",A28, \"T_CVol\",, \"T\"),\"\"))","v":""},null,{"$f":" IFERROR(O28/RTD(\"cqg.rtd\",,\"StudyData\",A28, \"MA\", \"InputChoice=Vol,MAType=Sim,Period=21\", \"MA\",\"D\",\"-1\",\"all\",,,,\"T\"),\"\")","v":""},{"$f":"ITA!R11","v":""}]
[{"$f":"TRIM(ITA!O12)","v":""},"News",{"$f":"IFERROR(PROPER(RTD(\"cqg.rtd\", ,\"ContractData\",A29, \"LongDescription\",, \"T\"))&\" (\"&RIGHT(A29,LEN(A29)-5)&\")\",\"\")","v":""},null,null,null,null,{"$f":"IF(C29=\"\",\"\",IFERROR(RTD(\"cqg.rtd\", ,\"ContractData\",A29, \"LastTradeToday\",, \"T\"),\"\"))","v":""},{"$f":"IF(C29=\"\",\"\",IFERROR(RTD(\"cqg.rtd\", ,\"ContractData\",A29, \"NetLastTradeToday\",, \"T\"),\"\"))","v":""},{"$f":"IFERROR(RTD(\"cqg.rtd\", ,\"ContractData\",A29, \"PerCentNetLastTrade\",, \"T\")/100,\"\")","v":""},{"$f":"IFERROR(I29/RTD(\"cqg.rtd\",,\"StudyData\",A29, \"ATR\", \"MaType=Sim,Period=10\", \"ATR\",\"D\",\"-1\",\"ALL\",,,\"FALSE\",\"T\")/100,\"\")","v":""},{"$f":"IF(C29=\"\",\"\",IFERROR(RTD(\"cqg.rtd\", ,\"ContractData\",A29, \"OPen\",, \"T\"),\"\"))","v":""},{"$f":"IF(C29=\"\",\"\",IFERROR(RTD(\"cqg.rtd\", ,\"ContractData\", A29, \"HIgh\",, \"T\"),\"\"))","v":""},{"$f":"IF(C29=\"\",\"\",IFERROR(RTD(\"cqg.rtd\", ,\"ContractData\",A29, \"LOw\",, \"T\"),\"\"))","v":""},{"$f":"IF(C29=\"\",\"\",IFERROR(RTD(\"cqg.rtd\", ,\"ContractData\",A29, \"T_CVol\",, \"T\"),\"\"))","v":""},null,{"$f":" IFERROR(O29/RTD(\"cqg.rtd\",,\"StudyData\",A29, \"MA\", \"InputChoice=Vol,MAType=Sim,Period=21\", \"MA\",\"D\",\"-1\",\"all\",,,,\"T\"),\"\")","v":""},{"$f":"ITA!R12","v":""}]
[{"$f":"TRIM(ITA!O13)","v":""},"News",{"$f":"IFERROR(PROPER(RTD(\"cqg.rtd\", ,\"ContractData\",A30, \"LongDescription\",, \"T\"))&\" (\"&RIGHT(A30,LEN(A30)-5)&\")\",\"\")","v":""},null,null,null,null,{"$f":"IF(C30=\"\",\"\",IFERROR(RTD(\"cqg.rtd\", ,\"ContractData\",A30, \"LastTradeToday\",, \"T\"),\"\"))","v":""},{"$f":"IF(C30=\"\",\"\",IFERROR(RTD(\"cqg.rtd\", ,\"ContractData\",A30, \"NetLastTradeToday\",, \"T\"),\"\"))","v":""},{"$f":"IFERROR(RTD(\"cqg.rtd\", ,\"ContractData\",A30, \"PerCentNetLastTrade\",, \"T\")/100,\"\")","v":""},{"$f":"IFERROR(I30/RTD(\"cqg.rtd\",,\"StudyData\",A30, \"ATR\", \"MaType=Sim,Period=10\", \"ATR\",\"D\",\"-1\",\"ALL\",,,\"FALSE\",\"T\")/100,\"\")","v":""},{"$f":"IF(C30=\"\",\"\",IFERROR(RTD(\"cqg.rtd\", ,\"ContractData\",A30, \"OPen\",, \"T\"),\"\"))","v":""},{"$f":"IF(C30=\"\",\"\",IFERROR(RTD(\"cqg.rtd\", ,\"ContractData\", A30, \"HIgh\",, \"T\"),\"\"))","v":""},{"$f":"IF(C30=\"\",\"\",IFERROR(RTD(\"cqg.rtd\", ,\"ContractData\",A30, \"LOw\",, \"T\"),\"\"))","v":""},{"$f":"IF(C30=\"\",\"\",IFERROR(RTD(\"cqg.rtd\", ,\"ContractData\",A30, \"T_CVol\",, \"T\"),\"\"))","v":""},null,{"$f":" IFERROR(O30/RTD(\"cqg.rtd\",,\"StudyData\",A30, \"MA\", \"InputChoice=Vol,MAType=Sim,Period=21\", \"MA\",\"D\",\"-1\",\"all\",,,,\"T\"),\"\")","v":""},{"$f":"ITA!R13","v":""}]
[{"$f":"TRIM(ITA!O14)","v":""},"News",{"$f":"IFERROR(PROPER(RTD(\"cqg.rtd\", ,\"ContractData\",A31, \"LongDescription\",, \"T\"))&\" (\"&RIGHT(A31,LEN(A31)-5)&\")\",\"\")","v":""},null,null,null,null,{"$f":"IF(C31=\"\",\"\",IFERROR(RTD(\"cqg.rtd\", ,\"ContractData\",A31, \"LastTradeToday\",, \"T\"),\"\"))","v":""},{"$f":"IF(C31=\"\",\"\",IFERROR(RTD(\"cqg.rtd\", ,\"ContractData\",A31, \"NetLastTradeToday\",, \"T\"),\"\"))","v":""},{"$f":"IFERROR(RTD(\"cqg.rtd\", ,\"ContractData\",A31, \"PerCentNetLastTrade\",, \"T\")/100,\"\")","v":""},{"$f":"IFERROR(I31/RTD(\"cqg.rtd\",,\"StudyData\",A31, \"ATR\", \"MaType=Sim,Period=10\", \"ATR\",\"D\",\"-1\",\"ALL\",,,\"FALSE\",\"T\")/100,\"\")","v":""},{"$f":"IF(C31=\"\",\"\",IFERROR(RTD(\"cqg.rtd\", ,\"ContractData\",A31, \"OPen\",, \"T\"),\"\"))","v":""},{"$f":"IF(C31=\"\",\"\",IFERROR(RTD(\"cqg.rtd\", ,\"ContractData\", A31, \"HIgh\",, \"T\"),\"\"))","v":""},{"$f":"IF(C31=\"\",\"\",IFERROR(RTD(\"cqg.rtd\", ,\"ContractData\",A31, \"LOw\",, \"T\"),\"\"))","v":""},{"$f":"IF(C31=\"\",\"\",IFERROR(RTD(\"cqg.rtd\", ,\"ContractData\",A31, \"T_CVol\",, \"T\"),\"\"))","v":""},null,{"$f":" IFERROR(O31/RTD(\"cqg.rtd\",,\"StudyData\",A31, \"MA\", \"InputChoice=Vol,MAType=Sim,Period=21\", \"MA\",\"D\",\"-1\",\"all\",,,,\"T\"),\"\")","v":""},{"$f":"ITA!R14","v":""}]
[{"$f":"TRIM(ITA!O15)","v":""},"News",{"$f":"IFERROR(PROPER(RTD(\"cqg.rtd\", ,\"ContractData\",A32, \"LongDescription\",, \"T\"))&\" (\"&RIGHT(A32,LEN(A32)-5)&\")\",\"\")","v":""},null,null,null,null,{"$f":"IF(C32=\"\",\"\",IFERROR(RTD(\"cqg.rtd\", ,\"ContractData\",A32, \"LastTradeToday\",, \"T\"),\"\"))","v":""},{"$f":"IF(C32=\"\",\"\",IFERROR(RTD(\"cqg.rtd\", ,\"ContractData\",A32, \"NetLastTradeToday\",, \"T\"),\"\"))","v":""},{"$f":"IFERROR(RTD(\"cqg.rtd\", ,\"ContractData\",A32, \"PerCentNetLastTrade\",, \"T\")/100,\"\")","v":""},{"$f":"IFERROR(I32/RTD(\"cqg.rtd\",,\"StudyData\",A32, \"ATR\", \"MaType=Sim,Period=10\", \"ATR\",\"D\",\"-1\",\"ALL\",,,\"FALSE\",\"T\")/100,\"\")","v":""},{"$f":"IF(C32=\"\",\"\",IFERROR(RTD(\"cqg.rtd\", ,\"ContractData\",A32, \"OPen\",, \"T\"),\"\"))","v":""},{"$f":"IF(C32=\"\",\"\",IFERROR(RTD(\"cqg.rtd\", ,\"ContractData\", A32, \"HIgh\",, \"T\"),\"\"))","v":""},{"$f":"IF(C32=\"\",\"\",IFERROR(RTD(\"cqg.rtd\", ,\"ContractData\",A32, \"LOw\",, \"T\"),\"\"))","v":""},{"$f":"IF(C32=\"\",\"\",IFERROR(RTD(\"cqg.rtd\", ,\"ContractData\",A32, \"T_CVol\",, \"T\"),\"\"))","v":""},null,{"$f":" IFERROR(O32/RTD(\"cqg.rtd\",,\"StudyData\",A32, \"MA\", \"InputChoice=Vol,MAType=Sim,Period=21\", \"MA\",\"D\",\"-1\",\"all\",,,,\"T\"),\"\")","v":""},{"$f":"ITA!R15","v":""}]
[null,null,"Bottom 15 Description",null,null,null,null,"Last","NC","%NC","NC/ATR","Open","High","Low","Volume",null,"Ratio"]
[{"$f":"TRIM(ITA!AC1)","v":""},"News",{"$f":"IFERROR(PROPER(RTD(\"cqg.rtd\", ,\"ContractData\",A34, \"LongDescription\",, \"T\"))&\" (\"&RIGHT(A34,LEN(A34)-5)&\")\",\"\")","v":""},null,null,null,null,{"$f":"IF(C34=\"\",\"\",IFERROR(RTD(\"cqg.rtd\", ,\"ContractData\",A34, \"LastTradeToday\",, \"T\"),\"\"))","v":""},{"$f":"IF(C34=\"\",\"\",IFERROR(RTD(\"cqg.rtd\", ,\"ContractData\",A34, \"NetLastTradeToday\",, \"T\"),\"\"))","v":""},{"$f":"IFERROR(RTD(\"cqg.rtd\", ,\"ContractData\",A34, \"PerCentNetLastTrade\",, \"T\")/100,\"\")","v":""},{"$f":"IFERROR(I34/RTD(\"cqg.rtd\",,\"StudyData\",A34, \"ATR\", \"MaType=Sim,Period=10\", \"ATR\",\"D\",\"-1\",\"ALL\",,,\"FALSE\",\"T\")/100,\"\")","v":""},{"$f":"IF(C34=\"\",\"\",IFERROR(RTD(\"cqg.rtd\", ,\"ContractData\",A34, \"OPen\",, \"T\"),\"\"))","v":""},{"$f":"IF(C34=\"\",\"\",IFERROR(RTD(\"cqg.rtd\", ,\"ContractData\", A34, \"HIgh\",, \"T\"),\"\"))","v":""},{"$f":"IF(C34=\"\",\"\",IFERROR(RTD(\"cqg.rtd\", ,\"ContractData\",A34, \"LOw\",, \"T\"),\"\"))","v":""},{"$f":"IF(C34=\"\",\"\",IFERROR(RTD(\"cqg.rtd\", ,\"ContractData\",A34, \"T_CVol\",, \"T\"),\"\"))","v":""},null,{"$f":" IFERROR(O34/RTD(\"cqg.rtd\",,\"StudyData\",A34, \"MA\", \"InputChoice=Vol,MAType=Sim,Period=21\", \"MA\",\"D\",\"-1\",\"all\",,,,\"T\"),\"\")","v":""},{"$f":"ITA!AH1","v":""}]
[{"$f":"TRIM(ITA!AC2)","v":""},"News",{"$f":"IFERROR(PROPER(RTD(\"cqg.rtd\", ,\"ContractData\",A35, \"LongDescription\",, \"T\"))&\" (\"&RIGHT(A35,LEN(A35)-5)&\")\",\"\")","v":""},null,null,null,null,{"$f":"IF(C35=\"\",\"\",IFERROR(RTD(\"cqg.rtd\", ,\"ContractData\",A35, \"LastTradeToday\",, \"T\"),\"\"))","v":""},{"$f":"IF(C35=\"\",\"\",IFERROR(RTD(\"cqg.rtd\", ,\"ContractData\",A35, \"NetLastTradeToday\",, \"T\"),\"\"))","v":""},{"$f":"IFERROR(RTD(\"cqg.rtd\", ,\"ContractData\",A35, \"PerCentNetLastTrade\",, \"T\")/100,\"\")","v":""},{"$f":"IFERROR(I35/RTD(\"cqg.rtd\",,\"StudyData\",A35, \"ATR\", \"MaType=Sim,Period=10\", \"ATR\",\"D\",\"-1\",\"ALL\",,,\"FALSE\",\"T\")/100,\"\")","v":""},{"$f":"IF(C35=\"\",\"\",IFERROR(RTD(\"cqg.rtd\", ,\"ContractData\",A35, \"OPen\",, \"T\"),\"\"))","v":""},{"$f":"IF(C35=\"\",\"\",IFERROR(RTD(\"cqg.rtd\", ,\"ContractData\", A35, \"HIgh\",, \"T\"),\"\"))","v":""},{"$f":"IF(C35=\"\",\"\",IFERROR(RTD(\"cqg.rtd\", ,\"ContractData\",A35, \"LOw\",, \"T\"),\"\"))","v":""},{"$f":"IF(C35=\"\",\"\",IFERROR(RTD(\"cqg.rtd\", ,\"ContractData\",A35, \"T_CVol\",, \"T\"),\"\"))","v":""},null,{"$f":" IFERROR(O35/RTD(\"cqg.rtd\",,\"StudyData\",A35, \"MA\", \"InputChoice=Vol,MAType=Sim,Period=21\", \"MA\",\"D\",\"-1\",\"all\",,,,\"T\"),\"\")","v":""},{"$f":"ITA!AH2","v":""}]
[{"$f":"TRIM(ITA!AC3)","v":""},"News",{"$f":"IFERROR(PROPER(RTD(\"cqg.rtd\", ,\"ContractData\",A36, \"LongDescription\",, \"T\"))&\" (\"&RIGHT(A36,LEN(A36)-5)&\")\",\"\")","v":""},null,null,null,null,{"$f":"IF(C36=\"\",\"\",IFERROR(RTD(\"cqg.rtd\", ,\"ContractData\",A36, \"LastTradeToday\",, \"T\"),\"\"))","v":""},{"$f":"IF(C36=\"\",\"\",IFERROR(RTD(\"cqg.rtd\", ,\"ContractData\",A36, \"NetLastTradeToday\",, \"T\"),\"\"))","v":""},{"$f":"IFERROR(RTD(\"cqg.rtd\", ,\"ContractData\",A36, \"PerCentNetLastTrade\",, \"T\")/100,\"\")","v":""},{"$f":"IFERROR(I36/RTD(\"cqg.rtd\",,\"StudyData\",A36, \"ATR\", \"MaType=Sim,Period=10\", \"ATR\",\"D\",\"-1\",\"ALL\",,,\"FALSE\",\"T\")/100,\"\")","v":""},{"$f":"IF(C36=\"\",\"\",IFERROR(RTD(\"cqg.rtd\", ,\"ContractData\",A36, \"OPen\",, \"T\"),\"\"))","v":""},{"$f":"IF(C36=\"\",\"\",IFERROR(RTD(\"cqg.rtd\", ,\"ContractData\", A36, \"HIgh\",, \"T\"),\"\"))","v":""},{"$f":"IF(C36=\"\",\"\",IFERROR(RTD(\"cqg.rtd\", ,\"ContractData\",A36, \"LOw\",, \"T\"),\"\"))","v":""},{"$f":"IF(C36=\"\",\"\",IFERROR(RTD(\"cqg.rtd\", ,\"ContractData\",A36, \"T_CVol\",, \"T\"),\"\"))","v":""},null,{"$f":" IFERROR(O36/RTD(\"cqg.rtd\",,\"StudyData\",A36, \"MA\", \"InputChoice=Vol,MAType=Sim,Period=21\", \"MA\",\"D\",\"-1\",\"all\",,,,\"T\"),\"\")","v":""},{"$f":"ITA!AH3","v":""}]
[{"$f":"TRIM(ITA!AC4)","v":""},"News",{"$f":"IFERROR(PROPER(RTD(\"cqg.rtd\", ,\"ContractData\",A37, \"LongDescription\",, \"T\"))&\" (\"&RIGHT(A37,LEN(A37)-5)&\")\",\"\")","v":""},null,null,null,null,{"$f":"IF(C37=\"\",\"\",IFERROR(RTD(\"cqg.rtd\", ,\"ContractData\",A37, \"LastTradeToday\",, \"T\"),\"\"))","v":""},{"$f":"IF(C37=\"\",\"\",IFERROR(RTD(\"cqg.rtd\", ,\"ContractData\",A37, \"NetLastTradeToday\",, \"T\"),\"\"))","v":""},{"$f":"IFERROR(RTD(\"cqg.rtd\", ,\"ContractData\",A37, \"PerCentNetLastTrade\",, \"T\")/100,\"\")","v":""},{"$f":"IFERROR(I37/RTD(\"cqg.rtd\",,\"StudyData\",A37, \"ATR\", \"MaType=Sim,Period=10\", \"ATR\",\"D\",\"-1\",\"ALL\",,,\"FALSE\",\"T\")/100,\"\")","v":""},{"$f":"IF(C37=\"\",\"\",IFERROR(RTD(\"cqg.rtd\", ,\"ContractData\",A37, \"OPen\",, \"T\"),\"\"))","v":""},{"$f":"IF(C37=\"\",\"\",IFERROR(RTD(\"cqg.rtd\", ,\"ContractData\", A37, \"HIgh\",, \"T\"),\"\"))","v":""},{"$f":"IF(C37=\"\",\"\",IFERROR(RTD(\"cqg.rtd\", ,\"ContractData\",A37, \"LOw\",, \"T\"),\"\"))","v":""},{"$f":"IF(C37=\"\",\"\",IFERROR(RTD(\"cqg.rtd\", ,\"ContractData\",A37, \"T_CVol\",, \"T\"),\"\"))","v":""},null,{"$f":" IFERROR(O37/RTD(\"cqg.rtd\",,\"StudyData\",A37, \"MA\", \"InputChoice=Vol,MAType=Sim,Period=21\", \"MA\",\"D\",\"-1\",\"all\",,,,\"T\"),\"\")","v":""},{"$f":"ITA!AH4","v":""}]
[{"$f":"TRIM(ITA!AC5)","v":""},"News",{"$f":"IFERROR(PROPER(RTD(\"cqg.rtd\", ,\"ContractData\",A38, \"LongDescription\",, \"T\"))&\" (\"&RIGHT(A38,LEN(A38)-5)&\")\",\"\")","v":""},null,null,null,null,{"$f":"IF(C38=\"\",\"\",IFERROR(RTD(\"cqg.rtd\", ,\"ContractData\",A38, \"LastTradeToday\",, \"T\"),\"\"))","v":""},{"$f":"IF(C38=\"\",\"\",IFERROR(RTD(\"cqg.rtd\", ,\"ContractData\",A38, \"NetLastTradeToday\",, \"T\"),\"\"))","v":""},{"$f":"IFERROR(RTD(\"cqg.rtd\", ,\"ContractData\",A38, \"PerCentNetLastTrade\",, \"T\")/100,\"\")","v":""},{"$f":"IFERROR(I38/RTD(\"cqg.rtd\",,\"StudyData\",A38, \"ATR\", \"MaType=Sim,Period=10\", \"ATR\",\"D\",\"-1\",\"ALL\",,,\"FALSE\",\"T\")/100,\"\")","v":""},{"$f":"IF(C38=\"\",\"\",IFERROR(RTD(\"cqg.rtd\", ,\"ContractData\",A38, \"OPen\",, \"T\"),\"\"))","v":""},{"$f":"IF(C38=\"\",\"\",IFERROR(RTD(\"cqg.rtd\", ,\"ContractData\", A38, \"HIgh\",, \"T\"),\"\"))","v":""},{"$f":"IF(C38=\"\",\"\",IFERROR(RTD(\"cqg.rtd\", ,\"ContractData\",A38, \"LOw\",, \"T\"),\"\"))","v":""},{"$f":"IF(C38=\"\",\"\",IFERROR(RTD(\"cqg.rtd\", ,\"ContractData\",A38, \"T_CVol\",, \"T\"),\"\"))","v":""},null,{"$f":" IFERROR(O38/RTD(\"cqg.rtd\",,\"StudyData\",A38, \"MA\", \"InputChoice=Vol,MAType=Sim,Period=21\", \"MA\",\"D\",\"-1\",\"all\",,,,\"T\"),\"\")","v":""},{"$f":"ITA!AH5","v":""}]
[{"$f":"TRIM(ITA!AC6)","v":""},"News",{"$f":"IFERROR(PROPER(RTD(\"cqg.rtd\", ,\"ContractData\",A39, \"LongDescription\",, \"T\"))&\" (\"&RIGHT(A39,LEN(A39)-5)&\")\",\"\")","v":""},null,null,null,null,{"$f":"IF(C39=\"\",\"\",IFERROR(RTD(\"cqg.rtd\", ,\"ContractData\",A39, \"LastTradeToday\",, \"T\"),\"\"))","v":""},{"$f":"IF(C39=\"\",\"\",IFERROR(RTD(\"cqg.rtd\", ,\"ContractData\",A39, \"NetLastTradeToday\",, \"T\"),\"\"))","v":""},{"$f":"IFERROR(RTD(\"cqg.rtd\", ,\"ContractData\",A39, \"PerCentNetLastTrade\",, \"T\")/100,\"\")","v":""},{"$f":"IFERROR(I39/RTD(\"cqg.rtd\",,\"StudyData\",A39, \"ATR\", \"MaType=Sim,Period=10\", \"ATR\",\"D\",\"-1\",\"ALL\",,,\"FALSE\",\"T\")/100,\"\")","v":""},{"$f":"IF(C39=\"\",\"\",IFERROR(RTD(\"cqg.rtd\", ,\"ContractData\",A39, \"OPen\",, \"T\"),\"\"))","v":""},{"$f":"IF(C39=\"\",\"\",IFERROR(RTD(\"cqg.rtd\", ,\"ContractData\", A39, \"HIgh\",, \"T\"),\"\"))","v":""},{"$f":"IF(C39=\"\",\"\",IFERROR(RTD(\"cqg.rtd\", ,\"ContractData\",A39, \"LOw\",, \"T\"),\"\"))","v":""},{"$f":"IF(C39=\"\",\"\",IFERROR(RTD(\"cqg.rtd\", ,\"ContractData\",A39, \"T_CVol\",, \"T\"),\"\"))","v":""},null,{"$f":" IFERROR(O39/RTD(\"cqg.rtd\",,\"StudyData\",A39, \"MA\", \"InputChoice=Vol,MAType=Sim,Period=21\", \"MA\",\"D\",\"-1\",\"all\",,,,\"T\"),\"\")","v":""},{"$f":"ITA!AH6","v":""}]
[{"$f":"TRIM(ITA!AC7)","v":""},"News",{"$f":"IFERROR(PROPER(RTD(\"cqg.rtd\", ,\"ContractData\",A40, \"LongDescription\",, \"T\"))&\" (\"&RIGHT(A40,LEN(A40)-5)&\")\",\"\")","v":""},null,null,null,null,{"$f":"IF(C40=\"\",\"\",IFERROR(RTD(\"cqg.rtd\", ,\"ContractData\",A40, \"LastTradeToday\",, \"T\"),\"\"))","v":""},{"$f":"IF(C40=\"\",\"\",IFERROR(RTD(\"cqg.rtd\", ,\"ContractData\",A40, \"NetLastTradeToday\",, \"T\"),\"\"))","v":""},{"$f":"IFERROR(RTD(\"cqg.rtd\", ,\"ContractData\",A40, \"PerCentNetLastTrade\",, \"T\")/100,\"\")","v":""},{"$f":"IFERROR(I40/RTD(\"cqg.rtd\",,\"StudyData\",A40, \"ATR\", \"MaType=Sim,Period=10\", \"ATR\",\"D\",\"-1\",\"ALL\",,,\"FALSE\",\"T\")/100,\"\")","v":""},{"$f":"IF(C40=\"\",\"\",IFERROR(RTD(\"cqg.rtd\", ,\"ContractData\",A40, \"OPen\",, \"T\"),\"\"))","v":""},{"$f":"IF(C40=\"\",\"\",IFERROR(RTD(\"cqg.rtd\", ,\"ContractData\", A40, \"HIgh\",, \"T\"),\"\"))","v":""},{"$f":"IF(C40=\"\",\"\",IFERROR(RTD(\"cqg.rtd\", ,\"ContractData\",A40, \"LOw\",, \"T\"),\"\"))","v":""},{"$f":"IF(C40=\"\",\"\",IFERROR(RTD(\"cqg.rtd\", ,\"ContractData\",A40, \"T_CVol\",, \"T\"),\"\"))","v":""},null,{"$f":" IFERROR(O40/RTD(\"cqg.rtd\",,\"StudyData\",A40, \"MA\", \"InputChoice=Vol,MAType=Sim,Period=21\", \"MA\",\"D\",\"-1\",\"all\",,,,\"T\"),\"\")","v":""},{"$f":"ITA!AH7","v":""}]
[{"$f":"TRIM(ITA!AC8)","v":""},"News",{"$f":"IFERROR(PROPER(RTD(\"cqg.rtd\", ,\"ContractData\",A41, \"LongDescription\",, \"T\"))&\" (\"&RIGHT(A41,LEN(A41)-5)&\")\",\"\")","v":""},null,null,null,null,{"$f":"IF(C41=\"\",\"\",IFERROR(RTD(\"cqg.rtd\", ,\"ContractData\",A41, \"LastTradeToday\",, \"T\"),\"\"))","v":""},{"$f":"IF(C41=\"\",\"\",IFERROR(RTD(\"cqg.rtd\", ,\"ContractData\",A41, \"NetLastTradeToday\",, \"T\"),\"\"))","v":""},{"$f":"IFERROR(RTD(\"cqg.rtd\", ,\"ContractData\",A41, \"PerCentNetLastTrade\",, \"T\")/100,\"\")","v":""},{"$f":"IFERROR(I41/RTD(\"cqg.rtd\",,\"StudyData\",A41, \"ATR\", \"MaType=Sim,Period=10\", \"ATR\",\"D\",\"-1\",\"ALL\",,,\"FALSE\",\"T\")/100,\"\")","v":""},{"$f":"IF(C41=\"\",\"\",IFERROR(RTD(\"cqg.rtd\", ,\"ContractData\",A41, \"OPen\",, \"T\"),\"\"))","v":""},{"$f":"IF(C41=\"\",\"\",IFERROR(RTD(\"cqg.rtd\", ,\"ContractData\", A41, \"HIgh\",, \"T\"),\"\"))","v":""},{"$f":"IF(C41=\"\",\"\",IFERROR(RTD(\"cqg.rtd\", ,\"ContractData\",A41, \"LOw\",, \"T\"),\"\"))","v":""},{"$f":"IF(C41=\"\",\"\",IFERROR(RTD(\"cqg.rtd\", ,\"ContractData\",A41, \"T_CVol\",, \"T\"),\"\"))","v":""},null,{"$f":" IFERROR(O41/RTD(\"cqg.rtd\",,\"StudyData\",A41, \"MA\", \"InputChoice=Vol,MAType=Sim,Period=21\", \"MA\",\"D\",\"-1\",\"all\",,,,\"T\"),\"\")","v":""},{"$f":"ITA!AH8","v":""}]
[{"$f":"TRIM(ITA!AC9)","v":""},"News",{"$f":"IFERROR(PROPER(RTD(\"cqg.rtd\", ,\"ContractData\",A42, \"LongDescription\",, \"T\"))&\" (\"&RIGHT(A42,LEN(A42)-5)&\")\",\"\")","v":""},null,null,null,null,{"$f":"IF(C42=\"\",\"\",IFERROR(RTD(\"cqg.rtd\", ,\"ContractData\",A42, \"LastTradeToday\",, \"T\"),\"\"))","v":""},{"$f":"IF(C42=\"\",\"\",IFERROR(RTD(\"cqg.rtd\", ,\"ContractData\",A42, \"NetLastTradeToday\",, \"T\"),\"\"))","v":""},{"$f":"IFERROR(RTD(\"cqg.rtd\", ,\"ContractData\",A42, \"PerCentNetLastTrade\",, \"T\")/100,\"\")","v":""},{"$f":"IFERROR(I42/RTD(\"cqg.rtd\",,\"StudyData\",A42, \"ATR\", \"MaType=Sim,Period=10\", \"ATR\",\"D\",\"-1\",\"ALL\",,,\"FALSE\",\"T\")/100,\"\")","v":""},{"$f":"IF(C42=\"\",\"\",IFERROR(RTD(\"cqg.rtd\", ,\"ContractData\",A42, \"OPen\",, \"T\"),\"\"))","v":""},{"$f":"IF(C42=\"\",\"\",IFERROR(RTD(\"cqg.rtd\", ,\"ContractData\", A42, \"HIgh\",, \"T\"),\"\"))","v":""},{"$f":"IF(C42=\"\",\"\",IFERROR(RTD(\"cqg.rtd\", ,\"ContractData\",A42, \"LOw\",, \"T\"),\"\"))","v":""},{"$f":"IF(C42=\"\",\"\",IFERROR(RTD(\"cqg.rtd\", ,\"ContractData\",A42, \"T_CVol\",, \"T\"),\"\"))","v":""},null,{"$f":" IFERROR(O42/RTD(\"cqg.rtd\",,\"StudyData\",A42, \"MA\", \"InputChoice=Vol,MAType=Sim,Period=21\", \"MA\",\"D\",\"-1\",\"all\",,,,\"T\"),\"\")","v":""},{"$f":"ITA!AH9","v":""}]
[{"$f":"TRIM(ITA!AC10)","v":""},"News",{"$f":"IFERROR(PROPER(RTD(\"cqg.rtd\", ,\"ContractData\",A43, \"LongDescription\",, \"T\"))&\" (\"&RIGHT(A43,LEN(A43)-5)&\")\",\"\")","v":""},null,null,null,null,{"$f":"IF(C43=\"\",\"\",IFERROR(RTD(\"cqg.rtd\", ,\"ContractData\",A43, \"LastTradeToday\",, \"T\"),\"\"))","v":""},{"$f":"IF(C43=\"\",\"\",IFERROR(RTD(\"cqg.rtd\", ,\"ContractData\",A43, \"NetLastTradeToday\",, \"T\"),\"\"))","v":""},{"$f":"IFERROR(RTD(\"cqg.rtd\", ,\"ContractData\",A43, \"PerCentNetLastTrade\",, \"T\")/100,\"\")","v":""},{"$f":"IFERROR(I43/RTD(\"cqg.rtd\",,\"StudyData\",A43, \"ATR\", \"MaType=Sim,Period=10\", \"ATR\",\"D\",\"-1\",\"ALL\",,,\"FALSE\",\"T\")/100,\"\")","v":""},{"$f":"IF(C43=\"\",\"\",IFERROR(RTD(\"cqg.rtd\", ,\"ContractData\",A43, \"OPen\",, \"T\"),\"\"))","v":""},{"$f":"IF(C43=\"\",\"\",IFERROR(RTD(\"cqg.rtd\", ,\"ContractData\", A43, \"HIgh\",, \"T\"),\"\"))","v":""},{"$f":"IF(C43=\"\",\"\",IFERROR(RTD(\"cqg.rtd\", ,\"ContractData\",A43, \"LOw\",, \"T\"),\"\"))","v":""},{"$f":"IF(C43=\"\",\"\",IFERROR(RTD(\"cqg.rtd\", ,\"ContractData\",A43, \"T_CVol\",, \"T\"),\"\"))","v":""},null,{"$f":" IFERROR(O43/RTD(\"cqg.rtd\",,\"StudyData\",A43, \"MA\", \"InputChoice=Vol,MAType=Sim,Period=21\", \"MA\",\"D\",\"-1\",\"all\",,,,\"T\"),\"\")","v":""},{"$f":"ITA!AH10","v":""}]
[{"$f":"TRIM(ITA!AC11)","v":""},"News",{"$f":"IFERROR(PROPER(RTD(\"cqg.rtd\", ,\"ContractData\",A44, \"LongDescription\",, \"T\"))&\" (\"&RIGHT(A44,LEN(A44)-5)&\")\",\"\")","v":""},null,null,null,null,{"$f":"IF(C44=\"\",\"\",IFERROR(RTD(\"cqg.rtd\", ,\"ContractData\",A44, \"LastTradeToday\",, \"T\"),\"\"))","v":""},{"$f":"IF(C44=\"\",\"\",IFERROR(RTD(\"cqg.rtd\", ,\"ContractData\",A44, \"NetLastTradeToday\",, \"T\"),\"\"))","v":""},{"$f":"IFERROR(RTD(\"cqg.rtd\", ,\"ContractData\",A44, \"PerCentNetLastTrade\",, \"T\")/100,\"\")","v":""},{"$f":"IFERROR(I44/RTD(\"cqg.rtd\",,\"StudyData\",A44, \"ATR\", \"MaType=Sim,Period=10\", \"ATR\",\"D\",\"-1\",\"ALL\",,,\"FALSE\",\"T\")/100,\"\")","v":""},{"$f":"IF(C44=\"\",\"\",IFERROR(RTD(\"cqg.rtd\", ,\"ContractData\",A44, \"OPen\",, \"T\"),\"\"))","v":""},{"$f":"IF(C44=\"\",\"\",IFERROR(RTD(\"cqg.rtd\", ,\"ContractData\", A44, \"HIgh\",, \"T\"),\"\"))","v":""},{"$f":"IF(C44=\"\",\"\",IFERROR(RTD(\"cqg.rtd\", ,\"ContractData\",A44, \"LOw\",, \"T\"),\"\"))","v":""},{"$f":"IF(C44=\"\",\"\",IFERROR(RTD(\"cqg.rtd\", ,\"ContractData\",A44, \"T_CVol\",, \"T\"),\"\"))","v":""},null,{"$f":" IFERROR(O44/RTD(\"cqg.rtd\",,\"StudyData\",A44, \"MA\", \"InputChoice=Vol,MAType=Sim,Period=21\", \"MA\",\"D\",\"-1\",\"all\",,,,\"T\"),\"\")","v":""},{"$f":"ITA!AH11","v":""}]
[{"$f":"TRIM(ITA!AC12)","v":""},"News",{"$f":"IFERROR(PROPER(RTD(\"cqg.rtd\", ,\"ContractData\",A45, \"LongDescription\",, \"T\"))&\" (\"&RIGHT(A45,LEN(A45)-5)&\")\",\"\")","v":""},null,null,null,null,{"$f":"IF(C45=\"\",\"\",IFERROR(RTD(\"cqg.rtd\", ,\"ContractData\",A45, \"LastTradeToday\",, \"T\"),\"\"))","v":""},{"$f":"IF(C45=\"\",\"\",IFERROR(RTD(\"cqg.rtd\", ,\"ContractData\",A45, \"NetLastTradeToday\",, \"T\"),\"\"))","v":""},{"$f":"IFERROR(RTD(\"cqg.rtd\", ,\"ContractData\",A45, \"PerCentNetLastTrade\",, \"T\")/100,\"\")","v":""},{"$f":"IFERROR(I45/RTD(\"cqg.rtd\",,\"StudyData\",A45, \"ATR\", \"MaType=Sim,Period=10\", \"ATR\",\"D\",\"-1\",\"ALL\",,,\"FALSE\",\"T\")/100,\"\")","v":""},{"$f":"IF(C45=\"\",\"\",IFERROR(RTD(\"cqg.rtd\", ,\"ContractData\",A45, \"OPen\",, \"T\"),\"\"))","v":""},{"$f":"IF(C45=\"\",\"\",IFERROR(RTD(\"cqg.rtd\", ,\"ContractData\", A45, \"HIgh\",, \"T\"),\"\"))","v":""},{"$f":"IF(C45=\"\",\"\",IFERROR(RTD(\"cqg.rtd\", ,\"ContractData\",A45, \"LOw\",, \"T\"),\"\"))","v":""},{"$f":"IF(C45=\"\",\"\",IFERROR(RTD(\"cqg.rtd\", ,\"ContractData\",A45, \"T_CVol\",, \"T\"),\"\"))","v":""},null,{"$f":" IFERROR(O45/RTD(\"cqg.rtd\",,\"StudyData\",A45, \"MA\", \"InputChoice=Vol,MAType=Sim,Period=21\", \"MA\",\"D\",\"-1\",\"all\",,,,\"T\"),\"\")","v":""},{"$f":"ITA!AH12","v":""}]
[{"$f":"TRIM(ITA!AC13)","v":""},"News",{"$f":"IFERROR(PROPER(RTD(\"cqg.rtd\", ,\"ContractData\",A46, \"LongDescription\",, \"T\"))&\" (\"&RIGHT(A46,LEN(A46)-5)&\")\",\"\")","v":""},null,null,null,null,{"$f":"IF(C46=\"\",\"\",IFERROR(RTD(\"cqg.rtd\", ,\"ContractData\",A46, \"LastTradeToday\",, \"T\"),\"\"))","v":""},{"$f":"IF(C46=\"\",\"\",IFERROR(RTD(\"cqg.rtd\", ,\"ContractData\",A46, \"NetLastTradeToday\",, \"T\"),\"\"))","v":""},{"$f":"IFERROR(RTD(\"cqg.rtd\", ,\"ContractData\",A46, \"PerCentNetLastTrade\",, \"T\")/100,\"\")","v":""},{"$f":"IFERROR(I46/RTD(\"cqg.rtd\",,\"StudyData\",A46, \"ATR\", \"MaType=Sim,Period=10\", \"ATR\",\"D\",\"-1\",\"ALL\",,,\"FALSE\",\"T\")/100,\"\")","v":""},{"$f":"IF(C46=\"\",\"\",IFERROR(RTD(\"cqg.rtd\", ,\"ContractData\",A46, \"OPen\",, \"T\"),\"\"))","v":""},{"$f":"IF(C46=\"\",\"\",IFERROR(RTD(\"cqg.rtd\", ,\"ContractData\", A46, \"HIgh\",, \"T\"),\"\"))","v":""},{"$f":"IF(C46=\"\",\"\",IFERROR(RTD(\"cqg.rtd\", ,\"ContractData\",A46, \"LOw\",, \"T\"),\"\"))","v":""},{"$f":"IF(C46=\"\",\"\",IFERROR(RTD(\"cqg.rtd\", ,\"ContractData\",A46, \"T_CVol\",, \"T\"),\"\"))","v":""},null,{"$f":" IFERROR(O46/RTD(\"cqg.rtd\",,\"StudyData\",A46, \"MA\", \"InputChoice=Vol,MAType=Sim,Period=21\", \"MA\",\"D\",\"-1\",\"all\",,,,\"T\"),\"\")","v":""},{"$f":"ITA!AH13","v":""}]
[{"$f":"TRIM(ITA!AC14)","v":""},"News",{"$f":"IFERROR(PROPER(RTD(\"cqg.rtd\", ,\"ContractData\",A47, \"LongDescription\",, \"T\"))&\" (\"&RIGHT(A47,LEN(A47)-5)&\")\",\"\")","v":""},null,null,null,null,{"$f":"IF(C47=\"\",\"\",IFERROR(RTD(\"cqg.rtd\", ,\"ContractData\",A47, \"LastTradeToday\",, \"T\"),\"\"))","v":""},{"$f":"IF(C47=\"\",\"\",IFERROR(RTD(\"cqg.rtd\", ,\"ContractData\",A47, \"NetLastTradeToday\",, \"T\"),\"\"))","v":""},{"$f":"IFERROR(RTD(\"cqg.rtd\", ,\"ContractData\",A47, \"PerCentNetLastTrade\",, \"T\")/100,\"\")","v":""},{"$f":"IFERROR(I47/RTD(\"cqg.rtd\",,\"StudyData\",A47, \"ATR\", \"MaType=Sim,Period=10\", \"ATR\",\"D\",\"-1\",\"ALL\",,,\"FALSE\",\"T\")/100,\"\")","v":""},{"$f":"IF(C47=\"\",\"\",IFERROR(RTD(\"cqg.rtd\", ,\"ContractData\",A47, \"OPen\",, \"T\"),\"\"))","v":""},{"$f":"IF(C47=\"\",\"\",IFERROR(RTD(\"cqg.rtd\", ,\"ContractData\", A47, \"HIgh\",, \"T\"),\"\"))","v":""},{"$f":"IF(C47=\"\",\"\",IFERROR(RTD(\"cqg.rtd\", ,\"ContractData\",A47, \"LOw\",, \"T\"),\"\"))","v":""},{"$f":"IF(C47=\"\",\"\",IFERROR(RTD(\"cqg.rtd\", ,\"ContractData\",A47, \"T_CVol\",, \"T\"),\"\"))","v":""},null,{"$f":" IFERROR(O47/RTD(\"cqg.rtd\",,\"StudyData\",A47, \"MA\", \"InputChoice=Vol,MAType=Sim,Period=21\", \"MA\",\"D\",\"-1\",\"all\",,,,\"T\"),\"\")","v":""},{"$f":"ITA!AH14","v":""}]
[{"$f":"TRIM(ITA!AC15)","v":""},"News",{"$f":"IFERROR(PROPER(RTD(\"cqg.rtd\", ,\"ContractData\",A48, \"LongDescription\",, \"T\"))&\" (\"&RIGHT(A48,LEN(A48)-5)&\")\",\"\")","v":""},null,null,null,null,{"$f":"IF(C48=\"\",\"\",IFERROR(RTD(\"cqg.rtd\", ,\"ContractData\",A48, \"LastTradeToday\",, \"T\"),\"\"))","v":""},{"$f":"IF(C48=\"\",\"\",IFERROR(RTD(\"cqg.rtd\", ,\"ContractData\",A48, \"NetLastTradeToday\",, \"T\"),\"\"))","v":""},{"$f":"IFERROR(RTD(\"cqg.rtd\", ,\"ContractData\",A48, \"PerCentNetLastTrade\",, \"T\")/100,\"\")","v":""},{"$f":"IFERROR(I48/RTD(\"cqg.rtd\",,\"StudyData\",A48, \"ATR\", \"MaType=Sim,Period=10\", \"ATR\",\"D\",\"-1\",\"ALL\",,,\"FALSE\",\"T\")/100,\"\")","v":""},{"$f":"IF(C48=\"\",\"\",IFERROR(RTD(\"cqg.rtd\", ,\"ContractData\",A48, \"OPen\",, \"T\"),\"\"))","v":""},{"$f":"IF(C48=\"\",\"\",IFERROR(RTD(\"cqg.rtd\", ,\"ContractData\", A48, \"HIgh\",, \"T\"),\"\"))","v":""},{"$f":"IF(C48=\"\",\"\",IFERROR(RTD(\"cqg.rtd\", ,\"ContractData\",A48, \"LOw\",, \"T\"),\"\"))","v":""},{"$f":"IF(C48=\"\",\"\",IFERROR(RTD(\"cqg.rtd\", ,\"ContractData\",A48, \"T_CVol\",, \"T\"),\"\"))","v":""},null,{"$f":" IFERROR(O48/RTD(\"cqg.rtd\",,\"StudyData\",A48, \"MA\", \"InputChoice=Vol,MAType=Sim,Period=21\", \"MA\",\"D\",\"-1\",\"all\",,,,\"T\"),\"\")","v":""},{"$f":"ITA!AH15","v":""}]
[null,"CQG Inc., Copyright © 2026   Designed by Thom Hartle",null,null,null,null,null,"  From their website: \"Exposure to U.S. companies that manufacture commercial and military aircrafts and other defense equipment.\"",null,null,null,null,null,null,null,null,null,null,null,null,null,null,null,null,null,{"$f":"Z52","v":"100% of the stocks in the ETF are higher today"}]
[]
[null,null,null,null,null,null,null,null,null,null,null,null,null,null,null,null,null,null,null,null,null,null,null,null,null,{"$f":"ITA!B351","v":1},"of the stocks in the ETF are higher today"]
[null,null,null,null,null,null,null,null,null,null,null,null,null,null,null,null,null,null,null,null,null,null,null,null,null,{"$f":"TEXT(Display!Z51,\"0%\")&\" \"&Display!AA51","v":"100% of the stocks in the ETF are higher today"}]

{"sheet":"ITA","index":1,"n_rows":352,"n_cols":34,"rows_kept":352,"cut":false,"hidden":true,"merged":[]}
[{"$f":"IF(Symbols!A1=\"\",\"\",Symbols!A1)","v":"S.US.ACHR"},{"$f":"IF(A1=\"\",\"\",IF(J1>0,1,0))","v":1},{"$f":"A1","v":"S.US.ACHR"},{"$f":"IF(A1=\"\",\"\",RTD(\"cqg.rtd\", ,\"ContractData\",C1, \"LongDescription\",, \"T\"))","v":"Archer Aviation Inc"},null,{"$f":"(\"$J$\"&\"1\"&\":$J$\"&A351)","v":"$J$1:$J$41"},null,{"$f":"IF(A1=\"\",\"\",RTD(\"cqg.rtd\", ,\"ContractData\",C1, \"LastTradeToday\",, \"T\"))","v":""},{"$f":"IF(A1=\"\",\"\",RTD(\"cqg.rtd\", ,\"ContractData\",C1, \"NetLastTradeToday\",, \"T\"))","v":""},{"$f":"IF(A1=\"\",\"\",IFERROR(RTD(\"cqg.rtd\", ,\"ContractData\",C1, \"PerCentNetLastTrade\",, \"T\")/100,\"\"))","v":""},{"$f":"IF(A1=\"\",\"\",RTD(\"cqg.rtd\", ,\"ContractData\", C1, \"T_CVol\",, \"T\"))","v":70459},1,{"$f":"IFERROR(RANK($J1,INDIRECT((\"$J$\"&\"1\"&\":$J$\"&$A$351)))+COUNTIF($J$1:J1,J1)-1,\"\")","v":""},{"$f":"C1","v":"S.US.ACHR"},{"$f":"IFERROR(VLOOKUP($L1,$M$1:$N$350,2,FALSE),\"\")","v":""},{"$f":"IF(O1=\"\",\"\",RTD(\"cqg.rtd\", ,\"ContractData\",O1, \"LongDescription\",, \"T\"))","v":""},{"$f":"IFERROR(RTD(\"cqg.rtd\", ,\"ContractData\",O1, \"PerCentNetLastTrade\",, \"T\")/100,\"\")","v":""},{"$f":"IFERROR(\"https://finance.yahoo.com/quote/\"&RIGHT(O1,(LEN(O1)-5)),\"\")","v":""},null,{"$f":"IF(Q1>=0,Q1,NA())","v":""},{"$f":"IFERROR(IF(Q1>=0,NA(),-1*Q1),\"\")","v":""},null,{"$f":"IF(Q1=\"\",\"\",IF(Q1<0,\"\",IFERROR(PROPER(RTD(\"cqg.rtd\", ,\"ContractData\",O1, \"LongDescription\",, \"T\")),\"\")))","v":""},null,null,{"$f":"IF(W1=\"\",\"\",IFERROR(T1,Q1))","v":""},{"$f":"MIN(J1:J350)","v":0},{"$f":"IFERROR(VLOOKUP(AA1,J1:O350,4,FALSE),\"\")","v":""},{"$f":"IF(AB1=\"\",\"\",VLOOKUP($AB1,$M$1:$N$350,2,FALSE))","v":""},{"$f":"IF(RTD(\"cqg.rtd\", ,\"ContractData\",AC1, \"PerCentNetLastTrade\",, \"T\")>0,\"\",IFERROR(RTD(\"cqg.rtd\", ,\"ContractData\",AC1, \"PerCentNetLastTrade\",, \"T\")/100,\"\"))","v":""},{"$f":"IF(AD1>0,\"\",IFERROR(PROPER(RTD(\"cqg.rtd\", ,\"ContractData\",AC1, \"LongDescription\",, \"T\")),\"\"))","v":""},{"$f":"\"\"","v":""},{"$f":"IF(AD1>0,\"\",IFERROR(AD1*-1,\"\"))","v":""},{"$f":"IFERROR(\"https://finance.yahoo.com/quote/\"&RIGHT(AC1,(LEN(AC1)-5)),\"\")","v":""}]
[{"$f":"IF(Symbols!A2=\"\",\"\",Symbols!A2)","v":"S.US.AIR"},{"$f":"IF(A2=\"\",\"\",IF(J2>0,1,0))","v":1},{"$f":"A2","v":"S.US.AIR"},{"$f":"IF(A2=\"\",\"\",RTD(\"cqg.rtd\", ,\"ContractData\",C2, \"LongDescription\",, \"T\"))","v":"AAR Corporation"},null,null,null,{"$f":"IF(A2=\"\",\"\",RTD(\"cqg.rtd\", ,\"ContractData\",C2, \"LastTradeToday\",, \"T\"))","v":""},{"$f":"IF(A2=\"\",\"\",RTD(\"cqg.rtd\", ,\"ContractData\",C2, \"NetLastTradeToday\",, \"T\"))","v":""},{"$f":"IF(A2=\"\",\"\",IFERROR(RTD(\"cqg.rtd\", ,\"ContractData\",C2, \"PerCentNetLastTrade\",, \"T\")/100,\"\"))","v":""},{"$f":"IF(A2=\"\",\"\",RTD(\"cqg.rtd\", ,\"ContractData\", C2, \"T_CVol\",, \"T\"))","v":401},{"$f":"L1+1","v":2},{"$f":"IFERROR(RANK($J2,INDIRECT((\"$J$\"&\"1\"&\":$J$\"&$A$351)))+COUNTIF($J$1:J2,J2)-1,\"\")","v":""},{"$f":"C2","v":"S.US.AIR"},{"$f":"IFERROR(VLOOKUP($L2,$M$1:$N$350,2,FALSE),\"\")","v":""},{"$f":"IF(O2=\"\",\"\",RTD(\"cqg.rtd\", ,\"ContractData\",O2, \"LongDescription\",, \"T\"))","v":""},{"$f":"IFERROR(RTD(\"cqg.rtd\", ,\"ContractData\",O2, \"PerCentNetLastTrade\",, \"T\")/100,\"\")","v":""},{"$f":"IFERROR(\"https://finance.yahoo.com/quote/\"&RIGHT(O2,(LEN(O2)-5)),\"\")","v":""},null,{"$f":"IF(Q2>=0,Q2,NA())","v":""},{"$f":"IFERROR(IF(Q2>=0,NA(),-1*Q2),\"\")","v":""},null,{"$f":"IF(Q2=\"\",\"\",IF(Q2<0,\"\",IFERROR(PROPER(RTD(\"cqg.rtd\", ,\"ContractData\",O2, \"LongDescription\",, \"T\")),\"\")))","v":""},null,null,{"$f":"IF(W2=\"\",\"\",IFERROR(T2,Q2))","v":""},null,{"$f":"IFERROR(AB1-1,\"\")","v":""},{"$f":"IF(AB2=\"\",\"\",VLOOKUP($AB2,$M$1:$N$350,2,FALSE))","v":""},{"$f":"IF(RTD(\"cqg.rtd\", ,\"ContractData\",AC2, \"PerCentNetLastTrade\",, \"T\")>0,\"\",IFERROR(RTD(\"cqg.rtd\", ,\"ContractData\",AC2, \"PerCentNetLastTrade\",, \"T\")/100,\"\"))","v":""},{"$f":"IF(AD2>0,\"\",IFERROR(PROPER(RTD(\"cqg.rtd\", ,\"ContractData\",AC2, \"LongDescription\",, \"T\")),\"\"))","v":""},{"$f":"\"\"","v":""},{"$f":"IF(AD2>0,\"\",IFERROR(AD2*-1,\"\"))","v":""},{"$f":"IFERROR(\"https://finance.yahoo.com/quote/\"&RIGHT(AC2,(LEN(AC2)-5)),\"\")","v":""}]
[{"$f":"IF(Symbols!A3=\"\",\"\",Symbols!A3)","v":"S.US.ATI"},1,"S.US.ATI",{"$f":"IF(A3=\"\",\"\",RTD(\"cqg.rtd\", ,\"ContractData\",C3, \"LongDescription\",, \"T\"))","v":"ATI Inc."},null,null,null,{"$f":"IF(A3=\"\",\"\",RTD(\"cqg.rtd\", ,\"ContractData\",C3, \"LastTradeToday\",, \"T\"))","v":""},{"$f":"IF(A3=\"\",\"\",RTD(\"cqg.rtd\", ,\"ContractData\",C3, \"NetLastTradeToday\",, \"T\"))","v":""},{"$f":"IF(A3=\"\",\"\",IFERROR(RTD(\"cqg.rtd\", ,\"ContractData\",C3, \"PerCentNetLastTrade\",, \"T\")/100,\"\"))","v":""},{"$f":"IF(A3=\"\",\"\",RTD(\"cqg.rtd\", ,\"ContractData\", C3, \"T_CVol\",, \"T\"))","v":137},{"$f":"L2+1","v":3},{"$f":"IFERROR(RANK($J3,INDIRECT((\"$J$\"&\"1\"&\":$J$\"&$A$351)))+COUNTIF($J$1:J3,J3)-1,\"\")","v":""},"S.US.ATI","",{"$f":"IF(O3=\"\",\"\",RTD(\"cqg.rtd\", ,\"ContractData\",O3, \"LongDescription\",, \"T\"))","v":""},{"$f":"IFERROR(RTD(\"cqg.rtd\", ,\"ContractData\",O3, \"PerCentNetLastTrade\",, \"T\")/100,\"\")","v":""},"",null,"","",null,{"$f":"IF(Q3=\"\",\"\",IF(Q3<0,\"\",IFERROR(PROPER(RTD(\"cqg.rtd\", ,\"ContractData\",O3, \"LongDescription\",, \"T\")),\"\")))","v":""},null,null,"",null,{"$f":"IFERROR(AB2-1,\"\")","v":""},"",{"$f":"IF(RTD(\"cqg.rtd\", ,\"ContractData\",AC3, \"PerCentNetLastTrade\",, \"T\")>0,\"\",IFERROR(RTD(\"cqg.rtd\", ,\"ContractData\",AC3, \"PerCentNetLastTrade\",, \"T\")/100,\"\"))","v":""},{"$f":"IF(AD3>0,\"\",IFERROR(PROPER(RTD(\"cqg.rtd\", ,\"ContractData\",AC3, \"LongDescription\",, \"T\")),\"\"))","v":""},{"$f":"\"\"","v":""},"",""]
[{"$f":"IF(Symbols!A4=\"\",\"\",Symbols!A4)","v":"S.US.ATRO"},1,"S.US.ATRO",{"$f":"IF(A4=\"\",\"\",RTD(\"cqg.rtd\", ,\"ContractData\",C4, \"LongDescription\",, \"T\"))","v":"ASTRONICS CP ##"},null,null,null,{"$f":"IF(A4=\"\",\"\",RTD(\"cqg.rtd\", ,\"ContractData\",C4, \"LastTradeToday\",, \"T\"))","v":""},{"$f":"IF(A4=\"\",\"\",RTD(\"cqg.rtd\", ,\"ContractData\",C4, \"NetLastTradeToday\",, \"T\"))","v":""},{"$f":"IF(A4=\"\",\"\",IFERROR(RTD(\"cqg.rtd\", ,\"ContractData\",C4, \"PerCentNetLastTrade\",, \"T\")/100,\"\"))","v":""},{"$f":"IF(A4=\"\",\"\",RTD(\"cqg.rtd\", ,\"ContractData\", C4, \"T_CVol\",, \"T\"))","v":1726},4,{"$f":"IFERROR(RANK($J4,INDIRECT((\"$J$\"&\"1\"&\":$J$\"&$A$351)))+COUNTIF($J$1:J4,J4)-1,\"\")","v":""},"S.US.ATRO","",{"$f":"IF(O4=\"\",\"\",RTD(\"cqg.rtd\", ,\"ContractData\",O4, \"LongDescription\",, \"T\"))","v":""},{"$f":"IFERROR(RTD(\"cqg.rtd\", ,\"ContractData\",O4, \"PerCentNetLastTrade\",, \"T\")/100,\"\")","v":""},"",null,"","",null,{"$f":"IF(Q4=\"\",\"\",IF(Q4<0,\"\",IFERROR(PROPER(RTD(\"cqg.rtd\", ,\"ContractData\",O4, \"LongDescription\",, \"T\")),\"\")))","v":""},null,null,"",null,"","",{"$f":"IF(RTD(\"cqg.rtd\", ,\"ContractData\",AC4, \"PerCentNetLastTrade\",, \"T\")>0,\"\",IFERROR(RTD(\"cqg.rtd\", ,\"ContractData\",AC4, \"PerCentNetLastTrade\",, \"T\")/100,\"\"))","v":""},{"$f":"IF(AD4>0,\"\",IFERROR(PROPER(RTD(\"cqg.rtd\", ,\"ContractData\",AC4, \"LongDescription\",, \"T\")),\"\"))","v":""},{"$f":"\"\"","v":""},"",""]
[{"$f":"IF(Symbols!A5=\"\",\"\",Symbols!A5)","v":"S.US.AVAV"},1,"S.US.AVAV",{"$f":"IF(A5=\"\",\"\",RTD(\"cqg.rtd\", ,\"ContractData\",C5, \"LongDescription\",, \"T\"))","v":"AEROVIRONMENT, INC."},null,null,null,{"$f":"IF(A5=\"\",\"\",RTD(\"cqg.rtd\", ,\"ContractData\",C5, \"LastTradeToday\",, \"T\"))","v":""},{"$f":"IF(A5=\"\",\"\",RTD(\"cqg.rtd\", ,\"ContractData\",C5, \"NetLastTradeToday\",, \"T\"))","v":""},{"$f":"IF(A5=\"\",\"\",IFERROR(RTD(\"cqg.rtd\", ,\"ContractData\",C5, \"PerCentNetLastTrade\",, \"T\")/100,\"\"))","v":""},{"$f":"IF(A5=\"\",\"\",RTD(\"cqg.rtd\", ,\"ContractData\", C5, \"T_CVol\",, \"T\"))","v":7367},5,{"$f":"IFERROR(RANK($J5,INDIRECT((\"$J$\"&\"1\"&\":$J$\"&$A$351)))+COUNTIF($J$1:J5,J5)-1,\"\")","v":""},"S.US.AVAV","",{"$f":"IF(O5=\"\",\"\",RTD(\"cqg.rtd\", ,\"ContractData\",O5, \"LongDescription\",, \"T\"))","v":""},{"$f":"IFERROR(RTD(\"cqg.rtd\", ,\"ContractData\",O5, \"PerCentNetLastTrade\",, \"T\")/100,\"\")","v":""},"",null,"","",null,{"$f":"IF(Q5=\"\",\"\",IF(Q5<0,\"\",IFERROR(PROPER(RTD(\"cqg.rtd\", ,\"ContractData\",O5, \"LongDescription\",, \"T\")),\"\")))","v":""},null,null,"",null,"","",{"$f":"IF(RTD(\"cqg.rtd\", ,\"ContractData\",AC5, \"PerCentNetLastTrade\",, \"T\")>0,\"\",IFERROR(RTD(\"cqg.rtd\", ,\"ContractData\",AC5, \"PerCentNetLastTrade\",, \"T\")/100,\"\"))","v":""},{"$f":"IF(AD5>0,\"\",IFERROR(PROPER(RTD(\"cqg.rtd\", ,\"ContractData\",AC5, \"LongDescription\",, \"T\")),\"\"))","v":""},{"$f":"\"\"","v":""},"",""]
[{"$f":"IF(Symbols!A6=\"\",\"\",Symbols!A6)","v":"S.US.AXON"},1,"S.US.AXON",{"$f":"IF(A6=\"\",\"\",RTD(\"cqg.rtd\", ,\"ContractData\",C6, \"LongDescription\",, \"T\"))","v":"AXON ENTERPRISE, INC"},null,null,null,{"$f":"IF(A6=\"\",\"\",RTD(\"cqg.rtd\", ,\"ContractData\",C6, \"LastTradeToday\",, \"T\"))","v":""},{"$f":"IF(A6=\"\",\"\",RTD(\"cqg.rtd\", ,\"ContractData\",C6, \"NetLastTradeToday\",, \"T\"))","v":""},{"$f":"IF(A6=\"\",\"\",IFERROR(RTD(\"cqg.rtd\", ,\"ContractData\",C6, \"PerCentNetLastTrade\",, \"T\")/100,\"\"))","v":""},{"$f":"IF(A6=\"\",\"\",RTD(\"cqg.rtd\", ,\"ContractData\", C6, \"T_CVol\",, \"T\"))","v":401},6,{"$f":"IFERROR(RANK($J6,INDIRECT((\"$J$\"&\"1\"&\":$J$\"&$A$351)))+COUNTIF($J$1:J6,J6)-1,\"\")","v":""},"S.US.AXON","",{"$f":"IF(O6=\"\",\"\",RTD(\"cqg.rtd\", ,\"ContractData\",O6, \"LongDescription\",, \"T\"))","v":""},{"$f":"IFERROR(RTD(\"cqg.rtd\", ,\"ContractData\",O6, \"PerCentNetLastTrade\",, \"T\")/100,\"\")","v":""},"",null,"","",null,{"$f":"IF(Q6=\"\",\"\",IF(Q6<0,\"\",IFERROR(PROPER(RTD(\"cqg.rtd\", ,\"ContractData\",O6, \"LongDescription\",, \"T\")),\"\")))","v":""},null,null,"",null,"","",{"$f":"IF(RTD(\"cqg.rtd\", ,\"ContractData\",AC6, \"PerCentNetLastTrade\",, \"T\")>0,\"\",IFERROR(RTD(\"cqg.rtd\", ,\"ContractData\",AC6, \"PerCentNetLastTrade\",, \"T\")/100,\"\"))","v":""},{"$f":"IF(AD6>0,\"\",IFERROR(PROPER(RTD(\"cqg.rtd\", ,\"ContractData\",AC6, \"LongDescription\",, \"T\")),\"\"))","v":""},{"$f":"\"\"","v":""},"",""]
[{"$f":"IF(Symbols!A7=\"\",\"\",Symbols!A7)","v":"S.US.BA"},1,"S.US.BA",{"$f":"IF(A7=\"\",\"\",RTD(\"cqg.rtd\", ,\"ContractData\",C7, \"LongDescription\",, \"T\"))","v":"Boeing Company"},null,null,null,{"$f":"IF(A7=\"\",\"\",RTD(\"cqg.rtd\", ,\"ContractData\",C7, \"LastTradeToday\",, \"T\"))","v":""},{"$f":"IF(A7=\"\",\"\",RTD(\"cqg.rtd\", ,\"ContractData\",C7, \"NetLastTradeToday\",, \"T\"))","v":""},{"$f":"IF(A7=\"\",\"\",IFERROR(RTD(\"cqg.rtd\", ,\"ContractData\",C7, \"PerCentNetLastTrade\",, \"T\")/100,\"\"))","v":""},{"$f":"IF(A7=\"\",\"\",RTD(\"cqg.rtd\", ,\"ContractData\", C7, \"T_CVol\",, \"T\"))","v":8846},7,{"$f":"IFERROR(RANK($J7,INDIRECT((\"$J$\"&\"1\"&\":$J$\"&$A$351)))+COUNTIF($J$1:J7,J7)-1,\"\")","v":""},"S.US.BA","",{"$f":"IF(O7=\"\",\"\",RTD(\"cqg.rtd\", ,\"ContractData\",O7, \"LongDescription\",, \"T\"))","v":""},{"$f":"IFERROR(RTD(\"cqg.rtd\", ,\"ContractData\",O7, \"PerCentNetLastTrade\",, \"T\")/100,\"\")","v":""},"",null,"","",null,{"$f":"IF(Q7=\"\",\"\",IF(Q7<0,\"\",IFERROR(PROPER(RTD(\"cqg.rtd\", ,\"ContractData\",O7, \"LongDescription\",, \"T\")),\"\")))","v":""},null,null,"",null,"","",{"$f":"IF(RTD(\"cqg.rtd\", ,\"ContractData\",AC7, \"PerCentNetLastTrade\",, \"T\")>0,\"\",IFERROR(RTD(\"cqg.rtd\", ,\"ContractData\",AC7, \"PerCentNetLastTrade\",, \"T\")/100,\"\"))","v":""},{"$f":"IF(AD7>0,\"\",IFERROR(PROPER(RTD(\"cqg.rtd\", ,\"ContractData\",AC7, \"LongDescription\",, \"T\")),\"\"))","v":""},{"$f":"\"\"","v":""},"",""]
[{"$f":"IF(Symbols!A8=\"\",\"\",Symbols!A8)","v":"S.US.BWXT"},1,"S.US.BWXT",{"$f":"IF(A8=\"\",\"\",RTD(\"cqg.rtd\", ,\"ContractData\",C8, \"LongDescription\",, \"T\"))","v":"BWX Technologies, Inc."},null,null,null,{"$f":"IF(A8=\"\",\"\",RTD(\"cqg.rtd\", ,\"ContractData\",C8, \"LastTradeToday\",, \"T\"))","v":""},{"$f":"IF(A8=\"\",\"\",RTD(\"cqg.rtd\", ,\"ContractData\",C8, \"NetLastTradeToday\",, \"T\"))","v":""},{"$f":"IF(A8=\"\",\"\",IFERROR(RTD(\"cqg.rtd\", ,\"ContractData\",C8, \"PerCentNetLastTrade\",, \"T\")/100,\"\"))","v":""},{"$f":"IF(A8=\"\",\"\",RTD(\"cqg.rtd\", ,\"ContractData\", C8, \"T_CVol\",, \"T\"))","v":1814},8,{"$f":"IFERROR(RANK($J8,INDIRECT((\"$J$\"&\"1\"&\":$J$\"&$A$351)))+COUNTIF($J$1:J8,J8)-1,\"\")","v":""},"S.US.BWXT","",{"$f":"IF(O8=\"\",\"\",RTD(\"cqg.rtd\", ,\"ContractData\",O8, \"LongDescription\",, \"T\"))","v":""},{"$f":"IFERROR(RTD(\"cqg.rtd\", ,\"ContractData\",O8, \"PerCentNetLastTrade\",, \"T\")/100,\"\")","v":""},"",null,"","",null,{"$f":"IF(Q8=\"\",\"\",IF(Q8<0,\"\",IFERROR(PROPER(RTD(\"cqg.rtd\", ,\"ContractData\",O8, \"LongDescription\",, \"T\")),\"\")))","v":""},null,null,"",null,"","",{"$f":"IF(RTD(\"cqg.rtd\", ,\"ContractData\",AC8, \"PerCentNetLastTrade\",, \"T\")>0,\"\",IFERROR(RTD(\"cqg.rtd\", ,\"ContractData\",AC8, \"PerCentNetLastTrade\",, \"T\")/100,\"\"))","v":""},{"$f":"IF(AD8>0,\"\",IFERROR(PROPER(RTD(\"cqg.rtd\", ,\"ContractData\",AC8, \"LongDescription\",, \"T\")),\"\"))","v":""},{"$f":"\"\"","v":""},"",""]
[{"$f":"IF(Symbols!A9=\"\",\"\",Symbols!A9)","v":"S.US.CDRE"},1,"S.US.CDRE",{"$f":"IF(A9=\"\",\"\",RTD(\"cqg.rtd\", ,\"ContractData\",C9, \"LongDescription\",, \"T\"))","v":"Cadre Holdings, Inc."},null,null,null,{"$f":"IF(A9=\"\",\"\",RTD(\"cqg.rtd\", ,\"ContractData\",C9, \"LastTradeToday\",, \"T\"))","v":""},{"$f":"IF(A9=\"\",\"\",RTD(\"cqg.rtd\", ,\"ContractData\",C9, \"NetLastTradeToday\",, \"T\"))","v":""},{"$f":"IF(A9=\"\",\"\",IFERROR(RTD(\"cqg.rtd\", ,\"ContractData\",C9, \"PerCentNetLastTrade\",, \"T\")/100,\"\"))","v":""},{"$f":"IF(A9=\"\",\"\",RTD(\"cqg.rtd\", ,\"ContractData\", C9, \"T_CVol\",, \"T\"))","v":119},9,{"$f":"IFERROR(RANK($J9,INDIRECT((\"$J$\"&\"1\"&\":$J$\"&$A$351)))+COUNTIF($J$1:J9,J9)-1,\"\")","v":""},"S.US.CDRE","",{"$f":"IF(O9=\"\",\"\",RTD(\"cqg.rtd\", ,\"ContractData\",O9, \"LongDescription\",, \"T\"))","v":""},{"$f":"IFERROR(RTD(\"cqg.rtd\", ,\"ContractData\",O9, \"PerCentNetLastTrade\",, \"T\")/100,\"\")","v":""},"",null,"","",null,{"$f":"IF(Q9=\"\",\"\",IF(Q9<0,\"\",IFERROR(PROPER(RTD(\"cqg.rtd\", ,\"ContractData\",O9, \"LongDescription\",, \"T\")),\"\")))","v":""},null,null,"",null,"","",{"$f":"IF(RTD(\"cqg.rtd\", ,\"ContractData\",AC9, \"PerCentNetLastTrade\",, \"T\")>0,\"\",IFERROR(RTD(\"cqg.rtd\", ,\"ContractData\",AC9, \"PerCentNetLastTrade\",, \"T\")/100,\"\"))","v":""},{"$f":"IF(AD9>0,\"\",IFERROR(PROPER(RTD(\"cqg.rtd\", ,\"ContractData\",AC9, \"LongDescription\",, \"T\")),\"\"))","v":""},{"$f":"\"\"","v":""},"",""]
[{"$f":"IF(Symbols!A10=\"\",\"\",Symbols!A10)","v":"S.US.CRS"},1,"S.US.CRS",{"$f":"IF(A10=\"\",\"\",RTD(\"cqg.rtd\", ,\"ContractData\",C10, \"LongDescription\",, \"T\"))","v":"Carpenter Technology Corp"},null,null,null,{"$f":"IF(A10=\"\",\"\",RTD(\"cqg.rtd\", ,\"ContractData\",C10, \"LastTradeToday\",, \"T\"))","v":""},{"$f":"IF(A10=\"\",\"\",RTD(\"cqg.rtd\", ,\"ContractData\",C10, \"NetLastTradeToday\",, \"T\"))","v":""},{"$f":"IF(A10=\"\",\"\",IFERROR(RTD(\"cqg.rtd\", ,\"ContractData\",C10, \"PerCentNetLastTrade\",, \"T\")/100,\"\"))","v":""},{"$f":"IF(A10=\"\",\"\",RTD(\"cqg.rtd\", ,\"ContractData\", C10, \"T_CVol\",, \"T\"))","v":517},10,{"$f":"IFERROR(RANK($J10,INDIRECT((\"$J$\"&\"1\"&\":$J$\"&$A$351)))+COUNTIF($J$1:J10,J10)-1,\"\")","v":""},"S.US.CRS","",{"$f":"IF(O10=\"\",\"\",RTD(\"cqg.rtd\", ,\"ContractData\",O10, \"LongDescription\",, \"T\"))","v":""},{"$f":"IFERROR(RTD(\"cqg.rtd\", ,\"ContractData\",O10, \"PerCentNetLastTrade\",, \"T\")/100,\"\")","v":""},"",null,"","",null,{"$f":"IF(Q10=\"\",\"\",IF(Q10<0,\"\",IFERROR(PROPER(RTD(\"cqg.rtd\", ,\"ContractData\",O10, \"LongDescription\",, \"T\")),\"\")))","v":""},null,null,"",null,"","",{"$f":"IF(RTD(\"cqg.rtd\", ,\"ContractData\",AC10, \"PerCentNetLastTrade\",, \"T\")>0,\"\",IFERROR(RTD(\"cqg.rtd\", ,\"ContractData\",AC10, \"PerCentNetLastTrade\",, \"T\")/100,\"\"))","v":""},{"$f":"IF(AD10>0,\"\",IFERROR(PROPER(RTD(\"cqg.rtd\", ,\"ContractData\",AC10, \"LongDescription\",, \"T\")),\"\"))","v":""},{"$f":"\"\"","v":""},"",""]
[{"$f":"IF(Symbols!A11=\"\",\"\",Symbols!A11)","v":"S.US.CW"},1,"S.US.CW",{"$f":"IF(A11=\"\",\"\",RTD(\"cqg.rtd\", ,\"ContractData\",C11, \"LongDescription\",, \"T\"))","v":"Curtiss-Wright Corporation"},null,null,null,{"$f":"IF(A11=\"\",\"\",RTD(\"cqg.rtd\", ,\"ContractData\",C11, \"LastTradeToday\",, \"T\"))","v":""},{"$f":"IF(A11=\"\",\"\",RTD(\"cqg.rtd\", ,\"ContractData\",C11, \"NetLastTradeToday\",, \"T\"))","v":""},{"$f":"IF(A11=\"\",\"\",IFERROR(RTD(\"cqg.rtd\", ,\"ContractData\",C11, \"PerCentNetLastTrade\",, \"T\")/100,\"\"))","v":""},{"$f":"IF(A11=\"\",\"\",RTD(\"cqg.rtd\", ,\"ContractData\", C11, \"T_CVol\",, \"T\"))","v":11},11,{"$f":"IFERROR(RANK($J11,INDIRECT((\"$J$\"&\"1\"&\":$J$\"&$A$351)))+COUNTIF($J$1:J11,J11)-1,\"\")","v":""},"S.US.CW","",{"$f":"IF(O11=\"\",\"\",RTD(\"cqg.rtd\", ,\"ContractData\",O11, \"LongDescription\",, \"T\"))","v":""},{"$f":"IFERROR(RTD(\"cqg.rtd\", ,\"ContractData\",O11, \"PerCentNetLastTrade\",, \"T\")/100,\"\")","v":""},"",null,"","",null,{"$f":"IF(Q11=\"\",\"\",IF(Q11<0,\"\",IFERROR(PROPER(RTD(\"cqg.rtd\", ,\"ContractData\",O11, \"LongDescription\",, \"T\")),\"\")))","v":""},null,null,"",null,"","",{"$f":"IF(RTD(\"cqg.rtd\", ,\"ContractData\",AC11, \"PerCentNetLastTrade\",, \"T\")>0,\"\",IFERROR(RTD(\"cqg.rtd\", ,\"ContractData\",AC11, \"PerCentNetLastTrade\",, \"T\")/100,\"\"))","v":""},{"$f":"IF(AD11>0,\"\",IFERROR(PROPER(RTD(\"cqg.rtd\", ,\"ContractData\",AC11, \"LongDescription\",, \"T\")),\"\"))","v":""},{"$f":"\"\"","v":""},"",""]
[{"$f":"IF(Symbols!A12=\"\",\"\",Symbols!A12)","v":"S.US.DCO"},1,"S.US.DCO",{"$f":"IF(A12=\"\",\"\",RTD(\"cqg.rtd\", ,\"ContractData\",C12, \"LongDescription\",, \"T\"))","v":"DUCOMMUN INC"},null,null,null,{"$f":"IF(A12=\"\",\"\",RTD(\"cqg.rtd\", ,\"ContractData\",C12, \"LastTradeToday\",, \"T\"))","v":""},{"$f":"IF(A12=\"\",\"\",RTD(\"cqg.rtd\", ,\"ContractData\",C12, \"NetLastTradeToday\",, \"T\"))","v":""},{"$f":"IF(A12=\"\",\"\",IFERROR(RTD(\"cqg.rtd\", ,\"ContractData\",C12, \"PerCentNetLastTrade\",, \"T\")/100,\"\"))","v":""},{"$f":"IF(A12=\"\",\"\",RTD(\"cqg.rtd\", ,\"ContractData\", C12, \"T_CVol\",, \"T\"))","v":0},12,{"$f":"IFERROR(RANK($J12,INDIRECT((\"$J$\"&\"1\"&\":$J$\"&$A$351)))+COUNTIF($J$1:J12,J12)-1,\"\")","v":""},"S.US.DCO","",{"$f":"IF(O12=\"\",\"\",RTD(\"cqg.rtd\", ,\"ContractData\",O12, \"LongDescription\",, \"T\"))","v":""},{"$f":"IFERROR(RTD(\"cqg.rtd\", ,\"ContractData\",O12, \"PerCentNetLastTrade\",, \"T\")/100,\"\")","v":""},"",null,"","",null,{"$f":"IF(Q12=\"\",\"\",IF(Q12<0,\"\",IFERROR(PROPER(RTD(\"cqg.rtd\", ,\"ContractData\",O12, \"LongDescription\",, \"T\")),\"\")))","v":""},null,null,"",null,"","",{"$f":"IF(RTD(\"cqg.rtd\", ,\"ContractData\",AC12, \"PerCentNetLastTrade\",, \"T\")>0,\"\",IFERROR(RTD(\"cqg.rtd\", ,\"ContractData\",AC12, \"PerCentNetLastTrade\",, \"T\")/100,\"\"))","v":""},{"$f":"IF(AD12>0,\"\",IFERROR(PROPER(RTD(\"cqg.rtd\", ,\"ContractData\",AC12, \"LongDescription\",, \"T\")),\"\"))","v":""},{"$f":"\"\"","v":""},"",""]
[{"$f":"IF(Symbols!A13=\"\",\"\",Symbols!A13)","v":"S.US.DRS"},1,"S.US.DRS",{"$f":"IF(A13=\"\",\"\",RTD(\"cqg.rtd\", ,\"ContractData\",C13, \"LongDescription\",, \"T\"))","v":"LEONARDO DRS, INC CM"},null,null,null,{"$f":"IF(A13=\"\",\"\",RTD(\"cqg.rtd\", ,\"ContractData\",C13, \"LastTradeToday\",, \"T\"))","v":""},{"$f":"IF(A13=\"\",\"\",RTD(\"cqg.rtd\", ,\"ContractData\",C13, \"NetLastTradeToday\",, \"T\"))","v":""},{"$f":"IF(A13=\"\",\"\",IFERROR(RTD(\"cqg.rtd\", ,\"ContractData\",C13, \"PerCentNetLastTrade\",, \"T\")/100,\"\"))","v":""},{"$f":"IF(A13=\"\",\"\",RTD(\"cqg.rtd\", ,\"ContractData\", C13, \"T_CVol\",, \"T\"))","v":20},13,{"$f":"IFERROR(RANK($J13,INDIRECT((\"$J$\"&\"1\"&\":$J$\"&$A$351)))+COUNTIF($J$1:J13,J13)-1,\"\")","v":""},"S.US.DRS","",{"$f":"IF(O13=\"\",\"\",RTD(\"cqg.rtd\", ,\"ContractData\",O13, \"LongDescription\",, \"T\"))","v":""},{"$f":"IFERROR(RTD(\"cqg.rtd\", ,\"ContractData\",O13, \"PerCentNetLastTrade\",, \"T\")/100,\"\")","v":""},"",null,"","",null,{"$f":"IF(Q13=\"\",\"\",IF(Q13<0,\"\",IFERROR(PROPER(RTD(\"cqg.rtd\", ,\"ContractData\",O13, \"LongDescription\",, \"T\")),\"\")))","v":""},null,null,"",null,"","",{"$f":"IF(RTD(\"cqg.rtd\", ,\"ContractData\",AC13, \"PerCentNetLastTrade\",, \"T\")>0,\"\",IFERROR(RTD(\"cqg.rtd\", ,\"ContractData\",AC13, \"PerCentNetLastTrade\",, \"T\")/100,\"\"))","v":""},{"$f":"IF(AD13>0,\"\",IFERROR(PROPER(RTD(\"cqg.rtd\", ,\"ContractData\",AC13, \"LongDescription\",, \"T\")),\"\"))","v":""},{"$f":"\"\"","v":""},"",""]
[{"$f":"IF(Symbols!A14=\"\",\"\",Symbols!A14)","v":"S.US.GD"},1,"S.US.GD",{"$f":"IF(A14=\"\",\"\",RTD(\"cqg.rtd\", ,\"ContractData\",C14, \"LongDescription\",, \"T\"))","v":"General Dynamics Corp"},null,null,null,{"$f":"IF(A14=\"\",\"\",RTD(\"cqg.rtd\", ,\"ContractData\",C14, \"LastTradeToday\",, \"T\"))","v":""},{"$f":"IF(A14=\"\",\"\",RTD(\"cqg.rtd\", ,\"ContractData\",C14, \"NetLastTradeToday\",, \"T\"))","v":""},{"$f":"IF(A14=\"\",\"\",IFERROR(RTD(\"cqg.rtd\", ,\"ContractData\",C14, \"PerCentNetLastTrade\",, \"T\")/100,\"\"))","v":""},{"$f":"IF(A14=\"\",\"\",RTD(\"cqg.rtd\", ,\"ContractData\", C14, \"T_CVol\",, \"T\"))","v":57},14,{"$f":"IFERROR(RANK($J14,INDIRECT((\"$J$\"&\"1\"&\":$J$\"&$A$351)))+COUNTIF($J$1:J14,J14)-1,\"\")","v":""},"S.US.GD","",{"$f":"IF(O14=\"\",\"\",RTD(\"cqg.rtd\", ,\"ContractData\",O14, \"LongDescription\",, \"T\"))","v":""},{"$f":"IFERROR(RTD(\"cqg.rtd\", ,\"ContractData\",O14, \"PerCentNetLastTrade\",, \"T\")/100,\"\")","v":""},"",null,"","",null,{"$f":"IF(Q14=\"\",\"\",IF(Q14<0,\"\",IFERROR(PROPER(RTD(\"cqg.rtd\", ,\"ContractData\",O14, \"LongDescription\",, \"T\")),\"\")))","v":""},null,null,"",null,"","",{"$f":"IF(RTD(\"cqg.rtd\", ,\"ContractData\",AC14, \"PerCentNetLastTrade\",, \"T\")>0,\"\",IFERROR(RTD(\"cqg.rtd\", ,\"ContractData\",AC14, \"PerCentNetLastTrade\",, \"T\")/100,\"\"))","v":""},{"$f":"IF(AD14>0,\"\",IFERROR(PROPER(RTD(\"cqg.rtd\", ,\"ContractData\",AC14, \"LongDescription\",, \"T\")),\"\"))","v":""},{"$f":"\"\"","v":""},"",""]
[{"$f":"IF(Symbols!A15=\"\",\"\",Symbols!A15)","v":"S.US.GE"},1,"S.US.GE",{"$f":"IF(A15=\"\",\"\",RTD(\"cqg.rtd\", ,\"ContractData\",C15, \"LongDescription\",, \"T\"))","v":"General Electric Co"},null,null,null,{"$f":"IF(A15=\"\",\"\",RTD(\"cqg.rtd\", ,\"ContractData\",C15, \"LastTradeToday\",, \"T\"))","v":""},{"$f":"IF(A15=\"\",\"\",RTD(\"cqg.rtd\", ,\"ContractData\",C15, \"NetLastTradeToday\",, \"T\"))","v":""},{"$f":"IF(A15=\"\",\"\",IFERROR(RTD(\"cqg.rtd\", ,\"ContractData\",C15, \"PerCentNetLastTrade\",, \"T\")/100,\"\"))","v":""},{"$f":"IF(A15=\"\",\"\",RTD(\"cqg.rtd\", ,\"ContractData\", C15, \"T_CVol\",, \"T\"))","v":2988},15,{"$f":"IFERROR(RANK($J15,INDIRECT((\"$J$\"&\"1\"&\":$J$\"&$A$351)))+COUNTIF($J$1:J15,J15)-1,\"\")","v":""},"S.US.GE","",{"$f":"IF(O15=\"\",\"\",RTD(\"cqg.rtd\", ,\"ContractData\",O15, \"LongDescription\",, \"T\"))","v":""},{"$f":"IFERROR(RTD(\"cqg.rtd\", ,\"ContractData\",O15, \"PerCentNetLastTrade\",, \"T\")/100,\"\")","v":""},"",null,"","",null,{"$f":"IF(Q15=\"\",\"\",IF(Q15<0,\"\",IFERROR(PROPER(RTD(\"cqg.rtd\", ,\"ContractData\",O15, \"LongDescription\",, \"T\")),\"\")))","v":""},null,null,"",null,"","",{"$f":"IF(RTD(\"cqg.rtd\", ,\"ContractData\",AC15, \"PerCentNetLastTrade\",, \"T\")>0,\"\",IFERROR(RTD(\"cqg.rtd\", ,\"ContractData\",AC15, \"PerCentNetLastTrade\",, \"T\")/100,\"\"))","v":""},{"$f":"IF(AD15>0,\"\",IFERROR(PROPER(RTD(\"cqg.rtd\", ,\"ContractData\",AC15, \"LongDescription\",, \"T\")),\"\"))","v":""},{"$f":"\"\"","v":""},"",""]
[{"$f":"IF(Symbols!A16=\"\",\"\",Symbols!A16)","v":"S.US.HEI"},1,"S.US.HEI",{"$f":"IF(A16=\"\",\"\",RTD(\"cqg.rtd\", ,\"ContractData\",C16, \"LongDescription\",, \"T\"))","v":"HEICO CORP"},null,null,null,{"$f":"IF(A16=\"\",\"\",RTD(\"cqg.rtd\", ,\"ContractData\",C16, \"LastTradeToday\",, \"T\"))","v":""},{"$f":"IF(A16=\"\",\"\",RTD(\"cqg.rtd\", ,\"ContractData\",C16, \"NetLastTradeToday\",, \"T\"))","v":""},{"$f":"IF(A16=\"\",\"\",IFERROR(RTD(\"cqg.rtd\", ,\"ContractData\",C16, \"PerCentNetLastTrade\",, \"T\")/100,\"\"))","v":""},{"$f":"IF(A16=\"\",\"\",RTD(\"cqg.rtd\", ,\"ContractData\", C16, \"T_CVol\",, \"T\"))","v":1},16,{"$f":"IFERROR(RANK($J16,INDIRECT((\"$J$\"&\"1\"&\":$J$\"&$A$351)))+COUNTIF($J$1:J16,J16)-1,\"\")","v":""},"S.US.HEI",""]
[{"$f":"IF(Symbols!A17=\"\",\"\",Symbols!A17)","v":"S.US.HEIA"},1,"S.US.HEIA",{"$f":"IF(A17=\"\",\"\",RTD(\"cqg.rtd\", ,\"ContractData\",C17, \"LongDescription\",, \"T\"))","v":"HEICO Corp ClA"},null,null,null,{"$f":"IF(A17=\"\",\"\",RTD(\"cqg.rtd\", ,\"ContractData\",C17, \"LastTradeToday\",, \"T\"))","v":""},{"$f":"IF(A17=\"\",\"\",RTD(\"cqg.rtd\", ,\"ContractData\",C17, \"NetLastTradeToday\",, \"T\"))","v":""},{"$f":"IF(A17=\"\",\"\",IFERROR(RTD(\"cqg.rtd\", ,\"ContractData\",C17, \"PerCentNetLastTrade\",, \"T\")/100,\"\"))","v":""},{"$f":"IF(A17=\"\",\"\",RTD(\"cqg.rtd\", ,\"ContractData\", C17, \"T_CVol\",, \"T\"))","v":401},17,{"$f":"IFERROR(RANK($J17,INDIRECT((\"$J$\"&\"1\"&\":$J$\"&$A$351)))+COUNTIF($J$1:J17,J17)-1,\"\")","v":""},"S.US.HEIA",""]
[{"$f":"IF(Symbols!A18=\"\",\"\",Symbols!A18)","v":"S.US.HII"},1,"S.US.HII",{"$f":"IF(A18=\"\",\"\",RTD(\"cqg.rtd\", ,\"ContractData\",C18, \"LongDescription\",, \"T\"))","v":"Huntington Ingalls Industries"},null,null,null,{"$f":"IF(A18=\"\",\"\",RTD(\"cqg.rtd\", ,\"ContractData\",C18, \"LastTradeToday\",, \"T\"))","v":""},{"$f":"IF(A18=\"\",\"\",RTD(\"cqg.rtd\", ,\"ContractData\",C18, \"NetLastTradeToday\",, \"T\"))","v":""},{"$f":"IF(A18=\"\",\"\",IFERROR(RTD(\"cqg.rtd\", ,\"ContractData\",C18, \"PerCentNetLastTrade\",, \"T\")/100,\"\"))","v":""},{"$f":"IF(A18=\"\",\"\",RTD(\"cqg.rtd\", ,\"ContractData\", C18, \"T_CVol\",, \"T\"))","v":591},18,{"$f":"IFERROR(RANK($J18,INDIRECT((\"$J$\"&\"1\"&\":$J$\"&$A$351)))+COUNTIF($J$1:J18,J18)-1,\"\")","v":""},"S.US.HII",""]
[{"$f":"IF(Symbols!A19=\"\",\"\",Symbols!A19)","v":"S.US.HWM"},1,"S.US.HWM",{"$f":"IF(A19=\"\",\"\",RTD(\"cqg.rtd\", ,\"ContractData\",C19, \"LongDescription\",, \"T\"))","v":"Howmet Aerospace Inc."},null,null,null,{"$f":"IF(A19=\"\",\"\",RTD(\"cqg.rtd\", ,\"ContractData\",C19, \"LastTradeToday\",, \"T\"))","v":""},{"$f":"IF(A19=\"\",\"\",RTD(\"cqg.rtd\", ,\"ContractData\",C19, \"NetLastTradeToday\",, \"T\"))","v":""},{"$f":"IF(A19=\"\",\"\",IFERROR(RTD(\"cqg.rtd\", ,\"ContractData\",C19, \"PerCentNetLastTrade\",, \"T\")/100,\"\"))","v":""},{"$f":"IF(A19=\"\",\"\",RTD(\"cqg.rtd\", ,\"ContractData\", C19, \"T_CVol\",, \"T\"))","v":989},19,{"$f":"IFERROR(RANK($J19,INDIRECT((\"$J$\"&\"1\"&\":$J$\"&$A$351)))+COUNTIF($J$1:J19,J19)-1,\"\")","v":""},"S.US.HWM",""]
[{"$f":"IF(Symbols!A20=\"\",\"\",Symbols!A20)","v":"S.US.HXL"},1,"S.US.HXL",{"$f":"IF(A20=\"\",\"\",RTD(\"cqg.rtd\", ,\"ContractData\",C20, \"LongDescription\",, \"T\"))","v":"Hexcel Corp"},null,null,null,{"$f":"IF(A20=\"\",\"\",RTD(\"cqg.rtd\", ,\"ContractData\",C20, \"LastTradeToday\",, \"T\"))","v":""},{"$f":"IF(A20=\"\",\"\",RTD(\"cqg.rtd\", ,\"ContractData\",C20, \"NetLastTradeToday\",, \"T\"))","v":""},{"$f":"IF(A20=\"\",\"\",IFERROR(RTD(\"cqg.rtd\", ,\"ContractData\",C20, \"PerCentNetLastTrade\",, \"T\")/100,\"\"))","v":""},{"$f":"IF(A20=\"\",\"\",RTD(\"cqg.rtd\", ,\"ContractData\", C20, \"T_CVol\",, \"T\"))","v":1},20,{"$f":"IFERROR(RANK($J20,INDIRECT((\"$J$\"&\"1\"&\":$J$\"&$A$351)))+COUNTIF($J$1:J20,J20)-1,\"\")","v":""},"S.US.HXL",""]
[{"$f":"IF(Symbols!A21=\"\",\"\",Symbols!A21)","v":"S.US.KRMN"},1,"S.US.KRMN",{"$f":"IF(A21=\"\",\"\",RTD(\"cqg.rtd\", ,\"ContractData\",C21, \"LongDescription\",, \"T\"))","v":"Karman Holdings Inc."},null,null,null,{"$f":"IF(A21=\"\",\"\",RTD(\"cqg.rtd\", ,\"ContractData\",C21, \"LastTradeToday\",, \"T\"))","v":""},{"$f":"IF(A21=\"\",\"\",RTD(\"cqg.rtd\", ,\"ContractData\",C21, \"NetLastTradeToday\",, \"T\"))","v":""},{"$f":"IF(A21=\"\",\"\",IFERROR(RTD(\"cqg.rtd\", ,\"ContractData\",C21, \"PerCentNetLastTrade\",, \"T\")/100,\"\"))","v":""},{"$f":"IF(A21=\"\",\"\",RTD(\"cqg.rtd\", ,\"ContractData\", C21, \"T_CVol\",, \"T\"))","v":1100},21,{"$f":"IFERROR(RANK($J21,INDIRECT((\"$J$\"&\"1\"&\":$J$\"&$A$351)))+COUNTIF($J$1:J21,J21)-1,\"\")","v":""},"S.US.KRMN",""]
[{"$f":"IF(Symbols!A22=\"\",\"\",Symbols!A22)","v":"S.US.KTOS"},1,"S.US.KTOS",{"$f":"IF(A22=\"\",\"\",RTD(\"cqg.rtd\", ,\"ContractData\",C22, \"LongDescription\",, \"T\"))","v":"KRATOS DEFNS"},null,null,null,{"$f":"IF(A22=\"\",\"\",RTD(\"cqg.rtd\", ,\"ContractData\",C22, \"LastTradeToday\",, \"T\"))","v":""},{"$f":"IF(A22=\"\",\"\",RTD(\"cqg.rtd\", ,\"ContractData\",C22, \"NetLastTradeToday\",, \"T\"))","v":""},{"$f":"IF(A22=\"\",\"\",IFERROR(RTD(\"cqg.rtd\", ,\"ContractData\",C22, \"PerCentNetLastTrade\",, \"T\")/100,\"\"))","v":""},{"$f":"IF(A22=\"\",\"\",RTD(\"cqg.rtd\", ,\"ContractData\", C22, \"T_CVol\",, \"T\"))","v":6826},22,{"$f":"IFERROR(RANK($J22,INDIRECT((\"$J$\"&\"1\"&\":$J$\"&$A$351)))+COUNTIF($J$1:J22,J22)-1,\"\")","v":""},"S.US.KTOS",""]
[{"$f":"IF(Symbols!A23=\"\",\"\",Symbols!A23)","v":"S.US.LHX"},1,"S.US.LHX",{"$f":"IF(A23=\"\",\"\",RTD(\"cqg.rtd\", ,\"ContractData\",C23, \"LongDescription\",, \"T\"))","v":"L3Harris Technologies, Inc."},null,null,null,{"$f":"IF(A23=\"\",\"\",RTD(\"cqg.rtd\", ,\"ContractData\",C23, \"LastTradeToday\",, \"T\"))","v":""},{"$f":"IF(A23=\"\",\"\",RTD(\"cqg.rtd\", ,\"ContractData\",C23, \"NetLastTradeToday\",, \"T\"))","v":""},{"$f":"IF(A23=\"\",\"\",IFERROR(RTD(\"cqg.rtd\", ,\"ContractData\",C23, \"PerCentNetLastTrade\",, \"T\")/100,\"\"))","v":""},{"$f":"IF(A23=\"\",\"\",RTD(\"cqg.rtd\", ,\"ContractData\", C23, \"T_CVol\",, \"T\"))","v":297},23,{"$f":"IFERROR(RANK($J23,INDIRECT((\"$J$\"&\"1\"&\":$J$\"&$A$351)))+COUNTIF($J$1:J23,J23)-1,\"\")","v":""},"S.US.LHX",""]
[{"$f":"IF(Symbols!A24=\"\",\"\",Symbols!A24)","v":"S.US.LMT"},1,"S.US.LMT",{"$f":"IF(A24=\"\",\"\",RTD(\"cqg.rtd\", ,\"ContractData\",C24, \"LongDescription\",, \"T\"))","v":"Lockheed Martin Corp"},null,null,null,{"$f":"IF(A24=\"\",\"\",RTD(\"cqg.rtd\", ,\"ContractData\",C24, \"LastTradeToday\",, \"T\"))","v":""},{"$f":"IF(A24=\"\",\"\",RTD(\"cqg.rtd\", ,\"ContractData\",C24, \"NetLastTradeToday\",, \"T\"))","v":""},{"$f":"IF(A24=\"\",\"\",IFERROR(RTD(\"cqg.rtd\", ,\"ContractData\",C24, \"PerCentNetLastTrade\",, \"T\")/100,\"\"))","v":""},{"$f":"IF(A24=\"\",\"\",RTD(\"cqg.rtd\", ,\"ContractData\", C24, \"T_CVol\",, \"T\"))","v":2783},24,{"$f":"IFERROR(RANK($J24,INDIRECT((\"$J$\"&\"1\"&\":$J$\"&$A$351)))+COUNTIF($J$1:J24,J24)-1,\"\")","v":""},"S.US.LMT",""]
[{"$f":"IF(Symbols!A25=\"\",\"\",Symbols!A25)","v":"S.US.LOAR"},1,"S.US.LOAR",{"$f":"IF(A25=\"\",\"\",RTD(\"cqg.rtd\", ,\"ContractData\",C25, \"LongDescription\",, \"T\"))","v":"Loar Holdings Inc."},null,null,null,{"$f":"IF(A25=\"\",\"\",RTD(\"cqg.rtd\", ,\"ContractData\",C25, \"LastTradeToday\",, \"T\"))","v":""},{"$f":"IF(A25=\"\",\"\",RTD(\"cqg.rtd\", ,\"ContractData\",C25, \"NetLastTradeToday\",, \"T\"))","v":""},{"$f":"IF(A25=\"\",\"\",IFERROR(RTD(\"cqg.rtd\", ,\"ContractData\",C25, \"PerCentNetLastTrade\",, \"T\")/100,\"\"))","v":""},{"$f":"IF(A25=\"\",\"\",RTD(\"cqg.rtd\", ,\"ContractData\", C25, \"T_CVol\",, \"T\"))","v":163},25,{"$f":"IFERROR(RANK($J25,INDIRECT((\"$J$\"&\"1\"&\":$J$\"&$A$351)))+COUNTIF($J$1:J25,J25)-1,\"\")","v":""},"S.US.LOAR",""]
[{"$f":"IF(Symbols!A26=\"\",\"\",Symbols!A26)","v":"S.US.LUNR"},1,"S.US.LUNR",{"$f":"IF(A26=\"\",\"\",RTD(\"cqg.rtd\", ,\"ContractData\",C26, \"LongDescription\",, \"T\"))","v":"INTUITIVE MCHNS CM"},null,null,null,{"$f":"IF(A26=\"\",\"\",RTD(\"cqg.rtd\", ,\"ContractData\",C26, \"LastTradeToday\",, \"T\"))","v":""},{"$f":"IF(A26=\"\",\"\",RTD(\"cqg.rtd\", ,\"ContractData\",C26, \"NetLastTradeToday\",, \"T\"))","v":""},{"$f":"IF(A26=\"\",\"\",IFERROR(RTD(\"cqg.rtd\", ,\"ContractData\",C26, \"PerCentNetLastTrade\",, \"T\")/100,\"\"))","v":""},{"$f":"IF(A26=\"\",\"\",RTD(\"cqg.rtd\", ,\"ContractData\", C26, \"T_CVol\",, \"T\"))","v":33573},26,{"$f":"IFERROR(RANK($J26,INDIRECT((\"$J$\"&\"1\"&\":$J$\"&$A$351)))+COUNTIF($J$1:J26,J26)-1,\"\")","v":""},"S.US.LUNR",""]
[{"$f":"IF(Symbols!A27=\"\",\"\",Symbols!A27)","v":"S.US.MOGA"},1,"S.US.MOGA",{"$f":"IF(A27=\"\",\"\",RTD(\"cqg.rtd\", ,\"ContractData\",C27, \"LongDescription\",, \"T\"))","v":"Moog Inc ClsA"},null,null,null,{"$f":"IF(A27=\"\",\"\",RTD(\"cqg.rtd\", ,\"ContractData\",C27, \"LastTradeToday\",, \"T\"))","v":""},{"$f":"IF(A27=\"\",\"\",RTD(\"cqg.rtd\", ,\"ContractData\",C27, \"NetLastTradeToday\",, \"T\"))","v":""},{"$f":"IF(A27=\"\",\"\",IFERROR(RTD(\"cqg.rtd\", ,\"ContractData\",C27, \"PerCentNetLastTrade\",, \"T\")/100,\"\"))","v":""},{"$f":"IF(A27=\"\",\"\",RTD(\"cqg.rtd\", ,\"ContractData\", C27, \"T_CVol\",, \"T\"))","v":10},27,{"$f":"IFERROR(RANK($J27,INDIRECT((\"$J$\"&\"1\"&\":$J$\"&$A$351)))+COUNTIF($J$1:J27,J27)-1,\"\")","v":""},"S.US.MOGA",""]
[{"$f":"IF(Symbols!A28=\"\",\"\",Symbols!A28)","v":"S.US.MRCY"},1,"S.US.MRCY",{"$f":"IF(A28=\"\",\"\",RTD(\"cqg.rtd\", ,\"ContractData\",C28, \"LongDescription\",, \"T\"))","v":"MERCURY SYS INC"},null,null,null,{"$f":"IF(A28=\"\",\"\",RTD(\"cqg.rtd\", ,\"ContractData\",C28, \"LastTradeToday\",, \"T\"))","v":""},{"$f":"IF(A28=\"\",\"\",RTD(\"cqg.rtd\", ,\"ContractData\",C28, \"NetLastTradeToday\",, \"T\"))","v":""},{"$f":"IF(A28=\"\",\"\",IFERROR(RTD(\"cqg.rtd\", ,\"ContractData\",C28, \"PerCentNetLastTrade\",, \"T\")/100,\"\"))","v":""},{"$f":"IF(A28=\"\",\"\",RTD(\"cqg.rtd\", ,\"ContractData\", C28, \"T_CVol\",, \"T\"))","v":0},28,{"$f":"IFERROR(RANK($J28,INDIRECT((\"$J$\"&\"1\"&\":$J$\"&$A$351)))+COUNTIF($J$1:J28,J28)-1,\"\")","v":""},"S.US.MRCY",""]
[{"$f":"IF(Symbols!A29=\"\",\"\",Symbols!A29)","v":"S.US.NOC"},1,"S.US.NOC",{"$f":"IF(A29=\"\",\"\",RTD(\"cqg.rtd\", ,\"ContractData\",C29, \"LongDescription\",, \"T\"))","v":"Northrop Grumman Corporation"},null,null,null,{"$f":"IF(A29=\"\",\"\",RTD(\"cqg.rtd\", ,\"ContractData\",C29, \"LastTradeToday\",, \"T\"))","v":""},{"$f":"IF(A29=\"\",\"\",RTD(\"cqg.rtd\", ,\"ContractData\",C29, \"NetLastTradeToday\",, \"T\"))","v":""},{"$f":"IF(A29=\"\",\"\",IFERROR(RTD(\"cqg.rtd\", ,\"ContractData\",C29, \"PerCentNetLastTrade\",, \"T\")/100,\"\"))","v":""},{"$f":"IF(A29=\"\",\"\",RTD(\"cqg.rtd\", ,\"ContractData\", C29, \"T_CVol\",, \"T\"))","v":477},29,{"$f":"IFERROR(RANK($J29,INDIRECT((\"$J$\"&\"1\"&\":$J$\"&$A$351)))+COUNTIF($J$1:J29,J29)-1,\"\")","v":""},"S.US.NOC",""]
[{"$f":"IF(Symbols!A30=\"\",\"\",Symbols!A30)","v":"S.US.NPK"},1,"S.US.NPK",{"$f":"IF(A30=\"\",\"\",RTD(\"cqg.rtd\", ,\"ContractData\",C30, \"LongDescription\",, \"T\"))","v":"National Presto Industries Inc."},null,null,null,{"$f":"IF(A30=\"\",\"\",RTD(\"cqg.rtd\", ,\"ContractData\",C30, \"LastTradeToday\",, \"T\"))","v":""},{"$f":"IF(A30=\"\",\"\",RTD(\"cqg.rtd\", ,\"ContractData\",C30, \"NetLastTradeToday\",, \"T\"))","v":""},{"$f":"IF(A30=\"\",\"\",IFERROR(RTD(\"cqg.rtd\", ,\"ContractData\",C30, \"PerCentNetLastTrade\",, \"T\")/100,\"\"))","v":""},{"$f":"IF(A30=\"\",\"\",RTD(\"cqg.rtd\", ,\"ContractData\", C30, \"T_CVol\",, \"T\"))","v":0},30,{"$f":"IFERROR(RANK($J30,INDIRECT((\"$J$\"&\"1\"&\":$J$\"&$A$351)))+COUNTIF($J$1:J30,J30)-1,\"\")","v":""},"S.US.NPK",""]
[{"$f":"IF(Symbols!A31=\"\",\"\",Symbols!A31)","v":"S.US.RCAT"},1,"S.US.RCAT",{"$f":"IF(A31=\"\",\"\",RTD(\"cqg.rtd\", ,\"ContractData\",C31, \"LongDescription\",, \"T\"))","v":"RED CAT HOLDINGS CMN"},null,null,null,{"$f":"IF(A31=\"\",\"\",RTD(\"cqg.rtd\", ,\"ContractData\",C31, \"LastTradeToday\",, \"T\"))","v":""},{"$f":"IF(A31=\"\",\"\",RTD(\"cqg.rtd\", ,\"ContractData\",C31, \"NetLastTradeToday\",, \"T\"))","v":""},{"$f":"IF(A31=\"\",\"\",IFERROR(RTD(\"cqg.rtd\", ,\"ContractData\",C31, \"PerCentNetLastTrade\",, \"T\")/100,\"\"))","v":""},{"$f":"IF(A31=\"\",\"\",RTD(\"cqg.rtd\", ,\"ContractData\", C31, \"T_CVol\",, \"T\"))","v":70523},31,{"$f":"IFERROR(RANK($J31,INDIRECT((\"$J$\"&\"1\"&\":$J$\"&$A$351)))+COUNTIF($J$1:J31,J31)-1,\"\")","v":""},"S.US.RCAT",""]
[{"$f":"IF(Symbols!A32=\"\",\"\",Symbols!A32)","v":"S.US.RGR"},1,"S.US.RGR",{"$f":"IF(A32=\"\",\"\",RTD(\"cqg.rtd\", ,\"ContractData\",C32, \"LongDescription\",, \"T\"))","v":"Sturm Ruger & Co Inc"},null,null,null,{"$f":"IF(A32=\"\",\"\",RTD(\"cqg.rtd\", ,\"ContractData\",C32, \"LastTradeToday\",, \"T\"))","v":""},{"$f":"IF(A32=\"\",\"\",RTD(\"cqg.rtd\", ,\"ContractData\",C32, \"NetLastTradeToday\",, \"T\"))","v":""},{"$f":"IF(A32=\"\",\"\",IFERROR(RTD(\"cqg.rtd\", ,\"ContractData\",C32, \"PerCentNetLastTrade\",, \"T\")/100,\"\"))","v":""},{"$f":"IF(A32=\"\",\"\",RTD(\"cqg.rtd\", ,\"ContractData\", C32, \"T_CVol\",, \"T\"))","v":0},32,{"$f":"IFERROR(RANK($J32,INDIRECT((\"$J$\"&\"1\"&\":$J$\"&$A$351)))+COUNTIF($J$1:J32,J32)-1,\"\")","v":""},"S.US.RGR",""]
[{"$f":"IF(Symbols!A33=\"\",\"\",Symbols!A33)","v":"S.US.RKLB"},1,"S.US.RKLB",{"$f":"IF(A33=\"\",\"\",RTD(\"cqg.rtd\", ,\"ContractData\",C33, \"LongDescription\",, \"T\"))","v":"ROCKET LAB CORP CMN"},null,null,null,{"$f":"IF(A33=\"\",\"\",RTD(\"cqg.rtd\", ,\"ContractData\",C33, \"LastTradeToday\",, \"T\"))","v":""},{"$f":"IF(A33=\"\",\"\",RTD(\"cqg.rtd\", ,\"ContractData\",C33, \"NetLastTradeToday\",, \"T\"))","v":""},{"$f":"IF(A33=\"\",\"\",IFERROR(RTD(\"cqg.rtd\", ,\"ContractData\",C33, \"PerCentNetLastTrade\",, \"T\")/100,\"\"))","v":""},{"$f":"IF(A33=\"\",\"\",RTD(\"cqg.rtd\", ,\"ContractData\", C33, \"T_CVol\",, \"T\"))","v":88976},33,{"$f":"IFERROR(RANK($J33,INDIRECT((\"$J$\"&\"1\"&\":$J$\"&$A$351)))+COUNTIF($J$1:J33,J33)-1,\"\")","v":""},"S.US.RKLB",""]
[{"$f":"IF(Symbols!A34=\"\",\"\",Symbols!A34)","v":"S.US.RTX"},1,"S.US.RTX",{"$f":"IF(A34=\"\",\"\",RTD(\"cqg.rtd\", ,\"ContractData\",C34, \"LongDescription\",, \"T\"))","v":"RTX Corporation"},null,null,null,{"$f":"IF(A34=\"\",\"\",RTD(\"cqg.rtd\", ,\"ContractData\",C34, \"LastTradeToday\",, \"T\"))","v":""},{"$f":"IF(A34=\"\",\"\",RTD(\"cqg.rtd\", ,\"ContractData\",C34, \"NetLastTradeToday\",, \"T\"))","v":""},{"$f":"IF(A34=\"\",\"\",IFERROR(RTD(\"cqg.rtd\", ,\"ContractData\",C34, \"PerCentNetLastTrade\",, \"T\")/100,\"\"))","v":""},{"$f":"IF(A34=\"\",\"\",RTD(\"cqg.rtd\", ,\"ContractData\", C34, \"T_CVol\",, \"T\"))","v":7212},34,{"$f":"IFERROR(RANK($J34,INDIRECT((\"$J$\"&\"1\"&\":$J$\"&$A$351)))+COUNTIF($J$1:J34,J34)-1,\"\")","v":""},"S.US.RTX",""]
[{"$f":"IF(Symbols!A35=\"\",\"\",Symbols!A35)","v":"S.US.SARO"},1,"S.US.SARO",{"$f":"IF(A35=\"\",\"\",RTD(\"cqg.rtd\", ,\"ContractData\",C35, \"LongDescription\",, \"T\"))","v":"StandardAero, Inc."},null,null,null,{"$f":"IF(A35=\"\",\"\",RTD(\"cqg.rtd\", ,\"ContractData\",C35, \"LastTradeToday\",, \"T\"))","v":""},{"$f":"IF(A35=\"\",\"\",RTD(\"cqg.rtd\", ,\"ContractData\",C35, \"NetLastTradeToday\",, \"T\"))","v":""},{"$f":"IF(A35=\"\",\"\",IFERROR(RTD(\"cqg.rtd\", ,\"ContractData\",C35, \"PerCentNetLastTrade\",, \"T\")/100,\"\"))","v":""},{"$f":"IF(A35=\"\",\"\",RTD(\"cqg.rtd\", ,\"ContractData\", C35, \"T_CVol\",, \"T\"))","v":10},35,{"$f":"IFERROR(RANK($J35,INDIRECT((\"$J$\"&\"1\"&\":$J$\"&$A$351)))+COUNTIF($J$1:J35,J35)-1,\"\")","v":""},"S.US.SARO",""]
[{"$f":"IF(Symbols!A36=\"\",\"\",Symbols!A36)","v":"S.US.SWBI"},1,"S.US.SWBI",{"$f":"IF(A36=\"\",\"\",RTD(\"cqg.rtd\", ,\"ContractData\",C36, \"LongDescription\",, \"T\"))","v":"SMITH & WESSON BRAND"},null,null,null,{"$f":"IF(A36=\"\",\"\",RTD(\"cqg.rtd\", ,\"ContractData\",C36, \"LastTradeToday\",, \"T\"))","v":""},{"$f":"IF(A36=\"\",\"\",RTD(\"cqg.rtd\", ,\"ContractData\",C36, \"NetLastTradeToday\",, \"T\"))","v":""},{"$f":"IF(A36=\"\",\"\",IFERROR(RTD(\"cqg.rtd\", ,\"ContractData\",C36, \"PerCentNetLastTrade\",, \"T\")/100,\"\"))","v":""},{"$f":"IF(A36=\"\",\"\",RTD(\"cqg.rtd\", ,\"ContractData\", C36, \"T_CVol\",, \"T\"))","v":7},36,{"$f":"IFERROR(RANK($J36,INDIRECT((\"$J$\"&\"1\"&\":$J$\"&$A$351)))+COUNTIF($J$1:J36,J36)-1,\"\")","v":""},"S.US.SWBI",""]
[{"$f":"IF(Symbols!A37=\"\",\"\",Symbols!A37)","v":"S.US.TDG"},1,"S.US.TDG",{"$f":"IF(A37=\"\",\"\",RTD(\"cqg.rtd\", ,\"ContractData\",C37, \"LongDescription\",, \"T\"))","v":"TransDigm Group"},null,null,null,{"$f":"IF(A37=\"\",\"\",RTD(\"cqg.rtd\", ,\"ContractData\",C37, \"LastTradeToday\",, \"T\"))","v":""},{"$f":"IF(A37=\"\",\"\",RTD(\"cqg.rtd\", ,\"ContractData\",C37, \"NetLastTradeToday\",, \"T\"))","v":""},{"$f":"IF(A37=\"\",\"\",IFERROR(RTD(\"cqg.rtd\", ,\"ContractData\",C37, \"PerCentNetLastTrade\",, \"T\")/100,\"\"))","v":""},{"$f":"IF(A37=\"\",\"\",RTD(\"cqg.rtd\", ,\"ContractData\", C37, \"T_CVol\",, \"T\"))","v":1},37,{"$f":"IFERROR(RANK($J37,INDIRECT((\"$J$\"&\"1\"&\":$J$\"&$A$351)))+COUNTIF($J$1:J37,J37)-1,\"\")","v":""},"S.US.TDG",""]
[{"$f":"IF(Symbols!A38=\"\",\"\",Symbols!A38)","v":"S.US.TXT"},1,"S.US.TXT",{"$f":"IF(A38=\"\",\"\",RTD(\"cqg.rtd\", ,\"ContractData\",C38, \"LongDescription\",, \"T\"))","v":"Textron Inc"},null,null,null,{"$f":"IF(A38=\"\",\"\",RTD(\"cqg.rtd\", ,\"ContractData\",C38, \"LastTradeToday\",, \"T\"))","v":""},{"$f":"IF(A38=\"\",\"\",RTD(\"cqg.rtd\", ,\"ContractData\",C38, \"NetLastTradeToday\",, \"T\"))","v":""},{"$f":"IF(A38=\"\",\"\",IFERROR(RTD(\"cqg.rtd\", ,\"ContractData\",C38, \"PerCentNetLastTrade\",, \"T\")/100,\"\"))","v":""},{"$f":"IF(A38=\"\",\"\",RTD(\"cqg.rtd\", ,\"ContractData\", C38, \"T_CVol\",, \"T\"))","v":10},38,{"$f":"IFERROR(RANK($J38,INDIRECT((\"$J$\"&\"1\"&\":$J$\"&$A$351)))+COUNTIF($J$1:J38,J38)-1,\"\")","v":""},"S.US.TXT",""]
[{"$f":"IF(Symbols!A39=\"\",\"\",Symbols!A39)","v":"S.US.VSEC"},1,"S.US.VSEC",{"$f":"IF(A39=\"\",\"\",RTD(\"cqg.rtd\", ,\"ContractData\",C39, \"LongDescription\",, \"T\"))","v":"V S E CP ##"},null,null,null,{"$f":"IF(A39=\"\",\"\",RTD(\"cqg.rtd\", ,\"ContractData\",C39, \"LastTradeToday\",, \"T\"))","v":""},{"$f":"IF(A39=\"\",\"\",RTD(\"cqg.rtd\", ,\"ContractData\",C39, \"NetLastTradeToday\",, \"T\"))","v":""},{"$f":"IF(A39=\"\",\"\",IFERROR(RTD(\"cqg.rtd\", ,\"ContractData\",C39, \"PerCentNetLastTrade\",, \"T\")/100,\"\"))","v":""},{"$f":"IF(A39=\"\",\"\",RTD(\"cqg.rtd\", ,\"ContractData\", C39, \"T_CVol\",, \"T\"))","v":3},39,{"$f":"IFERROR(RANK($J39,INDIRECT((\"$J$\"&\"1\"&\":$J$\"&$A$351)))+COUNTIF($J$1:J39,J39)-1,\"\")","v":""},"S.US.VSEC",""]
[{"$f":"IF(Symbols!A40=\"\",\"\",Symbols!A40)","v":"S.US.VVX"},1,"S.US.VVX",{"$f":"IF(A40=\"\",\"\",RTD(\"cqg.rtd\", ,\"ContractData\",C40, \"LongDescription\",, \"T\"))","v":"V2X, Inc."},null,null,null,{"$f":"IF(A40=\"\",\"\",RTD(\"cqg.rtd\", ,\"ContractData\",C40, \"LastTradeToday\",, \"T\"))","v":""},{"$f":"IF(A40=\"\",\"\",RTD(\"cqg.rtd\", ,\"ContractData\",C40, \"NetLastTradeToday\",, \"T\"))","v":""},{"$f":"IF(A40=\"\",\"\",IFERROR(RTD(\"cqg.rtd\", ,\"ContractData\",C40, \"PerCentNetLastTrade\",, \"T\")/100,\"\"))","v":""},{"$f":"IF(A40=\"\",\"\",RTD(\"cqg.rtd\", ,\"ContractData\", C40, \"T_CVol\",, \"T\"))","v":2},40,{"$f":"IFERROR(RANK($J40,INDIRECT((\"$J$\"&\"1\"&\":$J$\"&$A$351)))+COUNTIF($J$1:J40,J40)-1,\"\")","v":""},"S.US.VVX",""]
[{"$f":"IF(Symbols!A41=\"\",\"\",Symbols!A41)","v":"S.US.WWD"},1,"S.US.WWD",{"$f":"IF(A41=\"\",\"\",RTD(\"cqg.rtd\", ,\"ContractData\",C41, \"LongDescription\",, \"T\"))","v":"Woodward, Inc."},null,null,null,{"$f":"IF(A41=\"\",\"\",RTD(\"cqg.rtd\", ,\"ContractData\",C41, \"LastTradeToday\",, \"T\"))","v":""},{"$f":"IF(A41=\"\",\"\",RTD(\"cqg.rtd\", ,\"ContractData\",C41, \"NetLastTradeToday\",, \"T\"))","v":""},{"$f":"IF(A41=\"\",\"\",IFERROR(RTD(\"cqg.rtd\", ,\"ContractData\",C41, \"PerCentNetLastTrade\",, \"T\")/100,\"\"))","v":""},{"$f":"IF(A41=\"\",\"\",RTD(\"cqg.rtd\", ,\"ContractData\", C41, \"T_CVol\",, \"T\"))","v":138},41,{"$f":"IFERROR(RANK($J41,INDIRECT((\"$J$\"&\"1\"&\":$J$\"&$A$351)))+COUNTIF($J$1:J41,J41)-1,\"\")","v":""},"S.US.WWD",""]
[{"$f":"IF(Symbols!A42=\"\",\"\",Symbols!A42)","v":""},"","",{"$f":"IF(A42=\"\",\"\",RTD(\"cqg.rtd\", ,\"ContractData\",C42, \"LongDescription\",, \"T\"))","v":""},null,null,null,{"$f":"IF(A42=\"\",\"\",RTD(\"cqg.rtd\", ,\"ContractData\",C42, \"LastTradeToday\",, \"T\"))","v":""},{"$f":"IF(A42=\"\",\"\",RTD(\"cqg.rtd\", ,\"ContractData\",C42, \"NetLastTradeToday\",, \"T\"))","v":""},{"$f":"IF(A42=\"\",\"\",IFERROR(RTD(\"cqg.rtd\", ,\"ContractData\",C42, \"PerCentNetLastTrade\",, \"T\")/100,\"\"))","v":""},{"$f":"IF(A42=\"\",\"\",RTD(\"cqg.rtd\", ,\"ContractData\", C42, \"T_CVol\",, \"T\"))","v":""},42,{"$f":"IFERROR(RANK($J42,INDIRECT((\"$J$\"&\"1\"&\":$J$\"&$A$351)))+COUNTIF($J$1:J42,J42)-1,\"\")","v":""},"",""]
[{"$f":"IF(Symbols!A43=\"\",\"\",Symbols!A43)","v":""},"","",{"$f":"IF(A43=\"\",\"\",RTD(\"cqg.rtd\", ,\"ContractData\",C43, \"LongDescription\",, \"T\"))","v":""},null,null,null,{"$f":"IF(A43=\"\",\"\",RTD(\"cqg.rtd\", ,\"ContractData\",C43, \"LastTradeToday\",, \"T\"))","v":""},{"$f":"IF(A43=\"\",\"\",RTD(\"cqg.rtd\", ,\"ContractData\",C43, \"NetLastTradeToday\",, \"T\"))","v":""},{"$f":"IF(A43=\"\",\"\",IFERROR(RTD(\"cqg.rtd\", ,\"ContractData\",C43, \"PerCentNetLastTrade\",, \"T\")/100,\"\"))","v":""},{"$f":"IF(A43=\"\",\"\",RTD(\"cqg.rtd\", ,\"ContractData\", C43, \"T_CVol\",, \"T\"))","v":""},43,{"$f":"IFERROR(RANK($J43,INDIRECT((\"$J$\"&\"1\"&\":$J$\"&$A$351)))+COUNTIF($J$1:J43,J43)-1,\"\")","v":""},"",""]
[{"$f":"IF(Symbols!A44=\"\",\"\",Symbols!A44)","v":""},"","",{"$f":"IF(A44=\"\",\"\",RTD(\"cqg.rtd\", ,\"ContractData\",C44, \"LongDescription\",, \"T\"))","v":""},null,null,null,{"$f":"IF(A44=\"\",\"\",RTD(\"cqg.rtd\", ,\"ContractData\",C44, \"LastTradeToday\",, \"T\"))","v":""},{"$f":"IF(A44=\"\",\"\",RTD(\"cqg.rtd\", ,\"ContractData\",C44, \"NetLastTradeToday\",, \"T\"))","v":""},{"$f":"IF(A44=\"\",\"\",IFERROR(RTD(\"cqg.rtd\", ,\"ContractData\",C44, \"PerCentNetLastTrade\",, \"T\")/100,\"\"))","v":""},{"$f":"IF(A44=\"\",\"\",RTD(\"cqg.rtd\", ,\"ContractData\", C44, \"T_CVol\",, \"T\"))","v":""},44,{"$f":"IFERROR(RANK($J44,INDIRECT((\"$J$\"&\"1\"&\":$J$\"&$A$351)))+COUNTIF($J$1:J44,J44)-1,\"\")","v":""},"",""]
[{"$f":"IF(Symbols!A45=\"\",\"\",Symbols!A45)","v":""},"","",{"$f":"IF(A45=\"\",\"\",RTD(\"cqg.rtd\", ,\"ContractData\",C45, \"LongDescription\",, \"T\"))","v":""},null,null,null,{"$f":"IF(A45=\"\",\"\",RTD(\"cqg.rtd\", ,\"ContractData\",C45, \"LastTradeToday\",, \"T\"))","v":""},{"$f":"IF(A45=\"\",\"\",RTD(\"cqg.rtd\", ,\"ContractData\",C45, \"NetLastTradeToday\",, \"T\"))","v":""},{"$f":"IF(A45=\"\",\"\",IFERROR(RTD(\"cqg.rtd\", ,\"ContractData\",C45, \"PerCentNetLastTrade\",, \"T\")/100,\"\"))","v":""},{"$f":"IF(A45=\"\",\"\",RTD(\"cqg.rtd\", ,\"ContractData\", C45, \"T_CVol\",, \"T\"))","v":""},45,{"$f":"IFERROR(RANK($J45,INDIRECT((\"$J$\"&\"1\"&\":$J$\"&$A$351)))+COUNTIF($J$1:J45,J45)-1,\"\")","v":""},"",""]
[{"$f":"IF(Symbols!A46=\"\",\"\",Symbols!A46)","v":""},"","",{"$f":"IF(A46=\"\",\"\",RTD(\"cqg.rtd\", ,\"ContractData\",C46, \"LongDescription\",, \"T\"))","v":""},null,null,null,{"$f":"IF(A46=\"\",\"\",RTD(\"cqg.rtd\", ,\"ContractData\",C46, \"LastTradeToday\",, \"T\"))","v":""},{"$f":"IF(A46=\"\",\"\",RTD(\"cqg.rtd\", ,\"ContractData\",C46, \"NetLastTradeToday\",, \"T\"))","v":""},{"$f":"IF(A46=\"\",\"\",IFERROR(RTD(\"cqg.rtd\", ,\"ContractData\",C46, \"PerCentNetLastTrade\",, \"T\")/100,\"\"))","v":""},{"$f":"IF(A46=\"\",\"\",RTD(\"cqg.rtd\", ,\"ContractData\", C46, \"T_CVol\",, \"T\"))","v":""},46,{"$f":"IFERROR(RANK($J46,INDIRECT((\"$J$\"&\"1\"&\":$J$\"&$A$351)))+COUNTIF($J$1:J46,J46)-1,\"\")","v":""},"",""]
[{"$f":"IF(Symbols!A47=\"\",\"\",Symbols!A47)","v":""},"","",{"$f":"IF(A47=\"\",\"\",RTD(\"cqg.rtd\", ,\"ContractData\",C47, \"LongDescription\",, \"T\"))","v":""},null,null,null,{"$f":"IF(A47=\"\",\"\",RTD(\"cqg.rtd\", ,\"ContractData\",C47, \"LastTradeToday\",, \"T\"))","v":""},{"$f":"IF(A47=\"\",\"\",RTD(\"cqg.rtd\", ,\"ContractData\",C47, \"NetLastTradeToday\",, \"T\"))","v":""},{"$f":"IF(A47=\"\",\"\",IFERROR(RTD(\"cqg.rtd\", ,\"ContractData\",C47, \"PerCentNetLastTrade\",, \"T\")/100,\"\"))","v":""},{"$f":"IF(A47=\"\",\"\",RTD(\"cqg.rtd\", ,\"ContractData\", C47, \"T_CVol\",, \"T\"))","v":""},47,{"$f":"IFERROR(RANK($J47,INDIRECT((\"$J$\"&\"1\"&\":$J$\"&$A$351)))+COUNTIF($J$1:J47,J47)-1,\"\")","v":""},"",""]
[{"$f":"IF(Symbols!A48=\"\",\"\",Symbols!A48)","v":""},"","",{"$f":"IF(A48=\"\",\"\",RTD(\"cqg.rtd\", ,\"ContractData\",C48, \"LongDescription\",, \"T\"))","v":""},null,null,null,{"$f":"IF(A48=\"\",\"\",RTD(\"cqg.rtd\", ,\"ContractData\",C48, \"LastTradeToday\",, \"T\"))","v":""},{"$f":"IF(A48=\"\",\"\",RTD(\"cqg.rtd\", ,\"ContractData\",C48, \"NetLastTradeToday\",, \"T\"))","v":""},{"$f":"IF(A48=\"\",\"\",IFERROR(RTD(\"cqg.rtd\", ,\"ContractData\",C48, \"PerCentNetLastTrade\",, \"T\")/100,\"\"))","v":""},{"$f":"IF(A48=\"\",\"\",RTD(\"cqg.rtd\", ,\"ContractData\", C48, \"T_CVol\",, \"T\"))","v":""},48,{"$f":"IFERROR(RANK($J48,INDIRECT((\"$J$\"&\"1\"&\":$J$\"&$A$351)))+COUNTIF($J$1:J48,J48)-1,\"\")","v":""},"",""]
[{"$f":"IF(Symbols!A49=\"\",\"\",Symbols!A49)","v":""},"","",{"$f":"IF(A49=\"\",\"\",RTD(\"cqg.rtd\", ,\"ContractData\",C49, \"LongDescription\",, \"T\"))","v":""},null,null,null,{"$f":"IF(A49=\"\",\"\",RTD(\"cqg.rtd\", ,\"ContractData\",C49, \"LastTradeToday\",, \"T\"))","v":""},{"$f":"IF(A49=\"\",\"\",RTD(\"cqg.rtd\", ,\"ContractData\",C49, \"NetLastTradeToday\",, \"T\"))","v":""},{"$f":"IF(A49=\"\",\"\",IFERROR(RTD(\"cqg.rtd\", ,\"ContractData\",C49, \"PerCentNetLastTrade\",, \"T\")/100,\"\"))","v":""},{"$f":"IF(A49=\"\",\"\",RTD(\"cqg.rtd\", ,\"ContractData\", C49, \"T_CVol\",, \"T\"))","v":""},49,{"$f":"IFERROR(RANK($J49,INDIRECT((\"$J$\"&\"1\"&\":$J$\"&$A$351)))+COUNTIF($J$1:J49,J49)-1,\"\")","v":""},"",""]
[{"$f":"IF(Symbols!A50=\"\",\"\",Symbols!A50)","v":""},"","",{"$f":"IF(A50=\"\",\"\",RTD(\"cqg.rtd\", ,\"ContractData\",C50, \"LongDescription\",, \"T\"))","v":""},null,null,null,{"$f":"IF(A50=\"\",\"\",RTD(\"cqg.rtd\", ,\"ContractData\",C50, \"LastTradeToday\",, \"T\"))","v":""},{"$f":"IF(A50=\"\",\"\",RTD(\"cqg.rtd\", ,\"ContractData\",C50, \"NetLastTradeToday\",, \"T\"))","v":""},{"$f":"IF(A50=\"\",\"\",IFERROR(RTD(\"cqg.rtd\", ,\"ContractData\",C50, \"PerCentNetLastTrade\",, \"T\")/100,\"\"))","v":""},{"$f":"IF(A50=\"\",\"\",RTD(\"cqg.rtd\", ,\"ContractData\", C50, \"T_CVol\",, \"T\"))","v":""},50,{"$f":"IFERROR(RANK($J50,INDIRECT((\"$J$\"&\"1\"&\":$J$\"&$A$351)))+COUNTIF($J$1:J50,J50)-1,\"\")","v":""},"",""]
[{"$f":"IF(Symbols!A51=\"\",\"\",Symbols!A51)","v":""},"","",{"$f":"IF(A51=\"\",\"\",RTD(\"cqg.rtd\", ,\"ContractData\",C51, \"LongDescription\",, \"T\"))","v":""},null,null,null,{"$f":"IF(A51=\"\",\"\",RTD(\"cqg.rtd\", ,\"ContractData\",C51, \"LastTradeToday\",, \"T\"))","v":""},{"$f":"IF(A51=\"\",\"\",RTD(\"cqg.rtd\", ,\"ContractData\",C51, \"NetLastTradeToday\",, \"T\"))","v":""},{"$f":"IF(A51=\"\",\"\",IFERROR(RTD(\"cqg.rtd\", ,\"ContractData\",C51, \"PerCentNetLastTrade\",, \"T\")/100,\"\"))","v":""},{"$f":"IF(A51=\"\",\"\",RTD(\"cqg.rtd\", ,\"ContractData\", C51, \"T_CVol\",, \"T\"))","v":""},51,{"$f":"IFERROR(RANK($J51,INDIRECT((\"$J$\"&\"1\"&\":$J$\"&$A$351)))+COUNTIF($J$1:J51,J51)-1,\"\")","v":""},"",""]
[{"$f":"IF(Symbols!A52=\"\",\"\",Symbols!A52)","v":""},"","",{"$f":"IF(A52=\"\",\"\",RTD(\"cqg.rtd\", ,\"ContractData\",C52, \"LongDescription\",, \"T\"))","v":""},null,null,null,{"$f":"IF(A52=\"\",\"\",RTD(\"cqg.rtd\", ,\"ContractData\",C52, \"LastTradeToday\",, \"T\"))","v":""},{"$f":"IF(A52=\"\",\"\",RTD(\"cqg.rtd\", ,\"ContractData\",C52, \"NetLastTradeToday\",, \"T\"))","v":""},{"$f":"IF(A52=\"\",\"\",IFERROR(RTD(\"cqg.rtd\", ,\"ContractData\",C52, \"PerCentNetLastTrade\",, \"T\")/100,\"\"))","v":""},{"$f":"IF(A52=\"\",\"\",RTD(\"cqg.rtd\", ,\"ContractData\", C52, \"T_CVol\",, \"T\"))","v":""},52,{"$f":"IFERROR(RANK($J52,INDIRECT((\"$J$\"&\"1\"&\":$J$\"&$A$351)))+COUNTIF($J$1:J52,J52)-1,\"\")","v":""},"",""]
[{"$f":"IF(Symbols!A53=\"\",\"\",Symbols!A53)","v":""},"","",{"$f":"IF(A53=\"\",\"\",RTD(\"cqg.rtd\", ,\"ContractData\",C53, \"LongDescription\",, \"T\"))","v":""},null,null,null,{"$f":"IF(A53=\"\",\"\",RTD(\"cqg.rtd\", ,\"ContractData\",C53, \"LastTradeToday\",, \"T\"))","v":""},{"$f":"IF(A53=\"\",\"\",RTD(\"cqg.rtd\", ,\"ContractData\",C53, \"NetLastTradeToday\",, \"T\"))","v":""},{"$f":"IF(A53=\"\",\"\",IFERROR(RTD(\"cqg.rtd\", ,\"ContractData\",C53, \"PerCentNetLastTrade\",, \"T\")/100,\"\"))","v":""},{"$f":"IF(A53=\"\",\"\",RTD(\"cqg.rtd\", ,\"ContractData\", C53, \"T_CVol\",, \"T\"))","v":""},53,{"$f":"IFERROR(RANK($J53,INDIRECT((\"$J$\"&\"1\"&\":$J$\"&$A$351)))+COUNTIF($J$1:J53,J53)-1,\"\")","v":""},"",""]
[{"$f":"IF(Symbols!A54=\"\",\"\",Symbols!A54)","v":""},"","",{"$f":"IF(A54=\"\",\"\",RTD(\"cqg.rtd\", ,\"ContractData\",C54, \"LongDescription\",, \"T\"))","v":""},null,null,null,{"$f":"IF(A54=\"\",\"\",RTD(\"cqg.rtd\", ,\"ContractData\",C54, \"LastTradeToday\",, \"T\"))","v":""},{"$f":"IF(A54=\"\",\"\",RTD(\"cqg.rtd\", ,\"ContractData\",C54, \"NetLastTradeToday\",, \"T\"))","v":""},{"$f":"IF(A54=\"\",\"\",IFERROR(RTD(\"cqg.rtd\", ,\"ContractData\",C54, \"PerCentNetLastTrade\",, \"T\")/100,\"\"))","v":""},{"$f":"IF(A54=\"\",\"\",RTD(\"cqg.rtd\", ,\"ContractData\", C54, \"T_CVol\",, \"T\"))","v":""},54,{"$f":"IFERROR(RANK($J54,INDIRECT((\"$J$\"&\"1\"&\":$J$\"&$A$351)))+COUNTIF($J$1:J54,J54)-1,\"\")","v":""},"",""]
[{"$f":"IF(Symbols!A55=\"\",\"\",Symbols!A55)","v":""},"","",{"$f":"IF(A55=\"\",\"\",RTD(\"cqg.rtd\", ,\"ContractData\",C55, \"LongDescription\",, \"T\"))","v":""},null,null,null,{"$f":"IF(A55=\"\",\"\",RTD(\"cqg.rtd\", ,\"ContractData\",C55, \"LastTradeToday\",, \"T\"))","v":""},{"$f":"IF(A55=\"\",\"\",RTD(\"cqg.rtd\", ,\"ContractData\",C55, \"NetLastTradeToday\",, \"T\"))","v":""},{"$f":"IF(A55=\"\",\"\",IFERROR(RTD(\"cqg.rtd\", ,\"ContractData\",C55, \"PerCentNetLastTrade\",, \"T\")/100,\"\"))","v":""},{"$f":"IF(A55=\"\",\"\",RTD(\"cqg.rtd\", ,\"ContractData\", C55, \"T_CVol\",, \"T\"))","v":""},55,{"$f":"IFERROR(RANK($J55,INDIRECT((\"$J$\"&\"1\"&\":$J$\"&$A$351)))+COUNTIF($J$1:J55,J55)-1,\"\")","v":""},"",""]
[{"$f":"IF(Symbols!A56=\"\",\"\",Symbols!A56)","v":""},"","",{"$f":"IF(A56=\"\",\"\",RTD(\"cqg.rtd\", ,\"ContractData\",C56, \"LongDescription\",, \"T\"))","v":""},null,null,null,{"$f":"IF(A56=\"\",\"\",RTD(\"cqg.rtd\", ,\"ContractData\",C56, \"LastTradeToday\",, \"T\"))","v":""},{"$f":"IF(A56=\"\",\"\",RTD(\"cqg.rtd\", ,\"ContractData\",C56, \"NetLastTradeToday\",, \"T\"))","v":""},{"$f":"IF(A56=\"\",\"\",IFERROR(RTD(\"cqg.rtd\", ,\"ContractData\",C56, \"PerCentNetLastTrade\",, \"T\")/100,\"\"))","v":""},{"$f":"IF(A56=\"\",\"\",RTD(\"cqg.rtd\", ,\"ContractData\", C56, \"T_CVol\",, \"T\"))","v":""},56,{"$f":"IFERROR(RANK($J56,INDIRECT((\"$J$\"&\"1\"&\":$J$\"&$A$351)))+COUNTIF($J$1:J56,J56)-1,\"\")","v":""},"",""]
[{"$f":"IF(Symbols!A57=\"\",\"\",Symbols!A57)","v":""},"","",{"$f":"IF(A57=\"\",\"\",RTD(\"cqg.rtd\", ,\"ContractData\",C57, \"LongDescription\",, \"T\"))","v":""},null,null,null,{"$f":"IF(A57=\"\",\"\",RTD(\"cqg.rtd\", ,\"ContractData\",C57, \"LastTradeToday\",, \"T\"))","v":""},{"$f":"IF(A57=\"\",\"\",RTD(\"cqg.rtd\", ,\"ContractData\",C57, \"NetLastTradeToday\",, \"T\"))","v":""},{"$f":"IF(A57=\"\",\"\",IFERROR(RTD(\"cqg.rtd\", ,\"ContractData\",C57, \"PerCentNetLastTrade\",, \"T\")/100,\"\"))","v":""},{"$f":"IF(A57=\"\",\"\",RTD(\"cqg.rtd\", ,\"ContractData\", C57, \"T_CVol\",, \"T\"))","v":""},57,{"$f":"IFERROR(RANK($J57,INDIRECT((\"$J$\"&\"1\"&\":$J$\"&$A$351)))+COUNTIF($J$1:J57,J57)-1,\"\")","v":""},"",""]
[{"$f":"IF(Symbols!A58=\"\",\"\",Symbols!A58)","v":""},"","",{"$f":"IF(A58=\"\",\"\",RTD(\"cqg.rtd\", ,\"ContractData\",C58, \"LongDescription\",, \"T\"))","v":""},null,null,null,{"$f":"IF(A58=\"\",\"\",RTD(\"cqg.rtd\", ,\"ContractData\",C58, \"LastTradeToday\",, \"T\"))","v":""},{"$f":"IF(A58=\"\",\"\",RTD(\"cqg.rtd\", ,\"ContractData\",C58, \"NetLastTradeToday\",, \"T\"))","v":""},{"$f":"IF(A58=\"\",\"\",IFERROR(RTD(\"cqg.rtd\", ,\"ContractData\",C58, \"PerCentNetLastTrade\",, \"T\")/100,\"\"))","v":""},{"$f":"IF(A58=\"\",\"\",RTD(\"cqg.rtd\", ,\"ContractData\", C58, \"T_CVol\",, \"T\"))","v":""},58,{"$f":"IFERROR(RANK($J58,INDIRECT((\"$J$\"&\"1\"&\":$J$\"&$A$351)))+COUNTIF($J$1:J58,J58)-1,\"\")","v":""},"",""]
[{"$f":"IF(Symbols!A59=\"\",\"\",Symbols!A59)","v":""},"","",{"$f":"IF(A59=\"\",\"\",RTD(\"cqg.rtd\", ,\"ContractData\",C59, \"LongDescription\",, \"T\"))","v":""},null,null,null,{"$f":"IF(A59=\"\",\"\",RTD(\"cqg.rtd\", ,\"ContractData\",C59, \"LastTradeToday\",, \"T\"))","v":""},{"$f":"IF(A59=\"\",\"\",RTD(\"cqg.rtd\", ,\"ContractData\",C59, \"NetLastTradeToday\",, \"T\"))","v":""},{"$f":"IF(A59=\"\",\"\",IFERROR(RTD(\"cqg.rtd\", ,\"ContractData\",C59, \"PerCentNetLastTrade\",, \"T\")/100,\"\"))","v":""},{"$f":"IF(A59=\"\",\"\",RTD(\"cqg.rtd\", ,\"ContractData\", C59, \"T_CVol\",, \"T\"))","v":""},59,{"$f":"IFERROR(RANK($J59,INDIRECT((\"$J$\"&\"1\"&\":$J$\"&$A$351)))+COUNTIF($J$1:J59,J59)-1,\"\")","v":""},"",""]
[{"$f":"IF(Symbols!A60=\"\",\"\",Symbols!A60)","v":""},"","",{"$f":"IF(A60=\"\",\"\",RTD(\"cqg.rtd\", ,\"ContractData\",C60, \"LongDescription\",, \"T\"))","v":""},null,null,null,{"$f":"IF(A60=\"\",\"\",RTD(\"cqg.rtd\", ,\"ContractData\",C60, \"LastTradeToday\",, \"T\"))","v":""},{"$f":"IF(A60=\"\",\"\",RTD(\"cqg.rtd\", ,\"ContractData\",C60, \"NetLastTradeToday\",, \"T\"))","v":""},{"$f":"IF(A60=\"\",\"\",IFERROR(RTD(\"cqg.rtd\", ,\"ContractData\",C60, \"PerCentNetLastTrade\",, \"T\")/100,\"\"))","v":""},{"$f":"IF(A60=\"\",\"\",RTD(\"cqg.rtd\", ,\"ContractData\", C60, \"T_CVol\",, \"T\"))","v":""},60,{"$f":"IFERROR(RANK($J60,INDIRECT((\"$J$\"&\"1\"&\":$J$\"&$A$351)))+COUNTIF($J$1:J60,J60)-1,\"\")","v":""},"",""]
[{"$f":"IF(Symbols!A61=\"\",\"\",Symbols!A61)","v":""},{"$f":"IF(A61=\"\",\"\",IF(J61>0,1,0))","v":""},{"$f":"A61","v":""},{"$f":"IF(A61=\"\",\"\",RTD(\"cqg.rtd\", ,\"ContractData\",C61, \"LongDescription\",, \"T\"))","v":""},null,null,null,{"$f":"IF(A61=\"\",\"\",RTD(\"cqg.rtd\", ,\"ContractData\",C61, \"LastTradeToday\",, \"T\"))","v":""},{"$f":"IF(A61=\"\",\"\",RTD(\"cqg.rtd\", ,\"ContractData\",C61, \"NetLastTradeToday\",, \"T\"))","v":""},{"$f":"IF(A61=\"\",\"\",IFERROR(RTD(\"cqg.rtd\", ,\"ContractData\",C61, \"PerCentNetLastTrade\",, \"T\")/100,\"\"))","v":""},{"$f":"IF(A61=\"\",\"\",RTD(\"cqg.rtd\", ,\"ContractData\", C61, \"T_CVol\",, \"T\"))","v":""},61,{"$f":"IFERROR(RANK($J61,INDIRECT((\"$J$\"&\"1\"&\":$J$\"&$A$351)))+COUNTIF($J$1:J61,J61)-1,\"\")","v":""},{"$f":"C61","v":""},""]
[{"$f":"IF(Symbols!A62=\"\",\"\",Symbols!A62)","v":""},"","",{"$f":"IF(A62=\"\",\"\",RTD(\"cqg.rtd\", ,\"ContractData\",C62, \"LongDescription\",, \"T\"))","v":""},null,null,null,{"$f":"IF(A62=\"\",\"\",RTD(\"cqg.rtd\", ,\"ContractData\",C62, \"LastTradeToday\",, \"T\"))","v":""},{"$f":"IF(A62=\"\",\"\",RTD(\"cqg.rtd\", ,\"ContractData\",C62, \"NetLastTradeToday\",, \"T\"))","v":""},{"$f":"IF(A62=\"\",\"\",IFERROR(RTD(\"cqg.rtd\", ,\"ContractData\",C62, \"PerCentNetLastTrade\",, \"T\")/100,\"\"))","v":""},{"$f":"IF(A62=\"\",\"\",RTD(\"cqg.rtd\", ,\"ContractData\", C62, \"T_CVol\",, \"T\"))","v":""},62,{"$f":"IFERROR(RANK($J62,INDIRECT((\"$J$\"&\"1\"&\":$J$\"&$A$351)))+COUNTIF($J$1:J62,J62)-1,\"\")","v":""},"",""]
[{"$f":"IF(Symbols!A63=\"\",\"\",Symbols!A63)","v":""},"","",{"$f":"IF(A63=\"\",\"\",RTD(\"cqg.rtd\", ,\"ContractData\",C63, \"LongDescription\",, \"T\"))","v":""},null,null,null,{"$f":"IF(A63=\"\",\"\",RTD(\"cqg.rtd\", ,\"ContractData\",C63, \"LastTradeToday\",, \"T\"))","v":""},{"$f":"IF(A63=\"\",\"\",RTD(\"cqg.rtd\", ,\"ContractData\",C63, \"NetLastTradeToday\",, \"T\"))","v":""},{"$f":"IF(A63=\"\",\"\",IFERROR(RTD(\"cqg.rtd\", ,\"ContractData\",C63, \"PerCentNetLastTrade\",, \"T\")/100,\"\"))","v":""},{"$f":"IF(A63=\"\",\"\",RTD(\"cqg.rtd\", ,\"ContractData\", C63, \"T_CVol\",, \"T\"))","v":""},63,{"$f":"IFERROR(RANK($J63,INDIRECT((\"$J$\"&\"1\"&\":$J$\"&$A$351)))+COUNTIF($J$1:J63,J63)-1,\"\")","v":""},"",""]
[{"$f":"IF(Symbols!A64=\"\",\"\",Symbols!A64)","v":""},"","",{"$f":"IF(A64=\"\",\"\",RTD(\"cqg.rtd\", ,\"ContractData\",C64, \"LongDescription\",, \"T\"))","v":""},null,null,null,{"$f":"IF(A64=\"\",\"\",RTD(\"cqg.rtd\", ,\"ContractData\",C64, \"LastTradeToday\",, \"T\"))","v":""},{"$f":"IF(A64=\"\",\"\",RTD(\"cqg.rtd\", ,\"ContractData\",C64, \"NetLastTradeToday\",, \"T\"))","v":""},{"$f":"IF(A64=\"\",\"\",IFERROR(RTD(\"cqg.rtd\", ,\"ContractData\",C64, \"PerCentNetLastTrade\",, \"T\")/100,\"\"))","v":""},{"$f":"IF(A64=\"\",\"\",RTD(\"cqg.rtd\", ,\"ContractData\", C64, \"T_CVol\",, \"T\"))","v":""},64,{"$f":"IFERROR(RANK($J64,INDIRECT((\"$J$\"&\"1\"&\":$J$\"&$A$351)))+COUNTIF($J$1:J64,J64)-1,\"\")","v":""},"",""]
[{"$f":"IF(Symbols!A65=\"\",\"\",Symbols!A65)","v":""},"","",{"$f":"IF(A65=\"\",\"\",RTD(\"cqg.rtd\", ,\"ContractData\",C65, \"LongDescription\",, \"T\"))","v":""},null,null,null,{"$f":"IF(A65=\"\",\"\",RTD(\"cqg.rtd\", ,\"ContractData\",C65, \"LastTradeToday\",, \"T\"))","v":""},{"$f":"IF(A65=\"\",\"\",RTD(\"cqg.rtd\", ,\"ContractData\",C65, \"NetLastTradeToday\",, \"T\"))","v":""},{"$f":"IF(A65=\"\",\"\",IFERROR(RTD(\"cqg.rtd\", ,\"ContractData\",C65, \"PerCentNetLastTrade\",, \"T\")/100,\"\"))","v":""},{"$f":"IF(A65=\"\",\"\",RTD(\"cqg.rtd\", ,\"ContractData\", C65, \"T_CVol\",, \"T\"))","v":""},65,{"$f":"IFERROR(RANK($J65,INDIRECT((\"$J$\"&\"1\"&\":$J$\"&$A$351)))+COUNTIF($J$1:J65,J65)-1,\"\")","v":""},"",""]
[{"$f":"IF(Symbols!A66=\"\",\"\",Symbols!A66)","v":""},"","",{"$f":"IF(A66=\"\",\"\",RTD(\"cqg.rtd\", ,\"ContractData\",C66, \"LongDescription\",, \"T\"))","v":""},null,null,null,{"$f":"IF(A66=\"\",\"\",RTD(\"cqg.rtd\", ,\"ContractData\",C66, \"LastTradeToday\",, \"T\"))","v":""},{"$f":"IF(A66=\"\",\"\",RTD(\"cqg.rtd\", ,\"ContractData\",C66, \"NetLastTradeToday\",, \"T\"))","v":""},{"$f":"IF(A66=\"\",\"\",IFERROR(RTD(\"cqg.rtd\", ,\"ContractData\",C66, \"PerCentNetLastTrade\",, \"T\")/100,\"\"))","v":""},{"$f":"IF(A66=\"\",\"\",RTD(\"cqg.rtd\", ,\"ContractData\", C66, \"T_CVol\",, \"T\"))","v":""},66,{"$f":"IFERROR(RANK($J66,INDIRECT((\"$J$\"&\"1\"&\":$J$\"&$A$351)))+COUNTIF($J$1:J66,J66)-1,\"\")","v":""},"",{"$f":"IFERROR(VLOOKUP($L66,$M$1:$N$350,2,FALSE),\"\")","v":""}]
[{"$f":"IF(Symbols!A67=\"\",\"\",Symbols!A67)","v":""},"","",{"$f":"IF(A67=\"\",\"\",RTD(\"cqg.rtd\", ,\"ContractData\",C67, \"LongDescription\",, \"T\"))","v":""},null,null,null,{"$f":"IF(A67=\"\",\"\",RTD(\"cqg.rtd\", ,\"ContractData\",C67, \"LastTradeToday\",, \"T\"))","v":""},{"$f":"IF(A67=\"\",\"\",RTD(\"cqg.rtd\", ,\"ContractData\",C67, \"NetLastTradeToday\",, \"T\"))","v":""},{"$f":"IF(A67=\"\",\"\",IFERROR(RTD(\"cqg.rtd\", ,\"ContractData\",C67, \"PerCentNetLastTrade\",, \"T\")/100,\"\"))","v":""},{"$f":"IF(A67=\"\",\"\",RTD(\"cqg.rtd\", ,\"ContractData\", C67, \"T_CVol\",, \"T\"))","v":""},{"$f":"L66+1","v":67},{"$f":"IFERROR(RANK($J67,INDIRECT((\"$J$\"&\"1\"&\":$J$\"&$A$351)))+COUNTIF($J$1:J67,J67)-1,\"\")","v":""},"",""]
[{"$f":"IF(Symbols!A68=\"\",\"\",Symbols!A68)","v":""},"","",{"$f":"IF(A68=\"\",\"\",RTD(\"cqg.rtd\", ,\"ContractData\",C68, \"LongDescription\",, \"T\"))","v":""},null,null,null,{"$f":"IF(A68=\"\",\"\",RTD(\"cqg.rtd\", ,\"ContractData\",C68, \"LastTradeToday\",, \"T\"))","v":""},{"$f":"IF(A68=\"\",\"\",RTD(\"cqg.rtd\", ,\"ContractData\",C68, \"NetLastTradeToday\",, \"T\"))","v":""},{"$f":"IF(A68=\"\",\"\",IFERROR(RTD(\"cqg.rtd\", ,\"ContractData\",C68, \"PerCentNetLastTrade\",, \"T\")/100,\"\"))","v":""},{"$f":"IF(A68=\"\",\"\",RTD(\"cqg.rtd\", ,\"ContractData\", C68, \"T_CVol\",, \"T\"))","v":""},68,{"$f":"IFERROR(RANK($J68,INDIRECT((\"$J$\"&\"1\"&\":$J$\"&$A$351)))+COUNTIF($J$1:J68,J68)-1,\"\")","v":""},"",""]
[{"$f":"IF(Symbols!A69=\"\",\"\",Symbols!A69)","v":""},"","",{"$f":"IF(A69=\"\",\"\",RTD(\"cqg.rtd\", ,\"ContractData\",C69, \"LongDescription\",, \"T\"))","v":""},null,null,null,{"$f":"IF(A69=\"\",\"\",RTD(\"cqg.rtd\", ,\"ContractData\",C69, \"LastTradeToday\",, \"T\"))","v":""},{"$f":"IF(A69=\"\",\"\",RTD(\"cqg.rtd\", ,\"ContractData\",C69, \"NetLastTradeToday\",, \"T\"))","v":""},{"$f":"IF(A69=\"\",\"\",IFERROR(RTD(\"cqg.rtd\", ,\"ContractData\",C69, \"PerCentNetLastTrade\",, \"T\")/100,\"\"))","v":""},{"$f":"IF(A69=\"\",\"\",RTD(\"cqg.rtd\", ,\"ContractData\", C69, \"T_CVol\",, \"T\"))","v":""},69,{"$f":"IFERROR(RANK($J69,INDIRECT((\"$J$\"&\"1\"&\":$J$\"&$A$351)))+COUNTIF($J$1:J69,J69)-1,\"\")","v":""},"",""]
[{"$f":"IF(Symbols!A70=\"\",\"\",Symbols!A70)","v":""},"","",{"$f":"IF(A70=\"\",\"\",RTD(\"cqg.rtd\", ,\"ContractData\",C70, \"LongDescription\",, \"T\"))","v":""},null,null,null,{"$f":"IF(A70=\"\",\"\",RTD(\"cqg.rtd\", ,\"ContractData\",C70, \"LastTradeToday\",, \"T\"))","v":""},{"$f":"IF(A70=\"\",\"\",RTD(\"cqg.rtd\", ,\"ContractData\",C70, \"NetLastTradeToday\",, \"T\"))","v":""},{"$f":"IF(A70=\"\",\"\",IFERROR(RTD(\"cqg.rtd\", ,\"ContractData\",C70, \"PerCentNetLastTrade\",, \"T\")/100,\"\"))","v":""},{"$f":"IF(A70=\"\",\"\",RTD(\"cqg.rtd\", ,\"ContractData\", C70, \"T_CVol\",, \"T\"))","v":""},70,{"$f":"IFERROR(RANK($J70,INDIRECT((\"$J$\"&\"1\"&\":$J$\"&$A$351)))+COUNTIF($J$1:J70,J70)-1,\"\")","v":""},"",""]
[{"$f":"IF(Symbols!A71=\"\",\"\",Symbols!A71)","v":""},"","",{"$f":"IF(A71=\"\",\"\",RTD(\"cqg.rtd\", ,\"ContractData\",C71, \"LongDescription\",, \"T\"))","v":""},null,null,null,{"$f":"IF(A71=\"\",\"\",RTD(\"cqg.rtd\", ,\"ContractData\",C71, \"LastTradeToday\",, \"T\"))","v":""},{"$f":"IF(A71=\"\",\"\",RTD(\"cqg.rtd\", ,\"ContractData\",C71, \"NetLastTradeToday\",, \"T\"))","v":""},{"$f":"IF(A71=\"\",\"\",IFERROR(RTD(\"cqg.rtd\", ,\"ContractData\",C71, \"PerCentNetLastTrade\",, \"T\")/100,\"\"))","v":""},{"$f":"IF(A71=\"\",\"\",RTD(\"cqg.rtd\", ,\"ContractData\", C71, \"T_CVol\",, \"T\"))","v":""},71,{"$f":"IFERROR(RANK($J71,INDIRECT((\"$J$\"&\"1\"&\":$J$\"&$A$351)))+COUNTIF($J$1:J71,J71)-1,\"\")","v":""},"",""]
[{"$f":"IF(Symbols!A72=\"\",\"\",Symbols!A72)","v":""},"","",{"$f":"IF(A72=\"\",\"\",RTD(\"cqg.rtd\", ,\"ContractData\",C72, \"LongDescription\",, \"T\"))","v":""},null,null,null,{"$f":"IF(A72=\"\",\"\",RTD(\"cqg.rtd\", ,\"ContractData\",C72, \"LastTradeToday\",, \"T\"))","v":""},{"$f":"IF(A72=\"\",\"\",RTD(\"cqg.rtd\", ,\"ContractData\",C72, \"NetLastTradeToday\",, \"T\"))","v":""},{"$f":"IF(A72=\"\",\"\",IFERROR(RTD(\"cqg.rtd\", ,\"ContractData\",C72, \"PerCentNetLastTrade\",, \"T\")/100,\"\"))","v":""},{"$f":"IF(A72=\"\",\"\",RTD(\"cqg.rtd\", ,\"ContractData\", C72, \"T_CVol\",, \"T\"))","v":""},72,{"$f":"IFERROR(RANK($J72,INDIRECT((\"$J$\"&\"1\"&\":$J$\"&$A$351)))+COUNTIF($J$1:J72,J72)-1,\"\")","v":""},"",""]
[{"$f":"IF(Symbols!A73=\"\",\"\",Symbols!A73)","v":""},"","",{"$f":"IF(A73=\"\",\"\",RTD(\"cqg.rtd\", ,\"ContractData\",C73, \"LongDescription\",, \"T\"))","v":""},null,null,null,{"$f":"IF(A73=\"\",\"\",RTD(\"cqg.rtd\", ,\"ContractData\",C73, \"LastTradeToday\",, \"T\"))","v":""},{"$f":"IF(A73=\"\",\"\",RTD(\"cqg.rtd\", ,\"ContractData\",C73, \"NetLastTradeToday\",, \"T\"))","v":""},{"$f":"IF(A73=\"\",\"\",IFERROR(RTD(\"cqg.rtd\", ,\"ContractData\",C73, \"PerCentNetLastTrade\",, \"T\")/100,\"\"))","v":""},{"$f":"IF(A73=\"\",\"\",RTD(\"cqg.rtd\", ,\"ContractData\", C73, \"T_CVol\",, \"T\"))","v":""},73,{"$f":"IFERROR(RANK($J73,INDIRECT((\"$J$\"&\"1\"&\":$J$\"&$A$351)))+COUNTIF($J$1:J73,J73)-1,\"\")","v":""},"",""]
[{"$f":"IF(Symbols!A74=\"\",\"\",Symbols!A74)","v":""},"","",{"$f":"IF(A74=\"\",\"\",RTD(\"cqg.rtd\", ,\"ContractData\",C74, \"LongDescription\",, \"T\"))","v":""},null,null,null,{"$f":"IF(A74=\"\",\"\",RTD(\"cqg.rtd\", ,\"ContractData\",C74, \"LastTradeToday\",, \"T\"))","v":""},{"$f":"IF(A74=\"\",\"\",RTD(\"cqg.rtd\", ,\"ContractData\",C74, \"NetLastTradeToday\",, \"T\"))","v":""},{"$f":"IF(A74=\"\",\"\",IFERROR(RTD(\"cqg.rtd\", ,\"ContractData\",C74, \"PerCentNetLastTrade\",, \"T\")/100,\"\"))","v":""},{"$f":"IF(A74=\"\",\"\",RTD(\"cqg.rtd\", ,\"ContractData\", C74, \"T_CVol\",, \"T\"))","v":""},74,{"$f":"IFERROR(RANK($J74,INDIRECT((\"$J$\"&\"1\"&\":$J$\"&$A$351)))+COUNTIF($J$1:J74,J74)-1,\"\")","v":""},"",""]
[{"$f":"IF(Symbols!A75=\"\",\"\",Symbols!A75)","v":""},"","",{"$f":"IF(A75=\"\",\"\",RTD(\"cqg.rtd\", ,\"ContractData\",C75, \"LongDescription\",, \"T\"))","v":""},null,null,null,{"$f":"IF(A75=\"\",\"\",RTD(\"cqg.rtd\", ,\"ContractData\",C75, \"LastTradeToday\",, \"T\"))","v":""},{"$f":"IF(A75=\"\",\"\",RTD(\"cqg.rtd\", ,\"ContractData\",C75, \"NetLastTradeToday\",, \"T\"))","v":""},{"$f":"IF(A75=\"\",\"\",IFERROR(RTD(\"cqg.rtd\", ,\"ContractData\",C75, \"PerCentNetLastTrade\",, \"T\")/100,\"\"))","v":""},{"$f":"IF(A75=\"\",\"\",RTD(\"cqg.rtd\", ,\"ContractData\", C75, \"T_CVol\",, \"T\"))","v":""},75,{"$f":"IFERROR(RANK($J75,INDIRECT((\"$J$\"&\"1\"&\":$J$\"&$A$351)))+COUNTIF($J$1:J75,J75)-1,\"\")","v":""},"",""]
[{"$f":"IF(Symbols!A76=\"\",\"\",Symbols!A76)","v":""},"","",{"$f":"IF(A76=\"\",\"\",RTD(\"cqg.rtd\", ,\"ContractData\",C76, \"LongDescription\",, \"T\"))","v":""},null,null,null,{"$f":"IF(A76=\"\",\"\",RTD(\"cqg.rtd\", ,\"ContractData\",C76, \"LastTradeToday\",, \"T\"))","v":""},{"$f":"IF(A76=\"\",\"\",RTD(\"cqg.rtd\", ,\"ContractData\",C76, \"NetLastTradeToday\",, \"T\"))","v":""},{"$f":"IF(A76=\"\",\"\",IFERROR(RTD(\"cqg.rtd\", ,\"ContractData\",C76, \"PerCentNetLastTrade\",, \"T\")/100,\"\"))","v":""},{"$f":"IF(A76=\"\",\"\",RTD(\"cqg.rtd\", ,\"ContractData\", C76, \"T_CVol\",, \"T\"))","v":""},76,{"$f":"IFERROR(RANK($J76,INDIRECT((\"$J$\"&\"1\"&\":$J$\"&$A$351)))+COUNTIF($J$1:J76,J76)-1,\"\")","v":""},"",""]
[{"$f":"IF(Symbols!A77=\"\",\"\",Symbols!A77)","v":""},"","",{"$f":"IF(A77=\"\",\"\",RTD(\"cqg.rtd\", ,\"ContractData\",C77, \"LongDescription\",, \"T\"))","v":""},null,null,null,{"$f":"IF(A77=\"\",\"\",RTD(\"cqg.rtd\", ,\"ContractData\",C77, \"LastTradeToday\",, \"T\"))","v":""},{"$f":"IF(A77=\"\",\"\",RTD(\"cqg.rtd\", ,\"ContractData\",C77, \"NetLastTradeToday\",, \"T\"))","v":""},{"$f":"IF(A77=\"\",\"\",IFERROR(RTD(\"cqg.rtd\", ,\"ContractData\",C77, \"PerCentNetLastTrade\",, \"T\")/100,\"\"))","v":""},{"$f":"IF(A77=\"\",\"\",RTD(\"cqg.rtd\", ,\"ContractData\", C77, \"T_CVol\",, \"T\"))","v":""},77,{"$f":"IFERROR(RANK($J77,INDIRECT((\"$J$\"&\"1\"&\":$J$\"&$A$351)))+COUNTIF($J$1:J77,J77)-1,\"\")","v":""},"",""]
[{"$f":"IF(Symbols!A78=\"\",\"\",Symbols!A78)","v":""},"","",{"$f":"IF(A78=\"\",\"\",RTD(\"cqg.rtd\", ,\"ContractData\",C78, \"LongDescription\",, \"T\"))","v":""},null,null,null,{"$f":"IF(A78=\"\",\"\",RTD(\"cqg.rtd\", ,\"ContractData\",C78, \"LastTradeToday\",, \"T\"))","v":""},{"$f":"IF(A78=\"\",\"\",RTD(\"cqg.rtd\", ,\"ContractData\",C78, \"NetLastTradeToday\",, \"T\"))","v":""},{"$f":"IF(A78=\"\",\"\",IFERROR(RTD(\"cqg.rtd\", ,\"ContractData\",C78, \"PerCentNetLastTrade\",, \"T\")/100,\"\"))","v":""},{"$f":"IF(A78=\"\",\"\",RTD(\"cqg.rtd\", ,\"ContractData\", C78, \"T_CVol\",, \"T\"))","v":""},78,{"$f":"IFERROR(RANK($J78,INDIRECT((\"$J$\"&\"1\"&\":$J$\"&$A$351)))+COUNTIF($J$1:J78,J78)-1,\"\")","v":""},"",""]
[{"$f":"IF(Symbols!A79=\"\",\"\",Symbols!A79)","v":""},"","",{"$f":"IF(A79=\"\",\"\",RTD(\"cqg.rtd\", ,\"ContractData\",C79, \"LongDescription\",, \"T\"))","v":""},null,null,null,{"$f":"IF(A79=\"\",\"\",RTD(\"cqg.rtd\", ,\"ContractData\",C79, \"LastTradeToday\",, \"T\"))","v":""},{"$f":"IF(A79=\"\",\"\",RTD(\"cqg.rtd\", ,\"ContractData\",C79, \"NetLastTradeToday\",, \"T\"))","v":""},{"$f":"IF(A79=\"\",\"\",IFERROR(RTD(\"cqg.rtd\", ,\"ContractData\",C79, \"PerCentNetLastTrade\",, \"T\")/100,\"\"))","v":""},{"$f":"IF(A79=\"\",\"\",RTD(\"cqg.rtd\", ,\"ContractData\", C79, \"T_CVol\",, \"T\"))","v":""},79,{"$f":"IFERROR(RANK($J79,INDIRECT((\"$J$\"&\"1\"&\":$J$\"&$A$351)))+COUNTIF($J$1:J79,J79)-1,\"\")","v":""},"",""]
[{"$f":"IF(Symbols!A80=\"\",\"\",Symbols!A80)","v":""},"","",{"$f":"IF(A80=\"\",\"\",RTD(\"cqg.rtd\", ,\"ContractData\",C80, \"LongDescription\",, \"T\"))","v":""},null,null,null,{"$f":"IF(A80=\"\",\"\",RTD(\"cqg.rtd\", ,\"ContractData\",C80, \"LastTradeToday\",, \"T\"))","v":""},{"$f":"IF(A80=\"\",\"\",RTD(\"cqg.rtd\", ,\"ContractData\",C80, \"NetLastTradeToday\",, \"T\"))","v":""},{"$f":"IF(A80=\"\",\"\",IFERROR(RTD(\"cqg.rtd\", ,\"ContractData\",C80, \"PerCentNetLastTrade\",, \"T\")/100,\"\"))","v":""},{"$f":"IF(A80=\"\",\"\",RTD(\"cqg.rtd\", ,\"ContractData\", C80, \"T_CVol\",, \"T\"))","v":""},80,{"$f":"IFERROR(RANK($J80,INDIRECT((\"$J$\"&\"1\"&\":$J$\"&$A$351)))+COUNTIF($J$1:J80,J80)-1,\"\")","v":""},"",""]
[{"$f":"IF(Symbols!A81=\"\",\"\",Symbols!A81)","v":""},"","",{"$f":"IF(A81=\"\",\"\",RTD(\"cqg.rtd\", ,\"ContractData\",C81, \"LongDescription\",, \"T\"))","v":""},null,null,null,{"$f":"IF(A81=\"\",\"\",RTD(\"cqg.rtd\", ,\"ContractData\",C81, \"LastTradeToday\",, \"T\"))","v":""},{"$f":"IF(A81=\"\",\"\",RTD(\"cqg.rtd\", ,\"ContractData\",C81, \"NetLastTradeToday\",, \"T\"))","v":""},{"$f":"IF(A81=\"\",\"\",IFERROR(RTD(\"cqg.rtd\", ,\"ContractData\",C81, \"PerCentNetLastTrade\",, \"T\")/100,\"\"))","v":""},{"$f":"IF(A81=\"\",\"\",RTD(\"cqg.rtd\", ,\"ContractData\", C81, \"T_CVol\",, \"T\"))","v":""},81,{"$f":"IFERROR(RANK($J81,INDIRECT((\"$J$\"&\"1\"&\":$J$\"&$A$351)))+COUNTIF($J$1:J81,J81)-1,\"\")","v":""},"",""]
[{"$f":"IF(Symbols!A82=\"\",\"\",Symbols!A82)","v":""},"","",{"$f":"IF(A82=\"\",\"\",RTD(\"cqg.rtd\", ,\"ContractData\",C82, \"LongDescription\",, \"T\"))","v":""},null,null,null,{"$f":"IF(A82=\"\",\"\",RTD(\"cqg.rtd\", ,\"ContractData\",C82, \"LastTradeToday\",, \"T\"))","v":""},{"$f":"IF(A82=\"\",\"\",RTD(\"cqg.rtd\", ,\"ContractData\",C82, \"NetLastTradeToday\",, \"T\"))","v":""},{"$f":"IF(A82=\"\",\"\",IFERROR(RTD(\"cqg.rtd\", ,\"ContractData\",C82, \"PerCentNetLastTrade\",, \"T\")/100,\"\"))","v":""},{"$f":"IF(A82=\"\",\"\",RTD(\"cqg.rtd\", ,\"ContractData\", C82, \"T_CVol\",, \"T\"))","v":""},82,{"$f":"IFERROR(RANK($J82,INDIRECT((\"$J$\"&\"1\"&\":$J$\"&$A$351)))+COUNTIF($J$1:J82,J82)-1,\"\")","v":""},"",""]
[{"$f":"IF(Symbols!A83=\"\",\"\",Symbols!A83)","v":""},"","",{"$f":"IF(A83=\"\",\"\",RTD(\"cqg.rtd\", ,\"ContractData\",C83, \"LongDescription\",, \"T\"))","v":""},null,null,null,{"$f":"IF(A83=\"\",\"\",RTD(\"cqg.rtd\", ,\"ContractData\",C83, \"LastTradeToday\",, \"T\"))","v":""},{"$f":"IF(A83=\"\",\"\",RTD(\"cqg.rtd\", ,\"ContractData\",C83, \"NetLastTradeToday\",, \"T\"))","v":""},{"$f":"IF(A83=\"\",\"\",IFERROR(RTD(\"cqg.rtd\", ,\"ContractData\",C83, \"PerCentNetLastTrade\",, \"T\")/100,\"\"))","v":""},{"$f":"IF(A83=\"\",\"\",RTD(\"cqg.rtd\", ,\"ContractData\", C83, \"T_CVol\",, \"T\"))","v":""},83,{"$f":"IFERROR(RANK($J83,INDIRECT((\"$J$\"&\"1\"&\":$J$\"&$A$351)))+COUNTIF($J$1:J83,J83)-1,\"\")","v":""},"",""]
[{"$f":"IF(Symbols!A84=\"\",\"\",Symbols!A84)","v":""},"","",{"$f":"IF(A84=\"\",\"\",RTD(\"cqg.rtd\", ,\"ContractData\",C84, \"LongDescription\",, \"T\"))","v":""},null,null,null,{"$f":"IF(A84=\"\",\"\",RTD(\"cqg.rtd\", ,\"ContractData\",C84, \"LastTradeToday\",, \"T\"))","v":""},{"$f":"IF(A84=\"\",\"\",RTD(\"cqg.rtd\", ,\"ContractData\",C84, \"NetLastTradeToday\",, \"T\"))","v":""},{"$f":"IF(A84=\"\",\"\",IFERROR(RTD(\"cqg.rtd\", ,\"ContractData\",C84, \"PerCentNetLastTrade\",, \"T\")/100,\"\"))","v":""},{"$f":"IF(A84=\"\",\"\",RTD(\"cqg.rtd\", ,\"ContractData\", C84, \"T_CVol\",, \"T\"))","v":""},84,{"$f":"IFERROR(RANK($J84,INDIRECT((\"$J$\"&\"1\"&\":$J$\"&$A$351)))+COUNTIF($J$1:J84,J84)-1,\"\")","v":""},"",""]
[{"$f":"IF(Symbols!A85=\"\",\"\",Symbols!A85)","v":""},"","",{"$f":"IF(A85=\"\",\"\",RTD(\"cqg.rtd\", ,\"ContractData\",C85, \"LongDescription\",, \"T\"))","v":""},null,null,null,{"$f":"IF(A85=\"\",\"\",RTD(\"cqg.rtd\", ,\"ContractData\",C85, \"LastTradeToday\",, \"T\"))","v":""},{"$f":"IF(A85=\"\",\"\",RTD(\"cqg.rtd\", ,\"ContractData\",C85, \"NetLastTradeToday\",, \"T\"))","v":""},{"$f":"IF(A85=\"\",\"\",IFERROR(RTD(\"cqg.rtd\", ,\"ContractData\",C85, \"PerCentNetLastTrade\",, \"T\")/100,\"\"))","v":""},{"$f":"IF(A85=\"\",\"\",RTD(\"cqg.rtd\", ,\"ContractData\", C85, \"T_CVol\",, \"T\"))","v":""},85,{"$f":"IFERROR(RANK($J85,INDIRECT((\"$J$\"&\"1\"&\":$J$\"&$A$351)))+COUNTIF($J$1:J85,J85)-1,\"\")","v":""},"",""]
[{"$f":"IF(Symbols!A86=\"\",\"\",Symbols!A86)","v":""},"","",{"$f":"IF(A86=\"\",\"\",RTD(\"cqg.rtd\", ,\"ContractData\",C86, \"LongDescription\",, \"T\"))","v":""},null,null,null,{"$f":"IF(A86=\"\",\"\",RTD(\"cqg.rtd\", ,\"ContractData\",C86, \"LastTradeToday\",, \"T\"))","v":""},{"$f":"IF(A86=\"\",\"\",RTD(\"cqg.rtd\", ,\"ContractData\",C86, \"NetLastTradeToday\",, \"T\"))","v":""},{"$f":"IF(A86=\"\",\"\",IFERROR(RTD(\"cqg.rtd\", ,\"ContractData\",C86, \"PerCentNetLastTrade\",, \"T\")/100,\"\"))","v":""},{"$f":"IF(A86=\"\",\"\",RTD(\"cqg.rtd\", ,\"ContractData\", C86, \"T_CVol\",, \"T\"))","v":""},86,{"$f":"IFERROR(RANK($J86,INDIRECT((\"$J$\"&\"1\"&\":$J$\"&$A$351)))+COUNTIF($J$1:J86,J86)-1,\"\")","v":""},"",""]
[{"$f":"IF(Symbols!A87=\"\",\"\",Symbols!A87)","v":""},"","",{"$f":"IF(A87=\"\",\"\",RTD(\"cqg.rtd\", ,\"ContractData\",C87, \"LongDescription\",, \"T\"))","v":""},null,null,null,{"$f":"IF(A87=\"\",\"\",RTD(\"cqg.rtd\", ,\"ContractData\",C87, \"LastTradeToday\",, \"T\"))","v":""},{"$f":"IF(A87=\"\",\"\",RTD(\"cqg.rtd\", ,\"ContractData\",C87, \"NetLastTradeToday\",, \"T\"))","v":""},{"$f":"IF(A87=\"\",\"\",IFERROR(RTD(\"cqg.rtd\", ,\"ContractData\",C87, \"PerCentNetLastTrade\",, \"T\")/100,\"\"))","v":""},{"$f":"IF(A87=\"\",\"\",RTD(\"cqg.rtd\", ,\"ContractData\", C87, \"T_CVol\",, \"T\"))","v":""},87,{"$f":"IFERROR(RANK($J87,INDIRECT((\"$J$\"&\"1\"&\":$J$\"&$A$351)))+COUNTIF($J$1:J87,J87)-1,\"\")","v":""},"",""]
[{"$f":"IF(Symbols!A88=\"\",\"\",Symbols!A88)","v":""},"","",{"$f":"IF(A88=\"\",\"\",RTD(\"cqg.rtd\", ,\"ContractData\",C88, \"LongDescription\",, \"T\"))","v":""},null,null,null,{"$f":"IF(A88=\"\",\"\",RTD(\"cqg.rtd\", ,\"ContractData\",C88, \"LastTradeToday\",, \"T\"))","v":""},{"$f":"IF(A88=\"\",\"\",RTD(\"cqg.rtd\", ,\"ContractData\",C88, \"NetLastTradeToday\",, \"T\"))","v":""},{"$f":"IF(A88=\"\",\"\",IFERROR(RTD(\"cqg.rtd\", ,\"ContractData\",C88, \"PerCentNetLastTrade\",, \"T\")/100,\"\"))","v":""},{"$f":"IF(A88=\"\",\"\",RTD(\"cqg.rtd\", ,\"ContractData\", C88, \"T_CVol\",, \"T\"))","v":""},88,{"$f":"IFERROR(RANK($J88,INDIRECT((\"$J$\"&\"1\"&\":$J$\"&$A$351)))+COUNTIF($J$1:J88,J88)-1,\"\")","v":""},"",""]
[{"$f":"IF(Symbols!A89=\"\",\"\",Symbols!A89)","v":""},"","",{"$f":"IF(A89=\"\",\"\",RTD(\"cqg.rtd\", ,\"ContractData\",C89, \"LongDescription\",, \"T\"))","v":""},null,null,null,{"$f":"IF(A89=\"\",\"\",RTD(\"cqg.rtd\", ,\"ContractData\",C89, \"LastTradeToday\",, \"T\"))","v":""},{"$f":"IF(A89=\"\",\"\",RTD(\"cqg.rtd\", ,\"ContractData\",C89, \"NetLastTradeToday\",, \"T\"))","v":""},{"$f":"IF(A89=\"\",\"\",IFERROR(RTD(\"cqg.rtd\", ,\"ContractData\",C89, \"PerCentNetLastTrade\",, \"T\")/100,\"\"))","v":""},{"$f":"IF(A89=\"\",\"\",RTD(\"cqg.rtd\", ,\"ContractData\", C89, \"T_CVol\",, \"T\"))","v":""},89,{"$f":"IFERROR(RANK($J89,INDIRECT((\"$J$\"&\"1\"&\":$J$\"&$A$351)))+COUNTIF($J$1:J89,J89)-1,\"\")","v":""},"",""]
[{"$f":"IF(Symbols!A90=\"\",\"\",Symbols!A90)","v":""},"","",{"$f":"IF(A90=\"\",\"\",RTD(\"cqg.rtd\", ,\"ContractData\",C90, \"LongDescription\",, \"T\"))","v":""},null,null,null,{"$f":"IF(A90=\"\",\"\",RTD(\"cqg.rtd\", ,\"ContractData\",C90, \"LastTradeToday\",, \"T\"))","v":""},{"$f":"IF(A90=\"\",\"\",RTD(\"cqg.rtd\", ,\"ContractData\",C90, \"NetLastTradeToday\",, \"T\"))","v":""},{"$f":"IF(A90=\"\",\"\",IFERROR(RTD(\"cqg.rtd\", ,\"ContractData\",C90, \"PerCentNetLastTrade\",, \"T\")/100,\"\"))","v":""},{"$f":"IF(A90=\"\",\"\",RTD(\"cqg.rtd\", ,\"ContractData\", C90, \"T_CVol\",, \"T\"))","v":""},90,{"$f":"IFERROR(RANK($J90,INDIRECT((\"$J$\"&\"1\"&\":$J$\"&$A$351)))+COUNTIF($J$1:J90,J90)-1,\"\")","v":""},"",""]
[{"$f":"IF(Symbols!A91=\"\",\"\",Symbols!A91)","v":""},"","",{"$f":"IF(A91=\"\",\"\",RTD(\"cqg.rtd\", ,\"ContractData\",C91, \"LongDescription\",, \"T\"))","v":""},null,null,null,{"$f":"IF(A91=\"\",\"\",RTD(\"cqg.rtd\", ,\"ContractData\",C91, \"LastTradeToday\",, \"T\"))","v":""},{"$f":"IF(A91=\"\",\"\",RTD(\"cqg.rtd\", ,\"ContractData\",C91, \"NetLastTradeToday\",, \"T\"))","v":""},{"$f":"IF(A91=\"\",\"\",IFERROR(RTD(\"cqg.rtd\", ,\"ContractData\",C91, \"PerCentNetLastTrade\",, \"T\")/100,\"\"))","v":""},{"$f":"IF(A91=\"\",\"\",RTD(\"cqg.rtd\", ,\"ContractData\", C91, \"T_CVol\",, \"T\"))","v":""},91,{"$f":"IFERROR(RANK($J91,INDIRECT((\"$J$\"&\"1\"&\":$J$\"&$A$351)))+COUNTIF($J$1:J91,J91)-1,\"\")","v":""},"",""]
[{"$f":"IF(Symbols!A92=\"\",\"\",Symbols!A92)","v":""},"","",{"$f":"IF(A92=\"\",\"\",RTD(\"cqg.rtd\", ,\"ContractData\",C92, \"LongDescription\",, \"T\"))","v":""},null,null,null,{"$f":"IF(A92=\"\",\"\",RTD(\"cqg.rtd\", ,\"ContractData\",C92, \"LastTradeToday\",, \"T\"))","v":""},{"$f":"IF(A92=\"\",\"\",RTD(\"cqg.rtd\", ,\"ContractData\",C92, \"NetLastTradeToday\",, \"T\"))","v":""},{"$f":"IF(A92=\"\",\"\",IFERROR(RTD(\"cqg.rtd\", ,\"ContractData\",C92, \"PerCentNetLastTrade\",, \"T\")/100,\"\"))","v":""},{"$f":"IF(A92=\"\",\"\",RTD(\"cqg.rtd\", ,\"ContractData\", C92, \"T_CVol\",, \"T\"))","v":""},92,{"$f":"IFERROR(RANK($J92,INDIRECT((\"$J$\"&\"1\"&\":$J$\"&$A$351)))+COUNTIF($J$1:J92,J92)-1,\"\")","v":""},"",""]
[{"$f":"IF(Symbols!A93=\"\",\"\",Symbols!A93)","v":""},"","",{"$f":"IF(A93=\"\",\"\",RTD(\"cqg.rtd\", ,\"ContractData\",C93, \"LongDescription\",, \"T\"))","v":""},null,null,null,{"$f":"IF(A93=\"\",\"\",RTD(\"cqg.rtd\", ,\"ContractData\",C93, \"LastTradeToday\",, \"T\"))","v":""},{"$f":"IF(A93=\"\",\"\",RTD(\"cqg.rtd\", ,\"ContractData\",C93, \"NetLastTradeToday\",, \"T\"))","v":""},{"$f":"IF(A93=\"\",\"\",IFERROR(RTD(\"cqg.rtd\", ,\"ContractData\",C93, \"PerCentNetLastTrade\",, \"T\")/100,\"\"))","v":""},{"$f":"IF(A93=\"\",\"\",RTD(\"cqg.rtd\", ,\"ContractData\", C93, \"T_CVol\",, \"T\"))","v":""},93,{"$f":"IFERROR(RANK($J93,INDIRECT((\"$J$\"&\"1\"&\":$J$\"&$A$351)))+COUNTIF($J$1:J93,J93)-1,\"\")","v":""},"",""]
[{"$f":"IF(Symbols!A94=\"\",\"\",Symbols!A94)","v":""},"","",{"$f":"IF(A94=\"\",\"\",RTD(\"cqg.rtd\", ,\"ContractData\",C94, \"LongDescription\",, \"T\"))","v":""},null,null,null,{"$f":"IF(A94=\"\",\"\",RTD(\"cqg.rtd\", ,\"ContractData\",C94, \"LastTradeToday\",, \"T\"))","v":""},{"$f":"IF(A94=\"\",\"\",RTD(\"cqg.rtd\", ,\"ContractData\",C94, \"NetLastTradeToday\",, \"T\"))","v":""},{"$f":"IF(A94=\"\",\"\",IFERROR(RTD(\"cqg.rtd\", ,\"ContractData\",C94, \"PerCentNetLastTrade\",, \"T\")/100,\"\"))","v":""},{"$f":"IF(A94=\"\",\"\",RTD(\"cqg.rtd\", ,\"ContractData\", C94, \"T_CVol\",, \"T\"))","v":""},94,{"$f":"IFERROR(RANK($J94,INDIRECT((\"$J$\"&\"1\"&\":$J$\"&$A$351)))+COUNTIF($J$1:J94,J94)-1,\"\")","v":""},"",""]
[{"$f":"IF(Symbols!A95=\"\",\"\",Symbols!A95)","v":""},"","",{"$f":"IF(A95=\"\",\"\",RTD(\"cqg.rtd\", ,\"ContractData\",C95, \"LongDescription\",, \"T\"))","v":""},null,null,null,{"$f":"IF(A95=\"\",\"\",RTD(\"cqg.rtd\", ,\"ContractData\",C95, \"LastTradeToday\",, \"T\"))","v":""},{"$f":"IF(A95=\"\",\"\",RTD(\"cqg.rtd\", ,\"ContractData\",C95, \"NetLastTradeToday\",, \"T\"))","v":""},{"$f":"IF(A95=\"\",\"\",IFERROR(RTD(\"cqg.rtd\", ,\"ContractData\",C95, \"PerCentNetLastTrade\",, \"T\")/100,\"\"))","v":""},{"$f":"IF(A95=\"\",\"\",RTD(\"cqg.rtd\", ,\"ContractData\", C95, \"T_CVol\",, \"T\"))","v":""},95,{"$f":"IFERROR(RANK($J95,INDIRECT((\"$J$\"&\"1\"&\":$J$\"&$A$351)))+COUNTIF($J$1:J95,J95)-1,\"\")","v":""},"",""]
[{"$f":"IF(Symbols!A96=\"\",\"\",Symbols!A96)","v":""},"","",{"$f":"IF(A96=\"\",\"\",RTD(\"cqg.rtd\", ,\"ContractData\",C96, \"LongDescription\",, \"T\"))","v":""},null,null,null,{"$f":"IF(A96=\"\",\"\",RTD(\"cqg.rtd\", ,\"ContractData\",C96, \"LastTradeToday\",, \"T\"))","v":""},{"$f":"IF(A96=\"\",\"\",RTD(\"cqg.rtd\", ,\"ContractData\",C96, \"NetLastTradeToday\",, \"T\"))","v":""},{"$f":"IF(A96=\"\",\"\",IFERROR(RTD(\"cqg.rtd\", ,\"ContractData\",C96, \"PerCentNetLastTrade\",, \"T\")/100,\"\"))","v":""},{"$f":"IF(A96=\"\",\"\",RTD(\"cqg.rtd\", ,\"ContractData\", C96, \"T_CVol\",, \"T\"))","v":""},96,{"$f":"IFERROR(RANK($J96,INDIRECT((\"$J$\"&\"1\"&\":$J$\"&$A$351)))+COUNTIF($J$1:J96,J96)-1,\"\")","v":""},"",""]
[{"$f":"IF(Symbols!A97=\"\",\"\",Symbols!A97)","v":""},"","",{"$f":"IF(A97=\"\",\"\",RTD(\"cqg.rtd\", ,\"ContractData\",C97, \"LongDescription\",, \"T\"))","v":""},null,null,null,{"$f":"IF(A97=\"\",\"\",RTD(\"cqg.rtd\", ,\"ContractData\",C97, \"LastTradeToday\",, \"T\"))","v":""},{"$f":"IF(A97=\"\",\"\",RTD(\"cqg.rtd\", ,\"ContractData\",C97, \"NetLastTradeToday\",, \"T\"))","v":""},{"$f":"IF(A97=\"\",\"\",IFERROR(RTD(\"cqg.rtd\", ,\"ContractData\",C97, \"PerCentNetLastTrade\",, \"T\")/100,\"\"))","v":""},{"$f":"IF(A97=\"\",\"\",RTD(\"cqg.rtd\", ,\"ContractData\", C97, \"T_CVol\",, \"T\"))","v":""},97,{"$f":"IFERROR(RANK($J97,INDIRECT((\"$J$\"&\"1\"&\":$J$\"&$A$351)))+COUNTIF($J$1:J97,J97)-1,\"\")","v":""},"",""]
[{"$f":"IF(Symbols!A98=\"\",\"\",Symbols!A98)","v":""},"","",{"$f":"IF(A98=\"\",\"\",RTD(\"cqg.rtd\", ,\"ContractData\",C98, \"LongDescription\",, \"T\"))","v":""},null,null,null,{"$f":"IF(A98=\"\",\"\",RTD(\"cqg.rtd\", ,\"ContractData\",C98, \"LastTradeToday\",, \"T\"))","v":""},{"$f":"IF(A98=\"\",\"\",RTD(\"cqg.rtd\", ,\"ContractData\",C98, \"NetLastTradeToday\",, \"T\"))","v":""},{"$f":"IF(A98=\"\",\"\",IFERROR(RTD(\"cqg.rtd\", ,\"ContractData\",C98, \"PerCentNetLastTrade\",, \"T\")/100,\"\"))","v":""},{"$f":"IF(A98=\"\",\"\",RTD(\"cqg.rtd\", ,\"ContractData\", C98, \"T_CVol\",, \"T\"))","v":""},98,{"$f":"IFERROR(RANK($J98,INDIRECT((\"$J$\"&\"1\"&\":$J$\"&$A$351)))+COUNTIF($J$1:J98,J98)-1,\"\")","v":""},"",""]
[{"$f":"IF(Symbols!A99=\"\",\"\",Symbols!A99)","v":""},"","",{"$f":"IF(A99=\"\",\"\",RTD(\"cqg.rtd\", ,\"ContractData\",C99, \"LongDescription\",, \"T\"))","v":""},null,null,null,{"$f":"IF(A99=\"\",\"\",RTD(\"cqg.rtd\", ,\"ContractData\",C99, \"LastTradeToday\",, \"T\"))","v":""},{"$f":"IF(A99=\"\",\"\",RTD(\"cqg.rtd\", ,\"ContractData\",C99, \"NetLastTradeToday\",, \"T\"))","v":""},{"$f":"IF(A99=\"\",\"\",IFERROR(RTD(\"cqg.rtd\", ,\"ContractData\",C99, \"PerCentNetLastTrade\",, \"T\")/100,\"\"))","v":""},{"$f":"IF(A99=\"\",\"\",RTD(\"cqg.rtd\", ,\"ContractData\", C99, \"T_CVol\",, \"T\"))","v":""},99,{"$f":"IFERROR(RANK($J99,INDIRECT((\"$J$\"&\"1\"&\":$J$\"&$A$351)))+COUNTIF($J$1:J99,J99)-1,\"\")","v":""},"",""]
[{"$f":"IF(Symbols!A100=\"\",\"\",Symbols!A100)","v":""},"","",{"$f":"IF(A100=\"\",\"\",RTD(\"cqg.rtd\", ,\"ContractData\",C100, \"LongDescription\",, \"T\"))","v":""},null,null,null,{"$f":"IF(A100=\"\",\"\",RTD(\"cqg.rtd\", ,\"ContractData\",C100, \"LastTradeToday\",, \"T\"))","v":""},{"$f":"IF(A100=\"\",\"\",RTD(\"cqg.rtd\", ,\"ContractData\",C100, \"NetLastTradeToday\",, \"T\"))","v":""},{"$f":"IF(A100=\"\",\"\",IFERROR(RTD(\"cqg.rtd\", ,\"ContractData\",C100, \"PerCentNetLastTrade\",, \"T\")/100,\"\"))","v":""},{"$f":"IF(A100=\"\",\"\",RTD(\"cqg.rtd\", ,\"ContractData\", C100, \"T_CVol\",, \"T\"))","v":""},100,{"$f":"IFERROR(RANK($J100,INDIRECT((\"$J$\"&\"1\"&\":$J$\"&$A$351)))+COUNTIF($J$1:J100,J100)-1,\"\")","v":""},"",""]
[{"$f":"IF(Symbols!A101=\"\",\"\",Symbols!A101)","v":""},"","",{"$f":"IF(A101=\"\",\"\",RTD(\"cqg.rtd\", ,\"ContractData\",C101, \"LongDescription\",, \"T\"))","v":""},null,null,null,{"$f":"IF(A101=\"\",\"\",RTD(\"cqg.rtd\", ,\"ContractData\",C101, \"LastTradeToday\",, \"T\"))","v":""},{"$f":"IF(A101=\"\",\"\",RTD(\"cqg.rtd\", ,\"ContractData\",C101, \"NetLastTradeToday\",, \"T\"))","v":""},{"$f":"IF(A101=\"\",\"\",IFERROR(RTD(\"cqg.rtd\", ,\"ContractData\",C101, \"PerCentNetLastTrade\",, \"T\")/100,\"\"))","v":""},{"$f":"IF(A101=\"\",\"\",RTD(\"cqg.rtd\", ,\"ContractData\", C101, \"T_CVol\",, \"T\"))","v":""},101,{"$f":"IFERROR(RANK($J101,INDIRECT((\"$J$\"&\"1\"&\":$J$\"&$A$351)))+COUNTIF($J$1:J101,J101)-1,\"\")","v":""},"",""]
[{"$f":"IF(Symbols!A102=\"\",\"\",Symbols!A102)","v":""},"","",{"$f":"IF(A102=\"\",\"\",RTD(\"cqg.rtd\", ,\"ContractData\",C102, \"LongDescription\",, \"T\"))","v":""},null,null,null,{"$f":"IF(A102=\"\",\"\",RTD(\"cqg.rtd\", ,\"ContractData\",C102, \"LastTradeToday\",, \"T\"))","v":""},{"$f":"IF(A102=\"\",\"\",RTD(\"cqg.rtd\", ,\"ContractData\",C102, \"NetLastTradeToday\",, \"T\"))","v":""},{"$f":"IF(A102=\"\",\"\",IFERROR(RTD(\"cqg.rtd\", ,\"ContractData\",C102, \"PerCentNetLastTrade\",, \"T\")/100,\"\"))","v":""},{"$f":"IF(A102=\"\",\"\",RTD(\"cqg.rtd\", ,\"ContractData\", C102, \"T_CVol\",, \"T\"))","v":""},102,{"$f":"IFERROR(RANK($J102,INDIRECT((\"$J$\"&\"1\"&\":$J$\"&$A$351)))+COUNTIF($J$1:J102,J102)-1,\"\")","v":""},"",""]
[{"$f":"IF(Symbols!A103=\"\",\"\",Symbols!A103)","v":""},"","",{"$f":"IF(A103=\"\",\"\",RTD(\"cqg.rtd\", ,\"ContractData\",C103, \"LongDescription\",, \"T\"))","v":""},null,null,null,{"$f":"IF(A103=\"\",\"\",RTD(\"cqg.rtd\", ,\"ContractData\",C103, \"LastTradeToday\",, \"T\"))","v":""},{"$f":"IF(A103=\"\",\"\",RTD(\"cqg.rtd\", ,\"ContractData\",C103, \"NetLastTradeToday\",, \"T\"))","v":""},{"$f":"IF(A103=\"\",\"\",IFERROR(RTD(\"cqg.rtd\", ,\"ContractData\",C103, \"PerCentNetLastTrade\",, \"T\")/100,\"\"))","v":""},{"$f":"IF(A103=\"\",\"\",RTD(\"cqg.rtd\", ,\"ContractData\", C103, \"T_CVol\",, \"T\"))","v":""},103,{"$f":"IFERROR(RANK($J103,INDIRECT((\"$J$\"&\"1\"&\":$J$\"&$A$351)))+COUNTIF($J$1:J103,J103)-1,\"\")","v":""},"",""]
[{"$f":"IF(Symbols!A104=\"\",\"\",Symbols!A104)","v":""},"","",{"$f":"IF(A104=\"\",\"\",RTD(\"cqg.rtd\", ,\"ContractData\",C104, \"LongDescription\",, \"T\"))","v":""},null,null,null,{"$f":"IF(A104=\"\",\"\",RTD(\"cqg.rtd\", ,\"ContractData\",C104, \"LastTradeToday\",, \"T\"))","v":""},{"$f":"IF(A104=\"\",\"\",RTD(\"cqg.rtd\", ,\"ContractData\",C104, \"NetLastTradeToday\",, \"T\"))","v":""},{"$f":"IF(A104=\"\",\"\",IFERROR(RTD(\"cqg.rtd\", ,\"ContractData\",C104, \"PerCentNetLastTrade\",, \"T\")/100,\"\"))","v":""},{"$f":"IF(A104=\"\",\"\",RTD(\"cqg.rtd\", ,\"ContractData\", C104, \"T_CVol\",, \"T\"))","v":""},104,{"$f":"IFERROR(RANK($J104,INDIRECT((\"$J$\"&\"1\"&\":$J$\"&$A$351)))+COUNTIF($J$1:J104,J104)-1,\"\")","v":""},"",""]
[{"$f":"IF(Symbols!A105=\"\",\"\",Symbols!A105)","v":""},"","",{"$f":"IF(A105=\"\",\"\",RTD(\"cqg.rtd\", ,\"ContractData\",C105, \"LongDescription\",, \"T\"))","v":""},null,null,null,{"$f":"IF(A105=\"\",\"\",RTD(\"cqg.rtd\", ,\"ContractData\",C105, \"LastTradeToday\",, \"T\"))","v":""},{"$f":"IF(A105=\"\",\"\",RTD(\"cqg.rtd\", ,\"ContractData\",C105, \"NetLastTradeToday\",, \"T\"))","v":""},{"$f":"IF(A105=\"\",\"\",IFERROR(RTD(\"cqg.rtd\", ,\"ContractData\",C105, \"PerCentNetLastTrade\",, \"T\")/100,\"\"))","v":""},{"$f":"IF(A105=\"\",\"\",RTD(\"cqg.rtd\", ,\"ContractData\", C105, \"T_CVol\",, \"T\"))","v":""},105,{"$f":"IFERROR(RANK($J105,INDIRECT((\"$J$\"&\"1\"&\":$J$\"&$A$351)))+COUNTIF($J$1:J105,J105)-1,\"\")","v":""},"",""]
[{"$f":"IF(Symbols!A106=\"\",\"\",Symbols!A106)","v":""},"","",{"$f":"IF(A106=\"\",\"\",RTD(\"cqg.rtd\", ,\"ContractData\",C106, \"LongDescription\",, \"T\"))","v":""},null,null,null,{"$f":"IF(A106=\"\",\"\",RTD(\"cqg.rtd\", ,\"ContractData\",C106, \"LastTradeToday\",, \"T\"))","v":""},{"$f":"IF(A106=\"\",\"\",RTD(\"cqg.rtd\", ,\"ContractData\",C106, \"NetLastTradeToday\",, \"T\"))","v":""},{"$f":"IF(A106=\"\",\"\",IFERROR(RTD(\"cqg.rtd\", ,\"ContractData\",C106, \"PerCentNetLastTrade\",, \"T\")/100,\"\"))","v":""},{"$f":"IF(A106=\"\",\"\",RTD(\"cqg.rtd\", ,\"ContractData\", C106, \"T_CVol\",, \"T\"))","v":""},106,{"$f":"IFERROR(RANK($J106,INDIRECT((\"$J$\"&\"1\"&\":$J$\"&$A$351)))+COUNTIF($J$1:J106,J106)-1,\"\")","v":""},"",""]
[{"$f":"IF(Symbols!A107=\"\",\"\",Symbols!A107)","v":""},"","",{"$f":"IF(A107=\"\",\"\",RTD(\"cqg.rtd\", ,\"ContractData\",C107, \"LongDescription\",, \"T\"))","v":""},null,null,null,{"$f":"IF(A107=\"\",\"\",RTD(\"cqg.rtd\", ,\"ContractData\",C107, \"LastTradeToday\",, \"T\"))","v":""},{"$f":"IF(A107=\"\",\"\",RTD(\"cqg.rtd\", ,\"ContractData\",C107, \"NetLastTradeToday\",, \"T\"))","v":""},{"$f":"IF(A107=\"\",\"\",IFERROR(RTD(\"cqg.rtd\", ,\"ContractData\",C107, \"PerCentNetLastTrade\",, \"T\")/100,\"\"))","v":""},{"$f":"IF(A107=\"\",\"\",RTD(\"cqg.rtd\", ,\"ContractData\", C107, \"T_CVol\",, \"T\"))","v":""},107,{"$f":"IFERROR(RANK($J107,INDIRECT((\"$J$\"&\"1\"&\":$J$\"&$A$351)))+COUNTIF($J$1:J107,J107)-1,\"\")","v":""},"",""]
[{"$f":"IF(Symbols!A108=\"\",\"\",Symbols!A108)","v":""},"","",{"$f":"IF(A108=\"\",\"\",RTD(\"cqg.rtd\", ,\"ContractData\",C108, \"LongDescription\",, \"T\"))","v":""},null,null,null,{"$f":"IF(A108=\"\",\"\",RTD(\"cqg.rtd\", ,\"ContractData\",C108, \"LastTradeToday\",, \"T\"))","v":""},{"$f":"IF(A108=\"\",\"\",RTD(\"cqg.rtd\", ,\"ContractData\",C108, \"NetLastTradeToday\",, \"T\"))","v":""},{"$f":"IF(A108=\"\",\"\",IFERROR(RTD(\"cqg.rtd\", ,\"ContractData\",C108, \"PerCentNetLastTrade\",, \"T\")/100,\"\"))","v":""},{"$f":"IF(A108=\"\",\"\",RTD(\"cqg.rtd\", ,\"ContractData\", C108, \"T_CVol\",, \"T\"))","v":""},108,{"$f":"IFERROR(RANK($J108,INDIRECT((\"$J$\"&\"1\"&\":$J$\"&$A$351)))+COUNTIF($J$1:J108,J108)-1,\"\")","v":""},"",""]
[{"$f":"IF(Symbols!A109=\"\",\"\",Symbols!A109)","v":""},"","",{"$f":"IF(A109=\"\",\"\",RTD(\"cqg.rtd\", ,\"ContractData\",C109, \"LongDescription\",, \"T\"))","v":""},null,null,null,{"$f":"IF(A109=\"\",\"\",RTD(\"cqg.rtd\", ,\"ContractData\",C109, \"LastTradeToday\",, \"T\"))","v":""},{"$f":"IF(A109=\"\",\"\",RTD(\"cqg.rtd\", ,\"ContractData\",C109, \"NetLastTradeToday\",, \"T\"))","v":""},{"$f":"IF(A109=\"\",\"\",IFERROR(RTD(\"cqg.rtd\", ,\"ContractData\",C109, \"PerCentNetLastTrade\",, \"T\")/100,\"\"))","v":""},{"$f":"IF(A109=\"\",\"\",RTD(\"cqg.rtd\", ,\"ContractData\", C109, \"T_CVol\",, \"T\"))","v":""},109,{"$f":"IFERROR(RANK($J109,INDIRECT((\"$J$\"&\"1\"&\":$J$\"&$A$351)))+COUNTIF($J$1:J109,J109)-1,\"\")","v":""},"",""]
[{"$f":"IF(Symbols!A110=\"\",\"\",Symbols!A110)","v":""},"","",{"$f":"IF(A110=\"\",\"\",RTD(\"cqg.rtd\", ,\"ContractData\",C110, \"LongDescription\",, \"T\"))","v":""},null,null,null,{"$f":"IF(A110=\"\",\"\",RTD(\"cqg.rtd\", ,\"ContractData\",C110, \"LastTradeToday\",, \"T\"))","v":""},{"$f":"IF(A110=\"\",\"\",RTD(\"cqg.rtd\", ,\"ContractData\",C110, \"NetLastTradeToday\",, \"T\"))","v":""},{"$f":"IF(A110=\"\",\"\",IFERROR(RTD(\"cqg.rtd\", ,\"ContractData\",C110, \"PerCentNetLastTrade\",, \"T\")/100,\"\"))","v":""},{"$f":"IF(A110=\"\",\"\",RTD(\"cqg.rtd\", ,\"ContractData\", C110, \"T_CVol\",, \"T\"))","v":""},110,{"$f":"IFERROR(RANK($J110,INDIRECT((\"$J$\"&\"1\"&\":$J$\"&$A$351)))+COUNTIF($J$1:J110,J110)-1,\"\")","v":""},"",""]
[{"$f":"IF(Symbols!A111=\"\",\"\",Symbols!A111)","v":""},"","",{"$f":"IF(A111=\"\",\"\",RTD(\"cqg.rtd\", ,\"ContractData\",C111, \"LongDescription\",, \"T\"))","v":""},null,null,null,{"$f":"IF(A111=\"\",\"\",RTD(\"cqg.rtd\", ,\"ContractData\",C111, \"LastTradeToday\",, \"T\"))","v":""},{"$f":"IF(A111=\"\",\"\",RTD(\"cqg.rtd\", ,\"ContractData\",C111, \"NetLastTradeToday\",, \"T\"))","v":""},{"$f":"IF(A111=\"\",\"\",IFERROR(RTD(\"cqg.rtd\", ,\"ContractData\",C111, \"PerCentNetLastTrade\",, \"T\")/100,\"\"))","v":""},{"$f":"IF(A111=\"\",\"\",RTD(\"cqg.rtd\", ,\"ContractData\", C111, \"T_CVol\",, \"T\"))","v":""},111,{"$f":"IFERROR(RANK($J111,INDIRECT((\"$J$\"&\"1\"&\":$J$\"&$A$351)))+COUNTIF($J$1:J111,J111)-1,\"\")","v":""},"",""]
[{"$f":"IF(Symbols!A112=\"\",\"\",Symbols!A112)","v":""},"","",{"$f":"IF(A112=\"\",\"\",RTD(\"cqg.rtd\", ,\"ContractData\",C112, \"LongDescription\",, \"T\"))","v":""},null,null,null,{"$f":"IF(A112=\"\",\"\",RTD(\"cqg.rtd\", ,\"ContractData\",C112, \"LastTradeToday\",, \"T\"))","v":""},{"$f":"IF(A112=\"\",\"\",RTD(\"cqg.rtd\", ,\"ContractData\",C112, \"NetLastTradeToday\",, \"T\"))","v":""},{"$f":"IF(A112=\"\",\"\",IFERROR(RTD(\"cqg.rtd\", ,\"ContractData\",C112, \"PerCentNetLastTrade\",, \"T\")/100,\"\"))","v":""},{"$f":"IF(A112=\"\",\"\",RTD(\"cqg.rtd\", ,\"ContractData\", C112, \"T_CVol\",, \"T\"))","v":""},112,{"$f":"IFERROR(RANK($J112,INDIRECT((\"$J$\"&\"1\"&\":$J$\"&$A$351)))+COUNTIF($J$1:J112,J112)-1,\"\")","v":""},"",""]
[{"$f":"IF(Symbols!A113=\"\",\"\",Symbols!A113)","v":""},"","",{"$f":"IF(A113=\"\",\"\",RTD(\"cqg.rtd\", ,\"ContractData\",C113, \"LongDescription\",, \"T\"))","v":""},null,null,null,{"$f":"IF(A113=\"\",\"\",RTD(\"cqg.rtd\", ,\"ContractData\",C113, \"LastTradeToday\",, \"T\"))","v":""},{"$f":"IF(A113=\"\",\"\",RTD(\"cqg.rtd\", ,\"ContractData\",C113, \"NetLastTradeToday\",, \"T\"))","v":""},{"$f":"IF(A113=\"\",\"\",IFERROR(RTD(\"cqg.rtd\", ,\"ContractData\",C113, \"PerCentNetLastTrade\",, \"T\")/100,\"\"))","v":""},{"$f":"IF(A113=\"\",\"\",RTD(\"cqg.rtd\", ,\"ContractData\", C113, \"T_CVol\",, \"T\"))","v":""},113,{"$f":"IFERROR(RANK($J113,INDIRECT((\"$J$\"&\"1\"&\":$J$\"&$A$351)))+COUNTIF($J$1:J113,J113)-1,\"\")","v":""},"",""]
[{"$f":"IF(Symbols!A114=\"\",\"\",Symbols!A114)","v":""},"","",{"$f":"IF(A114=\"\",\"\",RTD(\"cqg.rtd\", ,\"ContractData\",C114, \"LongDescription\",, \"T\"))","v":""},null,null,null,{"$f":"IF(A114=\"\",\"\",RTD(\"cqg.rtd\", ,\"ContractData\",C114, \"LastTradeToday\",, \"T\"))","v":""},{"$f":"IF(A114=\"\",\"\",RTD(\"cqg.rtd\", ,\"ContractData\",C114, \"NetLastTradeToday\",, \"T\"))","v":""},{"$f":"IF(A114=\"\",\"\",IFERROR(RTD(\"cqg.rtd\", ,\"ContractData\",C114, \"PerCentNetLastTrade\",, \"T\")/100,\"\"))","v":""},{"$f":"IF(A114=\"\",\"\",RTD(\"cqg.rtd\", ,\"ContractData\", C114, \"T_CVol\",, \"T\"))","v":""},114,{"$f":"IFERROR(RANK($J114,INDIRECT((\"$J$\"&\"1\"&\":$J$\"&$A$351)))+COUNTIF($J$1:J114,J114)-1,\"\")","v":""},"",""]
[{"$f":"IF(Symbols!A115=\"\",\"\",Symbols!A115)","v":""},"","",{"$f":"IF(A115=\"\",\"\",RTD(\"cqg.rtd\", ,\"ContractData\",C115, \"LongDescription\",, \"T\"))","v":""},null,null,null,{"$f":"IF(A115=\"\",\"\",RTD(\"cqg.rtd\", ,\"ContractData\",C115, \"LastTradeToday\",, \"T\"))","v":""},{"$f":"IF(A115=\"\",\"\",RTD(\"cqg.rtd\", ,\"ContractData\",C115, \"NetLastTradeToday\",, \"T\"))","v":""},{"$f":"IF(A115=\"\",\"\",IFERROR(RTD(\"cqg.rtd\", ,\"ContractData\",C115, \"PerCentNetLastTrade\",, \"T\")/100,\"\"))","v":""},{"$f":"IF(A115=\"\",\"\",RTD(\"cqg.rtd\", ,\"ContractData\", C115, \"T_CVol\",, \"T\"))","v":""},115,{"$f":"IFERROR(RANK($J115,INDIRECT((\"$J$\"&\"1\"&\":$J$\"&$A$351)))+COUNTIF($J$1:J115,J115)-1,\"\")","v":""},"",""]
[{"$f":"IF(Symbols!A116=\"\",\"\",Symbols!A116)","v":""},"","",{"$f":"IF(A116=\"\",\"\",RTD(\"cqg.rtd\", ,\"ContractData\",C116, \"LongDescription\",, \"T\"))","v":""},null,null,null,{"$f":"IF(A116=\"\",\"\",RTD(\"cqg.rtd\", ,\"ContractData\",C116, \"LastTradeToday\",, \"T\"))","v":""},{"$f":"IF(A116=\"\",\"\",RTD(\"cqg.rtd\", ,\"ContractData\",C116, \"NetLastTradeToday\",, \"T\"))","v":""},{"$f":"IF(A116=\"\",\"\",IFERROR(RTD(\"cqg.rtd\", ,\"ContractData\",C116, \"PerCentNetLastTrade\",, \"T\")/100,\"\"))","v":""},{"$f":"IF(A116=\"\",\"\",RTD(\"cqg.rtd\", ,\"ContractData\", C116, \"T_CVol\",, \"T\"))","v":""},116,{"$f":"IFERROR(RANK($J116,INDIRECT((\"$J$\"&\"1\"&\":$J$\"&$A$351)))+COUNTIF($J$1:J116,J116)-1,\"\")","v":""},"",""]
[{"$f":"IF(Symbols!A117=\"\",\"\",Symbols!A117)","v":""},"","",{"$f":"IF(A117=\"\",\"\",RTD(\"cqg.rtd\", ,\"ContractData\",C117, \"LongDescription\",, \"T\"))","v":""},null,null,null,{"$f":"IF(A117=\"\",\"\",RTD(\"cqg.rtd\", ,\"ContractData\",C117, \"LastTradeToday\",, \"T\"))","v":""},{"$f":"IF(A117=\"\",\"\",RTD(\"cqg.rtd\", ,\"ContractData\",C117, \"NetLastTradeToday\",, \"T\"))","v":""},{"$f":"IF(A117=\"\",\"\",IFERROR(RTD(\"cqg.rtd\", ,\"ContractData\",C117, \"PerCentNetLastTrade\",, \"T\")/100,\"\"))","v":""},{"$f":"IF(A117=\"\",\"\",RTD(\"cqg.rtd\", ,\"ContractData\", C117, \"T_CVol\",, \"T\"))","v":""},117,{"$f":"IFERROR(RANK($J117,INDIRECT((\"$J$\"&\"1\"&\":$J$\"&$A$351)))+COUNTIF($J$1:J117,J117)-1,\"\")","v":""},"",""]
[{"$f":"IF(Symbols!A118=\"\",\"\",Symbols!A118)","v":""},"","",{"$f":"IF(A118=\"\",\"\",RTD(\"cqg.rtd\", ,\"ContractData\",C118, \"LongDescription\",, \"T\"))","v":""},null,null,null,{"$f":"IF(A118=\"\",\"\",RTD(\"cqg.rtd\", ,\"ContractData\",C118, \"LastTradeToday\",, \"T\"))","v":""},{"$f":"IF(A118=\"\",\"\",RTD(\"cqg.rtd\", ,\"ContractData\",C118, \"NetLastTradeToday\",, \"T\"))","v":""},{"$f":"IF(A118=\"\",\"\",IFERROR(RTD(\"cqg.rtd\", ,\"ContractData\",C118, \"PerCentNetLastTrade\",, \"T\")/100,\"\"))","v":""},{"$f":"IF(A118=\"\",\"\",RTD(\"cqg.rtd\", ,\"ContractData\", C118, \"T_CVol\",, \"T\"))","v":""},118,{"$f":"IFERROR(RANK($J118,INDIRECT((\"$J$\"&\"1\"&\":$J$\"&$A$351)))+COUNTIF($J$1:J118,J118)-1,\"\")","v":""},"",""]
[{"$f":"IF(Symbols!A119=\"\",\"\",Symbols!A119)","v":""},"","",{"$f":"IF(A119=\"\",\"\",RTD(\"cqg.rtd\", ,\"ContractData\",C119, \"LongDescription\",, \"T\"))","v":""},null,null,null,{"$f":"IF(A119=\"\",\"\",RTD(\"cqg.rtd\", ,\"ContractData\",C119, \"LastTradeToday\",, \"T\"))","v":""},{"$f":"IF(A119=\"\",\"\",RTD(\"cqg.rtd\", ,\"ContractData\",C119, \"NetLastTradeToday\",, \"T\"))","v":""},{"$f":"IF(A119=\"\",\"\",IFERROR(RTD(\"cqg.rtd\", ,\"ContractData\",C119, \"PerCentNetLastTrade\",, \"T\")/100,\"\"))","v":""},{"$f":"IF(A119=\"\",\"\",RTD(\"cqg.rtd\", ,\"ContractData\", C119, \"T_CVol\",, \"T\"))","v":""},119,{"$f":"IFERROR(RANK($J119,INDIRECT((\"$J$\"&\"1\"&\":$J$\"&$A$351)))+COUNTIF($J$1:J119,J119)-1,\"\")","v":""},"",""]
[{"$f":"IF(Symbols!A120=\"\",\"\",Symbols!A120)","v":""},"","",{"$f":"IF(A120=\"\",\"\",RTD(\"cqg.rtd\", ,\"ContractData\",C120, \"LongDescription\",, \"T\"))","v":""},null,null,null,{"$f":"IF(A120=\"\",\"\",RTD(\"cqg.rtd\", ,\"ContractData\",C120, \"LastTradeToday\",, \"T\"))","v":""},{"$f":"IF(A120=\"\",\"\",RTD(\"cqg.rtd\", ,\"ContractData\",C120, \"NetLastTradeToday\",, \"T\"))","v":""},{"$f":"IF(A120=\"\",\"\",IFERROR(RTD(\"cqg.rtd\", ,\"ContractData\",C120, \"PerCentNetLastTrade\",, \"T\")/100,\"\"))","v":""},{"$f":"IF(A120=\"\",\"\",RTD(\"cqg.rtd\", ,\"ContractData\", C120, \"T_CVol\",, \"T\"))","v":""},120,{"$f":"IFERROR(RANK($J120,INDIRECT((\"$J$\"&\"1\"&\":$J$\"&$A$351)))+COUNTIF($J$1:J120,J120)-1,\"\")","v":""},"",""]
[{"$f":"IF(Symbols!A121=\"\",\"\",Symbols!A121)","v":""},"","",{"$f":"IF(A121=\"\",\"\",RTD(\"cqg.rtd\", ,\"ContractData\",C121, \"LongDescription\",, \"T\"))","v":""},null,null,null,{"$f":"IF(A121=\"\",\"\",RTD(\"cqg.rtd\", ,\"ContractData\",C121, \"LastTradeToday\",, \"T\"))","v":""},{"$f":"IF(A121=\"\",\"\",RTD(\"cqg.rtd\", ,\"ContractData\",C121, \"NetLastTradeToday\",, \"T\"))","v":""},{"$f":"IF(A121=\"\",\"\",IFERROR(RTD(\"cqg.rtd\", ,\"ContractData\",C121, \"PerCentNetLastTrade\",, \"T\")/100,\"\"))","v":""},{"$f":"IF(A121=\"\",\"\",RTD(\"cqg.rtd\", ,\"ContractData\", C121, \"T_CVol\",, \"T\"))","v":""},121,{"$f":"IFERROR(RANK($J121,INDIRECT((\"$J$\"&\"1\"&\":$J$\"&$A$351)))+COUNTIF($J$1:J121,J121)-1,\"\")","v":""},"",""]
[{"$f":"IF(Symbols!A122=\"\",\"\",Symbols!A122)","v":""},"","",{"$f":"IF(A122=\"\",\"\",RTD(\"cqg.rtd\", ,\"ContractData\",C122, \"LongDescription\",, \"T\"))","v":""},null,null,null,{"$f":"IF(A122=\"\",\"\",RTD(\"cqg.rtd\", ,\"ContractData\",C122, \"LastTradeToday\",, \"T\"))","v":""},{"$f":"IF(A122=\"\",\"\",RTD(\"cqg.rtd\", ,\"ContractData\",C122, \"NetLastTradeToday\",, \"T\"))","v":""},{"$f":"IF(A122=\"\",\"\",IFERROR(RTD(\"cqg.rtd\", ,\"ContractData\",C122, \"PerCentNetLastTrade\",, \"T\")/100,\"\"))","v":""},{"$f":"IF(A122=\"\",\"\",RTD(\"cqg.rtd\", ,\"ContractData\", C122, \"T_CVol\",, \"T\"))","v":""},122,{"$f":"IFERROR(RANK($J122,INDIRECT((\"$J$\"&\"1\"&\":$J$\"&$A$351)))+COUNTIF($J$1:J122,J122)-1,\"\")","v":""},"",""]
[{"$f":"IF(Symbols!A123=\"\",\"\",Symbols!A123)","v":""},"","",{"$f":"IF(A123=\"\",\"\",RTD(\"cqg.rtd\", ,\"ContractData\",C123, \"LongDescription\",, \"T\"))","v":""},null,null,null,{"$f":"IF(A123=\"\",\"\",RTD(\"cqg.rtd\", ,\"ContractData\",C123, \"LastTradeToday\",, \"T\"))","v":""},{"$f":"IF(A123=\"\",\"\",RTD(\"cqg.rtd\", ,\"ContractData\",C123, \"NetLastTradeToday\",, \"T\"))","v":""},{"$f":"IF(A123=\"\",\"\",IFERROR(RTD(\"cqg.rtd\", ,\"ContractData\",C123, \"PerCentNetLastTrade\",, \"T\")/100,\"\"))","v":""},{"$f":"IF(A123=\"\",\"\",RTD(\"cqg.rtd\", ,\"ContractData\", C123, \"T_CVol\",, \"T\"))","v":""},123,{"$f":"IFERROR(RANK($J123,INDIRECT((\"$J$\"&\"1\"&\":$J$\"&$A$351)))+COUNTIF($J$1:J123,J123)-1,\"\")","v":""},"",""]
[{"$f":"IF(Symbols!A124=\"\",\"\",Symbols!A124)","v":""},"","",{"$f":"IF(A124=\"\",\"\",RTD(\"cqg.rtd\", ,\"ContractData\",C124, \"LongDescription\",, \"T\"))","v":""},null,null,null,{"$f":"IF(A124=\"\",\"\",RTD(\"cqg.rtd\", ,\"ContractData\",C124, \"LastTradeToday\",, \"T\"))","v":""},{"$f":"IF(A124=\"\",\"\",RTD(\"cqg.rtd\", ,\"ContractData\",C124, \"NetLastTradeToday\",, \"T\"))","v":""},{"$f":"IF(A124=\"\",\"\",IFERROR(RTD(\"cqg.rtd\", ,\"ContractData\",C124, \"PerCentNetLastTrade\",, \"T\")/100,\"\"))","v":""},{"$f":"IF(A124=\"\",\"\",RTD(\"cqg.rtd\", ,\"ContractData\", C124, \"T_CVol\",, \"T\"))","v":""},124,{"$f":"IFERROR(RANK($J124,INDIRECT((\"$J$\"&\"1\"&\":$J$\"&$A$351)))+COUNTIF($J$1:J124,J124)-1,\"\")","v":""},"",""]
[{"$f":"IF(Symbols!A125=\"\",\"\",Symbols!A125)","v":""},{"$f":"IF(A125=\"\",\"\",IF(J125>0,1,0))","v":""},{"$f":"A125","v":""},{"$f":"IF(A125=\"\",\"\",RTD(\"cqg.rtd\", ,\"ContractData\",C125, \"LongDescription\",, \"T\"))","v":""},null,null,null,{"$f":"IF(A125=\"\",\"\",RTD(\"cqg.rtd\", ,\"ContractData\",C125, \"LastTradeToday\",, \"T\"))","v":""},{"$f":"IF(A125=\"\",\"\",RTD(\"cqg.rtd\", ,\"ContractData\",C125, \"NetLastTradeToday\",, \"T\"))","v":""},{"$f":"IF(A125=\"\",\"\",IFERROR(RTD(\"cqg.rtd\", ,\"ContractData\",C125, \"PerCentNetLastTrade\",, \"T\")/100,\"\"))","v":""},{"$f":"IF(A125=\"\",\"\",RTD(\"cqg.rtd\", ,\"ContractData\", C125, \"T_CVol\",, \"T\"))","v":""},125,{"$f":"IFERROR(RANK($J125,INDIRECT((\"$J$\"&\"1\"&\":$J$\"&$A$351)))+COUNTIF($J$1:J125,J125)-1,\"\")","v":""},{"$f":"C125","v":""},""]
[{"$f":"IF(Symbols!A126=\"\",\"\",Symbols!A126)","v":""},"","",{"$f":"IF(A126=\"\",\"\",RTD(\"cqg.rtd\", ,\"ContractData\",C126, \"LongDescription\",, \"T\"))","v":""},null,null,null,{"$f":"IF(A126=\"\",\"\",RTD(\"cqg.rtd\", ,\"ContractData\",C126, \"LastTradeToday\",, \"T\"))","v":""},{"$f":"IF(A126=\"\",\"\",RTD(\"cqg.rtd\", ,\"ContractData\",C126, \"NetLastTradeToday\",, \"T\"))","v":""},{"$f":"IF(A126=\"\",\"\",IFERROR(RTD(\"cqg.rtd\", ,\"ContractData\",C126, \"PerCentNetLastTrade\",, \"T\")/100,\"\"))","v":""},{"$f":"IF(A126=\"\",\"\",RTD(\"cqg.rtd\", ,\"ContractData\", C126, \"T_CVol\",, \"T\"))","v":""},126,{"$f":"IFERROR(RANK($J126,INDIRECT((\"$J$\"&\"1\"&\":$J$\"&$A$351)))+COUNTIF($J$1:J126,J126)-1,\"\")","v":""},"",""]
[{"$f":"IF(Symbols!A127=\"\",\"\",Symbols!A127)","v":""},"","",{"$f":"IF(A127=\"\",\"\",RTD(\"cqg.rtd\", ,\"ContractData\",C127, \"LongDescription\",, \"T\"))","v":""},null,null,null,{"$f":"IF(A127=\"\",\"\",RTD(\"cqg.rtd\", ,\"ContractData\",C127, \"LastTradeToday\",, \"T\"))","v":""},{"$f":"IF(A127=\"\",\"\",RTD(\"cqg.rtd\", ,\"ContractData\",C127, \"NetLastTradeToday\",, \"T\"))","v":""},{"$f":"IF(A127=\"\",\"\",IFERROR(RTD(\"cqg.rtd\", ,\"ContractData\",C127, \"PerCentNetLastTrade\",, \"T\")/100,\"\"))","v":""},{"$f":"IF(A127=\"\",\"\",RTD(\"cqg.rtd\", ,\"ContractData\", C127, \"T_CVol\",, \"T\"))","v":""},127,{"$f":"IFERROR(RANK($J127,INDIRECT((\"$J$\"&\"1\"&\":$J$\"&$A$351)))+COUNTIF($J$1:J127,J127)-1,\"\")","v":""},"",""]
[{"$f":"IF(Symbols!A128=\"\",\"\",Symbols!A128)","v":""},"","",{"$f":"IF(A128=\"\",\"\",RTD(\"cqg.rtd\", ,\"ContractData\",C128, \"LongDescription\",, \"T\"))","v":""},null,null,null,{"$f":"IF(A128=\"\",\"\",RTD(\"cqg.rtd\", ,\"ContractData\",C128, \"LastTradeToday\",, \"T\"))","v":""},{"$f":"IF(A128=\"\",\"\",RTD(\"cqg.rtd\", ,\"ContractData\",C128, \"NetLastTradeToday\",, \"T\"))","v":""},{"$f":"IF(A128=\"\",\"\",IFERROR(RTD(\"cqg.rtd\", ,\"ContractData\",C128, \"PerCentNetLastTrade\",, \"T\")/100,\"\"))","v":""},{"$f":"IF(A128=\"\",\"\",RTD(\"cqg.rtd\", ,\"ContractData\", C128, \"T_CVol\",, \"T\"))","v":""},128,{"$f":"IFERROR(RANK($J128,INDIRECT((\"$J$\"&\"1\"&\":$J$\"&$A$351)))+COUNTIF($J$1:J128,J128)-1,\"\")","v":""},"",""]
[{"$f":"IF(Symbols!A129=\"\",\"\",Symbols!A129)","v":""},"","",{"$f":"IF(A129=\"\",\"\",RTD(\"cqg.rtd\", ,\"ContractData\",C129, \"LongDescription\",, \"T\"))","v":""},null,null,null,{"$f":"IF(A129=\"\",\"\",RTD(\"cqg.rtd\", ,\"ContractData\",C129, \"LastTradeToday\",, \"T\"))","v":""},{"$f":"IF(A129=\"\",\"\",RTD(\"cqg.rtd\", ,\"ContractData\",C129, \"NetLastTradeToday\",, \"T\"))","v":""},{"$f":"IF(A129=\"\",\"\",IFERROR(RTD(\"cqg.rtd\", ,\"ContractData\",C129, \"PerCentNetLastTrade\",, \"T\")/100,\"\"))","v":""},{"$f":"IF(A129=\"\",\"\",RTD(\"cqg.rtd\", ,\"ContractData\", C129, \"T_CVol\",, \"T\"))","v":""},129,{"$f":"IFERROR(RANK($J129,INDIRECT((\"$J$\"&\"1\"&\":$J$\"&$A$351)))+COUNTIF($J$1:J129,J129)-1,\"\")","v":""},"",""]
[{"$f":"IF(Symbols!A130=\"\",\"\",Symbols!A130)","v":""},"","",{"$f":"IF(A130=\"\",\"\",RTD(\"cqg.rtd\", ,\"ContractData\",C130, \"LongDescription\",, \"T\"))","v":""},null,null,null,{"$f":"IF(A130=\"\",\"\",RTD(\"cqg.rtd\", ,\"ContractData\",C130, \"LastTradeToday\",, \"T\"))","v":""},{"$f":"IF(A130=\"\",\"\",RTD(\"cqg.rtd\", ,\"ContractData\",C130, \"NetLastTradeToday\",, \"T\"))","v":""},{"$f":"IF(A130=\"\",\"\",IFERROR(RTD(\"cqg.rtd\", ,\"ContractData\",C130, \"PerCentNetLastTrade\",, \"T\")/100,\"\"))","v":""},{"$f":"IF(A130=\"\",\"\",RTD(\"cqg.rtd\", ,\"ContractData\", C130, \"T_CVol\",, \"T\"))","v":""},130,{"$f":"IFERROR(RANK($J130,INDIRECT((\"$J$\"&\"1\"&\":$J$\"&$A$351)))+COUNTIF($J$1:J130,J130)-1,\"\")","v":""},"",{"$f":"IFERROR(VLOOKUP($L130,$M$1:$N$350,2,FALSE),\"\")","v":""}]
[{"$f":"IF(Symbols!A131=\"\",\"\",Symbols!A131)","v":""},"","",{"$f":"IF(A131=\"\",\"\",RTD(\"cqg.rtd\", ,\"ContractData\",C131, \"LongDescription\",, \"T\"))","v":""},null,null,null,{"$f":"IF(A131=\"\",\"\",RTD(\"cqg.rtd\", ,\"ContractData\",C131, \"LastTradeToday\",, \"T\"))","v":""},{"$f":"IF(A131=\"\",\"\",RTD(\"cqg.rtd\", ,\"ContractData\",C131, \"NetLastTradeToday\",, \"T\"))","v":""},{"$f":"IF(A131=\"\",\"\",IFERROR(RTD(\"cqg.rtd\", ,\"ContractData\",C131, \"PerCentNetLastTrade\",, \"T\")/100,\"\"))","v":""},{"$f":"IF(A131=\"\",\"\",RTD(\"cqg.rtd\", ,\"ContractData\", C131, \"T_CVol\",, \"T\"))","v":""},{"$f":"L130+1","v":131},{"$f":"IFERROR(RANK($J131,INDIRECT((\"$J$\"&\"1\"&\":$J$\"&$A$351)))+COUNTIF($J$1:J131,J131)-1,\"\")","v":""},"",""]
[{"$f":"IF(Symbols!A132=\"\",\"\",Symbols!A132)","v":""},"","",{"$f":"IF(A132=\"\",\"\",RTD(\"cqg.rtd\", ,\"ContractData\",C132, \"LongDescription\",, \"T\"))","v":""},null,null,null,{"$f":"IF(A132=\"\",\"\",RTD(\"cqg.rtd\", ,\"ContractData\",C132, \"LastTradeToday\",, \"T\"))","v":""},{"$f":"IF(A132=\"\",\"\",RTD(\"cqg.rtd\", ,\"ContractData\",C132, \"NetLastTradeToday\",, \"T\"))","v":""},{"$f":"IF(A132=\"\",\"\",IFERROR(RTD(\"cqg.rtd\", ,\"ContractData\",C132, \"PerCentNetLastTrade\",, \"T\")/100,\"\"))","v":""},{"$f":"IF(A132=\"\",\"\",RTD(\"cqg.rtd\", ,\"ContractData\", C132, \"T_CVol\",, \"T\"))","v":""},132,{"$f":"IFERROR(RANK($J132,INDIRECT((\"$J$\"&\"1\"&\":$J$\"&$A$351)))+COUNTIF($J$1:J132,J132)-1,\"\")","v":""},"",""]
[{"$f":"IF(Symbols!A133=\"\",\"\",Symbols!A133)","v":""},"","",{"$f":"IF(A133=\"\",\"\",RTD(\"cqg.rtd\", ,\"ContractData\",C133, \"LongDescription\",, \"T\"))","v":""},null,null,null,{"$f":"IF(A133=\"\",\"\",RTD(\"cqg.rtd\", ,\"ContractData\",C133, \"LastTradeToday\",, \"T\"))","v":""},{"$f":"IF(A133=\"\",\"\",RTD(\"cqg.rtd\", ,\"ContractData\",C133, \"NetLastTradeToday\",, \"T\"))","v":""},{"$f":"IF(A133=\"\",\"\",IFERROR(RTD(\"cqg.rtd\", ,\"ContractData\",C133, \"PerCentNetLastTrade\",, \"T\")/100,\"\"))","v":""},{"$f":"IF(A133=\"\",\"\",RTD(\"cqg.rtd\", ,\"ContractData\", C133, \"T_CVol\",, \"T\"))","v":""},133,{"$f":"IFERROR(RANK($J133,INDIRECT((\"$J$\"&\"1\"&\":$J$\"&$A$351)))+COUNTIF($J$1:J133,J133)-1,\"\")","v":""},"",""]
[{"$f":"IF(Symbols!A134=\"\",\"\",Symbols!A134)","v":""},"","",{"$f":"IF(A134=\"\",\"\",RTD(\"cqg.rtd\", ,\"ContractData\",C134, \"LongDescription\",, \"T\"))","v":""},null,null,null,{"$f":"IF(A134=\"\",\"\",RTD(\"cqg.rtd\", ,\"ContractData\",C134, \"LastTradeToday\",, \"T\"))","v":""},{"$f":"IF(A134=\"\",\"\",RTD(\"cqg.rtd\", ,\"ContractData\",C134, \"NetLastTradeToday\",, \"T\"))","v":""},{"$f":"IF(A134=\"\",\"\",IFERROR(RTD(\"cqg.rtd\", ,\"ContractData\",C134, \"PerCentNetLastTrade\",, \"T\")/100,\"\"))","v":""},{"$f":"IF(A134=\"\",\"\",RTD(\"cqg.rtd\", ,\"ContractData\", C134, \"T_CVol\",, \"T\"))","v":""},134,{"$f":"IFERROR(RANK($J134,INDIRECT((\"$J$\"&\"1\"&\":$J$\"&$A$351)))+COUNTIF($J$1:J134,J134)-1,\"\")","v":""},"",""]
[{"$f":"IF(Symbols!A135=\"\",\"\",Symbols!A135)","v":""},"","",{"$f":"IF(A135=\"\",\"\",RTD(\"cqg.rtd\", ,\"ContractData\",C135, \"LongDescription\",, \"T\"))","v":""},null,null,null,{"$f":"IF(A135=\"\",\"\",RTD(\"cqg.rtd\", ,\"ContractData\",C135, \"LastTradeToday\",, \"T\"))","v":""},{"$f":"IF(A135=\"\",\"\",RTD(\"cqg.rtd\", ,\"ContractData\",C135, \"NetLastTradeToday\",, \"T\"))","v":""},{"$f":"IF(A135=\"\",\"\",IFERROR(RTD(\"cqg.rtd\", ,\"ContractData\",C135, \"PerCentNetLastTrade\",, \"T\")/100,\"\"))","v":""},{"$f":"IF(A135=\"\",\"\",RTD(\"cqg.rtd\", ,\"ContractData\", C135, \"T_CVol\",, \"T\"))","v":""},135,{"$f":"IFERROR(RANK($J135,INDIRECT((\"$J$\"&\"1\"&\":$J$\"&$A$351)))+COUNTIF($J$1:J135,J135)-1,\"\")","v":""},"",""]
[{"$f":"IF(Symbols!A136=\"\",\"\",Symbols!A136)","v":""},"","",{"$f":"IF(A136=\"\",\"\",RTD(\"cqg.rtd\", ,\"ContractData\",C136, \"LongDescription\",, \"T\"))","v":""},null,null,null,{"$f":"IF(A136=\"\",\"\",RTD(\"cqg.rtd\", ,\"ContractData\",C136, \"LastTradeToday\",, \"T\"))","v":""},{"$f":"IF(A136=\"\",\"\",RTD(\"cqg.rtd\", ,\"ContractData\",C136, \"NetLastTradeToday\",, \"T\"))","v":""},{"$f":"IF(A136=\"\",\"\",IFERROR(RTD(\"cqg.rtd\", ,\"ContractData\",C136, \"PerCentNetLastTrade\",, \"T\")/100,\"\"))","v":""},{"$f":"IF(A136=\"\",\"\",RTD(\"cqg.rtd\", ,\"ContractData\", C136, \"T_CVol\",, \"T\"))","v":""},136,{"$f":"IFERROR(RANK($J136,INDIRECT((\"$J$\"&\"1\"&\":$J$\"&$A$351)))+COUNTIF($J$1:J136,J136)-1,\"\")","v":""},"",""]
[{"$f":"IF(Symbols!A137=\"\",\"\",Symbols!A137)","v":""},"","",{"$f":"IF(A137=\"\",\"\",RTD(\"cqg.rtd\", ,\"ContractData\",C137, \"LongDescription\",, \"T\"))","v":""},null,null,null,{"$f":"IF(A137=\"\",\"\",RTD(\"cqg.rtd\", ,\"ContractData\",C137, \"LastTradeToday\",, \"T\"))","v":""},{"$f":"IF(A137=\"\",\"\",RTD(\"cqg.rtd\", ,\"ContractData\",C137, \"NetLastTradeToday\",, \"T\"))","v":""},{"$f":"IF(A137=\"\",\"\",IFERROR(RTD(\"cqg.rtd\", ,\"ContractData\",C137, \"PerCentNetLastTrade\",, \"T\")/100,\"\"))","v":""},{"$f":"IF(A137=\"\",\"\",RTD(\"cqg.rtd\", ,\"ContractData\", C137, \"T_CVol\",, \"T\"))","v":""},137,{"$f":"IFERROR(RANK($J137,INDIRECT((\"$J$\"&\"1\"&\":$J$\"&$A$351)))+COUNTIF($J$1:J137,J137)-1,\"\")","v":""},"",""]
[{"$f":"IF(Symbols!A138=\"\",\"\",Symbols!A138)","v":""},"","",{"$f":"IF(A138=\"\",\"\",RTD(\"cqg.rtd\", ,\"ContractData\",C138, \"LongDescription\",, \"T\"))","v":""},null,null,null,{"$f":"IF(A138=\"\",\"\",RTD(\"cqg.rtd\", ,\"ContractData\",C138, \"LastTradeToday\",, \"T\"))","v":""},{"$f":"IF(A138=\"\",\"\",RTD(\"cqg.rtd\", ,\"ContractData\",C138, \"NetLastTradeToday\",, \"T\"))","v":""},{"$f":"IF(A138=\"\",\"\",IFERROR(RTD(\"cqg.rtd\", ,\"ContractData\",C138, \"PerCentNetLastTrade\",, \"T\")/100,\"\"))","v":""},{"$f":"IF(A138=\"\",\"\",RTD(\"cqg.rtd\", ,\"ContractData\", C138, \"T_CVol\",, \"T\"))","v":""},138,{"$f":"IFERROR(RANK($J138,INDIRECT((\"$J$\"&\"1\"&\":$J$\"&$A$351)))+COUNTIF($J$1:J138,J138)-1,\"\")","v":""},"",""]
[{"$f":"IF(Symbols!A139=\"\",\"\",Symbols!A139)","v":""},"","",{"$f":"IF(A139=\"\",\"\",RTD(\"cqg.rtd\", ,\"ContractData\",C139, \"LongDescription\",, \"T\"))","v":""},null,null,null,{"$f":"IF(A139=\"\",\"\",RTD(\"cqg.rtd\", ,\"ContractData\",C139, \"LastTradeToday\",, \"T\"))","v":""},{"$f":"IF(A139=\"\",\"\",RTD(\"cqg.rtd\", ,\"ContractData\",C139, \"NetLastTradeToday\",, \"T\"))","v":""},{"$f":"IF(A139=\"\",\"\",IFERROR(RTD(\"cqg.rtd\", ,\"ContractData\",C139, \"PerCentNetLastTrade\",, \"T\")/100,\"\"))","v":""},{"$f":"IF(A139=\"\",\"\",RTD(\"cqg.rtd\", ,\"ContractData\", C139, \"T_CVol\",, \"T\"))","v":""},139,{"$f":"IFERROR(RANK($J139,INDIRECT((\"$J$\"&\"1\"&\":$J$\"&$A$351)))+COUNTIF($J$1:J139,J139)-1,\"\")","v":""},"",""]
[{"$f":"IF(Symbols!A140=\"\",\"\",Symbols!A140)","v":""},"","",{"$f":"IF(A140=\"\",\"\",RTD(\"cqg.rtd\", ,\"ContractData\",C140, \"LongDescription\",, \"T\"))","v":""},null,null,null,{"$f":"IF(A140=\"\",\"\",RTD(\"cqg.rtd\", ,\"ContractData\",C140, \"LastTradeToday\",, \"T\"))","v":""},{"$f":"IF(A140=\"\",\"\",RTD(\"cqg.rtd\", ,\"ContractData\",C140, \"NetLastTradeToday\",, \"T\"))","v":""},{"$f":"IF(A140=\"\",\"\",IFERROR(RTD(\"cqg.rtd\", ,\"ContractData\",C140, \"PerCentNetLastTrade\",, \"T\")/100,\"\"))","v":""},{"$f":"IF(A140=\"\",\"\",RTD(\"cqg.rtd\", ,\"ContractData\", C140, \"T_CVol\",, \"T\"))","v":""},140,{"$f":"IFERROR(RANK($J140,INDIRECT((\"$J$\"&\"1\"&\":$J$\"&$A$351)))+COUNTIF($J$1:J140,J140)-1,\"\")","v":""},"",""]
[{"$f":"IF(Symbols!A141=\"\",\"\",Symbols!A141)","v":""},"","",{"$f":"IF(A141=\"\",\"\",RTD(\"cqg.rtd\", ,\"ContractData\",C141, \"LongDescription\",, \"T\"))","v":""},null,null,null,{"$f":"IF(A141=\"\",\"\",RTD(\"cqg.rtd\", ,\"ContractData\",C141, \"LastTradeToday\",, \"T\"))","v":""},{"$f":"IF(A141=\"\",\"\",RTD(\"cqg.rtd\", ,\"ContractData\",C141, \"NetLastTradeToday\",, \"T\"))","v":""},{"$f":"IF(A141=\"\",\"\",IFERROR(RTD(\"cqg.rtd\", ,\"ContractData\",C141, \"PerCentNetLastTrade\",, \"T\")/100,\"\"))","v":""},{"$f":"IF(A141=\"\",\"\",RTD(\"cqg.rtd\", ,\"ContractData\", C141, \"T_CVol\",, \"T\"))","v":""},141,{"$f":"IFERROR(RANK($J141,INDIRECT((\"$J$\"&\"1\"&\":$J$\"&$A$351)))+COUNTIF($J$1:J141,J141)-1,\"\")","v":""},"",""]
[{"$f":"IF(Symbols!A142=\"\",\"\",Symbols!A142)","v":""},"","",{"$f":"IF(A142=\"\",\"\",RTD(\"cqg.rtd\", ,\"ContractData\",C142, \"LongDescription\",, \"T\"))","v":""},null,null,null,{"$f":"IF(A142=\"\",\"\",RTD(\"cqg.rtd\", ,\"ContractData\",C142, \"LastTradeToday\",, \"T\"))","v":""},{"$f":"IF(A142=\"\",\"\",RTD(\"cqg.rtd\", ,\"ContractData\",C142, \"NetLastTradeToday\",, \"T\"))","v":""},{"$f":"IF(A142=\"\",\"\",IFERROR(RTD(\"cqg.rtd\", ,\"ContractData\",C142, \"PerCentNetLastTrade\",, \"T\")/100,\"\"))","v":""},{"$f":"IF(A142=\"\",\"\",RTD(\"cqg.rtd\", ,\"ContractData\", C142, \"T_CVol\",, \"T\"))","v":""},142,{"$f":"IFERROR(RANK($J142,INDIRECT((\"$J$\"&\"1\"&\":$J$\"&$A$351)))+COUNTIF($J$1:J142,J142)-1,\"\")","v":""},"",""]
[{"$f":"IF(Symbols!A143=\"\",\"\",Symbols!A143)","v":""},"","",{"$f":"IF(A143=\"\",\"\",RTD(\"cqg.rtd\", ,\"ContractData\",C143, \"LongDescription\",, \"T\"))","v":""},null,null,null,{"$f":"IF(A143=\"\",\"\",RTD(\"cqg.rtd\", ,\"ContractData\",C143, \"LastTradeToday\",, \"T\"))","v":""},{"$f":"IF(A143=\"\",\"\",RTD(\"cqg.rtd\", ,\"ContractData\",C143, \"NetLastTradeToday\",, \"T\"))","v":""},{"$f":"IF(A143=\"\",\"\",IFERROR(RTD(\"cqg.rtd\", ,\"ContractData\",C143, \"PerCentNetLastTrade\",, \"T\")/100,\"\"))","v":""},{"$f":"IF(A143=\"\",\"\",RTD(\"cqg.rtd\", ,\"ContractData\", C143, \"T_CVol\",, \"T\"))","v":""},143,{"$f":"IFERROR(RANK($J143,INDIRECT((\"$J$\"&\"1\"&\":$J$\"&$A$351)))+COUNTIF($J$1:J143,J143)-1,\"\")","v":""},"",""]
[{"$f":"IF(Symbols!A144=\"\",\"\",Symbols!A144)","v":""},"","",{"$f":"IF(A144=\"\",\"\",RTD(\"cqg.rtd\", ,\"ContractData\",C144, \"LongDescription\",, \"T\"))","v":""},null,null,null,{"$f":"IF(A144=\"\",\"\",RTD(\"cqg.rtd\", ,\"ContractData\",C144, \"LastTradeToday\",, \"T\"))","v":""},{"$f":"IF(A144=\"\",\"\",RTD(\"cqg.rtd\", ,\"ContractData\",C144, \"NetLastTradeToday\",, \"T\"))","v":""},{"$f":"IF(A144=\"\",\"\",IFERROR(RTD(\"cqg.rtd\", ,\"ContractData\",C144, \"PerCentNetLastTrade\",, \"T\")/100,\"\"))","v":""},{"$f":"IF(A144=\"\",\"\",RTD(\"cqg.rtd\", ,\"ContractData\", C144, \"T_CVol\",, \"T\"))","v":""},144,{"$f":"IFERROR(RANK($J144,INDIRECT((\"$J$\"&\"1\"&\":$J$\"&$A$351)))+COUNTIF($J$1:J144,J144)-1,\"\")","v":""},"",""]
[{"$f":"IF(Symbols!A145=\"\",\"\",Symbols!A145)","v":""},"","",{"$f":"IF(A145=\"\",\"\",RTD(\"cqg.rtd\", ,\"ContractData\",C145, \"LongDescription\",, \"T\"))","v":""},null,null,null,{"$f":"IF(A145=\"\",\"\",RTD(\"cqg.rtd\", ,\"ContractData\",C145, \"LastTradeToday\",, \"T\"))","v":""},{"$f":"IF(A145=\"\",\"\",RTD(\"cqg.rtd\", ,\"ContractData\",C145, \"NetLastTradeToday\",, \"T\"))","v":""},{"$f":"IF(A145=\"\",\"\",IFERROR(RTD(\"cqg.rtd\", ,\"ContractData\",C145, \"PerCentNetLastTrade\",, \"T\")/100,\"\"))","v":""},{"$f":"IF(A145=\"\",\"\",RTD(\"cqg.rtd\", ,\"ContractData\", C145, \"T_CVol\",, \"T\"))","v":""},145,{"$f":"IFERROR(RANK($J145,INDIRECT((\"$J$\"&\"1\"&\":$J$\"&$A$351)))+COUNTIF($J$1:J145,J145)-1,\"\")","v":""},"",""]
[{"$f":"IF(Symbols!A146=\"\",\"\",Symbols!A146)","v":""},"","",{"$f":"IF(A146=\"\",\"\",RTD(\"cqg.rtd\", ,\"ContractData\",C146, \"LongDescription\",, \"T\"))","v":""},null,null,null,{"$f":"IF(A146=\"\",\"\",RTD(\"cqg.rtd\", ,\"ContractData\",C146, \"LastTradeToday\",, \"T\"))","v":""},{"$f":"IF(A146=\"\",\"\",RTD(\"cqg.rtd\", ,\"ContractData\",C146, \"NetLastTradeToday\",, \"T\"))","v":""},{"$f":"IF(A146=\"\",\"\",IFERROR(RTD(\"cqg.rtd\", ,\"ContractData\",C146, \"PerCentNetLastTrade\",, \"T\")/100,\"\"))","v":""},{"$f":"IF(A146=\"\",\"\",RTD(\"cqg.rtd\", ,\"ContractData\", C146, \"T_CVol\",, \"T\"))","v":""},146,{"$f":"IFERROR(RANK($J146,INDIRECT((\"$J$\"&\"1\"&\":$J$\"&$A$351)))+COUNTIF($J$1:J146,J146)-1,\"\")","v":""},"",""]
[{"$f":"IF(Symbols!A147=\"\",\"\",Symbols!A147)","v":""},"","",{"$f":"IF(A147=\"\",\"\",RTD(\"cqg.rtd\", ,\"ContractData\",C147, \"LongDescription\",, \"T\"))","v":""},null,null,null,{"$f":"IF(A147=\"\",\"\",RTD(\"cqg.rtd\", ,\"ContractData\",C147, \"LastTradeToday\",, \"T\"))","v":""},{"$f":"IF(A147=\"\",\"\",RTD(\"cqg.rtd\", ,\"ContractData\",C147, \"NetLastTradeToday\",, \"T\"))","v":""},{"$f":"IF(A147=\"\",\"\",IFERROR(RTD(\"cqg.rtd\", ,\"ContractData\",C147, \"PerCentNetLastTrade\",, \"T\")/100,\"\"))","v":""},{"$f":"IF(A147=\"\",\"\",RTD(\"cqg.rtd\", ,\"ContractData\", C147, \"T_CVol\",, \"T\"))","v":""},147,{"$f":"IFERROR(RANK($J147,INDIRECT((\"$J$\"&\"1\"&\":$J$\"&$A$351)))+COUNTIF($J$1:J147,J147)-1,\"\")","v":""},"",""]
[{"$f":"IF(Symbols!A148=\"\",\"\",Symbols!A148)","v":""},"","",{"$f":"IF(A148=\"\",\"\",RTD(\"cqg.rtd\", ,\"ContractData\",C148, \"LongDescription\",, \"T\"))","v":""},null,null,null,{"$f":"IF(A148=\"\",\"\",RTD(\"cqg.rtd\", ,\"ContractData\",C148, \"LastTradeToday\",, \"T\"))","v":""},{"$f":"IF(A148=\"\",\"\",RTD(\"cqg.rtd\", ,\"ContractData\",C148, \"NetLastTradeToday\",, \"T\"))","v":""},{"$f":"IF(A148=\"\",\"\",IFERROR(RTD(\"cqg.rtd\", ,\"ContractData\",C148, \"PerCentNetLastTrade\",, \"T\")/100,\"\"))","v":""},{"$f":"IF(A148=\"\",\"\",RTD(\"cqg.rtd\", ,\"ContractData\", C148, \"T_CVol\",, \"T\"))","v":""},148,{"$f":"IFERROR(RANK($J148,INDIRECT((\"$J$\"&\"1\"&\":$J$\"&$A$351)))+COUNTIF($J$1:J148,J148)-1,\"\")","v":""},"",""]
[{"$f":"IF(Symbols!A149=\"\",\"\",Symbols!A149)","v":""},"","",{"$f":"IF(A149=\"\",\"\",RTD(\"cqg.rtd\", ,\"ContractData\",C149, \"LongDescription\",, \"T\"))","v":""},null,null,null,{"$f":"IF(A149=\"\",\"\",RTD(\"cqg.rtd\", ,\"ContractData\",C149, \"LastTradeToday\",, \"T\"))","v":""},{"$f":"IF(A149=\"\",\"\",RTD(\"cqg.rtd\", ,\"ContractData\",C149, \"NetLastTradeToday\",, \"T\"))","v":""},{"$f":"IF(A149=\"\",\"\",IFERROR(RTD(\"cqg.rtd\", ,\"ContractData\",C149, \"PerCentNetLastTrade\",, \"T\")/100,\"\"))","v":""},{"$f":"IF(A149=\"\",\"\",RTD(\"cqg.rtd\", ,\"ContractData\", C149, \"T_CVol\",, \"T\"))","v":""},149,{"$f":"IFERROR(RANK($J149,INDIRECT((\"$J$\"&\"1\"&\":$J$\"&$A$351)))+COUNTIF($J$1:J149,J149)-1,\"\")","v":""},"",""]
[{"$f":"IF(Symbols!A150=\"\",\"\",Symbols!A150)","v":""},"","",{"$f":"IF(A150=\"\",\"\",RTD(\"cqg.rtd\", ,\"ContractData\",C150, \"LongDescription\",, \"T\"))","v":""},null,null,null,{"$f":"IF(A150=\"\",\"\",RTD(\"cqg.rtd\", ,\"ContractData\",C150, \"LastTradeToday\",, \"T\"))","v":""},{"$f":"IF(A150=\"\",\"\",RTD(\"cqg.rtd\", ,\"ContractData\",C150, \"NetLastTradeToday\",, \"T\"))","v":""},{"$f":"IF(A150=\"\",\"\",IFERROR(RTD(\"cqg.rtd\", ,\"ContractData\",C150, \"PerCentNetLastTrade\",, \"T\")/100,\"\"))","v":""},{"$f":"IF(A150=\"\",\"\",RTD(\"cqg.rtd\", ,\"ContractData\", C150, \"T_CVol\",, \"T\"))","v":""},150,{"$f":"IFERROR(RANK($J150,INDIRECT((\"$J$\"&\"1\"&\":$J$\"&$A$351)))+COUNTIF($J$1:J150,J150)-1,\"\")","v":""},"",""]
[{"$f":"IF(Symbols!A151=\"\",\"\",Symbols!A151)","v":""},"","",{"$f":"IF(A151=\"\",\"\",RTD(\"cqg.rtd\", ,\"ContractData\",C151, \"LongDescription\",, \"T\"))","v":""},null,null,null,{"$f":"IF(A151=\"\",\"\",RTD(\"cqg.rtd\", ,\"ContractData\",C151, \"LastTradeToday\",, \"T\"))","v":""},{"$f":"IF(A151=\"\",\"\",RTD(\"cqg.rtd\", ,\"ContractData\",C151, \"NetLastTradeToday\",, \"T\"))","v":""},{"$f":"IF(A151=\"\",\"\",IFERROR(RTD(\"cqg.rtd\", ,\"ContractData\",C151, \"PerCentNetLastTrade\",, \"T\")/100,\"\"))","v":""},{"$f":"IF(A151=\"\",\"\",RTD(\"cqg.rtd\", ,\"ContractData\", C151, \"T_CVol\",, \"T\"))","v":""},151,{"$f":"IFERROR(RANK($J151,INDIRECT((\"$J$\"&\"1\"&\":$J$\"&$A$351)))+COUNTIF($J$1:J151,J151)-1,\"\")","v":""},"",""]
[{"$f":"IF(Symbols!A152=\"\",\"\",Symbols!A152)","v":""},"","",{"$f":"IF(A152=\"\",\"\",RTD(\"cqg.rtd\", ,\"ContractData\",C152, \"LongDescription\",, \"T\"))","v":""},null,null,null,{"$f":"IF(A152=\"\",\"\",RTD(\"cqg.rtd\", ,\"ContractData\",C152, \"LastTradeToday\",, \"T\"))","v":""},{"$f":"IF(A152=\"\",\"\",RTD(\"cqg.rtd\", ,\"ContractData\",C152, \"NetLastTradeToday\",, \"T\"))","v":""},{"$f":"IF(A152=\"\",\"\",IFERROR(RTD(\"cqg.rtd\", ,\"ContractData\",C152, \"PerCentNetLastTrade\",, \"T\")/100,\"\"))","v":""},{"$f":"IF(A152=\"\",\"\",RTD(\"cqg.rtd\", ,\"ContractData\", C152, \"T_CVol\",, \"T\"))","v":""},152,{"$f":"IFERROR(RANK($J152,INDIRECT((\"$J$\"&\"1\"&\":$J$\"&$A$351)))+COUNTIF($J$1:J152,J152)-1,\"\")","v":""},"",""]
[{"$f":"IF(Symbols!A153=\"\",\"\",Symbols!A153)","v":""},"","",{"$f":"IF(A153=\"\",\"\",RTD(\"cqg.rtd\", ,\"ContractData\",C153, \"LongDescription\",, \"T\"))","v":""},null,null,null,{"$f":"IF(A153=\"\",\"\",RTD(\"cqg.rtd\", ,\"ContractData\",C153, \"LastTradeToday\",, \"T\"))","v":""},{"$f":"IF(A153=\"\",\"\",RTD(\"cqg.rtd\", ,\"ContractData\",C153, \"NetLastTradeToday\",, \"T\"))","v":""},{"$f":"IF(A153=\"\",\"\",IFERROR(RTD(\"cqg.rtd\", ,\"ContractData\",C153, \"PerCentNetLastTrade\",, \"T\")/100,\"\"))","v":""},{"$f":"IF(A153=\"\",\"\",RTD(\"cqg.rtd\", ,\"ContractData\", C153, \"T_CVol\",, \"T\"))","v":""},153,{"$f":"IFERROR(RANK($J153,INDIRECT((\"$J$\"&\"1\"&\":$J$\"&$A$351)))+COUNTIF($J$1:J153,J153)-1,\"\")","v":""},"",""]
[{"$f":"IF(Symbols!A154=\"\",\"\",Symbols!A154)","v":""},"","",{"$f":"IF(A154=\"\",\"\",RTD(\"cqg.rtd\", ,\"ContractData\",C154, \"LongDescription\",, \"T\"))","v":""},null,null,null,{"$f":"IF(A154=\"\",\"\",RTD(\"cqg.rtd\", ,\"ContractData\",C154, \"LastTradeToday\",, \"T\"))","v":""},{"$f":"IF(A154=\"\",\"\",RTD(\"cqg.rtd\", ,\"ContractData\",C154, \"NetLastTradeToday\",, \"T\"))","v":""},{"$f":"IF(A154=\"\",\"\",IFERROR(RTD(\"cqg.rtd\", ,\"ContractData\",C154, \"PerCentNetLastTrade\",, \"T\")/100,\"\"))","v":""},{"$f":"IF(A154=\"\",\"\",RTD(\"cqg.rtd\", ,\"ContractData\", C154, \"T_CVol\",, \"T\"))","v":""},154,{"$f":"IFERROR(RANK($J154,INDIRECT((\"$J$\"&\"1\"&\":$J$\"&$A$351)))+COUNTIF($J$1:J154,J154)-1,\"\")","v":""},"",""]
[{"$f":"IF(Symbols!A155=\"\",\"\",Symbols!A155)","v":""},"","",{"$f":"IF(A155=\"\",\"\",RTD(\"cqg.rtd\", ,\"ContractData\",C155, \"LongDescription\",, \"T\"))","v":""},null,null,null,{"$f":"IF(A155=\"\",\"\",RTD(\"cqg.rtd\", ,\"ContractData\",C155, \"LastTradeToday\",, \"T\"))","v":""},{"$f":"IF(A155=\"\",\"\",RTD(\"cqg.rtd\", ,\"ContractData\",C155, \"NetLastTradeToday\",, \"T\"))","v":""},{"$f":"IF(A155=\"\",\"\",IFERROR(RTD(\"cqg.rtd\", ,\"ContractData\",C155, \"PerCentNetLastTrade\",, \"T\")/100,\"\"))","v":""},{"$f":"IF(A155=\"\",\"\",RTD(\"cqg.rtd\", ,\"ContractData\", C155, \"T_CVol\",, \"T\"))","v":""},155,{"$f":"IFERROR(RANK($J155,INDIRECT((\"$J$\"&\"1\"&\":$J$\"&$A$351)))+COUNTIF($J$1:J155,J155)-1,\"\")","v":""},"",""]
[{"$f":"IF(Symbols!A156=\"\",\"\",Symbols!A156)","v":""},"","",{"$f":"IF(A156=\"\",\"\",RTD(\"cqg.rtd\", ,\"ContractData\",C156, \"LongDescription\",, \"T\"))","v":""},null,null,null,{"$f":"IF(A156=\"\",\"\",RTD(\"cqg.rtd\", ,\"ContractData\",C156, \"LastTradeToday\",, \"T\"))","v":""},{"$f":"IF(A156=\"\",\"\",RTD(\"cqg.rtd\", ,\"ContractData\",C156, \"NetLastTradeToday\",, \"T\"))","v":""},{"$f":"IF(A156=\"\",\"\",IFERROR(RTD(\"cqg.rtd\", ,\"ContractData\",C156, \"PerCentNetLastTrade\",, \"T\")/100,\"\"))","v":""},{"$f":"IF(A156=\"\",\"\",RTD(\"cqg.rtd\", ,\"ContractData\", C156, \"T_CVol\",, \"T\"))","v":""},156,{"$f":"IFERROR(RANK($J156,INDIRECT((\"$J$\"&\"1\"&\":$J$\"&$A$351)))+COUNTIF($J$1:J156,J156)-1,\"\")","v":""},"",""]
[{"$f":"IF(Symbols!A157=\"\",\"\",Symbols!A157)","v":""},"","",{"$f":"IF(A157=\"\",\"\",RTD(\"cqg.rtd\", ,\"ContractData\",C157, \"LongDescription\",, \"T\"))","v":""},null,null,null,{"$f":"IF(A157=\"\",\"\",RTD(\"cqg.rtd\", ,\"ContractData\",C157, \"LastTradeToday\",, \"T\"))","v":""},{"$f":"IF(A157=\"\",\"\",RTD(\"cqg.rtd\", ,\"ContractData\",C157, \"NetLastTradeToday\",, \"T\"))","v":""},{"$f":"IF(A157=\"\",\"\",IFERROR(RTD(\"cqg.rtd\", ,\"ContractData\",C157, \"PerCentNetLastTrade\",, \"T\")/100,\"\"))","v":""},{"$f":"IF(A157=\"\",\"\",RTD(\"cqg.rtd\", ,\"ContractData\", C157, \"T_CVol\",, \"T\"))","v":""},157,{"$f":"IFERROR(RANK($J157,INDIRECT((\"$J$\"&\"1\"&\":$J$\"&$A$351)))+COUNTIF($J$1:J157,J157)-1,\"\")","v":""},"",""]
[{"$f":"IF(Symbols!A158=\"\",\"\",Symbols!A158)","v":""},"","",{"$f":"IF(A158=\"\",\"\",RTD(\"cqg.rtd\", ,\"ContractData\",C158, \"LongDescription\",, \"T\"))","v":""},null,null,null,{"$f":"IF(A158=\"\",\"\",RTD(\"cqg.rtd\", ,\"ContractData\",C158, \"LastTradeToday\",, \"T\"))","v":""},{"$f":"IF(A158=\"\",\"\",RTD(\"cqg.rtd\", ,\"ContractData\",C158, \"NetLastTradeToday\",, \"T\"))","v":""},{"$f":"IF(A158=\"\",\"\",IFERROR(RTD(\"cqg.rtd\", ,\"ContractData\",C158, \"PerCentNetLastTrade\",, \"T\")/100,\"\"))","v":""},{"$f":"IF(A158=\"\",\"\",RTD(\"cqg.rtd\", ,\"ContractData\", C158, \"T_CVol\",, \"T\"))","v":""},158,{"$f":"IFERROR(RANK($J158,INDIRECT((\"$J$\"&\"1\"&\":$J$\"&$A$351)))+COUNTIF($J$1:J158,J158)-1,\"\")","v":""},"",""]
[{"$f":"IF(Symbols!A159=\"\",\"\",Symbols!A159)","v":""},"","",{"$f":"IF(A159=\"\",\"\",RTD(\"cqg.rtd\", ,\"ContractData\",C159, \"LongDescription\",, \"T\"))","v":""},null,null,null,{"$f":"IF(A159=\"\",\"\",RTD(\"cqg.rtd\", ,\"ContractData\",C159, \"LastTradeToday\",, \"T\"))","v":""},{"$f":"IF(A159=\"\",\"\",RTD(\"cqg.rtd\", ,\"ContractData\",C159, \"NetLastTradeToday\",, \"T\"))","v":""},{"$f":"IF(A159=\"\",\"\",IFERROR(RTD(\"cqg.rtd\", ,\"ContractData\",C159, \"PerCentNetLastTrade\",, \"T\")/100,\"\"))","v":""},{"$f":"IF(A159=\"\",\"\",RTD(\"cqg.rtd\", ,\"ContractData\", C159, \"T_CVol\",, \"T\"))","v":""},159,{"$f":"IFERROR(RANK($J159,INDIRECT((\"$J$\"&\"1\"&\":$J$\"&$A$351)))+COUNTIF($J$1:J159,J159)-1,\"\")","v":""},"",""]
[{"$f":"IF(Symbols!A160=\"\",\"\",Symbols!A160)","v":""},"","",{"$f":"IF(A160=\"\",\"\",RTD(\"cqg.rtd\", ,\"ContractData\",C160, \"LongDescription\",, \"T\"))","v":""},null,null,null,{"$f":"IF(A160=\"\",\"\",RTD(\"cqg.rtd\", ,\"ContractData\",C160, \"LastTradeToday\",, \"T\"))","v":""},{"$f":"IF(A160=\"\",\"\",RTD(\"cqg.rtd\", ,\"ContractData\",C160, \"NetLastTradeToday\",, \"T\"))","v":""},{"$f":"IF(A160=\"\",\"\",IFERROR(RTD(\"cqg.rtd\", ,\"ContractData\",C160, \"PerCentNetLastTrade\",, \"T\")/100,\"\"))","v":""},{"$f":"IF(A160=\"\",\"\",RTD(\"cqg.rtd\", ,\"ContractData\", C160, \"T_CVol\",, \"T\"))","v":""},160,{"$f":"IFERROR(RANK($J160,INDIRECT((\"$J$\"&\"1\"&\":$J$\"&$A$351)))+COUNTIF($J$1:J160,J160)-1,\"\")","v":""},"",""]
[{"$f":"IF(Symbols!A161=\"\",\"\",Symbols!A161)","v":""},"","",{"$f":"IF(A161=\"\",\"\",RTD(\"cqg.rtd\", ,\"ContractData\",C161, \"LongDescription\",, \"T\"))","v":""},null,null,null,{"$f":"IF(A161=\"\",\"\",RTD(\"cqg.rtd\", ,\"ContractData\",C161, \"LastTradeToday\",, \"T\"))","v":""},{"$f":"IF(A161=\"\",\"\",RTD(\"cqg.rtd\", ,\"ContractData\",C161, \"NetLastTradeToday\",, \"T\"))","v":""},{"$f":"IF(A161=\"\",\"\",IFERROR(RTD(\"cqg.rtd\", ,\"ContractData\",C161, \"PerCentNetLastTrade\",, \"T\")/100,\"\"))","v":""},{"$f":"IF(A161=\"\",\"\",RTD(\"cqg.rtd\", ,\"ContractData\", C161, \"T_CVol\",, \"T\"))","v":""},161,{"$f":"IFERROR(RANK($J161,INDIRECT((\"$J$\"&\"1\"&\":$J$\"&$A$351)))+COUNTIF($J$1:J161,J161)-1,\"\")","v":""},"",""]
[{"$f":"IF(Symbols!A162=\"\",\"\",Symbols!A162)","v":""},"","",{"$f":"IF(A162=\"\",\"\",RTD(\"cqg.rtd\", ,\"ContractData\",C162, \"LongDescription\",, \"T\"))","v":""},null,null,null,{"$f":"IF(A162=\"\",\"\",RTD(\"cqg.rtd\", ,\"ContractData\",C162, \"LastTradeToday\",, \"T\"))","v":""},{"$f":"IF(A162=\"\",\"\",RTD(\"cqg.rtd\", ,\"ContractData\",C162, \"NetLastTradeToday\",, \"T\"))","v":""},{"$f":"IF(A162=\"\",\"\",IFERROR(RTD(\"cqg.rtd\", ,\"ContractData\",C162, \"PerCentNetLastTrade\",, \"T\")/100,\"\"))","v":""},{"$f":"IF(A162=\"\",\"\",RTD(\"cqg.rtd\", ,\"ContractData\", C162, \"T_CVol\",, \"T\"))","v":""},162,{"$f":"IFERROR(RANK($J162,INDIRECT((\"$J$\"&\"1\"&\":$J$\"&$A$351)))+COUNTIF($J$1:J162,J162)-1,\"\")","v":""},"",""]
[{"$f":"IF(Symbols!A163=\"\",\"\",Symbols!A163)","v":""},"","",{"$f":"IF(A163=\"\",\"\",RTD(\"cqg.rtd\", ,\"ContractData\",C163, \"LongDescription\",, \"T\"))","v":""},null,null,null,{"$f":"IF(A163=\"\",\"\",RTD(\"cqg.rtd\", ,\"ContractData\",C163, \"LastTradeToday\",, \"T\"))","v":""},{"$f":"IF(A163=\"\",\"\",RTD(\"cqg.rtd\", ,\"ContractData\",C163, \"NetLastTradeToday\",, \"T\"))","v":""},{"$f":"IF(A163=\"\",\"\",IFERROR(RTD(\"cqg.rtd\", ,\"ContractData\",C163, \"PerCentNetLastTrade\",, \"T\")/100,\"\"))","v":""},{"$f":"IF(A163=\"\",\"\",RTD(\"cqg.rtd\", ,\"ContractData\", C163, \"T_CVol\",, \"T\"))","v":""},163,{"$f":"IFERROR(RANK($J163,INDIRECT((\"$J$\"&\"1\"&\":$J$\"&$A$351)))+COUNTIF($J$1:J163,J163)-1,\"\")","v":""},"",""]
[{"$f":"IF(Symbols!A164=\"\",\"\",Symbols!A164)","v":""},"","",{"$f":"IF(A164=\"\",\"\",RTD(\"cqg.rtd\", ,\"ContractData\",C164, \"LongDescription\",, \"T\"))","v":""},null,null,null,{"$f":"IF(A164=\"\",\"\",RTD(\"cqg.rtd\", ,\"ContractData\",C164, \"LastTradeToday\",, \"T\"))","v":""},{"$f":"IF(A164=\"\",\"\",RTD(\"cqg.rtd\", ,\"ContractData\",C164, \"NetLastTradeToday\",, \"T\"))","v":""},{"$f":"IF(A164=\"\",\"\",IFERROR(RTD(\"cqg.rtd\", ,\"ContractData\",C164, \"PerCentNetLastTrade\",, \"T\")/100,\"\"))","v":""},{"$f":"IF(A164=\"\",\"\",RTD(\"cqg.rtd\", ,\"ContractData\", C164, \"T_CVol\",, \"T\"))","v":""},164,{"$f":"IFERROR(RANK($J164,INDIRECT((\"$J$\"&\"1\"&\":$J$\"&$A$351)))+COUNTIF($J$1:J164,J164)-1,\"\")","v":""},"",""]
[{"$f":"IF(Symbols!A165=\"\",\"\",Symbols!A165)","v":""},"","",{"$f":"IF(A165=\"\",\"\",RTD(\"cqg.rtd\", ,\"ContractData\",C165, \"LongDescription\",, \"T\"))","v":""},null,null,null,{"$f":"IF(A165=\"\",\"\",RTD(\"cqg.rtd\", ,\"ContractData\",C165, \"LastTradeToday\",, \"T\"))","v":""},{"$f":"IF(A165=\"\",\"\",RTD(\"cqg.rtd\", ,\"ContractData\",C165, \"NetLastTradeToday\",, \"T\"))","v":""},{"$f":"IF(A165=\"\",\"\",IFERROR(RTD(\"cqg.rtd\", ,\"ContractData\",C165, \"PerCentNetLastTrade\",, \"T\")/100,\"\"))","v":""},{"$f":"IF(A165=\"\",\"\",RTD(\"cqg.rtd\", ,\"ContractData\", C165, \"T_CVol\",, \"T\"))","v":""},165,{"$f":"IFERROR(RANK($J165,INDIRECT((\"$J$\"&\"1\"&\":$J$\"&$A$351)))+COUNTIF($J$1:J165,J165)-1,\"\")","v":""},"",""]
[{"$f":"IF(Symbols!A166=\"\",\"\",Symbols!A166)","v":""},"","",{"$f":"IF(A166=\"\",\"\",RTD(\"cqg.rtd\", ,\"ContractData\",C166, \"LongDescription\",, \"T\"))","v":""},null,null,null,{"$f":"IF(A166=\"\",\"\",RTD(\"cqg.rtd\", ,\"ContractData\",C166, \"LastTradeToday\",, \"T\"))","v":""},{"$f":"IF(A166=\"\",\"\",RTD(\"cqg.rtd\", ,\"ContractData\",C166, \"NetLastTradeToday\",, \"T\"))","v":""},{"$f":"IF(A166=\"\",\"\",IFERROR(RTD(\"cqg.rtd\", ,\"ContractData\",C166, \"PerCentNetLastTrade\",, \"T\")/100,\"\"))","v":""},{"$f":"IF(A166=\"\",\"\",RTD(\"cqg.rtd\", ,\"ContractData\", C166, \"T_CVol\",, \"T\"))","v":""},166,{"$f":"IFERROR(RANK($J166,INDIRECT((\"$J$\"&\"1\"&\":$J$\"&$A$351)))+COUNTIF($J$1:J166,J166)-1,\"\")","v":""},"",""]
[{"$f":"IF(Symbols!A167=\"\",\"\",Symbols!A167)","v":""},"","",{"$f":"IF(A167=\"\",\"\",RTD(\"cqg.rtd\", ,\"ContractData\",C167, \"LongDescription\",, \"T\"))","v":""},null,null,null,{"$f":"IF(A167=\"\",\"\",RTD(\"cqg.rtd\", ,\"ContractData\",C167, \"LastTradeToday\",, \"T\"))","v":""},{"$f":"IF(A167=\"\",\"\",RTD(\"cqg.rtd\", ,\"ContractData\",C167, \"NetLastTradeToday\",, \"T\"))","v":""},{"$f":"IF(A167=\"\",\"\",IFERROR(RTD(\"cqg.rtd\", ,\"ContractData\",C167, \"PerCentNetLastTrade\",, \"T\")/100,\"\"))","v":""},{"$f":"IF(A167=\"\",\"\",RTD(\"cqg.rtd\", ,\"ContractData\", C167, \"T_CVol\",, \"T\"))","v":""},167,{"$f":"IFERROR(RANK($J167,INDIRECT((\"$J$\"&\"1\"&\":$J$\"&$A$351)))+COUNTIF($J$1:J167,J167)-1,\"\")","v":""},"",""]
[{"$f":"IF(Symbols!A168=\"\",\"\",Symbols!A168)","v":""},"","",{"$f":"IF(A168=\"\",\"\",RTD(\"cqg.rtd\", ,\"ContractData\",C168, \"LongDescription\",, \"T\"))","v":""},null,null,null,{"$f":"IF(A168=\"\",\"\",RTD(\"cqg.rtd\", ,\"ContractData\",C168, \"LastTradeToday\",, \"T\"))","v":""},{"$f":"IF(A168=\"\",\"\",RTD(\"cqg.rtd\", ,\"ContractData\",C168, \"NetLastTradeToday\",, \"T\"))","v":""},{"$f":"IF(A168=\"\",\"\",IFERROR(RTD(\"cqg.rtd\", ,\"ContractData\",C168, \"PerCentNetLastTrade\",, \"T\")/100,\"\"))","v":""},{"$f":"IF(A168=\"\",\"\",RTD(\"cqg.rtd\", ,\"ContractData\", C168, \"T_CVol\",, \"T\"))","v":""},168,{"$f":"IFERROR(RANK($J168,INDIRECT((\"$J$\"&\"1\"&\":$J$\"&$A$351)))+COUNTIF($J$1:J168,J168)-1,\"\")","v":""},"",""]
[{"$f":"IF(Symbols!A169=\"\",\"\",Symbols!A169)","v":""},"","",{"$f":"IF(A169=\"\",\"\",RTD(\"cqg.rtd\", ,\"ContractData\",C169, \"LongDescription\",, \"T\"))","v":""},null,null,null,{"$f":"IF(A169=\"\",\"\",RTD(\"cqg.rtd\", ,\"ContractData\",C169, \"LastTradeToday\",, \"T\"))","v":""},{"$f":"IF(A169=\"\",\"\",RTD(\"cqg.rtd\", ,\"ContractData\",C169, \"NetLastTradeToday\",, \"T\"))","v":""},{"$f":"IF(A169=\"\",\"\",IFERROR(RTD(\"cqg.rtd\", ,\"ContractData\",C169, \"PerCentNetLastTrade\",, \"T\")/100,\"\"))","v":""},{"$f":"IF(A169=\"\",\"\",RTD(\"cqg.rtd\", ,\"ContractData\", C169, \"T_CVol\",, \"T\"))","v":""},169,{"$f":"IFERROR(RANK($J169,INDIRECT((\"$J$\"&\"1\"&\":$J$\"&$A$351)))+COUNTIF($J$1:J169,J169)-1,\"\")","v":""},"",""]
[{"$f":"IF(Symbols!A170=\"\",\"\",Symbols!A170)","v":""},"","",{"$f":"IF(A170=\"\",\"\",RTD(\"cqg.rtd\", ,\"ContractData\",C170, \"LongDescription\",, \"T\"))","v":""},null,null,null,{"$f":"IF(A170=\"\",\"\",RTD(\"cqg.rtd\", ,\"ContractData\",C170, \"LastTradeToday\",, \"T\"))","v":""},{"$f":"IF(A170=\"\",\"\",RTD(\"cqg.rtd\", ,\"ContractData\",C170, \"NetLastTradeToday\",, \"T\"))","v":""},{"$f":"IF(A170=\"\",\"\",IFERROR(RTD(\"cqg.rtd\", ,\"ContractData\",C170, \"PerCentNetLastTrade\",, \"T\")/100,\"\"))","v":""},{"$f":"IF(A170=\"\",\"\",RTD(\"cqg.rtd\", ,\"ContractData\", C170, \"T_CVol\",, \"T\"))","v":""},170,{"$f":"IFERROR(RANK($J170,INDIRECT((\"$J$\"&\"1\"&\":$J$\"&$A$351)))+COUNTIF($J$1:J170,J170)-1,\"\")","v":""},"",""]
[{"$f":"IF(Symbols!A171=\"\",\"\",Symbols!A171)","v":""},"","",{"$f":"IF(A171=\"\",\"\",RTD(\"cqg.rtd\", ,\"ContractData\",C171, \"LongDescription\",, \"T\"))","v":""},null,null,null,{"$f":"IF(A171=\"\",\"\",RTD(\"cqg.rtd\", ,\"ContractData\",C171, \"LastTradeToday\",, \"T\"))","v":""},{"$f":"IF(A171=\"\",\"\",RTD(\"cqg.rtd\", ,\"ContractData\",C171, \"NetLastTradeToday\",, \"T\"))","v":""},{"$f":"IF(A171=\"\",\"\",IFERROR(RTD(\"cqg.rtd\", ,\"ContractData\",C171, \"PerCentNetLastTrade\",, \"T\")/100,\"\"))","v":""},{"$f":"IF(A171=\"\",\"\",RTD(\"cqg.rtd\", ,\"ContractData\", C171, \"T_CVol\",, \"T\"))","v":""},171,{"$f":"IFERROR(RANK($J171,INDIRECT((\"$J$\"&\"1\"&\":$J$\"&$A$351)))+COUNTIF($J$1:J171,J171)-1,\"\")","v":""},"",""]
[{"$f":"IF(Symbols!A172=\"\",\"\",Symbols!A172)","v":""},"","",{"$f":"IF(A172=\"\",\"\",RTD(\"cqg.rtd\", ,\"ContractData\",C172, \"LongDescription\",, \"T\"))","v":""},null,null,null,{"$f":"IF(A172=\"\",\"\",RTD(\"cqg.rtd\", ,\"ContractData\",C172, \"LastTradeToday\",, \"T\"))","v":""},{"$f":"IF(A172=\"\",\"\",RTD(\"cqg.rtd\", ,\"ContractData\",C172, \"NetLastTradeToday\",, \"T\"))","v":""},{"$f":"IF(A172=\"\",\"\",IFERROR(RTD(\"cqg.rtd\", ,\"ContractData\",C172, \"PerCentNetLastTrade\",, \"T\")/100,\"\"))","v":""},{"$f":"IF(A172=\"\",\"\",RTD(\"cqg.rtd\", ,\"ContractData\", C172, \"T_CVol\",, \"T\"))","v":""},172,{"$f":"IFERROR(RANK($J172,INDIRECT((\"$J$\"&\"1\"&\":$J$\"&$A$351)))+COUNTIF($J$1:J172,J172)-1,\"\")","v":""},"",""]
[{"$f":"IF(Symbols!A173=\"\",\"\",Symbols!A173)","v":""},"","",{"$f":"IF(A173=\"\",\"\",RTD(\"cqg.rtd\", ,\"ContractData\",C173, \"LongDescription\",, \"T\"))","v":""},null,null,null,{"$f":"IF(A173=\"\",\"\",RTD(\"cqg.rtd\", ,\"ContractData\",C173, \"LastTradeToday\",, \"T\"))","v":""},{"$f":"IF(A173=\"\",\"\",RTD(\"cqg.rtd\", ,\"ContractData\",C173, \"NetLastTradeToday\",, \"T\"))","v":""},{"$f":"IF(A173=\"\",\"\",IFERROR(RTD(\"cqg.rtd\", ,\"ContractData\",C173, \"PerCentNetLastTrade\",, \"T\")/100,\"\"))","v":""},{"$f":"IF(A173=\"\",\"\",RTD(\"cqg.rtd\", ,\"ContractData\", C173, \"T_CVol\",, \"T\"))","v":""},173,{"$f":"IFERROR(RANK($J173,INDIRECT((\"$J$\"&\"1\"&\":$J$\"&$A$351)))+COUNTIF($J$1:J173,J173)-1,\"\")","v":""},"",""]
[{"$f":"IF(Symbols!A174=\"\",\"\",Symbols!A174)","v":""},"","",{"$f":"IF(A174=\"\",\"\",RTD(\"cqg.rtd\", ,\"ContractData\",C174, \"LongDescription\",, \"T\"))","v":""},null,null,null,{"$f":"IF(A174=\"\",\"\",RTD(\"cqg.rtd\", ,\"ContractData\",C174, \"LastTradeToday\",, \"T\"))","v":""},{"$f":"IF(A174=\"\",\"\",RTD(\"cqg.rtd\", ,\"ContractData\",C174, \"NetLastTradeToday\",, \"T\"))","v":""},{"$f":"IF(A174=\"\",\"\",IFERROR(RTD(\"cqg.rtd\", ,\"ContractData\",C174, \"PerCentNetLastTrade\",, \"T\")/100,\"\"))","v":""},{"$f":"IF(A174=\"\",\"\",RTD(\"cqg.rtd\", ,\"ContractData\", C174, \"T_CVol\",, \"T\"))","v":""},174,{"$f":"IFERROR(RANK($J174,INDIRECT((\"$J$\"&\"1\"&\":$J$\"&$A$351)))+COUNTIF($J$1:J174,J174)-1,\"\")","v":""},"",""]
[{"$f":"IF(Symbols!A175=\"\",\"\",Symbols!A175)","v":""},"","",{"$f":"IF(A175=\"\",\"\",RTD(\"cqg.rtd\", ,\"ContractData\",C175, \"LongDescription\",, \"T\"))","v":""},null,null,null,{"$f":"IF(A175=\"\",\"\",RTD(\"cqg.rtd\", ,\"ContractData\",C175, \"LastTradeToday\",, \"T\"))","v":""},{"$f":"IF(A175=\"\",\"\",RTD(\"cqg.rtd\", ,\"ContractData\",C175, \"NetLastTradeToday\",, \"T\"))","v":""},{"$f":"IF(A175=\"\",\"\",IFERROR(RTD(\"cqg.rtd\", ,\"ContractData\",C175, \"PerCentNetLastTrade\",, \"T\")/100,\"\"))","v":""},{"$f":"IF(A175=\"\",\"\",RTD(\"cqg.rtd\", ,\"ContractData\", C175, \"T_CVol\",, \"T\"))","v":""},175,{"$f":"IFERROR(RANK($J175,INDIRECT((\"$J$\"&\"1\"&\":$J$\"&$A$351)))+COUNTIF($J$1:J175,J175)-1,\"\")","v":""},"",""]
[{"$f":"IF(Symbols!A176=\"\",\"\",Symbols!A176)","v":""},"","",{"$f":"IF(A176=\"\",\"\",RTD(\"cqg.rtd\", ,\"ContractData\",C176, \"LongDescription\",, \"T\"))","v":""},null,null,null,{"$f":"IF(A176=\"\",\"\",RTD(\"cqg.rtd\", ,\"ContractData\",C176, \"LastTradeToday\",, \"T\"))","v":""},{"$f":"IF(A176=\"\",\"\",RTD(\"cqg.rtd\", ,\"ContractData\",C176, \"NetLastTradeToday\",, \"T\"))","v":""},{"$f":"IF(A176=\"\",\"\",IFERROR(RTD(\"cqg.rtd\", ,\"ContractData\",C176, \"PerCentNetLastTrade\",, \"T\")/100,\"\"))","v":""},{"$f":"IF(A176=\"\",\"\",RTD(\"cqg.rtd\", ,\"ContractData\", C176, \"T_CVol\",, \"T\"))","v":""},176,{"$f":"IFERROR(RANK($J176,INDIRECT((\"$J$\"&\"1\"&\":$J$\"&$A$351)))+COUNTIF($J$1:J176,J176)-1,\"\")","v":""},"",""]
[{"$f":"IF(Symbols!A177=\"\",\"\",Symbols!A177)","v":""},"","",{"$f":"IF(A177=\"\",\"\",RTD(\"cqg.rtd\", ,\"ContractData\",C177, \"LongDescription\",, \"T\"))","v":""},null,null,null,{"$f":"IF(A177=\"\",\"\",RTD(\"cqg.rtd\", ,\"ContractData\",C177, \"LastTradeToday\",, \"T\"))","v":""},{"$f":"IF(A177=\"\",\"\",RTD(\"cqg.rtd\", ,\"ContractData\",C177, \"NetLastTradeToday\",, \"T\"))","v":""},{"$f":"IF(A177=\"\",\"\",IFERROR(RTD(\"cqg.rtd\", ,\"ContractData\",C177, \"PerCentNetLastTrade\",, \"T\")/100,\"\"))","v":""},{"$f":"IF(A177=\"\",\"\",RTD(\"cqg.rtd\", ,\"ContractData\", C177, \"T_CVol\",, \"T\"))","v":""},177,{"$f":"IFERROR(RANK($J177,INDIRECT((\"$J$\"&\"1\"&\":$J$\"&$A$351)))+COUNTIF($J$1:J177,J177)-1,\"\")","v":""},"",""]
[{"$f":"IF(Symbols!A178=\"\",\"\",Symbols!A178)","v":""},"","",{"$f":"IF(A178=\"\",\"\",RTD(\"cqg.rtd\", ,\"ContractData\",C178, \"LongDescription\",, \"T\"))","v":""},null,null,null,{"$f":"IF(A178=\"\",\"\",RTD(\"cqg.rtd\", ,\"ContractData\",C178, \"LastTradeToday\",, \"T\"))","v":""},{"$f":"IF(A178=\"\",\"\",RTD(\"cqg.rtd\", ,\"ContractData\",C178, \"NetLastTradeToday\",, \"T\"))","v":""},{"$f":"IF(A178=\"\",\"\",IFERROR(RTD(\"cqg.rtd\", ,\"ContractData\",C178, \"PerCentNetLastTrade\",, \"T\")/100,\"\"))","v":""},{"$f":"IF(A178=\"\",\"\",RTD(\"cqg.rtd\", ,\"ContractData\", C178, \"T_CVol\",, \"T\"))","v":""},178,{"$f":"IFERROR(RANK($J178,INDIRECT((\"$J$\"&\"1\"&\":$J$\"&$A$351)))+COUNTIF($J$1:J178,J178)-1,\"\")","v":""},"",""]
[{"$f":"IF(Symbols!A179=\"\",\"\",Symbols!A179)","v":""},"","",{"$f":"IF(A179=\"\",\"\",RTD(\"cqg.rtd\", ,\"ContractData\",C179, \"LongDescription\",, \"T\"))","v":""},null,null,null,{"$f":"IF(A179=\"\",\"\",RTD(\"cqg.rtd\", ,\"ContractData\",C179, \"LastTradeToday\",, \"T\"))","v":""},{"$f":"IF(A179=\"\",\"\",RTD(\"cqg.rtd\", ,\"ContractData\",C179, \"NetLastTradeToday\",, \"T\"))","v":""},{"$f":"IF(A179=\"\",\"\",IFERROR(RTD(\"cqg.rtd\", ,\"ContractData\",C179, \"PerCentNetLastTrade\",, \"T\")/100,\"\"))","v":""},{"$f":"IF(A179=\"\",\"\",RTD(\"cqg.rtd\", ,\"ContractData\", C179, \"T_CVol\",, \"T\"))","v":""},179,{"$f":"IFERROR(RANK($J179,INDIRECT((\"$J$\"&\"1\"&\":$J$\"&$A$351)))+COUNTIF($J$1:J179,J179)-1,\"\")","v":""},"",""]
[{"$f":"IF(Symbols!A180=\"\",\"\",Symbols!A180)","v":""},"","",{"$f":"IF(A180=\"\",\"\",RTD(\"cqg.rtd\", ,\"ContractData\",C180, \"LongDescription\",, \"T\"))","v":""},null,null,null,{"$f":"IF(A180=\"\",\"\",RTD(\"cqg.rtd\", ,\"ContractData\",C180, \"LastTradeToday\",, \"T\"))","v":""},{"$f":"IF(A180=\"\",\"\",RTD(\"cqg.rtd\", ,\"ContractData\",C180, \"NetLastTradeToday\",, \"T\"))","v":""},{"$f":"IF(A180=\"\",\"\",IFERROR(RTD(\"cqg.rtd\", ,\"ContractData\",C180, \"PerCentNetLastTrade\",, \"T\")/100,\"\"))","v":""},{"$f":"IF(A180=\"\",\"\",RTD(\"cqg.rtd\", ,\"ContractData\", C180, \"T_CVol\",, \"T\"))","v":""},180,{"$f":"IFERROR(RANK($J180,INDIRECT((\"$J$\"&\"1\"&\":$J$\"&$A$351)))+COUNTIF($J$1:J180,J180)-1,\"\")","v":""},"",""]
[{"$f":"IF(Symbols!A181=\"\",\"\",Symbols!A181)","v":""},"","",{"$f":"IF(A181=\"\",\"\",RTD(\"cqg.rtd\", ,\"ContractData\",C181, \"LongDescription\",, \"T\"))","v":""},null,null,null,{"$f":"IF(A181=\"\",\"\",RTD(\"cqg.rtd\", ,\"ContractData\",C181, \"LastTradeToday\",, \"T\"))","v":""},{"$f":"IF(A181=\"\",\"\",RTD(\"cqg.rtd\", ,\"ContractData\",C181, \"NetLastTradeToday\",, \"T\"))","v":""},{"$f":"IF(A181=\"\",\"\",IFERROR(RTD(\"cqg.rtd\", ,\"ContractData\",C181, \"PerCentNetLastTrade\",, \"T\")/100,\"\"))","v":""},{"$f":"IF(A181=\"\",\"\",RTD(\"cqg.rtd\", ,\"ContractData\", C181, \"T_CVol\",, \"T\"))","v":""},181,{"$f":"IFERROR(RANK($J181,INDIRECT((\"$J$\"&\"1\"&\":$J$\"&$A$351)))+COUNTIF($J$1:J181,J181)-1,\"\")","v":""},"",""]
[{"$f":"IF(Symbols!A182=\"\",\"\",Symbols!A182)","v":""},"","",{"$f":"IF(A182=\"\",\"\",RTD(\"cqg.rtd\", ,\"ContractData\",C182, \"LongDescription\",, \"T\"))","v":""},null,null,null,{"$f":"IF(A182=\"\",\"\",RTD(\"cqg.rtd\", ,\"ContractData\",C182, \"LastTradeToday\",, \"T\"))","v":""},{"$f":"IF(A182=\"\",\"\",RTD(\"cqg.rtd\", ,\"ContractData\",C182, \"NetLastTradeToday\",, \"T\"))","v":""},{"$f":"IF(A182=\"\",\"\",IFERROR(RTD(\"cqg.rtd\", ,\"ContractData\",C182, \"PerCentNetLastTrade\",, \"T\")/100,\"\"))","v":""},{"$f":"IF(A182=\"\",\"\",RTD(\"cqg.rtd\", ,\"ContractData\", C182, \"T_CVol\",, \"T\"))","v":""},182,{"$f":"IFERROR(RANK($J182,INDIRECT((\"$J$\"&\"1\"&\":$J$\"&$A$351)))+COUNTIF($J$1:J182,J182)-1,\"\")","v":""},"",""]
[{"$f":"IF(Symbols!A183=\"\",\"\",Symbols!A183)","v":""},"","",{"$f":"IF(A183=\"\",\"\",RTD(\"cqg.rtd\", ,\"ContractData\",C183, \"LongDescription\",, \"T\"))","v":""},null,null,null,{"$f":"IF(A183=\"\",\"\",RTD(\"cqg.rtd\", ,\"ContractData\",C183, \"LastTradeToday\",, \"T\"))","v":""},{"$f":"IF(A183=\"\",\"\",RTD(\"cqg.rtd\", ,\"ContractData\",C183, \"NetLastTradeToday\",, \"T\"))","v":""},{"$f":"IF(A183=\"\",\"\",IFERROR(RTD(\"cqg.rtd\", ,\"ContractData\",C183, \"PerCentNetLastTrade\",, \"T\")/100,\"\"))","v":""},{"$f":"IF(A183=\"\",\"\",RTD(\"cqg.rtd\", ,\"ContractData\", C183, \"T_CVol\",, \"T\"))","v":""},183,{"$f":"IFERROR(RANK($J183,INDIRECT((\"$J$\"&\"1\"&\":$J$\"&$A$351)))+COUNTIF($J$1:J183,J183)-1,\"\")","v":""},"",""]
[{"$f":"IF(Symbols!A184=\"\",\"\",Symbols!A184)","v":""},"","",{"$f":"IF(A184=\"\",\"\",RTD(\"cqg.rtd\", ,\"ContractData\",C184, \"LongDescription\",, \"T\"))","v":""},null,null,null,{"$f":"IF(A184=\"\",\"\",RTD(\"cqg.rtd\", ,\"ContractData\",C184, \"LastTradeToday\",, \"T\"))","v":""},{"$f":"IF(A184=\"\",\"\",RTD(\"cqg.rtd\", ,\"ContractData\",C184, \"NetLastTradeToday\",, \"T\"))","v":""},{"$f":"IF(A184=\"\",\"\",IFERROR(RTD(\"cqg.rtd\", ,\"ContractData\",C184, \"PerCentNetLastTrade\",, \"T\")/100,\"\"))","v":""},{"$f":"IF(A184=\"\",\"\",RTD(\"cqg.rtd\", ,\"ContractData\", C184, \"T_CVol\",, \"T\"))","v":""},184,{"$f":"IFERROR(RANK($J184,INDIRECT((\"$J$\"&\"1\"&\":$J$\"&$A$351)))+COUNTIF($J$1:J184,J184)-1,\"\")","v":""},"",""]
[{"$f":"IF(Symbols!A185=\"\",\"\",Symbols!A185)","v":""},"","",{"$f":"IF(A185=\"\",\"\",RTD(\"cqg.rtd\", ,\"ContractData\",C185, \"LongDescription\",, \"T\"))","v":""},null,null,null,{"$f":"IF(A185=\"\",\"\",RTD(\"cqg.rtd\", ,\"ContractData\",C185, \"LastTradeToday\",, \"T\"))","v":""},{"$f":"IF(A185=\"\",\"\",RTD(\"cqg.rtd\", ,\"ContractData\",C185, \"NetLastTradeToday\",, \"T\"))","v":""},{"$f":"IF(A185=\"\",\"\",IFERROR(RTD(\"cqg.rtd\", ,\"ContractData\",C185, \"PerCentNetLastTrade\",, \"T\")/100,\"\"))","v":""},{"$f":"IF(A185=\"\",\"\",RTD(\"cqg.rtd\", ,\"ContractData\", C185, \"T_CVol\",, \"T\"))","v":""},185,{"$f":"IFERROR(RANK($J185,INDIRECT((\"$J$\"&\"1\"&\":$J$\"&$A$351)))+COUNTIF($J$1:J185,J185)-1,\"\")","v":""},"",""]
[{"$f":"IF(Symbols!A186=\"\",\"\",Symbols!A186)","v":""},"","",{"$f":"IF(A186=\"\",\"\",RTD(\"cqg.rtd\", ,\"ContractData\",C186, \"LongDescription\",, \"T\"))","v":""},null,null,null,{"$f":"IF(A186=\"\",\"\",RTD(\"cqg.rtd\", ,\"ContractData\",C186, \"LastTradeToday\",, \"T\"))","v":""},{"$f":"IF(A186=\"\",\"\",RTD(\"cqg.rtd\", ,\"ContractData\",C186, \"NetLastTradeToday\",, \"T\"))","v":""},{"$f":"IF(A186=\"\",\"\",IFERROR(RTD(\"cqg.rtd\", ,\"ContractData\",C186, \"PerCentNetLastTrade\",, \"T\")/100,\"\"))","v":""},{"$f":"IF(A186=\"\",\"\",RTD(\"cqg.rtd\", ,\"ContractData\", C186, \"T_CVol\",, \"T\"))","v":""},186,{"$f":"IFERROR(RANK($J186,INDIRECT((\"$J$\"&\"1\"&\":$J$\"&$A$351)))+COUNTIF($J$1:J186,J186)-1,\"\")","v":""},"",""]
[{"$f":"IF(Symbols!A187=\"\",\"\",Symbols!A187)","v":""},"","",{"$f":"IF(A187=\"\",\"\",RTD(\"cqg.rtd\", ,\"ContractData\",C187, \"LongDescription\",, \"T\"))","v":""},null,null,null,{"$f":"IF(A187=\"\",\"\",RTD(\"cqg.rtd\", ,\"ContractData\",C187, \"LastTradeToday\",, \"T\"))","v":""},{"$f":"IF(A187=\"\",\"\",RTD(\"cqg.rtd\", ,\"ContractData\",C187, \"NetLastTradeToday\",, \"T\"))","v":""},{"$f":"IF(A187=\"\",\"\",IFERROR(RTD(\"cqg.rtd\", ,\"ContractData\",C187, \"PerCentNetLastTrade\",, \"T\")/100,\"\"))","v":""},{"$f":"IF(A187=\"\",\"\",RTD(\"cqg.rtd\", ,\"ContractData\", C187, \"T_CVol\",, \"T\"))","v":""},187,{"$f":"IFERROR(RANK($J187,INDIRECT((\"$J$\"&\"1\"&\":$J$\"&$A$351)))+COUNTIF($J$1:J187,J187)-1,\"\")","v":""},"",""]
[{"$f":"IF(Symbols!A188=\"\",\"\",Symbols!A188)","v":""},"","",{"$f":"IF(A188=\"\",\"\",RTD(\"cqg.rtd\", ,\"ContractData\",C188, \"LongDescription\",, \"T\"))","v":""},null,null,null,{"$f":"IF(A188=\"\",\"\",RTD(\"cqg.rtd\", ,\"ContractData\",C188, \"LastTradeToday\",, \"T\"))","v":""},{"$f":"IF(A188=\"\",\"\",RTD(\"cqg.rtd\", ,\"ContractData\",C188, \"NetLastTradeToday\",, \"T\"))","v":""},{"$f":"IF(A188=\"\",\"\",IFERROR(RTD(\"cqg.rtd\", ,\"ContractData\",C188, \"PerCentNetLastTrade\",, \"T\")/100,\"\"))","v":""},{"$f":"IF(A188=\"\",\"\",RTD(\"cqg.rtd\", ,\"ContractData\", C188, \"T_CVol\",, \"T\"))","v":""},188,{"$f":"IFERROR(RANK($J188,INDIRECT((\"$J$\"&\"1\"&\":$J$\"&$A$351)))+COUNTIF($J$1:J188,J188)-1,\"\")","v":""},"",""]
[{"$f":"IF(Symbols!A189=\"\",\"\",Symbols!A189)","v":""},{"$f":"IF(A189=\"\",\"\",IF(J189>0,1,0))","v":""},{"$f":"A189","v":""},{"$f":"IF(A189=\"\",\"\",RTD(\"cqg.rtd\", ,\"ContractData\",C189, \"LongDescription\",, \"T\"))","v":""},null,null,null,{"$f":"IF(A189=\"\",\"\",RTD(\"cqg.rtd\", ,\"ContractData\",C189, \"LastTradeToday\",, \"T\"))","v":""},{"$f":"IF(A189=\"\",\"\",RTD(\"cqg.rtd\", ,\"ContractData\",C189, \"NetLastTradeToday\",, \"T\"))","v":""},{"$f":"IF(A189=\"\",\"\",IFERROR(RTD(\"cqg.rtd\", ,\"ContractData\",C189, \"PerCentNetLastTrade\",, \"T\")/100,\"\"))","v":""},{"$f":"IF(A189=\"\",\"\",RTD(\"cqg.rtd\", ,\"ContractData\", C189, \"T_CVol\",, \"T\"))","v":""},189,{"$f":"IFERROR(RANK($J189,INDIRECT((\"$J$\"&\"1\"&\":$J$\"&$A$351)))+COUNTIF($J$1:J189,J189)-1,\"\")","v":""},{"$f":"C189","v":""},""]
[{"$f":"IF(Symbols!A190=\"\",\"\",Symbols!A190)","v":""},"","",{"$f":"IF(A190=\"\",\"\",RTD(\"cqg.rtd\", ,\"ContractData\",C190, \"LongDescription\",, \"T\"))","v":""},null,null,null,{"$f":"IF(A190=\"\",\"\",RTD(\"cqg.rtd\", ,\"ContractData\",C190, \"LastTradeToday\",, \"T\"))","v":""},{"$f":"IF(A190=\"\",\"\",RTD(\"cqg.rtd\", ,\"ContractData\",C190, \"NetLastTradeToday\",, \"T\"))","v":""},{"$f":"IF(A190=\"\",\"\",IFERROR(RTD(\"cqg.rtd\", ,\"ContractData\",C190, \"PerCentNetLastTrade\",, \"T\")/100,\"\"))","v":""},{"$f":"IF(A190=\"\",\"\",RTD(\"cqg.rtd\", ,\"ContractData\", C190, \"T_CVol\",, \"T\"))","v":""},190,{"$f":"IFERROR(RANK($J190,INDIRECT((\"$J$\"&\"1\"&\":$J$\"&$A$351)))+COUNTIF($J$1:J190,J190)-1,\"\")","v":""},"",""]
[{"$f":"IF(Symbols!A191=\"\",\"\",Symbols!A191)","v":""},"","",{"$f":"IF(A191=\"\",\"\",RTD(\"cqg.rtd\", ,\"ContractData\",C191, \"LongDescription\",, \"T\"))","v":""},null,null,null,{"$f":"IF(A191=\"\",\"\",RTD(\"cqg.rtd\", ,\"ContractData\",C191, \"LastTradeToday\",, \"T\"))","v":""},{"$f":"IF(A191=\"\",\"\",RTD(\"cqg.rtd\", ,\"ContractData\",C191, \"NetLastTradeToday\",, \"T\"))","v":""},{"$f":"IF(A191=\"\",\"\",IFERROR(RTD(\"cqg.rtd\", ,\"ContractData\",C191, \"PerCentNetLastTrade\",, \"T\")/100,\"\"))","v":""},{"$f":"IF(A191=\"\",\"\",RTD(\"cqg.rtd\", ,\"ContractData\", C191, \"T_CVol\",, \"T\"))","v":""},191,{"$f":"IFERROR(RANK($J191,INDIRECT((\"$J$\"&\"1\"&\":$J$\"&$A$351)))+COUNTIF($J$1:J191,J191)-1,\"\")","v":""},"",""]
[{"$f":"IF(Symbols!A192=\"\",\"\",Symbols!A192)","v":""},"","",{"$f":"IF(A192=\"\",\"\",RTD(\"cqg.rtd\", ,\"ContractData\",C192, \"LongDescription\",, \"T\"))","v":""},null,null,null,{"$f":"IF(A192=\"\",\"\",RTD(\"cqg.rtd\", ,\"ContractData\",C192, \"LastTradeToday\",, \"T\"))","v":""},{"$f":"IF(A192=\"\",\"\",RTD(\"cqg.rtd\", ,\"ContractData\",C192, \"NetLastTradeToday\",, \"T\"))","v":""},{"$f":"IF(A192=\"\",\"\",IFERROR(RTD(\"cqg.rtd\", ,\"ContractData\",C192, \"PerCentNetLastTrade\",, \"T\")/100,\"\"))","v":""},{"$f":"IF(A192=\"\",\"\",RTD(\"cqg.rtd\", ,\"ContractData\", C192, \"T_CVol\",, \"T\"))","v":""},192,{"$f":"IFERROR(RANK($J192,INDIRECT((\"$J$\"&\"1\"&\":$J$\"&$A$351)))+COUNTIF($J$1:J192,J192)-1,\"\")","v":""},"",""]
[{"$f":"IF(Symbols!A193=\"\",\"\",Symbols!A193)","v":""},"","",{"$f":"IF(A193=\"\",\"\",RTD(\"cqg.rtd\", ,\"ContractData\",C193, \"LongDescription\",, \"T\"))","v":""},null,null,null,{"$f":"IF(A193=\"\",\"\",RTD(\"cqg.rtd\", ,\"ContractData\",C193, \"LastTradeToday\",, \"T\"))","v":""},{"$f":"IF(A193=\"\",\"\",RTD(\"cqg.rtd\", ,\"ContractData\",C193, \"NetLastTradeToday\",, \"T\"))","v":""},{"$f":"IF(A193=\"\",\"\",IFERROR(RTD(\"cqg.rtd\", ,\"ContractData\",C193, \"PerCentNetLastTrade\",, \"T\")/100,\"\"))","v":""},{"$f":"IF(A193=\"\",\"\",RTD(\"cqg.rtd\", ,\"ContractData\", C193, \"T_CVol\",, \"T\"))","v":""},193,{"$f":"IFERROR(RANK($J193,INDIRECT((\"$J$\"&\"1\"&\":$J$\"&$A$351)))+COUNTIF($J$1:J193,J193)-1,\"\")","v":""},"",""]
[{"$f":"IF(Symbols!A194=\"\",\"\",Symbols!A194)","v":""},"","",{"$f":"IF(A194=\"\",\"\",RTD(\"cqg.rtd\", ,\"ContractData\",C194, \"LongDescription\",, \"T\"))","v":""},null,null,null,{"$f":"IF(A194=\"\",\"\",RTD(\"cqg.rtd\", ,\"ContractData\",C194, \"LastTradeToday\",, \"T\"))","v":""},{"$f":"IF(A194=\"\",\"\",RTD(\"cqg.rtd\", ,\"ContractData\",C194, \"NetLastTradeToday\",, \"T\"))","v":""},{"$f":"IF(A194=\"\",\"\",IFERROR(RTD(\"cqg.rtd\", ,\"ContractData\",C194, \"PerCentNetLastTrade\",, \"T\")/100,\"\"))","v":""},{"$f":"IF(A194=\"\",\"\",RTD(\"cqg.rtd\", ,\"ContractData\", C194, \"T_CVol\",, \"T\"))","v":""},194,{"$f":"IFERROR(RANK($J194,INDIRECT((\"$J$\"&\"1\"&\":$J$\"&$A$351)))+COUNTIF($J$1:J194,J194)-1,\"\")","v":""},"",{"$f":"IFERROR(VLOOKUP($L194,$M$1:$N$350,2,FALSE),\"\")","v":""}]
[{"$f":"IF(Symbols!A195=\"\",\"\",Symbols!A195)","v":""},"","",{"$f":"IF(A195=\"\",\"\",RTD(\"cqg.rtd\", ,\"ContractData\",C195, \"LongDescription\",, \"T\"))","v":""},null,null,null,{"$f":"IF(A195=\"\",\"\",RTD(\"cqg.rtd\", ,\"ContractData\",C195, \"LastTradeToday\",, \"T\"))","v":""},{"$f":"IF(A195=\"\",\"\",RTD(\"cqg.rtd\", ,\"ContractData\",C195, \"NetLastTradeToday\",, \"T\"))","v":""},{"$f":"IF(A195=\"\",\"\",IFERROR(RTD(\"cqg.rtd\", ,\"ContractData\",C195, \"PerCentNetLastTrade\",, \"T\")/100,\"\"))","v":""},{"$f":"IF(A195=\"\",\"\",RTD(\"cqg.rtd\", ,\"ContractData\", C195, \"T_CVol\",, \"T\"))","v":""},{"$f":"L194+1","v":195},{"$f":"IFERROR(RANK($J195,INDIRECT((\"$J$\"&\"1\"&\":$J$\"&$A$351)))+COUNTIF($J$1:J195,J195)-1,\"\")","v":""},"",""]
[{"$f":"IF(Symbols!A196=\"\",\"\",Symbols!A196)","v":""},"","",{"$f":"IF(A196=\"\",\"\",RTD(\"cqg.rtd\", ,\"ContractData\",C196, \"LongDescription\",, \"T\"))","v":""},null,null,null,{"$f":"IF(A196=\"\",\"\",RTD(\"cqg.rtd\", ,\"ContractData\",C196, \"LastTradeToday\",, \"T\"))","v":""},{"$f":"IF(A196=\"\",\"\",RTD(\"cqg.rtd\", ,\"ContractData\",C196, \"NetLastTradeToday\",, \"T\"))","v":""},{"$f":"IF(A196=\"\",\"\",IFERROR(RTD(\"cqg.rtd\", ,\"ContractData\",C196, \"PerCentNetLastTrade\",, \"T\")/100,\"\"))","v":""},{"$f":"IF(A196=\"\",\"\",RTD(\"cqg.rtd\", ,\"ContractData\", C196, \"T_CVol\",, \"T\"))","v":""},196,{"$f":"IFERROR(RANK($J196,INDIRECT((\"$J$\"&\"1\"&\":$J$\"&$A$351)))+COUNTIF($J$1:J196,J196)-1,\"\")","v":""},"",""]
[{"$f":"IF(Symbols!A197=\"\",\"\",Symbols!A197)","v":""},"","",{"$f":"IF(A197=\"\",\"\",RTD(\"cqg.rtd\", ,\"ContractData\",C197, \"LongDescription\",, \"T\"))","v":""},null,null,null,{"$f":"IF(A197=\"\",\"\",RTD(\"cqg.rtd\", ,\"ContractData\",C197, \"LastTradeToday\",, \"T\"))","v":""},{"$f":"IF(A197=\"\",\"\",RTD(\"cqg.rtd\", ,\"ContractData\",C197, \"NetLastTradeToday\",, \"T\"))","v":""},{"$f":"IF(A197=\"\",\"\",IFERROR(RTD(\"cqg.rtd\", ,\"ContractData\",C197, \"PerCentNetLastTrade\",, \"T\")/100,\"\"))","v":""},{"$f":"IF(A197=\"\",\"\",RTD(\"cqg.rtd\", ,\"ContractData\", C197, \"T_CVol\",, \"T\"))","v":""},197,{"$f":"IFERROR(RANK($J197,INDIRECT((\"$J$\"&\"1\"&\":$J$\"&$A$351)))+COUNTIF($J$1:J197,J197)-1,\"\")","v":""},"",""]
[{"$f":"IF(Symbols!A198=\"\",\"\",Symbols!A198)","v":""},"","",{"$f":"IF(A198=\"\",\"\",RTD(\"cqg.rtd\", ,\"ContractData\",C198, \"LongDescription\",, \"T\"))","v":""},null,null,null,{"$f":"IF(A198=\"\",\"\",RTD(\"cqg.rtd\", ,\"ContractData\",C198, \"LastTradeToday\",, \"T\"))","v":""},{"$f":"IF(A198=\"\",\"\",RTD(\"cqg.rtd\", ,\"ContractData\",C198, \"NetLastTradeToday\",, \"T\"))","v":""},{"$f":"IF(A198=\"\",\"\",IFERROR(RTD(\"cqg.rtd\", ,\"ContractData\",C198, \"PerCentNetLastTrade\",, \"T\")/100,\"\"))","v":""},{"$f":"IF(A198=\"\",\"\",RTD(\"cqg.rtd\", ,\"ContractData\", C198, \"T_CVol\",, \"T\"))","v":""},198,{"$f":"IFERROR(RANK($J198,INDIRECT((\"$J$\"&\"1\"&\":$J$\"&$A$351)))+COUNTIF($J$1:J198,J198)-1,\"\")","v":""},"",""]
[{"$f":"IF(Symbols!A199=\"\",\"\",Symbols!A199)","v":""},"","",{"$f":"IF(A199=\"\",\"\",RTD(\"cqg.rtd\", ,\"ContractData\",C199, \"LongDescription\",, \"T\"))","v":""},null,null,null,{"$f":"IF(A199=\"\",\"\",RTD(\"cqg.rtd\", ,\"ContractData\",C199, \"LastTradeToday\",, \"T\"))","v":""},{"$f":"IF(A199=\"\",\"\",RTD(\"cqg.rtd\", ,\"ContractData\",C199, \"NetLastTradeToday\",, \"T\"))","v":""},{"$f":"IF(A199=\"\",\"\",IFERROR(RTD(\"cqg.rtd\", ,\"ContractData\",C199, \"PerCentNetLastTrade\",, \"T\")/100,\"\"))","v":""},{"$f":"IF(A199=\"\",\"\",RTD(\"cqg.rtd\", ,\"ContractData\", C199, \"T_CVol\",, \"T\"))","v":""},199,{"$f":"IFERROR(RANK($J199,INDIRECT((\"$J$\"&\"1\"&\":$J$\"&$A$351)))+COUNTIF($J$1:J199,J199)-1,\"\")","v":""},"",""]
[{"$f":"IF(Symbols!A200=\"\",\"\",Symbols!A200)","v":""},"","",{"$f":"IF(A200=\"\",\"\",RTD(\"cqg.rtd\", ,\"ContractData\",C200, \"LongDescription\",, \"T\"))","v":""},null,null,null,{"$f":"IF(A200=\"\",\"\",RTD(\"cqg.rtd\", ,\"ContractData\",C200, \"LastTradeToday\",, \"T\"))","v":""},{"$f":"IF(A200=\"\",\"\",RTD(\"cqg.rtd\", ,\"ContractData\",C200, \"NetLastTradeToday\",, \"T\"))","v":""},{"$f":"IF(A200=\"\",\"\",IFERROR(RTD(\"cqg.rtd\", ,\"ContractData\",C200, \"PerCentNetLastTrade\",, \"T\")/100,\"\"))","v":""},{"$f":"IF(A200=\"\",\"\",RTD(\"cqg.rtd\", ,\"ContractData\", C200, \"T_CVol\",, \"T\"))","v":""},200,{"$f":"IFERROR(RANK($J200,INDIRECT((\"$J$\"&\"1\"&\":$J$\"&$A$351)))+COUNTIF($J$1:J200,J200)-1,\"\")","v":""},"",""]
[{"$f":"IF(Symbols!A201=\"\",\"\",Symbols!A201)","v":""},"","",{"$f":"IF(A201=\"\",\"\",RTD(\"cqg.rtd\", ,\"ContractData\",C201, \"LongDescription\",, \"T\"))","v":""},null,null,null,{"$f":"IF(A201=\"\",\"\",RTD(\"cqg.rtd\", ,\"ContractData\",C201, \"LastTradeToday\",, \"T\"))","v":""},{"$f":"IF(A201=\"\",\"\",RTD(\"cqg.rtd\", ,\"ContractData\",C201, \"NetLastTradeToday\",, \"T\"))","v":""},{"$f":"IF(A201=\"\",\"\",IFERROR(RTD(\"cqg.rtd\", ,\"ContractData\",C201, \"PerCentNetLastTrade\",, \"T\")/100,\"\"))","v":""},{"$f":"IF(A201=\"\",\"\",RTD(\"cqg.rtd\", ,\"ContractData\", C201, \"T_CVol\",, \"T\"))","v":""},201,{"$f":"IFERROR(RANK($J201,INDIRECT((\"$J$\"&\"1\"&\":$J$\"&$A$351)))+COUNTIF($J$1:J201,J201)-1,\"\")","v":""},"",""]
[{"$f":"IF(Symbols!A202=\"\",\"\",Symbols!A202)","v":""},"","",{"$f":"IF(A202=\"\",\"\",RTD(\"cqg.rtd\", ,\"ContractData\",C202, \"LongDescription\",, \"T\"))","v":""},null,null,null,{"$f":"IF(A202=\"\",\"\",RTD(\"cqg.rtd\", ,\"ContractData\",C202, \"LastTradeToday\",, \"T\"))","v":""},{"$f":"IF(A202=\"\",\"\",RTD(\"cqg.rtd\", ,\"ContractData\",C202, \"NetLastTradeToday\",, \"T\"))","v":""},{"$f":"IF(A202=\"\",\"\",IFERROR(RTD(\"cqg.rtd\", ,\"ContractData\",C202, \"PerCentNetLastTrade\",, \"T\")/100,\"\"))","v":""},{"$f":"IF(A202=\"\",\"\",RTD(\"cqg.rtd\", ,\"ContractData\", C202, \"T_CVol\",, \"T\"))","v":""},202,{"$f":"IFERROR(RANK($J202,INDIRECT((\"$J$\"&\"1\"&\":$J$\"&$A$351)))+COUNTIF($J$1:J202,J202)-1,\"\")","v":""},"",""]
[{"$f":"IF(Symbols!A203=\"\",\"\",Symbols!A203)","v":""},"","",{"$f":"IF(A203=\"\",\"\",RTD(\"cqg.rtd\", ,\"ContractData\",C203, \"LongDescription\",, \"T\"))","v":""},null,null,null,{"$f":"IF(A203=\"\",\"\",RTD(\"cqg.rtd\", ,\"ContractData\",C203, \"LastTradeToday\",, \"T\"))","v":""},{"$f":"IF(A203=\"\",\"\",RTD(\"cqg.rtd\", ,\"ContractData\",C203, \"NetLastTradeToday\",, \"T\"))","v":""},{"$f":"IF(A203=\"\",\"\",IFERROR(RTD(\"cqg.rtd\", ,\"ContractData\",C203, \"PerCentNetLastTrade\",, \"T\")/100,\"\"))","v":""},{"$f":"IF(A203=\"\",\"\",RTD(\"cqg.rtd\", ,\"ContractData\", C203, \"T_CVol\",, \"T\"))","v":""},203,{"$f":"IFERROR(RANK($J203,INDIRECT((\"$J$\"&\"1\"&\":$J$\"&$A$351)))+COUNTIF($J$1:J203,J203)-1,\"\")","v":""},"",""]
[{"$f":"IF(Symbols!A204=\"\",\"\",Symbols!A204)","v":""},"","",{"$f":"IF(A204=\"\",\"\",RTD(\"cqg.rtd\", ,\"ContractData\",C204, \"LongDescription\",, \"T\"))","v":""},null,null,null,{"$f":"IF(A204=\"\",\"\",RTD(\"cqg.rtd\", ,\"ContractData\",C204, \"LastTradeToday\",, \"T\"))","v":""},{"$f":"IF(A204=\"\",\"\",RTD(\"cqg.rtd\", ,\"ContractData\",C204, \"NetLastTradeToday\",, \"T\"))","v":""},{"$f":"IF(A204=\"\",\"\",IFERROR(RTD(\"cqg.rtd\", ,\"ContractData\",C204, \"PerCentNetLastTrade\",, \"T\")/100,\"\"))","v":""},{"$f":"IF(A204=\"\",\"\",RTD(\"cqg.rtd\", ,\"ContractData\", C204, \"T_CVol\",, \"T\"))","v":""},204,{"$f":"IFERROR(RANK($J204,INDIRECT((\"$J$\"&\"1\"&\":$J$\"&$A$351)))+COUNTIF($J$1:J204,J204)-1,\"\")","v":""},"",""]
[{"$f":"IF(Symbols!A205=\"\",\"\",Symbols!A205)","v":""},"","",{"$f":"IF(A205=\"\",\"\",RTD(\"cqg.rtd\", ,\"ContractData\",C205, \"LongDescription\",, \"T\"))","v":""},null,null,null,{"$f":"IF(A205=\"\",\"\",RTD(\"cqg.rtd\", ,\"ContractData\",C205, \"LastTradeToday\",, \"T\"))","v":""},{"$f":"IF(A205=\"\",\"\",RTD(\"cqg.rtd\", ,\"ContractData\",C205, \"NetLastTradeToday\",, \"T\"))","v":""},{"$f":"IF(A205=\"\",\"\",IFERROR(RTD(\"cqg.rtd\", ,\"ContractData\",C205, \"PerCentNetLastTrade\",, \"T\")/100,\"\"))","v":""},{"$f":"IF(A205=\"\",\"\",RTD(\"cqg.rtd\", ,\"ContractData\", C205, \"T_CVol\",, \"T\"))","v":""},205,{"$f":"IFERROR(RANK($J205,INDIRECT((\"$J$\"&\"1\"&\":$J$\"&$A$351)))+COUNTIF($J$1:J205,J205)-1,\"\")","v":""},"",""]
[{"$f":"IF(Symbols!A206=\"\",\"\",Symbols!A206)","v":""},"","",{"$f":"IF(A206=\"\",\"\",RTD(\"cqg.rtd\", ,\"ContractData\",C206, \"LongDescription\",, \"T\"))","v":""},null,null,null,{"$f":"IF(A206=\"\",\"\",RTD(\"cqg.rtd\", ,\"ContractData\",C206, \"LastTradeToday\",, \"T\"))","v":""},{"$f":"IF(A206=\"\",\"\",RTD(\"cqg.rtd\", ,\"ContractData\",C206, \"NetLastTradeToday\",, \"T\"))","v":""},{"$f":"IF(A206=\"\",\"\",IFERROR(RTD(\"cqg.rtd\", ,\"ContractData\",C206, \"PerCentNetLastTrade\",, \"T\")/100,\"\"))","v":""},{"$f":"IF(A206=\"\",\"\",RTD(\"cqg.rtd\", ,\"ContractData\", C206, \"T_CVol\",, \"T\"))","v":""},206,{"$f":"IFERROR(RANK($J206,INDIRECT((\"$J$\"&\"1\"&\":$J$\"&$A$351)))+COUNTIF($J$1:J206,J206)-1,\"\")","v":""},"",""]
[{"$f":"IF(Symbols!A207=\"\",\"\",Symbols!A207)","v":""},"","",{"$f":"IF(A207=\"\",\"\",RTD(\"cqg.rtd\", ,\"ContractData\",C207, \"LongDescription\",, \"T\"))","v":""},null,null,null,{"$f":"IF(A207=\"\",\"\",RTD(\"cqg.rtd\", ,\"ContractData\",C207, \"LastTradeToday\",, \"T\"))","v":""},{"$f":"IF(A207=\"\",\"\",RTD(\"cqg.rtd\", ,\"ContractData\",C207, \"NetLastTradeToday\",, \"T\"))","v":""},{"$f":"IF(A207=\"\",\"\",IFERROR(RTD(\"cqg.rtd\", ,\"ContractData\",C207, \"PerCentNetLastTrade\",, \"T\")/100,\"\"))","v":""},{"$f":"IF(A207=\"\",\"\",RTD(\"cqg.rtd\", ,\"ContractData\", C207, \"T_CVol\",, \"T\"))","v":""},207,{"$f":"IFERROR(RANK($J207,INDIRECT((\"$J$\"&\"1\"&\":$J$\"&$A$351)))+COUNTIF($J$1:J207,J207)-1,\"\")","v":""},"",""]
[{"$f":"IF(Symbols!A208=\"\",\"\",Symbols!A208)","v":""},"","",{"$f":"IF(A208=\"\",\"\",RTD(\"cqg.rtd\", ,\"ContractData\",C208, \"LongDescription\",, \"T\"))","v":""},null,null,null,{"$f":"IF(A208=\"\",\"\",RTD(\"cqg.rtd\", ,\"ContractData\",C208, \"LastTradeToday\",, \"T\"))","v":""},{"$f":"IF(A208=\"\",\"\",RTD(\"cqg.rtd\", ,\"ContractData\",C208, \"NetLastTradeToday\",, \"T\"))","v":""},{"$f":"IF(A208=\"\",\"\",IFERROR(RTD(\"cqg.rtd\", ,\"ContractData\",C208, \"PerCentNetLastTrade\",, \"T\")/100,\"\"))","v":""},{"$f":"IF(A208=\"\",\"\",RTD(\"cqg.rtd\", ,\"ContractData\", C208, \"T_CVol\",, \"T\"))","v":""},208,{"$f":"IFERROR(RANK($J208,INDIRECT((\"$J$\"&\"1\"&\":$J$\"&$A$351)))+COUNTIF($J$1:J208,J208)-1,\"\")","v":""},"",""]
[{"$f":"IF(Symbols!A209=\"\",\"\",Symbols!A209)","v":""},"","",{"$f":"IF(A209=\"\",\"\",RTD(\"cqg.rtd\", ,\"ContractData\",C209, \"LongDescription\",, \"T\"))","v":""},null,null,null,{"$f":"IF(A209=\"\",\"\",RTD(\"cqg.rtd\", ,\"ContractData\",C209, \"LastTradeToday\",, \"T\"))","v":""},{"$f":"IF(A209=\"\",\"\",RTD(\"cqg.rtd\", ,\"ContractData\",C209, \"NetLastTradeToday\",, \"T\"))","v":""},{"$f":"IF(A209=\"\",\"\",IFERROR(RTD(\"cqg.rtd\", ,\"ContractData\",C209, \"PerCentNetLastTrade\",, \"T\")/100,\"\"))","v":""},{"$f":"IF(A209=\"\",\"\",RTD(\"cqg.rtd\", ,\"ContractData\", C209, \"T_CVol\",, \"T\"))","v":""},209,{"$f":"IFERROR(RANK($J209,INDIRECT((\"$J$\"&\"1\"&\":$J$\"&$A$351)))+COUNTIF($J$1:J209,J209)-1,\"\")","v":""},"",""]
[{"$f":"IF(Symbols!A210=\"\",\"\",Symbols!A210)","v":""},"","",{"$f":"IF(A210=\"\",\"\",RTD(\"cqg.rtd\", ,\"ContractData\",C210, \"LongDescription\",, \"T\"))","v":""},null,null,null,{"$f":"IF(A210=\"\",\"\",RTD(\"cqg.rtd\", ,\"ContractData\",C210, \"LastTradeToday\",, \"T\"))","v":""},{"$f":"IF(A210=\"\",\"\",RTD(\"cqg.rtd\", ,\"ContractData\",C210, \"NetLastTradeToday\",, \"T\"))","v":""},{"$f":"IF(A210=\"\",\"\",IFERROR(RTD(\"cqg.rtd\", ,\"ContractData\",C210, \"PerCentNetLastTrade\",, \"T\")/100,\"\"))","v":""},{"$f":"IF(A210=\"\",\"\",RTD(\"cqg.rtd\", ,\"ContractData\", C210, \"T_CVol\",, \"T\"))","v":""},210,{"$f":"IFERROR(RANK($J210,INDIRECT((\"$J$\"&\"1\"&\":$J$\"&$A$351)))+COUNTIF($J$1:J210,J210)-1,\"\")","v":""},"",""]
[{"$f":"IF(Symbols!A211=\"\",\"\",Symbols!A211)","v":""},"","",{"$f":"IF(A211=\"\",\"\",RTD(\"cqg.rtd\", ,\"ContractData\",C211, \"LongDescription\",, \"T\"))","v":""},null,null,null,{"$f":"IF(A211=\"\",\"\",RTD(\"cqg.rtd\", ,\"ContractData\",C211, \"LastTradeToday\",, \"T\"))","v":""},{"$f":"IF(A211=\"\",\"\",RTD(\"cqg.rtd\", ,\"ContractData\",C211, \"NetLastTradeToday\",, \"T\"))","v":""},{"$f":"IF(A211=\"\",\"\",IFERROR(RTD(\"cqg.rtd\", ,\"ContractData\",C211, \"PerCentNetLastTrade\",, \"T\")/100,\"\"))","v":""},{"$f":"IF(A211=\"\",\"\",RTD(\"cqg.rtd\", ,\"ContractData\", C211, \"T_CVol\",, \"T\"))","v":""},211,{"$f":"IFERROR(RANK($J211,INDIRECT((\"$J$\"&\"1\"&\":$J$\"&$A$351)))+COUNTIF($J$1:J211,J211)-1,\"\")","v":""},"",""]
[{"$f":"IF(Symbols!A212=\"\",\"\",Symbols!A212)","v":""},"","",{"$f":"IF(A212=\"\",\"\",RTD(\"cqg.rtd\", ,\"ContractData\",C212, \"LongDescription\",, \"T\"))","v":""},null,null,null,{"$f":"IF(A212=\"\",\"\",RTD(\"cqg.rtd\", ,\"ContractData\",C212, \"LastTradeToday\",, \"T\"))","v":""},{"$f":"IF(A212=\"\",\"\",RTD(\"cqg.rtd\", ,\"ContractData\",C212, \"NetLastTradeToday\",, \"T\"))","v":""},{"$f":"IF(A212=\"\",\"\",IFERROR(RTD(\"cqg.rtd\", ,\"ContractData\",C212, \"PerCentNetLastTrade\",, \"T\")/100,\"\"))","v":""},{"$f":"IF(A212=\"\",\"\",RTD(\"cqg.rtd\", ,\"ContractData\", C212, \"T_CVol\",, \"T\"))","v":""},212,{"$f":"IFERROR(RANK($J212,INDIRECT((\"$J$\"&\"1\"&\":$J$\"&$A$351)))+COUNTIF($J$1:J212,J212)-1,\"\")","v":""},"",""]
[{"$f":"IF(Symbols!A213=\"\",\"\",Symbols!A213)","v":""},"","",{"$f":"IF(A213=\"\",\"\",RTD(\"cqg.rtd\", ,\"ContractData\",C213, \"LongDescription\",, \"T\"))","v":""},null,null,null,{"$f":"IF(A213=\"\",\"\",RTD(\"cqg.rtd\", ,\"ContractData\",C213, \"LastTradeToday\",, \"T\"))","v":""},{"$f":"IF(A213=\"\",\"\",RTD(\"cqg.rtd\", ,\"ContractData\",C213, \"NetLastTradeToday\",, \"T\"))","v":""},{"$f":"IF(A213=\"\",\"\",IFERROR(RTD(\"cqg.rtd\", ,\"ContractData\",C213, \"PerCentNetLastTrade\",, \"T\")/100,\"\"))","v":""},{"$f":"IF(A213=\"\",\"\",RTD(\"cqg.rtd\", ,\"ContractData\", C213, \"T_CVol\",, \"T\"))","v":""},213,{"$f":"IFERROR(RANK($J213,INDIRECT((\"$J$\"&\"1\"&\":$J$\"&$A$351)))+COUNTIF($J$1:J213,J213)-1,\"\")","v":""},"",""]
[{"$f":"IF(Symbols!A214=\"\",\"\",Symbols!A214)","v":""},"","",{"$f":"IF(A214=\"\",\"\",RTD(\"cqg.rtd\", ,\"ContractData\",C214, \"LongDescription\",, \"T\"))","v":""},null,null,null,{"$f":"IF(A214=\"\",\"\",RTD(\"cqg.rtd\", ,\"ContractData\",C214, \"LastTradeToday\",, \"T\"))","v":""},{"$f":"IF(A214=\"\",\"\",RTD(\"cqg.rtd\", ,\"ContractData\",C214, \"NetLastTradeToday\",, \"T\"))","v":""},{"$f":"IF(A214=\"\",\"\",IFERROR(RTD(\"cqg.rtd\", ,\"ContractData\",C214, \"PerCentNetLastTrade\",, \"T\")/100,\"\"))","v":""},{"$f":"IF(A214=\"\",\"\",RTD(\"cqg.rtd\", ,\"ContractData\", C214, \"T_CVol\",, \"T\"))","v":""},214,{"$f":"IFERROR(RANK($J214,INDIRECT((\"$J$\"&\"1\"&\":$J$\"&$A$351)))+COUNTIF($J$1:J214,J214)-1,\"\")","v":""},"",""]
[{"$f":"IF(Symbols!A215=\"\",\"\",Symbols!A215)","v":""},"","",{"$f":"IF(A215=\"\",\"\",RTD(\"cqg.rtd\", ,\"ContractData\",C215, \"LongDescription\",, \"T\"))","v":""},null,null,null,{"$f":"IF(A215=\"\",\"\",RTD(\"cqg.rtd\", ,\"ContractData\",C215, \"LastTradeToday\",, \"T\"))","v":""},{"$f":"IF(A215=\"\",\"\",RTD(\"cqg.rtd\", ,\"ContractData\",C215, \"NetLastTradeToday\",, \"T\"))","v":""},{"$f":"IF(A215=\"\",\"\",IFERROR(RTD(\"cqg.rtd\", ,\"ContractData\",C215, \"PerCentNetLastTrade\",, \"T\")/100,\"\"))","v":""},{"$f":"IF(A215=\"\",\"\",RTD(\"cqg.rtd\", ,\"ContractData\", C215, \"T_CVol\",, \"T\"))","v":""},215,{"$f":"IFERROR(RANK($J215,INDIRECT((\"$J$\"&\"1\"&\":$J$\"&$A$351)))+COUNTIF($J$1:J215,J215)-1,\"\")","v":""},"",""]
[{"$f":"IF(Symbols!A216=\"\",\"\",Symbols!A216)","v":""},"","",{"$f":"IF(A216=\"\",\"\",RTD(\"cqg.rtd\", ,\"ContractData\",C216, \"LongDescription\",, \"T\"))","v":""},null,null,null,{"$f":"IF(A216=\"\",\"\",RTD(\"cqg.rtd\", ,\"ContractData\",C216, \"LastTradeToday\",, \"T\"))","v":""},{"$f":"IF(A216=\"\",\"\",RTD(\"cqg.rtd\", ,\"ContractData\",C216, \"NetLastTradeToday\",, \"T\"))","v":""},{"$f":"IF(A216=\"\",\"\",IFERROR(RTD(\"cqg.rtd\", ,\"ContractData\",C216, \"PerCentNetLastTrade\",, \"T\")/100,\"\"))","v":""},{"$f":"IF(A216=\"\",\"\",RTD(\"cqg.rtd\", ,\"ContractData\", C216, \"T_CVol\",, \"T\"))","v":""},216,{"$f":"IFERROR(RANK($J216,INDIRECT((\"$J$\"&\"1\"&\":$J$\"&$A$351)))+COUNTIF($J$1:J216,J216)-1,\"\")","v":""},"",""]
[{"$f":"IF(Symbols!A217=\"\",\"\",Symbols!A217)","v":""},"","",{"$f":"IF(A217=\"\",\"\",RTD(\"cqg.rtd\", ,\"ContractData\",C217, \"LongDescription\",, \"T\"))","v":""},null,null,null,{"$f":"IF(A217=\"\",\"\",RTD(\"cqg.rtd\", ,\"ContractData\",C217, \"LastTradeToday\",, \"T\"))","v":""},{"$f":"IF(A217=\"\",\"\",RTD(\"cqg.rtd\", ,\"ContractData\",C217, \"NetLastTradeToday\",, \"T\"))","v":""},{"$f":"IF(A217=\"\",\"\",IFERROR(RTD(\"cqg.rtd\", ,\"ContractData\",C217, \"PerCentNetLastTrade\",, \"T\")/100,\"\"))","v":""},{"$f":"IF(A217=\"\",\"\",RTD(\"cqg.rtd\", ,\"ContractData\", C217, \"T_CVol\",, \"T\"))","v":""},217,{"$f":"IFERROR(RANK($J217,INDIRECT((\"$J$\"&\"1\"&\":$J$\"&$A$351)))+COUNTIF($J$1:J217,J217)-1,\"\")","v":""},"",""]
[{"$f":"IF(Symbols!A218=\"\",\"\",Symbols!A218)","v":""},"","",{"$f":"IF(A218=\"\",\"\",RTD(\"cqg.rtd\", ,\"ContractData\",C218, \"LongDescription\",, \"T\"))","v":""},null,null,null,{"$f":"IF(A218=\"\",\"\",RTD(\"cqg.rtd\", ,\"ContractData\",C218, \"LastTradeToday\",, \"T\"))","v":""},{"$f":"IF(A218=\"\",\"\",RTD(\"cqg.rtd\", ,\"ContractData\",C218, \"NetLastTradeToday\",, \"T\"))","v":""},{"$f":"IF(A218=\"\",\"\",IFERROR(RTD(\"cqg.rtd\", ,\"ContractData\",C218, \"PerCentNetLastTrade\",, \"T\")/100,\"\"))","v":""},{"$f":"IF(A218=\"\",\"\",RTD(\"cqg.rtd\", ,\"ContractData\", C218, \"T_CVol\",, \"T\"))","v":""},218,{"$f":"IFERROR(RANK($J218,INDIRECT((\"$J$\"&\"1\"&\":$J$\"&$A$351)))+COUNTIF($J$1:J218,J218)-1,\"\")","v":""},"",""]
[{"$f":"IF(Symbols!A219=\"\",\"\",Symbols!A219)","v":""},"","",{"$f":"IF(A219=\"\",\"\",RTD(\"cqg.rtd\", ,\"ContractData\",C219, \"LongDescription\",, \"T\"))","v":""},null,null,null,{"$f":"IF(A219=\"\",\"\",RTD(\"cqg.rtd\", ,\"ContractData\",C219, \"LastTradeToday\",, \"T\"))","v":""},{"$f":"IF(A219=\"\",\"\",RTD(\"cqg.rtd\", ,\"ContractData\",C219, \"NetLastTradeToday\",, \"T\"))","v":""},{"$f":"IF(A219=\"\",\"\",IFERROR(RTD(\"cqg.rtd\", ,\"ContractData\",C219, \"PerCentNetLastTrade\",, \"T\")/100,\"\"))","v":""},{"$f":"IF(A219=\"\",\"\",RTD(\"cqg.rtd\", ,\"ContractData\", C219, \"T_CVol\",, \"T\"))","v":""},219,{"$f":"IFERROR(RANK($J219,INDIRECT((\"$J$\"&\"1\"&\":$J$\"&$A$351)))+COUNTIF($J$1:J219,J219)-1,\"\")","v":""},"",""]
[{"$f":"IF(Symbols!A220=\"\",\"\",Symbols!A220)","v":""},"","",{"$f":"IF(A220=\"\",\"\",RTD(\"cqg.rtd\", ,\"ContractData\",C220, \"LongDescription\",, \"T\"))","v":""},null,null,null,{"$f":"IF(A220=\"\",\"\",RTD(\"cqg.rtd\", ,\"ContractData\",C220, \"LastTradeToday\",, \"T\"))","v":""},{"$f":"IF(A220=\"\",\"\",RTD(\"cqg.rtd\", ,\"ContractData\",C220, \"NetLastTradeToday\",, \"T\"))","v":""},{"$f":"IF(A220=\"\",\"\",IFERROR(RTD(\"cqg.rtd\", ,\"ContractData\",C220, \"PerCentNetLastTrade\",, \"T\")/100,\"\"))","v":""},{"$f":"IF(A220=\"\",\"\",RTD(\"cqg.rtd\", ,\"ContractData\", C220, \"T_CVol\",, \"T\"))","v":""},220,{"$f":"IFERROR(RANK($J220,INDIRECT((\"$J$\"&\"1\"&\":$J$\"&$A$351)))+COUNTIF($J$1:J220,J220)-1,\"\")","v":""},"",""]
[{"$f":"IF(Symbols!A221=\"\",\"\",Symbols!A221)","v":""},"","",{"$f":"IF(A221=\"\",\"\",RTD(\"cqg.rtd\", ,\"ContractData\",C221, \"LongDescription\",, \"T\"))","v":""},null,null,null,{"$f":"IF(A221=\"\",\"\",RTD(\"cqg.rtd\", ,\"ContractData\",C221, \"LastTradeToday\",, \"T\"))","v":""},{"$f":"IF(A221=\"\",\"\",RTD(\"cqg.rtd\", ,\"ContractData\",C221, \"NetLastTradeToday\",, \"T\"))","v":""},{"$f":"IF(A221=\"\",\"\",IFERROR(RTD(\"cqg.rtd\", ,\"ContractData\",C221, \"PerCentNetLastTrade\",, \"T\")/100,\"\"))","v":""},{"$f":"IF(A221=\"\",\"\",RTD(\"cqg.rtd\", ,\"ContractData\", C221, \"T_CVol\",, \"T\"))","v":""},221,{"$f":"IFERROR(RANK($J221,INDIRECT((\"$J$\"&\"1\"&\":$J$\"&$A$351)))+COUNTIF($J$1:J221,J221)-1,\"\")","v":""},"",""]
[{"$f":"IF(Symbols!A222=\"\",\"\",Symbols!A222)","v":""},"","",{"$f":"IF(A222=\"\",\"\",RTD(\"cqg.rtd\", ,\"ContractData\",C222, \"LongDescription\",, \"T\"))","v":""},null,null,null,{"$f":"IF(A222=\"\",\"\",RTD(\"cqg.rtd\", ,\"ContractData\",C222, \"LastTradeToday\",, \"T\"))","v":""},{"$f":"IF(A222=\"\",\"\",RTD(\"cqg.rtd\", ,\"ContractData\",C222, \"NetLastTradeToday\",, \"T\"))","v":""},{"$f":"IF(A222=\"\",\"\",IFERROR(RTD(\"cqg.rtd\", ,\"ContractData\",C222, \"PerCentNetLastTrade\",, \"T\")/100,\"\"))","v":""},{"$f":"IF(A222=\"\",\"\",RTD(\"cqg.rtd\", ,\"ContractData\", C222, \"T_CVol\",, \"T\"))","v":""},222,{"$f":"IFERROR(RANK($J222,INDIRECT((\"$J$\"&\"1\"&\":$J$\"&$A$351)))+COUNTIF($J$1:J222,J222)-1,\"\")","v":""},"",""]
[{"$f":"IF(Symbols!A223=\"\",\"\",Symbols!A223)","v":""},"","",{"$f":"IF(A223=\"\",\"\",RTD(\"cqg.rtd\", ,\"ContractData\",C223, \"LongDescription\",, \"T\"))","v":""},null,null,null,{"$f":"IF(A223=\"\",\"\",RTD(\"cqg.rtd\", ,\"ContractData\",C223, \"LastTradeToday\",, \"T\"))","v":""},{"$f":"IF(A223=\"\",\"\",RTD(\"cqg.rtd\", ,\"ContractData\",C223, \"NetLastTradeToday\",, \"T\"))","v":""},{"$f":"IF(A223=\"\",\"\",IFERROR(RTD(\"cqg.rtd\", ,\"ContractData\",C223, \"PerCentNetLastTrade\",, \"T\")/100,\"\"))","v":""},{"$f":"IF(A223=\"\",\"\",RTD(\"cqg.rtd\", ,\"ContractData\", C223, \"T_CVol\",, \"T\"))","v":""},223,{"$f":"IFERROR(RANK($J223,INDIRECT((\"$J$\"&\"1\"&\":$J$\"&$A$351)))+COUNTIF($J$1:J223,J223)-1,\"\")","v":""},"",""]
[{"$f":"IF(Symbols!A224=\"\",\"\",Symbols!A224)","v":""},"","",{"$f":"IF(A224=\"\",\"\",RTD(\"cqg.rtd\", ,\"ContractData\",C224, \"LongDescription\",, \"T\"))","v":""},null,null,null,{"$f":"IF(A224=\"\",\"\",RTD(\"cqg.rtd\", ,\"ContractData\",C224, \"LastTradeToday\",, \"T\"))","v":""},{"$f":"IF(A224=\"\",\"\",RTD(\"cqg.rtd\", ,\"ContractData\",C224, \"NetLastTradeToday\",, \"T\"))","v":""},{"$f":"IF(A224=\"\",\"\",IFERROR(RTD(\"cqg.rtd\", ,\"ContractData\",C224, \"PerCentNetLastTrade\",, \"T\")/100,\"\"))","v":""},{"$f":"IF(A224=\"\",\"\",RTD(\"cqg.rtd\", ,\"ContractData\", C224, \"T_CVol\",, \"T\"))","v":""},224,{"$f":"IFERROR(RANK($J224,INDIRECT((\"$J$\"&\"1\"&\":$J$\"&$A$351)))+COUNTIF($J$1:J224,J224)-1,\"\")","v":""},"",""]
[{"$f":"IF(Symbols!A225=\"\",\"\",Symbols!A225)","v":""},"","",{"$f":"IF(A225=\"\",\"\",RTD(\"cqg.rtd\", ,\"ContractData\",C225, \"LongDescription\",, \"T\"))","v":""},null,null,null,{"$f":"IF(A225=\"\",\"\",RTD(\"cqg.rtd\", ,\"ContractData\",C225, \"LastTradeToday\",, \"T\"))","v":""},{"$f":"IF(A225=\"\",\"\",RTD(\"cqg.rtd\", ,\"ContractData\",C225, \"NetLastTradeToday\",, \"T\"))","v":""},{"$f":"IF(A225=\"\",\"\",IFERROR(RTD(\"cqg.rtd\", ,\"ContractData\",C225, \"PerCentNetLastTrade\",, \"T\")/100,\"\"))","v":""},{"$f":"IF(A225=\"\",\"\",RTD(\"cqg.rtd\", ,\"ContractData\", C225, \"T_CVol\",, \"T\"))","v":""},225,{"$f":"IFERROR(RANK($J225,INDIRECT((\"$J$\"&\"1\"&\":$J$\"&$A$351)))+COUNTIF($J$1:J225,J225)-1,\"\")","v":""},"",""]
[{"$f":"IF(Symbols!A226=\"\",\"\",Symbols!A226)","v":""},"","",{"$f":"IF(A226=\"\",\"\",RTD(\"cqg.rtd\", ,\"ContractData\",C226, \"LongDescription\",, \"T\"))","v":""},null,null,null,{"$f":"IF(A226=\"\",\"\",RTD(\"cqg.rtd\", ,\"ContractData\",C226, \"LastTradeToday\",, \"T\"))","v":""},{"$f":"IF(A226=\"\",\"\",RTD(\"cqg.rtd\", ,\"ContractData\",C226, \"NetLastTradeToday\",, \"T\"))","v":""},{"$f":"IF(A226=\"\",\"\",IFERROR(RTD(\"cqg.rtd\", ,\"ContractData\",C226, \"PerCentNetLastTrade\",, \"T\")/100,\"\"))","v":""},{"$f":"IF(A226=\"\",\"\",RTD(\"cqg.rtd\", ,\"ContractData\", C226, \"T_CVol\",, \"T\"))","v":""},226,{"$f":"IFERROR(RANK($J226,INDIRECT((\"$J$\"&\"1\"&\":$J$\"&$A$351)))+COUNTIF($J$1:J226,J226)-1,\"\")","v":""},"",""]
[{"$f":"IF(Symbols!A227=\"\",\"\",Symbols!A227)","v":""},"","",{"$f":"IF(A227=\"\",\"\",RTD(\"cqg.rtd\", ,\"ContractData\",C227, \"LongDescription\",, \"T\"))","v":""},null,null,null,{"$f":"IF(A227=\"\",\"\",RTD(\"cqg.rtd\", ,\"ContractData\",C227, \"LastTradeToday\",, \"T\"))","v":""},{"$f":"IF(A227=\"\",\"\",RTD(\"cqg.rtd\", ,\"ContractData\",C227, \"NetLastTradeToday\",, \"T\"))","v":""},{"$f":"IF(A227=\"\",\"\",IFERROR(RTD(\"cqg.rtd\", ,\"ContractData\",C227, \"PerCentNetLastTrade\",, \"T\")/100,\"\"))","v":""},{"$f":"IF(A227=\"\",\"\",RTD(\"cqg.rtd\", ,\"ContractData\", C227, \"T_CVol\",, \"T\"))","v":""},227,{"$f":"IFERROR(RANK($J227,INDIRECT((\"$J$\"&\"1\"&\":$J$\"&$A$351)))+COUNTIF($J$1:J227,J227)-1,\"\")","v":""},"",""]
[{"$f":"IF(Symbols!A228=\"\",\"\",Symbols!A228)","v":""},"","",{"$f":"IF(A228=\"\",\"\",RTD(\"cqg.rtd\", ,\"ContractData\",C228, \"LongDescription\",, \"T\"))","v":""},null,null,null,{"$f":"IF(A228=\"\",\"\",RTD(\"cqg.rtd\", ,\"ContractData\",C228, \"LastTradeToday\",, \"T\"))","v":""},{"$f":"IF(A228=\"\",\"\",RTD(\"cqg.rtd\", ,\"ContractData\",C228, \"NetLastTradeToday\",, \"T\"))","v":""},{"$f":"IF(A228=\"\",\"\",IFERROR(RTD(\"cqg.rtd\", ,\"ContractData\",C228, \"PerCentNetLastTrade\",, \"T\")/100,\"\"))","v":""},{"$f":"IF(A228=\"\",\"\",RTD(\"cqg.rtd\", ,\"ContractData\", C228, \"T_CVol\",, \"T\"))","v":""},228,{"$f":"IFERROR(RANK($J228,INDIRECT((\"$J$\"&\"1\"&\":$J$\"&$A$351)))+COUNTIF($J$1:J228,J228)-1,\"\")","v":""},"",""]
[{"$f":"IF(Symbols!A229=\"\",\"\",Symbols!A229)","v":""},"","",{"$f":"IF(A229=\"\",\"\",RTD(\"cqg.rtd\", ,\"ContractData\",C229, \"LongDescription\",, \"T\"))","v":""},null,null,null,{"$f":"IF(A229=\"\",\"\",RTD(\"cqg.rtd\", ,\"ContractData\",C229, \"LastTradeToday\",, \"T\"))","v":""},{"$f":"IF(A229=\"\",\"\",RTD(\"cqg.rtd\", ,\"ContractData\",C229, \"NetLastTradeToday\",, \"T\"))","v":""},{"$f":"IF(A229=\"\",\"\",IFERROR(RTD(\"cqg.rtd\", ,\"ContractData\",C229, \"PerCentNetLastTrade\",, \"T\")/100,\"\"))","v":""},{"$f":"IF(A229=\"\",\"\",RTD(\"cqg.rtd\", ,\"ContractData\", C229, \"T_CVol\",, \"T\"))","v":""},229,{"$f":"IFERROR(RANK($J229,INDIRECT((\"$J$\"&\"1\"&\":$J$\"&$A$351)))+COUNTIF($J$1:J229,J229)-1,\"\")","v":""},"",""]
[{"$f":"IF(Symbols!A230=\"\",\"\",Symbols!A230)","v":""},"","",{"$f":"IF(A230=\"\",\"\",RTD(\"cqg.rtd\", ,\"ContractData\",C230, \"LongDescription\",, \"T\"))","v":""},null,null,null,{"$f":"IF(A230=\"\",\"\",RTD(\"cqg.rtd\", ,\"ContractData\",C230, \"LastTradeToday\",, \"T\"))","v":""},{"$f":"IF(A230=\"\",\"\",RTD(\"cqg.rtd\", ,\"ContractData\",C230, \"NetLastTradeToday\",, \"T\"))","v":""},{"$f":"IF(A230=\"\",\"\",IFERROR(RTD(\"cqg.rtd\", ,\"ContractData\",C230, \"PerCentNetLastTrade\",, \"T\")/100,\"\"))","v":""},{"$f":"IF(A230=\"\",\"\",RTD(\"cqg.rtd\", ,\"ContractData\", C230, \"T_CVol\",, \"T\"))","v":""},230,{"$f":"IFERROR(RANK($J230,INDIRECT((\"$J$\"&\"1\"&\":$J$\"&$A$351)))+COUNTIF($J$1:J230,J230)-1,\"\")","v":""},"",""]
[{"$f":"IF(Symbols!A231=\"\",\"\",Symbols!A231)","v":""},"","",{"$f":"IF(A231=\"\",\"\",RTD(\"cqg.rtd\", ,\"ContractData\",C231, \"LongDescription\",, \"T\"))","v":""},null,null,null,{"$f":"IF(A231=\"\",\"\",RTD(\"cqg.rtd\", ,\"ContractData\",C231, \"LastTradeToday\",, \"T\"))","v":""},{"$f":"IF(A231=\"\",\"\",RTD(\"cqg.rtd\", ,\"ContractData\",C231, \"NetLastTradeToday\",, \"T\"))","v":""},{"$f":"IF(A231=\"\",\"\",IFERROR(RTD(\"cqg.rtd\", ,\"ContractData\",C231, \"PerCentNetLastTrade\",, \"T\")/100,\"\"))","v":""},{"$f":"IF(A231=\"\",\"\",RTD(\"cqg.rtd\", ,\"ContractData\", C231, \"T_CVol\",, \"T\"))","v":""},231,{"$f":"IFERROR(RANK($J231,INDIRECT((\"$J$\"&\"1\"&\":$J$\"&$A$351)))+COUNTIF($J$1:J231,J231)-1,\"\")","v":""},"",""]
[{"$f":"IF(Symbols!A232=\"\",\"\",Symbols!A232)","v":""},"","",{"$f":"IF(A232=\"\",\"\",RTD(\"cqg.rtd\", ,\"ContractData\",C232, \"LongDescription\",, \"T\"))","v":""},null,null,null,{"$f":"IF(A232=\"\",\"\",RTD(\"cqg.rtd\", ,\"ContractData\",C232, \"LastTradeToday\",, \"T\"))","v":""},{"$f":"IF(A232=\"\",\"\",RTD(\"cqg.rtd\", ,\"ContractData\",C232, \"NetLastTradeToday\",, \"T\"))","v":""},{"$f":"IF(A232=\"\",\"\",IFERROR(RTD(\"cqg.rtd\", ,\"ContractData\",C232, \"PerCentNetLastTrade\",, \"T\")/100,\"\"))","v":""},{"$f":"IF(A232=\"\",\"\",RTD(\"cqg.rtd\", ,\"ContractData\", C232, \"T_CVol\",, \"T\"))","v":""},232,{"$f":"IFERROR(RANK($J232,INDIRECT((\"$J$\"&\"1\"&\":$J$\"&$A$351)))+COUNTIF($J$1:J232,J232)-1,\"\")","v":""},"",""]
[{"$f":"IF(Symbols!A233=\"\",\"\",Symbols!A233)","v":""},"","",{"$f":"IF(A233=\"\",\"\",RTD(\"cqg.rtd\", ,\"ContractData\",C233, \"LongDescription\",, \"T\"))","v":""},null,null,null,{"$f":"IF(A233=\"\",\"\",RTD(\"cqg.rtd\", ,\"ContractData\",C233, \"LastTradeToday\",, \"T\"))","v":""},{"$f":"IF(A233=\"\",\"\",RTD(\"cqg.rtd\", ,\"ContractData\",C233, \"NetLastTradeToday\",, \"T\"))","v":""},{"$f":"IF(A233=\"\",\"\",IFERROR(RTD(\"cqg.rtd\", ,\"ContractData\",C233, \"PerCentNetLastTrade\",, \"T\")/100,\"\"))","v":""},{"$f":"IF(A233=\"\",\"\",RTD(\"cqg.rtd\", ,\"ContractData\", C233, \"T_CVol\",, \"T\"))","v":""},233,{"$f":"IFERROR(RANK($J233,INDIRECT((\"$J$\"&\"1\"&\":$J$\"&$A$351)))+COUNTIF($J$1:J233,J233)-1,\"\")","v":""},"",""]
[{"$f":"IF(Symbols!A234=\"\",\"\",Symbols!A234)","v":""},"","",{"$f":"IF(A234=\"\",\"\",RTD(\"cqg.rtd\", ,\"ContractData\",C234, \"LongDescription\",, \"T\"))","v":""},null,null,null,{"$f":"IF(A234=\"\",\"\",RTD(\"cqg.rtd\", ,\"ContractData\",C234, \"LastTradeToday\",, \"T\"))","v":""},{"$f":"IF(A234=\"\",\"\",RTD(\"cqg.rtd\", ,\"ContractData\",C234, \"NetLastTradeToday\",, \"T\"))","v":""},{"$f":"IF(A234=\"\",\"\",IFERROR(RTD(\"cqg.rtd\", ,\"ContractData\",C234, \"PerCentNetLastTrade\",, \"T\")/100,\"\"))","v":""},{"$f":"IF(A234=\"\",\"\",RTD(\"cqg.rtd\", ,\"ContractData\", C234, \"T_CVol\",, \"T\"))","v":""},234,{"$f":"IFERROR(RANK($J234,INDIRECT((\"$J$\"&\"1\"&\":$J$\"&$A$351)))+COUNTIF($J$1:J234,J234)-1,\"\")","v":""},"",""]
[{"$f":"IF(Symbols!A235=\"\",\"\",Symbols!A235)","v":""},"","",{"$f":"IF(A235=\"\",\"\",RTD(\"cqg.rtd\", ,\"ContractData\",C235, \"LongDescription\",, \"T\"))","v":""},null,null,null,{"$f":"IF(A235=\"\",\"\",RTD(\"cqg.rtd\", ,\"ContractData\",C235, \"LastTradeToday\",, \"T\"))","v":""},{"$f":"IF(A235=\"\",\"\",RTD(\"cqg.rtd\", ,\"ContractData\",C235, \"NetLastTradeToday\",, \"T\"))","v":""},{"$f":"IF(A235=\"\",\"\",IFERROR(RTD(\"cqg.rtd\", ,\"ContractData\",C235, \"PerCentNetLastTrade\",, \"T\")/100,\"\"))","v":""},{"$f":"IF(A235=\"\",\"\",RTD(\"cqg.rtd\", ,\"ContractData\", C235, \"T_CVol\",, \"T\"))","v":""},235,{"$f":"IFERROR(RANK($J235,INDIRECT((\"$J$\"&\"1\"&\":$J$\"&$A$351)))+COUNTIF($J$1:J235,J235)-1,\"\")","v":""},"",""]
[{"$f":"IF(Symbols!A236=\"\",\"\",Symbols!A236)","v":""},"","",{"$f":"IF(A236=\"\",\"\",RTD(\"cqg.rtd\", ,\"ContractData\",C236, \"LongDescription\",, \"T\"))","v":""},null,null,null,{"$f":"IF(A236=\"\",\"\",RTD(\"cqg.rtd\", ,\"ContractData\",C236, \"LastTradeToday\",, \"T\"))","v":""},{"$f":"IF(A236=\"\",\"\",RTD(\"cqg.rtd\", ,\"ContractData\",C236, \"NetLastTradeToday\",, \"T\"))","v":""},{"$f":"IF(A236=\"\",\"\",IFERROR(RTD(\"cqg.rtd\", ,\"ContractData\",C236, \"PerCentNetLastTrade\",, \"T\")/100,\"\"))","v":""},{"$f":"IF(A236=\"\",\"\",RTD(\"cqg.rtd\", ,\"ContractData\", C236, \"T_CVol\",, \"T\"))","v":""},236,{"$f":"IFERROR(RANK($J236,INDIRECT((\"$J$\"&\"1\"&\":$J$\"&$A$351)))+COUNTIF($J$1:J236,J236)-1,\"\")","v":""},"",""]
[{"$f":"IF(Symbols!A237=\"\",\"\",Symbols!A237)","v":""},"","",{"$f":"IF(A237=\"\",\"\",RTD(\"cqg.rtd\", ,\"ContractData\",C237, \"LongDescription\",, \"T\"))","v":""},null,null,null,{"$f":"IF(A237=\"\",\"\",RTD(\"cqg.rtd\", ,\"ContractData\",C237, \"LastTradeToday\",, \"T\"))","v":""},{"$f":"IF(A237=\"\",\"\",RTD(\"cqg.rtd\", ,\"ContractData\",C237, \"NetLastTradeToday\",, \"T\"))","v":""},{"$f":"IF(A237=\"\",\"\",IFERROR(RTD(\"cqg.rtd\", ,\"ContractData\",C237, \"PerCentNetLastTrade\",, \"T\")/100,\"\"))","v":""},{"$f":"IF(A237=\"\",\"\",RTD(\"cqg.rtd\", ,\"ContractData\", C237, \"T_CVol\",, \"T\"))","v":""},237,{"$f":"IFERROR(RANK($J237,INDIRECT((\"$J$\"&\"1\"&\":$J$\"&$A$351)))+COUNTIF($J$1:J237,J237)-1,\"\")","v":""},"",""]
[{"$f":"IF(Symbols!A238=\"\",\"\",Symbols!A238)","v":""},"","",{"$f":"IF(A238=\"\",\"\",RTD(\"cqg.rtd\", ,\"ContractData\",C238, \"LongDescription\",, \"T\"))","v":""},null,null,null,{"$f":"IF(A238=\"\",\"\",RTD(\"cqg.rtd\", ,\"ContractData\",C238, \"LastTradeToday\",, \"T\"))","v":""},{"$f":"IF(A238=\"\",\"\",RTD(\"cqg.rtd\", ,\"ContractData\",C238, \"NetLastTradeToday\",, \"T\"))","v":""},{"$f":"IF(A238=\"\",\"\",IFERROR(RTD(\"cqg.rtd\", ,\"ContractData\",C238, \"PerCentNetLastTrade\",, \"T\")/100,\"\"))","v":""},{"$f":"IF(A238=\"\",\"\",RTD(\"cqg.rtd\", ,\"ContractData\", C238, \"T_CVol\",, \"T\"))","v":""},238,{"$f":"IFERROR(RANK($J238,INDIRECT((\"$J$\"&\"1\"&\":$J$\"&$A$351)))+COUNTIF($J$1:J238,J238)-1,\"\")","v":""},"",""]
[{"$f":"IF(Symbols!A239=\"\",\"\",Symbols!A239)","v":""},"","",{"$f":"IF(A239=\"\",\"\",RTD(\"cqg.rtd\", ,\"ContractData\",C239, \"LongDescription\",, \"T\"))","v":""},null,null,null,{"$f":"IF(A239=\"\",\"\",RTD(\"cqg.rtd\", ,\"ContractData\",C239, \"LastTradeToday\",, \"T\"))","v":""},{"$f":"IF(A239=\"\",\"\",RTD(\"cqg.rtd\", ,\"ContractData\",C239, \"NetLastTradeToday\",, \"T\"))","v":""},{"$f":"IF(A239=\"\",\"\",IFERROR(RTD(\"cqg.rtd\", ,\"ContractData\",C239, \"PerCentNetLastTrade\",, \"T\")/100,\"\"))","v":""},{"$f":"IF(A239=\"\",\"\",RTD(\"cqg.rtd\", ,\"ContractData\", C239, \"T_CVol\",, \"T\"))","v":""},239,{"$f":"IFERROR(RANK($J239,INDIRECT((\"$J$\"&\"1\"&\":$J$\"&$A$351)))+COUNTIF($J$1:J239,J239)-1,\"\")","v":""},"",""]
[{"$f":"IF(Symbols!A240=\"\",\"\",Symbols!A240)","v":""},"","",{"$f":"IF(A240=\"\",\"\",RTD(\"cqg.rtd\", ,\"ContractData\",C240, \"LongDescription\",, \"T\"))","v":""},null,null,null,{"$f":"IF(A240=\"\",\"\",RTD(\"cqg.rtd\", ,\"ContractData\",C240, \"LastTradeToday\",, \"T\"))","v":""},{"$f":"IF(A240=\"\",\"\",RTD(\"cqg.rtd\", ,\"ContractData\",C240, \"NetLastTradeToday\",, \"T\"))","v":""},{"$f":"IF(A240=\"\",\"\",IFERROR(RTD(\"cqg.rtd\", ,\"ContractData\",C240, \"PerCentNetLastTrade\",, \"T\")/100,\"\"))","v":""},{"$f":"IF(A240=\"\",\"\",RTD(\"cqg.rtd\", ,\"ContractData\", C240, \"T_CVol\",, \"T\"))","v":""},240,{"$f":"IFERROR(RANK($J240,INDIRECT((\"$J$\"&\"1\"&\":$J$\"&$A$351)))+COUNTIF($J$1:J240,J240)-1,\"\")","v":""},"",""]
[{"$f":"IF(Symbols!A241=\"\",\"\",Symbols!A241)","v":""},"","",{"$f":"IF(A241=\"\",\"\",RTD(\"cqg.rtd\", ,\"ContractData\",C241, \"LongDescription\",, \"T\"))","v":""},null,null,null,{"$f":"IF(A241=\"\",\"\",RTD(\"cqg.rtd\", ,\"ContractData\",C241, \"LastTradeToday\",, \"T\"))","v":""},{"$f":"IF(A241=\"\",\"\",RTD(\"cqg.rtd\", ,\"ContractData\",C241, \"NetLastTradeToday\",, \"T\"))","v":""},{"$f":"IF(A241=\"\",\"\",IFERROR(RTD(\"cqg.rtd\", ,\"ContractData\",C241, \"PerCentNetLastTrade\",, \"T\")/100,\"\"))","v":""},{"$f":"IF(A241=\"\",\"\",RTD(\"cqg.rtd\", ,\"ContractData\", C241, \"T_CVol\",, \"T\"))","v":""},241,{"$f":"IFERROR(RANK($J241,INDIRECT((\"$J$\"&\"1\"&\":$J$\"&$A$351)))+COUNTIF($J$1:J241,J241)-1,\"\")","v":""},"",""]
[{"$f":"IF(Symbols!A242=\"\",\"\",Symbols!A242)","v":""},"","",{"$f":"IF(A242=\"\",\"\",RTD(\"cqg.rtd\", ,\"ContractData\",C242, \"LongDescription\",, \"T\"))","v":""},null,null,null,{"$f":"IF(A242=\"\",\"\",RTD(\"cqg.rtd\", ,\"ContractData\",C242, \"LastTradeToday\",, \"T\"))","v":""},{"$f":"IF(A242=\"\",\"\",RTD(\"cqg.rtd\", ,\"ContractData\",C242, \"NetLastTradeToday\",, \"T\"))","v":""},{"$f":"IF(A242=\"\",\"\",IFERROR(RTD(\"cqg.rtd\", ,\"ContractData\",C242, \"PerCentNetLastTrade\",, \"T\")/100,\"\"))","v":""},{"$f":"IF(A242=\"\",\"\",RTD(\"cqg.rtd\", ,\"ContractData\", C242, \"T_CVol\",, \"T\"))","v":""},242,{"$f":"IFERROR(RANK($J242,INDIRECT((\"$J$\"&\"1\"&\":$J$\"&$A$351)))+COUNTIF($J$1:J242,J242)-1,\"\")","v":""},"",""]
[{"$f":"IF(Symbols!A243=\"\",\"\",Symbols!A243)","v":""},"","",{"$f":"IF(A243=\"\",\"\",RTD(\"cqg.rtd\", ,\"ContractData\",C243, \"LongDescription\",, \"T\"))","v":""},null,null,null,{"$f":"IF(A243=\"\",\"\",RTD(\"cqg.rtd\", ,\"ContractData\",C243, \"LastTradeToday\",, \"T\"))","v":""},{"$f":"IF(A243=\"\",\"\",RTD(\"cqg.rtd\", ,\"ContractData\",C243, \"NetLastTradeToday\",, \"T\"))","v":""},{"$f":"IF(A243=\"\",\"\",IFERROR(RTD(\"cqg.rtd\", ,\"ContractData\",C243, \"PerCentNetLastTrade\",, \"T\")/100,\"\"))","v":""},{"$f":"IF(A243=\"\",\"\",RTD(\"cqg.rtd\", ,\"ContractData\", C243, \"T_CVol\",, \"T\"))","v":""},243,{"$f":"IFERROR(RANK($J243,INDIRECT((\"$J$\"&\"1\"&\":$J$\"&$A$351)))+COUNTIF($J$1:J243,J243)-1,\"\")","v":""},"",""]
[{"$f":"IF(Symbols!A244=\"\",\"\",Symbols!A244)","v":""},"","",{"$f":"IF(A244=\"\",\"\",RTD(\"cqg.rtd\", ,\"ContractData\",C244, \"LongDescription\",, \"T\"))","v":""},null,null,null,{"$f":"IF(A244=\"\",\"\",RTD(\"cqg.rtd\", ,\"ContractData\",C244, \"LastTradeToday\",, \"T\"))","v":""},{"$f":"IF(A244=\"\",\"\",RTD(\"cqg.rtd\", ,\"ContractData\",C244, \"NetLastTradeToday\",, \"T\"))","v":""},{"$f":"IF(A244=\"\",\"\",IFERROR(RTD(\"cqg.rtd\", ,\"ContractData\",C244, \"PerCentNetLastTrade\",, \"T\")/100,\"\"))","v":""},{"$f":"IF(A244=\"\",\"\",RTD(\"cqg.rtd\", ,\"ContractData\", C244, \"T_CVol\",, \"T\"))","v":""},244,{"$f":"IFERROR(RANK($J244,INDIRECT((\"$J$\"&\"1\"&\":$J$\"&$A$351)))+COUNTIF($J$1:J244,J244)-1,\"\")","v":""},"",""]
[{"$f":"IF(Symbols!A245=\"\",\"\",Symbols!A245)","v":""},"","",{"$f":"IF(A245=\"\",\"\",RTD(\"cqg.rtd\", ,\"ContractData\",C245, \"LongDescription\",, \"T\"))","v":""},null,null,null,{"$f":"IF(A245=\"\",\"\",RTD(\"cqg.rtd\", ,\"ContractData\",C245, \"LastTradeToday\",, \"T\"))","v":""},{"$f":"IF(A245=\"\",\"\",RTD(\"cqg.rtd\", ,\"ContractData\",C245, \"NetLastTradeToday\",, \"T\"))","v":""},{"$f":"IF(A245=\"\",\"\",IFERROR(RTD(\"cqg.rtd\", ,\"ContractData\",C245, \"PerCentNetLastTrade\",, \"T\")/100,\"\"))","v":""},{"$f":"IF(A245=\"\",\"\",RTD(\"cqg.rtd\", ,\"ContractData\", C245, \"T_CVol\",, \"T\"))","v":""},245,{"$f":"IFERROR(RANK($J245,INDIRECT((\"$J$\"&\"1\"&\":$J$\"&$A$351)))+COUNTIF($J$1:J245,J245)-1,\"\")","v":""},"",""]
[{"$f":"IF(Symbols!A246=\"\",\"\",Symbols!A246)","v":""},"","",{"$f":"IF(A246=\"\",\"\",RTD(\"cqg.rtd\", ,\"ContractData\",C246, \"LongDescription\",, \"T\"))","v":""},null,null,null,{"$f":"IF(A246=\"\",\"\",RTD(\"cqg.rtd\", ,\"ContractData\",C246, \"LastTradeToday\",, \"T\"))","v":""},{"$f":"IF(A246=\"\",\"\",RTD(\"cqg.rtd\", ,\"ContractData\",C246, \"NetLastTradeToday\",, \"T\"))","v":""},{"$f":"IF(A246=\"\",\"\",IFERROR(RTD(\"cqg.rtd\", ,\"ContractData\",C246, \"PerCentNetLastTrade\",, \"T\")/100,\"\"))","v":""},{"$f":"IF(A246=\"\",\"\",RTD(\"cqg.rtd\", ,\"ContractData\", C246, \"T_CVol\",, \"T\"))","v":""},246,{"$f":"IFERROR(RANK($J246,INDIRECT((\"$J$\"&\"1\"&\":$J$\"&$A$351)))+COUNTIF($J$1:J246,J246)-1,\"\")","v":""},"",""]
[{"$f":"IF(Symbols!A247=\"\",\"\",Symbols!A247)","v":""},"","",{"$f":"IF(A247=\"\",\"\",RTD(\"cqg.rtd\", ,\"ContractData\",C247, \"LongDescription\",, \"T\"))","v":""},null,null,null,{"$f":"IF(A247=\"\",\"\",RTD(\"cqg.rtd\", ,\"ContractData\",C247, \"LastTradeToday\",, \"T\"))","v":""},{"$f":"IF(A247=\"\",\"\",RTD(\"cqg.rtd\", ,\"ContractData\",C247, \"NetLastTradeToday\",, \"T\"))","v":""},{"$f":"IF(A247=\"\",\"\",IFERROR(RTD(\"cqg.rtd\", ,\"ContractData\",C247, \"PerCentNetLastTrade\",, \"T\")/100,\"\"))","v":""},{"$f":"IF(A247=\"\",\"\",RTD(\"cqg.rtd\", ,\"ContractData\", C247, \"T_CVol\",, \"T\"))","v":""},247,{"$f":"IFERROR(RANK($J247,INDIRECT((\"$J$\"&\"1\"&\":$J$\"&$A$351)))+COUNTIF($J$1:J247,J247)-1,\"\")","v":""},"",""]
[{"$f":"IF(Symbols!A248=\"\",\"\",Symbols!A248)","v":""},"","",{"$f":"IF(A248=\"\",\"\",RTD(\"cqg.rtd\", ,\"ContractData\",C248, \"LongDescription\",, \"T\"))","v":""},null,null,null,{"$f":"IF(A248=\"\",\"\",RTD(\"cqg.rtd\", ,\"ContractData\",C248, \"LastTradeToday\",, \"T\"))","v":""},{"$f":"IF(A248=\"\",\"\",RTD(\"cqg.rtd\", ,\"ContractData\",C248, \"NetLastTradeToday\",, \"T\"))","v":""},{"$f":"IF(A248=\"\",\"\",IFERROR(RTD(\"cqg.rtd\", ,\"ContractData\",C248, \"PerCentNetLastTrade\",, \"T\")/100,\"\"))","v":""},{"$f":"IF(A248=\"\",\"\",RTD(\"cqg.rtd\", ,\"ContractData\", C248, \"T_CVol\",, \"T\"))","v":""},248,{"$f":"IFERROR(RANK($J248,INDIRECT((\"$J$\"&\"1\"&\":$J$\"&$A$351)))+COUNTIF($J$1:J248,J248)-1,\"\")","v":""},"",""]
[{"$f":"IF(Symbols!A249=\"\",\"\",Symbols!A249)","v":""},"","",{"$f":"IF(A249=\"\",\"\",RTD(\"cqg.rtd\", ,\"ContractData\",C249, \"LongDescription\",, \"T\"))","v":""},null,null,null,{"$f":"IF(A249=\"\",\"\",RTD(\"cqg.rtd\", ,\"ContractData\",C249, \"LastTradeToday\",, \"T\"))","v":""},{"$f":"IF(A249=\"\",\"\",RTD(\"cqg.rtd\", ,\"ContractData\",C249, \"NetLastTradeToday\",, \"T\"))","v":""},{"$f":"IF(A249=\"\",\"\",IFERROR(RTD(\"cqg.rtd\", ,\"ContractData\",C249, \"PerCentNetLastTrade\",, \"T\")/100,\"\"))","v":""},{"$f":"IF(A249=\"\",\"\",RTD(\"cqg.rtd\", ,\"ContractData\", C249, \"T_CVol\",, \"T\"))","v":""},249,{"$f":"IFERROR(RANK($J249,INDIRECT((\"$J$\"&\"1\"&\":$J$\"&$A$351)))+COUNTIF($J$1:J249,J249)-1,\"\")","v":""},"",""]
[{"$f":"IF(Symbols!A250=\"\",\"\",Symbols!A250)","v":""},"","",{"$f":"IF(A250=\"\",\"\",RTD(\"cqg.rtd\", ,\"ContractData\",C250, \"LongDescription\",, \"T\"))","v":""},null,null,null,{"$f":"IF(A250=\"\",\"\",RTD(\"cqg.rtd\", ,\"ContractData\",C250, \"LastTradeToday\",, \"T\"))","v":""},{"$f":"IF(A250=\"\",\"\",RTD(\"cqg.rtd\", ,\"ContractData\",C250, \"NetLastTradeToday\",, \"T\"))","v":""},{"$f":"IF(A250=\"\",\"\",IFERROR(RTD(\"cqg.rtd\", ,\"ContractData\",C250, \"PerCentNetLastTrade\",, \"T\")/100,\"\"))","v":""},{"$f":"IF(A250=\"\",\"\",RTD(\"cqg.rtd\", ,\"ContractData\", C250, \"T_CVol\",, \"T\"))","v":""},250,{"$f":"IFERROR(RANK($J250,INDIRECT((\"$J$\"&\"1\"&\":$J$\"&$A$351)))+COUNTIF($J$1:J250,J250)-1,\"\")","v":""},"",""]
[{"$f":"IF(Symbols!A251=\"\",\"\",Symbols!A251)","v":""},"","",{"$f":"IF(A251=\"\",\"\",RTD(\"cqg.rtd\", ,\"ContractData\",C251, \"LongDescription\",, \"T\"))","v":""},null,null,null,{"$f":"IF(A251=\"\",\"\",RTD(\"cqg.rtd\", ,\"ContractData\",C251, \"LastTradeToday\",, \"T\"))","v":""},{"$f":"IF(A251=\"\",\"\",RTD(\"cqg.rtd\", ,\"ContractData\",C251, \"NetLastTradeToday\",, \"T\"))","v":""},{"$f":"IF(A251=\"\",\"\",IFERROR(RTD(\"cqg.rtd\", ,\"ContractData\",C251, \"PerCentNetLastTrade\",, \"T\")/100,\"\"))","v":""},{"$f":"IF(A251=\"\",\"\",RTD(\"cqg.rtd\", ,\"ContractData\", C251, \"T_CVol\",, \"T\"))","v":""},251,{"$f":"IFERROR(RANK($J251,INDIRECT((\"$J$\"&\"1\"&\":$J$\"&$A$351)))+COUNTIF($J$1:J251,J251)-1,\"\")","v":""},"",""]
[{"$f":"IF(Symbols!A252=\"\",\"\",Symbols!A252)","v":""},"","",{"$f":"IF(A252=\"\",\"\",RTD(\"cqg.rtd\", ,\"ContractData\",C252, \"LongDescription\",, \"T\"))","v":""},null,null,null,{"$f":"IF(A252=\"\",\"\",RTD(\"cqg.rtd\", ,\"ContractData\",C252, \"LastTradeToday\",, \"T\"))","v":""},{"$f":"IF(A252=\"\",\"\",RTD(\"cqg.rtd\", ,\"ContractData\",C252, \"NetLastTradeToday\",, \"T\"))","v":""},{"$f":"IF(A252=\"\",\"\",IFERROR(RTD(\"cqg.rtd\", ,\"ContractData\",C252, \"PerCentNetLastTrade\",, \"T\")/100,\"\"))","v":""},{"$f":"IF(A252=\"\",\"\",RTD(\"cqg.rtd\", ,\"ContractData\", C252, \"T_CVol\",, \"T\"))","v":""},252,{"$f":"IFERROR(RANK($J252,INDIRECT((\"$J$\"&\"1\"&\":$J$\"&$A$351)))+COUNTIF($J$1:J252,J252)-1,\"\")","v":""},"",""]
[{"$f":"IF(Symbols!A253=\"\",\"\",Symbols!A253)","v":""},{"$f":"IF(A253=\"\",\"\",IF(J253>0,1,0))","v":""},{"$f":"A253","v":""},{"$f":"IF(A253=\"\",\"\",RTD(\"cqg.rtd\", ,\"ContractData\",C253, \"LongDescription\",, \"T\"))","v":""},null,null,null,{"$f":"IF(A253=\"\",\"\",RTD(\"cqg.rtd\", ,\"ContractData\",C253, \"LastTradeToday\",, \"T\"))","v":""},{"$f":"IF(A253=\"\",\"\",RTD(\"cqg.rtd\", ,\"ContractData\",C253, \"NetLastTradeToday\",, \"T\"))","v":""},{"$f":"IF(A253=\"\",\"\",IFERROR(RTD(\"cqg.rtd\", ,\"ContractData\",C253, \"PerCentNetLastTrade\",, \"T\")/100,\"\"))","v":""},{"$f":"IF(A253=\"\",\"\",RTD(\"cqg.rtd\", ,\"ContractData\", C253, \"T_CVol\",, \"T\"))","v":""},253,{"$f":"IFERROR(RANK($J253,INDIRECT((\"$J$\"&\"1\"&\":$J$\"&$A$351)))+COUNTIF($J$1:J253,J253)-1,\"\")","v":""},{"$f":"C253","v":""},""]
[{"$f":"IF(Symbols!A254=\"\",\"\",Symbols!A254)","v":""},"","",{"$f":"IF(A254=\"\",\"\",RTD(\"cqg.rtd\", ,\"ContractData\",C254, \"LongDescription\",, \"T\"))","v":""},null,null,null,{"$f":"IF(A254=\"\",\"\",RTD(\"cqg.rtd\", ,\"ContractData\",C254, \"LastTradeToday\",, \"T\"))","v":""},{"$f":"IF(A254=\"\",\"\",RTD(\"cqg.rtd\", ,\"ContractData\",C254, \"NetLastTradeToday\",, \"T\"))","v":""},{"$f":"IF(A254=\"\",\"\",IFERROR(RTD(\"cqg.rtd\", ,\"ContractData\",C254, \"PerCentNetLastTrade\",, \"T\")/100,\"\"))","v":""},{"$f":"IF(A254=\"\",\"\",RTD(\"cqg.rtd\", ,\"ContractData\", C254, \"T_CVol\",, \"T\"))","v":""},254,{"$f":"IFERROR(RANK($J254,INDIRECT((\"$J$\"&\"1\"&\":$J$\"&$A$351)))+COUNTIF($J$1:J254,J254)-1,\"\")","v":""},"",""]
[{"$f":"IF(Symbols!A255=\"\",\"\",Symbols!A255)","v":""},"","",{"$f":"IF(A255=\"\",\"\",RTD(\"cqg.rtd\", ,\"ContractData\",C255, \"LongDescription\",, \"T\"))","v":""},null,null,null,{"$f":"IF(A255=\"\",\"\",RTD(\"cqg.rtd\", ,\"ContractData\",C255, \"LastTradeToday\",, \"T\"))","v":""},{"$f":"IF(A255=\"\",\"\",RTD(\"cqg.rtd\", ,\"ContractData\",C255, \"NetLastTradeToday\",, \"T\"))","v":""},{"$f":"IF(A255=\"\",\"\",IFERROR(RTD(\"cqg.rtd\", ,\"ContractData\",C255, \"PerCentNetLastTrade\",, \"T\")/100,\"\"))","v":""},{"$f":"IF(A255=\"\",\"\",RTD(\"cqg.rtd\", ,\"ContractData\", C255, \"T_CVol\",, \"T\"))","v":""},255,{"$f":"IFERROR(RANK($J255,INDIRECT((\"$J$\"&\"1\"&\":$J$\"&$A$351)))+COUNTIF($J$1:J255,J255)-1,\"\")","v":""},"",""]
[{"$f":"IF(Symbols!A256=\"\",\"\",Symbols!A256)","v":""},"","",{"$f":"IF(A256=\"\",\"\",RTD(\"cqg.rtd\", ,\"ContractData\",C256, \"LongDescription\",, \"T\"))","v":""},null,null,null,{"$f":"IF(A256=\"\",\"\",RTD(\"cqg.rtd\", ,\"ContractData\",C256, \"LastTradeToday\",, \"T\"))","v":""},{"$f":"IF(A256=\"\",\"\",RTD(\"cqg.rtd\", ,\"ContractData\",C256, \"NetLastTradeToday\",, \"T\"))","v":""},{"$f":"IF(A256=\"\",\"\",IFERROR(RTD(\"cqg.rtd\", ,\"ContractData\",C256, \"PerCentNetLastTrade\",, \"T\")/100,\"\"))","v":""},{"$f":"IF(A256=\"\",\"\",RTD(\"cqg.rtd\", ,\"ContractData\", C256, \"T_CVol\",, \"T\"))","v":""},256,{"$f":"IFERROR(RANK($J256,INDIRECT((\"$J$\"&\"1\"&\":$J$\"&$A$351)))+COUNTIF($J$1:J256,J256)-1,\"\")","v":""},"",""]
[{"$f":"IF(Symbols!A257=\"\",\"\",Symbols!A257)","v":""},"","",{"$f":"IF(A257=\"\",\"\",RTD(\"cqg.rtd\", ,\"ContractData\",C257, \"LongDescription\",, \"T\"))","v":""},null,null,null,{"$f":"IF(A257=\"\",\"\",RTD(\"cqg.rtd\", ,\"ContractData\",C257, \"LastTradeToday\",, \"T\"))","v":""},{"$f":"IF(A257=\"\",\"\",RTD(\"cqg.rtd\", ,\"ContractData\",C257, \"NetLastTradeToday\",, \"T\"))","v":""},{"$f":"IF(A257=\"\",\"\",IFERROR(RTD(\"cqg.rtd\", ,\"ContractData\",C257, \"PerCentNetLastTrade\",, \"T\")/100,\"\"))","v":""},{"$f":"IF(A257=\"\",\"\",RTD(\"cqg.rtd\", ,\"ContractData\", C257, \"T_CVol\",, \"T\"))","v":""},257,{"$f":"IFERROR(RANK($J257,INDIRECT((\"$J$\"&\"1\"&\":$J$\"&$A$351)))+COUNTIF($J$1:J257,J257)-1,\"\")","v":""},"",""]
[{"$f":"IF(Symbols!A258=\"\",\"\",Symbols!A258)","v":""},"","",{"$f":"IF(A258=\"\",\"\",RTD(\"cqg.rtd\", ,\"ContractData\",C258, \"LongDescription\",, \"T\"))","v":""},null,null,null,{"$f":"IF(A258=\"\",\"\",RTD(\"cqg.rtd\", ,\"ContractData\",C258, \"LastTradeToday\",, \"T\"))","v":""},{"$f":"IF(A258=\"\",\"\",RTD(\"cqg.rtd\", ,\"ContractData\",C258, \"NetLastTradeToday\",, \"T\"))","v":""},{"$f":"IF(A258=\"\",\"\",IFERROR(RTD(\"cqg.rtd\", ,\"ContractData\",C258, \"PerCentNetLastTrade\",, \"T\")/100,\"\"))","v":""},{"$f":"IF(A258=\"\",\"\",RTD(\"cqg.rtd\", ,\"ContractData\", C258, \"T_CVol\",, \"T\"))","v":""},258,{"$f":"IFERROR(RANK($J258,INDIRECT((\"$J$\"&\"1\"&\":$J$\"&$A$351)))+COUNTIF($J$1:J258,J258)-1,\"\")","v":""},"",{"$f":"IFERROR(VLOOKUP($L258,$M$1:$N$350,2,FALSE),\"\")","v":""}]
[{"$f":"IF(Symbols!A259=\"\",\"\",Symbols!A259)","v":""},"","",{"$f":"IF(A259=\"\",\"\",RTD(\"cqg.rtd\", ,\"ContractData\",C259, \"LongDescription\",, \"T\"))","v":""},null,null,null,{"$f":"IF(A259=\"\",\"\",RTD(\"cqg.rtd\", ,\"ContractData\",C259, \"LastTradeToday\",, \"T\"))","v":""},{"$f":"IF(A259=\"\",\"\",RTD(\"cqg.rtd\", ,\"ContractData\",C259, \"NetLastTradeToday\",, \"T\"))","v":""},{"$f":"IF(A259=\"\",\"\",IFERROR(RTD(\"cqg.rtd\", ,\"ContractData\",C259, \"PerCentNetLastTrade\",, \"T\")/100,\"\"))","v":""},{"$f":"IF(A259=\"\",\"\",RTD(\"cqg.rtd\", ,\"ContractData\", C259, \"T_CVol\",, \"T\"))","v":""},{"$f":"L258+1","v":259},{"$f":"IFERROR(RANK($J259,INDIRECT((\"$J$\"&\"1\"&\":$J$\"&$A$351)))+COUNTIF($J$1:J259,J259)-1,\"\")","v":""},"",""]
[{"$f":"IF(Symbols!A260=\"\",\"\",Symbols!A260)","v":""},"","",{"$f":"IF(A260=\"\",\"\",RTD(\"cqg.rtd\", ,\"ContractData\",C260, \"LongDescription\",, \"T\"))","v":""},null,null,null,{"$f":"IF(A260=\"\",\"\",RTD(\"cqg.rtd\", ,\"ContractData\",C260, \"LastTradeToday\",, \"T\"))","v":""},{"$f":"IF(A260=\"\",\"\",RTD(\"cqg.rtd\", ,\"ContractData\",C260, \"NetLastTradeToday\",, \"T\"))","v":""},{"$f":"IF(A260=\"\",\"\",IFERROR(RTD(\"cqg.rtd\", ,\"ContractData\",C260, \"PerCentNetLastTrade\",, \"T\")/100,\"\"))","v":""},{"$f":"IF(A260=\"\",\"\",RTD(\"cqg.rtd\", ,\"ContractData\", C260, \"T_CVol\",, \"T\"))","v":""},260,{"$f":"IFERROR(RANK($J260,INDIRECT((\"$J$\"&\"1\"&\":$J$\"&$A$351)))+COUNTIF($J$1:J260,J260)-1,\"\")","v":""},"",""]
[{"$f":"IF(Symbols!A261=\"\",\"\",Symbols!A261)","v":""},"","",{"$f":"IF(A261=\"\",\"\",RTD(\"cqg.rtd\", ,\"ContractData\",C261, \"LongDescription\",, \"T\"))","v":""},null,null,null,{"$f":"IF(A261=\"\",\"\",RTD(\"cqg.rtd\", ,\"ContractData\",C261, \"LastTradeToday\",, \"T\"))","v":""},{"$f":"IF(A261=\"\",\"\",RTD(\"cqg.rtd\", ,\"ContractData\",C261, \"NetLastTradeToday\",, \"T\"))","v":""},{"$f":"IF(A261=\"\",\"\",IFERROR(RTD(\"cqg.rtd\", ,\"ContractData\",C261, \"PerCentNetLastTrade\",, \"T\")/100,\"\"))","v":""},{"$f":"IF(A261=\"\",\"\",RTD(\"cqg.rtd\", ,\"ContractData\", C261, \"T_CVol\",, \"T\"))","v":""},261,{"$f":"IFERROR(RANK($J261,INDIRECT((\"$J$\"&\"1\"&\":$J$\"&$A$351)))+COUNTIF($J$1:J261,J261)-1,\"\")","v":""},"",""]
[{"$f":"IF(Symbols!A262=\"\",\"\",Symbols!A262)","v":""},"","",{"$f":"IF(A262=\"\",\"\",RTD(\"cqg.rtd\", ,\"ContractData\",C262, \"LongDescription\",, \"T\"))","v":""},null,null,null,{"$f":"IF(A262=\"\",\"\",RTD(\"cqg.rtd\", ,\"ContractData\",C262, \"LastTradeToday\",, \"T\"))","v":""},{"$f":"IF(A262=\"\",\"\",RTD(\"cqg.rtd\", ,\"ContractData\",C262, \"NetLastTradeToday\",, \"T\"))","v":""},{"$f":"IF(A262=\"\",\"\",IFERROR(RTD(\"cqg.rtd\", ,\"ContractData\",C262, \"PerCentNetLastTrade\",, \"T\")/100,\"\"))","v":""},{"$f":"IF(A262=\"\",\"\",RTD(\"cqg.rtd\", ,\"ContractData\", C262, \"T_CVol\",, \"T\"))","v":""},262,{"$f":"IFERROR(RANK($J262,INDIRECT((\"$J$\"&\"1\"&\":$J$\"&$A$351)))+COUNTIF($J$1:J262,J262)-1,\"\")","v":""},"",""]
[{"$f":"IF(Symbols!A263=\"\",\"\",Symbols!A263)","v":""},"","",{"$f":"IF(A263=\"\",\"\",RTD(\"cqg.rtd\", ,\"ContractData\",C263, \"LongDescription\",, \"T\"))","v":""},null,null,null,{"$f":"IF(A263=\"\",\"\",RTD(\"cqg.rtd\", ,\"ContractData\",C263, \"LastTradeToday\",, \"T\"))","v":""},{"$f":"IF(A263=\"\",\"\",RTD(\"cqg.rtd\", ,\"ContractData\",C263, \"NetLastTradeToday\",, \"T\"))","v":""},{"$f":"IF(A263=\"\",\"\",IFERROR(RTD(\"cqg.rtd\", ,\"ContractData\",C263, \"PerCentNetLastTrade\",, \"T\")/100,\"\"))","v":""},{"$f":"IF(A263=\"\",\"\",RTD(\"cqg.rtd\", ,\"ContractData\", C263, \"T_CVol\",, \"T\"))","v":""},263,{"$f":"IFERROR(RANK($J263,INDIRECT((\"$J$\"&\"1\"&\":$J$\"&$A$351)))+COUNTIF($J$1:J263,J263)-1,\"\")","v":""},"",""]
[{"$f":"IF(Symbols!A264=\"\",\"\",Symbols!A264)","v":""},"","",{"$f":"IF(A264=\"\",\"\",RTD(\"cqg.rtd\", ,\"ContractData\",C264, \"LongDescription\",, \"T\"))","v":""},null,null,null,{"$f":"IF(A264=\"\",\"\",RTD(\"cqg.rtd\", ,\"ContractData\",C264, \"LastTradeToday\",, \"T\"))","v":""},{"$f":"IF(A264=\"\",\"\",RTD(\"cqg.rtd\", ,\"ContractData\",C264, \"NetLastTradeToday\",, \"T\"))","v":""},{"$f":"IF(A264=\"\",\"\",IFERROR(RTD(\"cqg.rtd\", ,\"ContractData\",C264, \"PerCentNetLastTrade\",, \"T\")/100,\"\"))","v":""},{"$f":"IF(A264=\"\",\"\",RTD(\"cqg.rtd\", ,\"ContractData\", C264, \"T_CVol\",, \"T\"))","v":""},264,{"$f":"IFERROR(RANK($J264,INDIRECT((\"$J$\"&\"1\"&\":$J$\"&$A$351)))+COUNTIF($J$1:J264,J264)-1,\"\")","v":""},"",""]
[{"$f":"IF(Symbols!A265=\"\",\"\",Symbols!A265)","v":""},"","",{"$f":"IF(A265=\"\",\"\",RTD(\"cqg.rtd\", ,\"ContractData\",C265, \"LongDescription\",, \"T\"))","v":""},null,null,null,{"$f":"IF(A265=\"\",\"\",RTD(\"cqg.rtd\", ,\"ContractData\",C265, \"LastTradeToday\",, \"T\"))","v":""},{"$f":"IF(A265=\"\",\"\",RTD(\"cqg.rtd\", ,\"ContractData\",C265, \"NetLastTradeToday\",, \"T\"))","v":""},{"$f":"IF(A265=\"\",\"\",IFERROR(RTD(\"cqg.rtd\", ,\"ContractData\",C265, \"PerCentNetLastTrade\",, \"T\")/100,\"\"))","v":""},{"$f":"IF(A265=\"\",\"\",RTD(\"cqg.rtd\", ,\"ContractData\", C265, \"T_CVol\",, \"T\"))","v":""},265,{"$f":"IFERROR(RANK($J265,INDIRECT((\"$J$\"&\"1\"&\":$J$\"&$A$351)))+COUNTIF($J$1:J265,J265)-1,\"\")","v":""},"",""]
[{"$f":"IF(Symbols!A266=\"\",\"\",Symbols!A266)","v":""},"","",{"$f":"IF(A266=\"\",\"\",RTD(\"cqg.rtd\", ,\"ContractData\",C266, \"LongDescription\",, \"T\"))","v":""},null,null,null,{"$f":"IF(A266=\"\",\"\",RTD(\"cqg.rtd\", ,\"ContractData\",C266, \"LastTradeToday\",, \"T\"))","v":""},{"$f":"IF(A266=\"\",\"\",RTD(\"cqg.rtd\", ,\"ContractData\",C266, \"NetLastTradeToday\",, \"T\"))","v":""},{"$f":"IF(A266=\"\",\"\",IFERROR(RTD(\"cqg.rtd\", ,\"ContractData\",C266, \"PerCentNetLastTrade\",, \"T\")/100,\"\"))","v":""},{"$f":"IF(A266=\"\",\"\",RTD(\"cqg.rtd\", ,\"ContractData\", C266, \"T_CVol\",, \"T\"))","v":""},266,{"$f":"IFERROR(RANK($J266,INDIRECT((\"$J$\"&\"1\"&\":$J$\"&$A$351)))+COUNTIF($J$1:J266,J266)-1,\"\")","v":""},"",""]
[{"$f":"IF(Symbols!A267=\"\",\"\",Symbols!A267)","v":""},"","",{"$f":"IF(A267=\"\",\"\",RTD(\"cqg.rtd\", ,\"ContractData\",C267, \"LongDescription\",, \"T\"))","v":""},null,null,null,{"$f":"IF(A267=\"\",\"\",RTD(\"cqg.rtd\", ,\"ContractData\",C267, \"LastTradeToday\",, \"T\"))","v":""},{"$f":"IF(A267=\"\",\"\",RTD(\"cqg.rtd\", ,\"ContractData\",C267, \"NetLastTradeToday\",, \"T\"))","v":""},{"$f":"IF(A267=\"\",\"\",IFERROR(RTD(\"cqg.rtd\", ,\"ContractData\",C267, \"PerCentNetLastTrade\",, \"T\")/100,\"\"))","v":""},{"$f":"IF(A267=\"\",\"\",RTD(\"cqg.rtd\", ,\"ContractData\", C267, \"T_CVol\",, \"T\"))","v":""},267,{"$f":"IFERROR(RANK($J267,INDIRECT((\"$J$\"&\"1\"&\":$J$\"&$A$351)))+COUNTIF($J$1:J267,J267)-1,\"\")","v":""},"",""]
[{"$f":"IF(Symbols!A268=\"\",\"\",Symbols!A268)","v":""},"","",{"$f":"IF(A268=\"\",\"\",RTD(\"cqg.rtd\", ,\"ContractData\",C268, \"LongDescription\",, \"T\"))","v":""},null,null,null,{"$f":"IF(A268=\"\",\"\",RTD(\"cqg.rtd\", ,\"ContractData\",C268, \"LastTradeToday\",, \"T\"))","v":""},{"$f":"IF(A268=\"\",\"\",RTD(\"cqg.rtd\", ,\"ContractData\",C268, \"NetLastTradeToday\",, \"T\"))","v":""},{"$f":"IF(A268=\"\",\"\",IFERROR(RTD(\"cqg.rtd\", ,\"ContractData\",C268, \"PerCentNetLastTrade\",, \"T\")/100,\"\"))","v":""},{"$f":"IF(A268=\"\",\"\",RTD(\"cqg.rtd\", ,\"ContractData\", C268, \"T_CVol\",, \"T\"))","v":""},268,{"$f":"IFERROR(RANK($J268,INDIRECT((\"$J$\"&\"1\"&\":$J$\"&$A$351)))+COUNTIF($J$1:J268,J268)-1,\"\")","v":""},"",""]
[{"$f":"IF(Symbols!A269=\"\",\"\",Symbols!A269)","v":""},"","",{"$f":"IF(A269=\"\",\"\",RTD(\"cqg.rtd\", ,\"ContractData\",C269, \"LongDescription\",, \"T\"))","v":""},null,null,null,{"$f":"IF(A269=\"\",\"\",RTD(\"cqg.rtd\", ,\"ContractData\",C269, \"LastTradeToday\",, \"T\"))","v":""},{"$f":"IF(A269=\"\",\"\",RTD(\"cqg.rtd\", ,\"ContractData\",C269, \"NetLastTradeToday\",, \"T\"))","v":""},{"$f":"IF(A269=\"\",\"\",IFERROR(RTD(\"cqg.rtd\", ,\"ContractData\",C269, \"PerCentNetLastTrade\",, \"T\")/100,\"\"))","v":""},{"$f":"IF(A269=\"\",\"\",RTD(\"cqg.rtd\", ,\"ContractData\", C269, \"T_CVol\",, \"T\"))","v":""},269,{"$f":"IFERROR(RANK($J269,INDIRECT((\"$J$\"&\"1\"&\":$J$\"&$A$351)))+COUNTIF($J$1:J269,J269)-1,\"\")","v":""},"",""]
[{"$f":"IF(Symbols!A270=\"\",\"\",Symbols!A270)","v":""},"","",{"$f":"IF(A270=\"\",\"\",RTD(\"cqg.rtd\", ,\"ContractData\",C270, \"LongDescription\",, \"T\"))","v":""},null,null,null,{"$f":"IF(A270=\"\",\"\",RTD(\"cqg.rtd\", ,\"ContractData\",C270, \"LastTradeToday\",, \"T\"))","v":""},{"$f":"IF(A270=\"\",\"\",RTD(\"cqg.rtd\", ,\"ContractData\",C270, \"NetLastTradeToday\",, \"T\"))","v":""},{"$f":"IF(A270=\"\",\"\",IFERROR(RTD(\"cqg.rtd\", ,\"ContractData\",C270, \"PerCentNetLastTrade\",, \"T\")/100,\"\"))","v":""},{"$f":"IF(A270=\"\",\"\",RTD(\"cqg.rtd\", ,\"ContractData\", C270, \"T_CVol\",, \"T\"))","v":""},270,{"$f":"IFERROR(RANK($J270,INDIRECT((\"$J$\"&\"1\"&\":$J$\"&$A$351)))+COUNTIF($J$1:J270,J270)-1,\"\")","v":""},"",""]
[{"$f":"IF(Symbols!A271=\"\",\"\",Symbols!A271)","v":""},"","",{"$f":"IF(A271=\"\",\"\",RTD(\"cqg.rtd\", ,\"ContractData\",C271, \"LongDescription\",, \"T\"))","v":""},null,null,null,{"$f":"IF(A271=\"\",\"\",RTD(\"cqg.rtd\", ,\"ContractData\",C271, \"LastTradeToday\",, \"T\"))","v":""},{"$f":"IF(A271=\"\",\"\",RTD(\"cqg.rtd\", ,\"ContractData\",C271, \"NetLastTradeToday\",, \"T\"))","v":""},{"$f":"IF(A271=\"\",\"\",IFERROR(RTD(\"cqg.rtd\", ,\"ContractData\",C271, \"PerCentNetLastTrade\",, \"T\")/100,\"\"))","v":""},{"$f":"IF(A271=\"\",\"\",RTD(\"cqg.rtd\", ,\"ContractData\", C271, \"T_CVol\",, \"T\"))","v":""},271,{"$f":"IFERROR(RANK($J271,INDIRECT((\"$J$\"&\"1\"&\":$J$\"&$A$351)))+COUNTIF($J$1:J271,J271)-1,\"\")","v":""},"",""]
[{"$f":"IF(Symbols!A272=\"\",\"\",Symbols!A272)","v":""},"","",{"$f":"IF(A272=\"\",\"\",RTD(\"cqg.rtd\", ,\"ContractData\",C272, \"LongDescription\",, \"T\"))","v":""},null,null,null,{"$f":"IF(A272=\"\",\"\",RTD(\"cqg.rtd\", ,\"ContractData\",C272, \"LastTradeToday\",, \"T\"))","v":""},{"$f":"IF(A272=\"\",\"\",RTD(\"cqg.rtd\", ,\"ContractData\",C272, \"NetLastTradeToday\",, \"T\"))","v":""},{"$f":"IF(A272=\"\",\"\",IFERROR(RTD(\"cqg.rtd\", ,\"ContractData\",C272, \"PerCentNetLastTrade\",, \"T\")/100,\"\"))","v":""},{"$f":"IF(A272=\"\",\"\",RTD(\"cqg.rtd\", ,\"ContractData\", C272, \"T_CVol\",, \"T\"))","v":""},272,{"$f":"IFERROR(RANK($J272,INDIRECT((\"$J$\"&\"1\"&\":$J$\"&$A$351)))+COUNTIF($J$1:J272,J272)-1,\"\")","v":""},"",""]
[{"$f":"IF(Symbols!A273=\"\",\"\",Symbols!A273)","v":""},"","",{"$f":"IF(A273=\"\",\"\",RTD(\"cqg.rtd\", ,\"ContractData\",C273, \"LongDescription\",, \"T\"))","v":""},null,null,null,{"$f":"IF(A273=\"\",\"\",RTD(\"cqg.rtd\", ,\"ContractData\",C273, \"LastTradeToday\",, \"T\"))","v":""},{"$f":"IF(A273=\"\",\"\",RTD(\"cqg.rtd\", ,\"ContractData\",C273, \"NetLastTradeToday\",, \"T\"))","v":""},{"$f":"IF(A273=\"\",\"\",IFERROR(RTD(\"cqg.rtd\", ,\"ContractData\",C273, \"PerCentNetLastTrade\",, \"T\")/100,\"\"))","v":""},{"$f":"IF(A273=\"\",\"\",RTD(\"cqg.rtd\", ,\"ContractData\", C273, \"T_CVol\",, \"T\"))","v":""},273,{"$f":"IFERROR(RANK($J273,INDIRECT((\"$J$\"&\"1\"&\":$J$\"&$A$351)))+COUNTIF($J$1:J273,J273)-1,\"\")","v":""},"",""]
[{"$f":"IF(Symbols!A274=\"\",\"\",Symbols!A274)","v":""},"","",{"$f":"IF(A274=\"\",\"\",RTD(\"cqg.rtd\", ,\"ContractData\",C274, \"LongDescription\",, \"T\"))","v":""},null,null,null,{"$f":"IF(A274=\"\",\"\",RTD(\"cqg.rtd\", ,\"ContractData\",C274, \"LastTradeToday\",, \"T\"))","v":""},{"$f":"IF(A274=\"\",\"\",RTD(\"cqg.rtd\", ,\"ContractData\",C274, \"NetLastTradeToday\",, \"T\"))","v":""},{"$f":"IF(A274=\"\",\"\",IFERROR(RTD(\"cqg.rtd\", ,\"ContractData\",C274, \"PerCentNetLastTrade\",, \"T\")/100,\"\"))","v":""},{"$f":"IF(A274=\"\",\"\",RTD(\"cqg.rtd\", ,\"ContractData\", C274, \"T_CVol\",, \"T\"))","v":""},274,{"$f":"IFERROR(RANK($J274,INDIRECT((\"$J$\"&\"1\"&\":$J$\"&$A$351)))+COUNTIF($J$1:J274,J274)-1,\"\")","v":""},"",""]
[{"$f":"IF(Symbols!A275=\"\",\"\",Symbols!A275)","v":""},"","",{"$f":"IF(A275=\"\",\"\",RTD(\"cqg.rtd\", ,\"ContractData\",C275, \"LongDescription\",, \"T\"))","v":""},null,null,null,{"$f":"IF(A275=\"\",\"\",RTD(\"cqg.rtd\", ,\"ContractData\",C275, \"LastTradeToday\",, \"T\"))","v":""},{"$f":"IF(A275=\"\",\"\",RTD(\"cqg.rtd\", ,\"ContractData\",C275, \"NetLastTradeToday\",, \"T\"))","v":""},{"$f":"IF(A275=\"\",\"\",IFERROR(RTD(\"cqg.rtd\", ,\"ContractData\",C275, \"PerCentNetLastTrade\",, \"T\")/100,\"\"))","v":""},{"$f":"IF(A275=\"\",\"\",RTD(\"cqg.rtd\", ,\"ContractData\", C275, \"T_CVol\",, \"T\"))","v":""},275,{"$f":"IFERROR(RANK($J275,INDIRECT((\"$J$\"&\"1\"&\":$J$\"&$A$351)))+COUNTIF($J$1:J275,J275)-1,\"\")","v":""},"",""]
[{"$f":"IF(Symbols!A276=\"\",\"\",Symbols!A276)","v":""},"","",{"$f":"IF(A276=\"\",\"\",RTD(\"cqg.rtd\", ,\"ContractData\",C276, \"LongDescription\",, \"T\"))","v":""},null,null,null,{"$f":"IF(A276=\"\",\"\",RTD(\"cqg.rtd\", ,\"ContractData\",C276, \"LastTradeToday\",, \"T\"))","v":""},{"$f":"IF(A276=\"\",\"\",RTD(\"cqg.rtd\", ,\"ContractData\",C276, \"NetLastTradeToday\",, \"T\"))","v":""},{"$f":"IF(A276=\"\",\"\",IFERROR(RTD(\"cqg.rtd\", ,\"ContractData\",C276, \"PerCentNetLastTrade\",, \"T\")/100,\"\"))","v":""},{"$f":"IF(A276=\"\",\"\",RTD(\"cqg.rtd\", ,\"ContractData\", C276, \"T_CVol\",, \"T\"))","v":""},276,{"$f":"IFERROR(RANK($J276,INDIRECT((\"$J$\"&\"1\"&\":$J$\"&$A$351)))+COUNTIF($J$1:J276,J276)-1,\"\")","v":""},"",""]
[{"$f":"IF(Symbols!A277=\"\",\"\",Symbols!A277)","v":""},"","",{"$f":"IF(A277=\"\",\"\",RTD(\"cqg.rtd\", ,\"ContractData\",C277, \"LongDescription\",, \"T\"))","v":""},null,null,null,{"$f":"IF(A277=\"\",\"\",RTD(\"cqg.rtd\", ,\"ContractData\",C277, \"LastTradeToday\",, \"T\"))","v":""},{"$f":"IF(A277=\"\",\"\",RTD(\"cqg.rtd\", ,\"ContractData\",C277, \"NetLastTradeToday\",, \"T\"))","v":""},{"$f":"IF(A277=\"\",\"\",IFERROR(RTD(\"cqg.rtd\", ,\"ContractData\",C277, \"PerCentNetLastTrade\",, \"T\")/100,\"\"))","v":""},{"$f":"IF(A277=\"\",\"\",RTD(\"cqg.rtd\", ,\"ContractData\", C277, \"T_CVol\",, \"T\"))","v":""},277,{"$f":"IFERROR(RANK($J277,INDIRECT((\"$J$\"&\"1\"&\":$J$\"&$A$351)))+COUNTIF($J$1:J277,J277)-1,\"\")","v":""},"",""]
[{"$f":"IF(Symbols!A278=\"\",\"\",Symbols!A278)","v":""},"","",{"$f":"IF(A278=\"\",\"\",RTD(\"cqg.rtd\", ,\"ContractData\",C278, \"LongDescription\",, \"T\"))","v":""},null,null,null,{"$f":"IF(A278=\"\",\"\",RTD(\"cqg.rtd\", ,\"ContractData\",C278, \"LastTradeToday\",, \"T\"))","v":""},{"$f":"IF(A278=\"\",\"\",RTD(\"cqg.rtd\", ,\"ContractData\",C278, \"NetLastTradeToday\",, \"T\"))","v":""},{"$f":"IF(A278=\"\",\"\",IFERROR(RTD(\"cqg.rtd\", ,\"ContractData\",C278, \"PerCentNetLastTrade\",, \"T\")/100,\"\"))","v":""},{"$f":"IF(A278=\"\",\"\",RTD(\"cqg.rtd\", ,\"ContractData\", C278, \"T_CVol\",, \"T\"))","v":""},278,{"$f":"IFERROR(RANK($J278,INDIRECT((\"$J$\"&\"1\"&\":$J$\"&$A$351)))+COUNTIF($J$1:J278,J278)-1,\"\")","v":""},"",""]
[{"$f":"IF(Symbols!A279=\"\",\"\",Symbols!A279)","v":""},"","",{"$f":"IF(A279=\"\",\"\",RTD(\"cqg.rtd\", ,\"ContractData\",C279, \"LongDescription\",, \"T\"))","v":""},null,null,null,{"$f":"IF(A279=\"\",\"\",RTD(\"cqg.rtd\", ,\"ContractData\",C279, \"LastTradeToday\",, \"T\"))","v":""},{"$f":"IF(A279=\"\",\"\",RTD(\"cqg.rtd\", ,\"ContractData\",C279, \"NetLastTradeToday\",, \"T\"))","v":""},{"$f":"IF(A279=\"\",\"\",IFERROR(RTD(\"cqg.rtd\", ,\"ContractData\",C279, \"PerCentNetLastTrade\",, \"T\")/100,\"\"))","v":""},{"$f":"IF(A279=\"\",\"\",RTD(\"cqg.rtd\", ,\"ContractData\", C279, \"T_CVol\",, \"T\"))","v":""},279,{"$f":"IFERROR(RANK($J279,INDIRECT((\"$J$\"&\"1\"&\":$J$\"&$A$351)))+COUNTIF($J$1:J279,J279)-1,\"\")","v":""},"",""]
[{"$f":"IF(Symbols!A280=\"\",\"\",Symbols!A280)","v":""},"","",{"$f":"IF(A280=\"\",\"\",RTD(\"cqg.rtd\", ,\"ContractData\",C280, \"LongDescription\",, \"T\"))","v":""},null,null,null,{"$f":"IF(A280=\"\",\"\",RTD(\"cqg.rtd\", ,\"ContractData\",C280, \"LastTradeToday\",, \"T\"))","v":""},{"$f":"IF(A280=\"\",\"\",RTD(\"cqg.rtd\", ,\"ContractData\",C280, \"NetLastTradeToday\",, \"T\"))","v":""},{"$f":"IF(A280=\"\",\"\",IFERROR(RTD(\"cqg.rtd\", ,\"ContractData\",C280, \"PerCentNetLastTrade\",, \"T\")/100,\"\"))","v":""},{"$f":"IF(A280=\"\",\"\",RTD(\"cqg.rtd\", ,\"ContractData\", C280, \"T_CVol\",, \"T\"))","v":""},280,{"$f":"IFERROR(RANK($J280,INDIRECT((\"$J$\"&\"1\"&\":$J$\"&$A$351)))+COUNTIF($J$1:J280,J280)-1,\"\")","v":""},"",""]
[{"$f":"IF(Symbols!A281=\"\",\"\",Symbols!A281)","v":""},"","",{"$f":"IF(A281=\"\",\"\",RTD(\"cqg.rtd\", ,\"ContractData\",C281, \"LongDescription\",, \"T\"))","v":""},null,null,null,{"$f":"IF(A281=\"\",\"\",RTD(\"cqg.rtd\", ,\"ContractData\",C281, \"LastTradeToday\",, \"T\"))","v":""},{"$f":"IF(A281=\"\",\"\",RTD(\"cqg.rtd\", ,\"ContractData\",C281, \"NetLastTradeToday\",, \"T\"))","v":""},{"$f":"IF(A281=\"\",\"\",IFERROR(RTD(\"cqg.rtd\", ,\"ContractData\",C281, \"PerCentNetLastTrade\",, \"T\")/100,\"\"))","v":""},{"$f":"IF(A281=\"\",\"\",RTD(\"cqg.rtd\", ,\"ContractData\", C281, \"T_CVol\",, \"T\"))","v":""},281,{"$f":"IFERROR(RANK($J281,INDIRECT((\"$J$\"&\"1\"&\":$J$\"&$A$351)))+COUNTIF($J$1:J281,J281)-1,\"\")","v":""},"",""]
[{"$f":"IF(Symbols!A282=\"\",\"\",Symbols!A282)","v":""},"","",{"$f":"IF(A282=\"\",\"\",RTD(\"cqg.rtd\", ,\"ContractData\",C282, \"LongDescription\",, \"T\"))","v":""},null,null,null,{"$f":"IF(A282=\"\",\"\",RTD(\"cqg.rtd\", ,\"ContractData\",C282, \"LastTradeToday\",, \"T\"))","v":""},{"$f":"IF(A282=\"\",\"\",RTD(\"cqg.rtd\", ,\"ContractData\",C282, \"NetLastTradeToday\",, \"T\"))","v":""},{"$f":"IF(A282=\"\",\"\",IFERROR(RTD(\"cqg.rtd\", ,\"ContractData\",C282, \"PerCentNetLastTrade\",, \"T\")/100,\"\"))","v":""},{"$f":"IF(A282=\"\",\"\",RTD(\"cqg.rtd\", ,\"ContractData\", C282, \"T_CVol\",, \"T\"))","v":""},282,{"$f":"IFERROR(RANK($J282,INDIRECT((\"$J$\"&\"1\"&\":$J$\"&$A$351)))+COUNTIF($J$1:J282,J282)-1,\"\")","v":""},"",""]
[{"$f":"IF(Symbols!A283=\"\",\"\",Symbols!A283)","v":""},"","",{"$f":"IF(A283=\"\",\"\",RTD(\"cqg.rtd\", ,\"ContractData\",C283, \"LongDescription\",, \"T\"))","v":""},null,null,null,{"$f":"IF(A283=\"\",\"\",RTD(\"cqg.rtd\", ,\"ContractData\",C283, \"LastTradeToday\",, \"T\"))","v":""},{"$f":"IF(A283=\"\",\"\",RTD(\"cqg.rtd\", ,\"ContractData\",C283, \"NetLastTradeToday\",, \"T\"))","v":""},{"$f":"IF(A283=\"\",\"\",IFERROR(RTD(\"cqg.rtd\", ,\"ContractData\",C283, \"PerCentNetLastTrade\",, \"T\")/100,\"\"))","v":""},{"$f":"IF(A283=\"\",\"\",RTD(\"cqg.rtd\", ,\"ContractData\", C283, \"T_CVol\",, \"T\"))","v":""},283,{"$f":"IFERROR(RANK($J283,INDIRECT((\"$J$\"&\"1\"&\":$J$\"&$A$351)))+COUNTIF($J$1:J283,J283)-1,\"\")","v":""},"",""]
[{"$f":"IF(Symbols!A284=\"\",\"\",Symbols!A284)","v":""},"","",{"$f":"IF(A284=\"\",\"\",RTD(\"cqg.rtd\", ,\"ContractData\",C284, \"LongDescription\",, \"T\"))","v":""},null,null,null,{"$f":"IF(A284=\"\",\"\",RTD(\"cqg.rtd\", ,\"ContractData\",C284, \"LastTradeToday\",, \"T\"))","v":""},{"$f":"IF(A284=\"\",\"\",RTD(\"cqg.rtd\", ,\"ContractData\",C284, \"NetLastTradeToday\",, \"T\"))","v":""},{"$f":"IF(A284=\"\",\"\",IFERROR(RTD(\"cqg.rtd\", ,\"ContractData\",C284, \"PerCentNetLastTrade\",, \"T\")/100,\"\"))","v":""},{"$f":"IF(A284=\"\",\"\",RTD(\"cqg.rtd\", ,\"ContractData\", C284, \"T_CVol\",, \"T\"))","v":""},284,{"$f":"IFERROR(RANK($J284,INDIRECT((\"$J$\"&\"1\"&\":$J$\"&$A$351)))+COUNTIF($J$1:J284,J284)-1,\"\")","v":""},"",""]
[{"$f":"IF(Symbols!A285=\"\",\"\",Symbols!A285)","v":""},"","",{"$f":"IF(A285=\"\",\"\",RTD(\"cqg.rtd\", ,\"ContractData\",C285, \"LongDescription\",, \"T\"))","v":""},null,null,null,{"$f":"IF(A285=\"\",\"\",RTD(\"cqg.rtd\", ,\"ContractData\",C285, \"LastTradeToday\",, \"T\"))","v":""},{"$f":"IF(A285=\"\",\"\",RTD(\"cqg.rtd\", ,\"ContractData\",C285, \"NetLastTradeToday\",, \"T\"))","v":""},{"$f":"IF(A285=\"\",\"\",IFERROR(RTD(\"cqg.rtd\", ,\"ContractData\",C285, \"PerCentNetLastTrade\",, \"T\")/100,\"\"))","v":""},{"$f":"IF(A285=\"\",\"\",RTD(\"cqg.rtd\", ,\"ContractData\", C285, \"T_CVol\",, \"T\"))","v":""},285,{"$f":"IFERROR(RANK($J285,INDIRECT((\"$J$\"&\"1\"&\":$J$\"&$A$351)))+COUNTIF($J$1:J285,J285)-1,\"\")","v":""},"",""]
[{"$f":"IF(Symbols!A286=\"\",\"\",Symbols!A286)","v":""},"","",{"$f":"IF(A286=\"\",\"\",RTD(\"cqg.rtd\", ,\"ContractData\",C286, \"LongDescription\",, \"T\"))","v":""},null,null,null,{"$f":"IF(A286=\"\",\"\",RTD(\"cqg.rtd\", ,\"ContractData\",C286, \"LastTradeToday\",, \"T\"))","v":""},{"$f":"IF(A286=\"\",\"\",RTD(\"cqg.rtd\", ,\"ContractData\",C286, \"NetLastTradeToday\",, \"T\"))","v":""},{"$f":"IF(A286=\"\",\"\",IFERROR(RTD(\"cqg.rtd\", ,\"ContractData\",C286, \"PerCentNetLastTrade\",, \"T\")/100,\"\"))","v":""},{"$f":"IF(A286=\"\",\"\",RTD(\"cqg.rtd\", ,\"ContractData\", C286, \"T_CVol\",, \"T\"))","v":""},286,{"$f":"IFERROR(RANK($J286,INDIRECT((\"$J$\"&\"1\"&\":$J$\"&$A$351)))+COUNTIF($J$1:J286,J286)-1,\"\")","v":""},"",""]
[{"$f":"IF(Symbols!A287=\"\",\"\",Symbols!A287)","v":""},"","",{"$f":"IF(A287=\"\",\"\",RTD(\"cqg.rtd\", ,\"ContractData\",C287, \"LongDescription\",, \"T\"))","v":""},null,null,null,{"$f":"IF(A287=\"\",\"\",RTD(\"cqg.rtd\", ,\"ContractData\",C287, \"LastTradeToday\",, \"T\"))","v":""},{"$f":"IF(A287=\"\",\"\",RTD(\"cqg.rtd\", ,\"ContractData\",C287, \"NetLastTradeToday\",, \"T\"))","v":""},{"$f":"IF(A287=\"\",\"\",IFERROR(RTD(\"cqg.rtd\", ,\"ContractData\",C287, \"PerCentNetLastTrade\",, \"T\")/100,\"\"))","v":""},{"$f":"IF(A287=\"\",\"\",RTD(\"cqg.rtd\", ,\"ContractData\", C287, \"T_CVol\",, \"T\"))","v":""},287,{"$f":"IFERROR(RANK($J287,INDIRECT((\"$J$\"&\"1\"&\":$J$\"&$A$351)))+COUNTIF($J$1:J287,J287)-1,\"\")","v":""},"",""]
[{"$f":"IF(Symbols!A288=\"\",\"\",Symbols!A288)","v":""},"","",{"$f":"IF(A288=\"\",\"\",RTD(\"cqg.rtd\", ,\"ContractData\",C288, \"LongDescription\",, \"T\"))","v":""},null,null,null,{"$f":"IF(A288=\"\",\"\",RTD(\"cqg.rtd\", ,\"ContractData\",C288, \"LastTradeToday\",, \"T\"))","v":""},{"$f":"IF(A288=\"\",\"\",RTD(\"cqg.rtd\", ,\"ContractData\",C288, \"NetLastTradeToday\",, \"T\"))","v":""},{"$f":"IF(A288=\"\",\"\",IFERROR(RTD(\"cqg.rtd\", ,\"ContractData\",C288, \"PerCentNetLastTrade\",, \"T\")/100,\"\"))","v":""},{"$f":"IF(A288=\"\",\"\",RTD(\"cqg.rtd\", ,\"ContractData\", C288, \"T_CVol\",, \"T\"))","v":""},288,{"$f":"IFERROR(RANK($J288,INDIRECT((\"$J$\"&\"1\"&\":$J$\"&$A$351)))+COUNTIF($J$1:J288,J288)-1,\"\")","v":""},"",""]
[{"$f":"IF(Symbols!A289=\"\",\"\",Symbols!A289)","v":""},"","",{"$f":"IF(A289=\"\",\"\",RTD(\"cqg.rtd\", ,\"ContractData\",C289, \"LongDescription\",, \"T\"))","v":""},null,null,null,{"$f":"IF(A289=\"\",\"\",RTD(\"cqg.rtd\", ,\"ContractData\",C289, \"LastTradeToday\",, \"T\"))","v":""},{"$f":"IF(A289=\"\",\"\",RTD(\"cqg.rtd\", ,\"ContractData\",C289, \"NetLastTradeToday\",, \"T\"))","v":""},{"$f":"IF(A289=\"\",\"\",IFERROR(RTD(\"cqg.rtd\", ,\"ContractData\",C289, \"PerCentNetLastTrade\",, \"T\")/100,\"\"))","v":""},{"$f":"IF(A289=\"\",\"\",RTD(\"cqg.rtd\", ,\"ContractData\", C289, \"T_CVol\",, \"T\"))","v":""},289,{"$f":"IFERROR(RANK($J289,INDIRECT((\"$J$\"&\"1\"&\":$J$\"&$A$351)))+COUNTIF($J$1:J289,J289)-1,\"\")","v":""},"",""]
[{"$f":"IF(Symbols!A290=\"\",\"\",Symbols!A290)","v":""},"","",{"$f":"IF(A290=\"\",\"\",RTD(\"cqg.rtd\", ,\"ContractData\",C290, \"LongDescription\",, \"T\"))","v":""},null,null,null,{"$f":"IF(A290=\"\",\"\",RTD(\"cqg.rtd\", ,\"ContractData\",C290, \"LastTradeToday\",, \"T\"))","v":""},{"$f":"IF(A290=\"\",\"\",RTD(\"cqg.rtd\", ,\"ContractData\",C290, \"NetLastTradeToday\",, \"T\"))","v":""},{"$f":"IF(A290=\"\",\"\",IFERROR(RTD(\"cqg.rtd\", ,\"ContractData\",C290, \"PerCentNetLastTrade\",, \"T\")/100,\"\"))","v":""},{"$f":"IF(A290=\"\",\"\",RTD(\"cqg.rtd\", ,\"ContractData\", C290, \"T_CVol\",, \"T\"))","v":""},290,{"$f":"IFERROR(RANK($J290,INDIRECT((\"$J$\"&\"1\"&\":$J$\"&$A$351)))+COUNTIF($J$1:J290,J290)-1,\"\")","v":""},"",""]
[{"$f":"IF(Symbols!A291=\"\",\"\",Symbols!A291)","v":""},"","",{"$f":"IF(A291=\"\",\"\",RTD(\"cqg.rtd\", ,\"ContractData\",C291, \"LongDescription\",, \"T\"))","v":""},null,null,null,{"$f":"IF(A291=\"\",\"\",RTD(\"cqg.rtd\", ,\"ContractData\",C291, \"LastTradeToday\",, \"T\"))","v":""},{"$f":"IF(A291=\"\",\"\",RTD(\"cqg.rtd\", ,\"ContractData\",C291, \"NetLastTradeToday\",, \"T\"))","v":""},{"$f":"IF(A291=\"\",\"\",IFERROR(RTD(\"cqg.rtd\", ,\"ContractData\",C291, \"PerCentNetLastTrade\",, \"T\")/100,\"\"))","v":""},{"$f":"IF(A291=\"\",\"\",RTD(\"cqg.rtd\", ,\"ContractData\", C291, \"T_CVol\",, \"T\"))","v":""},291,{"$f":"IFERROR(RANK($J291,INDIRECT((\"$J$\"&\"1\"&\":$J$\"&$A$351)))+COUNTIF($J$1:J291,J291)-1,\"\")","v":""},"",""]
[{"$f":"IF(Symbols!A292=\"\",\"\",Symbols!A292)","v":""},"","",{"$f":"IF(A292=\"\",\"\",RTD(\"cqg.rtd\", ,\"ContractData\",C292, \"LongDescription\",, \"T\"))","v":""},null,null,null,{"$f":"IF(A292=\"\",\"\",RTD(\"cqg.rtd\", ,\"ContractData\",C292, \"LastTradeToday\",, \"T\"))","v":""},{"$f":"IF(A292=\"\",\"\",RTD(\"cqg.rtd\", ,\"ContractData\",C292, \"NetLastTradeToday\",, \"T\"))","v":""},{"$f":"IF(A292=\"\",\"\",IFERROR(RTD(\"cqg.rtd\", ,\"ContractData\",C292, \"PerCentNetLastTrade\",, \"T\")/100,\"\"))","v":""},{"$f":"IF(A292=\"\",\"\",RTD(\"cqg.rtd\", ,\"ContractData\", C292, \"T_CVol\",, \"T\"))","v":""},292,{"$f":"IFERROR(RANK($J292,INDIRECT((\"$J$\"&\"1\"&\":$J$\"&$A$351)))+COUNTIF($J$1:J292,J292)-1,\"\")","v":""},"",""]
[{"$f":"IF(Symbols!A293=\"\",\"\",Symbols!A293)","v":""},"","",{"$f":"IF(A293=\"\",\"\",RTD(\"cqg.rtd\", ,\"ContractData\",C293, \"LongDescription\",, \"T\"))","v":""},null,null,null,{"$f":"IF(A293=\"\",\"\",RTD(\"cqg.rtd\", ,\"ContractData\",C293, \"LastTradeToday\",, \"T\"))","v":""},{"$f":"IF(A293=\"\",\"\",RTD(\"cqg.rtd\", ,\"ContractData\",C293, \"NetLastTradeToday\",, \"T\"))","v":""},{"$f":"IF(A293=\"\",\"\",IFERROR(RTD(\"cqg.rtd\", ,\"ContractData\",C293, \"PerCentNetLastTrade\",, \"T\")/100,\"\"))","v":""},{"$f":"IF(A293=\"\",\"\",RTD(\"cqg.rtd\", ,\"ContractData\", C293, \"T_CVol\",, \"T\"))","v":""},293,{"$f":"IFERROR(RANK($J293,INDIRECT((\"$J$\"&\"1\"&\":$J$\"&$A$351)))+COUNTIF($J$1:J293,J293)-1,\"\")","v":""},"",""]
[{"$f":"IF(Symbols!A294=\"\",\"\",Symbols!A294)","v":""},"","",{"$f":"IF(A294=\"\",\"\",RTD(\"cqg.rtd\", ,\"ContractData\",C294, \"LongDescription\",, \"T\"))","v":""},null,null,null,{"$f":"IF(A294=\"\",\"\",RTD(\"cqg.rtd\", ,\"ContractData\",C294, \"LastTradeToday\",, \"T\"))","v":""},{"$f":"IF(A294=\"\",\"\",RTD(\"cqg.rtd\", ,\"ContractData\",C294, \"NetLastTradeToday\",, \"T\"))","v":""},{"$f":"IF(A294=\"\",\"\",IFERROR(RTD(\"cqg.rtd\", ,\"ContractData\",C294, \"PerCentNetLastTrade\",, \"T\")/100,\"\"))","v":""},{"$f":"IF(A294=\"\",\"\",RTD(\"cqg.rtd\", ,\"ContractData\", C294, \"T_CVol\",, \"T\"))","v":""},294,{"$f":"IFERROR(RANK($J294,INDIRECT((\"$J$\"&\"1\"&\":$J$\"&$A$351)))+COUNTIF($J$1:J294,J294)-1,\"\")","v":""},"",""]
[{"$f":"IF(Symbols!A295=\"\",\"\",Symbols!A295)","v":""},"","",{"$f":"IF(A295=\"\",\"\",RTD(\"cqg.rtd\", ,\"ContractData\",C295, \"LongDescription\",, \"T\"))","v":""},null,null,null,{"$f":"IF(A295=\"\",\"\",RTD(\"cqg.rtd\", ,\"ContractData\",C295, \"LastTradeToday\",, \"T\"))","v":""},{"$f":"IF(A295=\"\",\"\",RTD(\"cqg.rtd\", ,\"ContractData\",C295, \"NetLastTradeToday\",, \"T\"))","v":""},{"$f":"IF(A295=\"\",\"\",IFERROR(RTD(\"cqg.rtd\", ,\"ContractData\",C295, \"PerCentNetLastTrade\",, \"T\")/100,\"\"))","v":""},{"$f":"IF(A295=\"\",\"\",RTD(\"cqg.rtd\", ,\"ContractData\", C295, \"T_CVol\",, \"T\"))","v":""},295,{"$f":"IFERROR(RANK($J295,INDIRECT((\"$J$\"&\"1\"&\":$J$\"&$A$351)))+COUNTIF($J$1:J295,J295)-1,\"\")","v":""},"",""]
[{"$f":"IF(Symbols!A296=\"\",\"\",Symbols!A296)","v":""},"","",{"$f":"IF(A296=\"\",\"\",RTD(\"cqg.rtd\", ,\"ContractData\",C296, \"LongDescription\",, \"T\"))","v":""},null,null,null,{"$f":"IF(A296=\"\",\"\",RTD(\"cqg.rtd\", ,\"ContractData\",C296, \"LastTradeToday\",, \"T\"))","v":""},{"$f":"IF(A296=\"\",\"\",RTD(\"cqg.rtd\", ,\"ContractData\",C296, \"NetLastTradeToday\",, \"T\"))","v":""},{"$f":"IF(A296=\"\",\"\",IFERROR(RTD(\"cqg.rtd\", ,\"ContractData\",C296, \"PerCentNetLastTrade\",, \"T\")/100,\"\"))","v":""},{"$f":"IF(A296=\"\",\"\",RTD(\"cqg.rtd\", ,\"ContractData\", C296, \"T_CVol\",, \"T\"))","v":""},296,{"$f":"IFERROR(RANK($J296,INDIRECT((\"$J$\"&\"1\"&\":$J$\"&$A$351)))+COUNTIF($J$1:J296,J296)-1,\"\")","v":""},"",""]
[{"$f":"IF(Symbols!A297=\"\",\"\",Symbols!A297)","v":""},"","",{"$f":"IF(A297=\"\",\"\",RTD(\"cqg.rtd\", ,\"ContractData\",C297, \"LongDescription\",, \"T\"))","v":""},null,null,null,{"$f":"IF(A297=\"\",\"\",RTD(\"cqg.rtd\", ,\"ContractData\",C297, \"LastTradeToday\",, \"T\"))","v":""},{"$f":"IF(A297=\"\",\"\",RTD(\"cqg.rtd\", ,\"ContractData\",C297, \"NetLastTradeToday\",, \"T\"))","v":""},{"$f":"IF(A297=\"\",\"\",IFERROR(RTD(\"cqg.rtd\", ,\"ContractData\",C297, \"PerCentNetLastTrade\",, \"T\")/100,\"\"))","v":""},{"$f":"IF(A297=\"\",\"\",RTD(\"cqg.rtd\", ,\"ContractData\", C297, \"T_CVol\",, \"T\"))","v":""},297,{"$f":"IFERROR(RANK($J297,INDIRECT((\"$J$\"&\"1\"&\":$J$\"&$A$351)))+COUNTIF($J$1:J297,J297)-1,\"\")","v":""},"",""]
[{"$f":"IF(Symbols!A298=\"\",\"\",Symbols!A298)","v":""},"","",{"$f":"IF(A298=\"\",\"\",RTD(\"cqg.rtd\", ,\"ContractData\",C298, \"LongDescription\",, \"T\"))","v":""},null,null,null,{"$f":"IF(A298=\"\",\"\",RTD(\"cqg.rtd\", ,\"ContractData\",C298, \"LastTradeToday\",, \"T\"))","v":""},{"$f":"IF(A298=\"\",\"\",RTD(\"cqg.rtd\", ,\"ContractData\",C298, \"NetLastTradeToday\",, \"T\"))","v":""},{"$f":"IF(A298=\"\",\"\",IFERROR(RTD(\"cqg.rtd\", ,\"ContractData\",C298, \"PerCentNetLastTrade\",, \"T\")/100,\"\"))","v":""},{"$f":"IF(A298=\"\",\"\",RTD(\"cqg.rtd\", ,\"ContractData\", C298, \"T_CVol\",, \"T\"))","v":""},298,{"$f":"IFERROR(RANK($J298,INDIRECT((\"$J$\"&\"1\"&\":$J$\"&$A$351)))+COUNTIF($J$1:J298,J298)-1,\"\")","v":""},"",""]
[{"$f":"IF(Symbols!A299=\"\",\"\",Symbols!A299)","v":""},"","",{"$f":"IF(A299=\"\",\"\",RTD(\"cqg.rtd\", ,\"ContractData\",C299, \"LongDescription\",, \"T\"))","v":""},null,null,null,{"$f":"IF(A299=\"\",\"\",RTD(\"cqg.rtd\", ,\"ContractData\",C299, \"LastTradeToday\",, \"T\"))","v":""},{"$f":"IF(A299=\"\",\"\",RTD(\"cqg.rtd\", ,\"ContractData\",C299, \"NetLastTradeToday\",, \"T\"))","v":""},{"$f":"IF(A299=\"\",\"\",IFERROR(RTD(\"cqg.rtd\", ,\"ContractData\",C299, \"PerCentNetLastTrade\",, \"T\")/100,\"\"))","v":""},{"$f":"IF(A299=\"\",\"\",RTD(\"cqg.rtd\", ,\"ContractData\", C299, \"T_CVol\",, \"T\"))","v":""},299,{"$f":"IFERROR(RANK($J299,INDIRECT((\"$J$\"&\"1\"&\":$J$\"&$A$351)))+COUNTIF($J$1:J299,J299)-1,\"\")","v":""},"",""]
[{"$f":"IF(Symbols!A300=\"\",\"\",Symbols!A300)","v":""},"","",{"$f":"IF(A300=\"\",\"\",RTD(\"cqg.rtd\", ,\"ContractData\",C300, \"LongDescription\",, \"T\"))","v":""},null,null,null,{"$f":"IF(A300=\"\",\"\",RTD(\"cqg.rtd\", ,\"ContractData\",C300, \"LastTradeToday\",, \"T\"))","v":""},{"$f":"IF(A300=\"\",\"\",RTD(\"cqg.rtd\", ,\"ContractData\",C300, \"NetLastTradeToday\",, \"T\"))","v":""},{"$f":"IF(A300=\"\",\"\",IFERROR(RTD(\"cqg.rtd\", ,\"ContractData\",C300, \"PerCentNetLastTrade\",, \"T\")/100,\"\"))","v":""},{"$f":"IF(A300=\"\",\"\",RTD(\"cqg.rtd\", ,\"ContractData\", C300, \"T_CVol\",, \"T\"))","v":""},300,{"$f":"IFERROR(RANK($J300,INDIRECT((\"$J$\"&\"1\"&\":$J$\"&$A$351)))+COUNTIF($J$1:J300,J300)-1,\"\")","v":""},"",""]
[{"$f":"IF(Symbols!A301=\"\",\"\",Symbols!A301)","v":""},"","",{"$f":"IF(A301=\"\",\"\",RTD(\"cqg.rtd\", ,\"ContractData\",C301, \"LongDescription\",, \"T\"))","v":""},null,null,null,{"$f":"IF(A301=\"\",\"\",RTD(\"cqg.rtd\", ,\"ContractData\",C301, \"LastTradeToday\",, \"T\"))","v":""},{"$f":"IF(A301=\"\",\"\",RTD(\"cqg.rtd\", ,\"ContractData\",C301, \"NetLastTradeToday\",, \"T\"))","v":""},{"$f":"IF(A301=\"\",\"\",IFERROR(RTD(\"cqg.rtd\", ,\"ContractData\",C301, \"PerCentNetLastTrade\",, \"T\")/100,\"\"))","v":""},{"$f":"IF(A301=\"\",\"\",RTD(\"cqg.rtd\", ,\"ContractData\", C301, \"T_CVol\",, \"T\"))","v":""},301,{"$f":"IFERROR(RANK($J301,INDIRECT((\"$J$\"&\"1\"&\":$J$\"&$A$351)))+COUNTIF($J$1:J301,J301)-1,\"\")","v":""},"",""]
[{"$f":"IF(Symbols!A302=\"\",\"\",Symbols!A302)","v":""},"","",{"$f":"IF(A302=\"\",\"\",RTD(\"cqg.rtd\", ,\"ContractData\",C302, \"LongDescription\",, \"T\"))","v":""},null,null,null,{"$f":"IF(A302=\"\",\"\",RTD(\"cqg.rtd\", ,\"ContractData\",C302, \"LastTradeToday\",, \"T\"))","v":""},{"$f":"IF(A302=\"\",\"\",RTD(\"cqg.rtd\", ,\"ContractData\",C302, \"NetLastTradeToday\",, \"T\"))","v":""},{"$f":"IF(A302=\"\",\"\",IFERROR(RTD(\"cqg.rtd\", ,\"ContractData\",C302, \"PerCentNetLastTrade\",, \"T\")/100,\"\"))","v":""},{"$f":"IF(A302=\"\",\"\",RTD(\"cqg.rtd\", ,\"ContractData\", C302, \"T_CVol\",, \"T\"))","v":""},302,{"$f":"IFERROR(RANK($J302,INDIRECT((\"$J$\"&\"1\"&\":$J$\"&$A$351)))+COUNTIF($J$1:J302,J302)-1,\"\")","v":""},"",""]
[{"$f":"IF(Symbols!A303=\"\",\"\",Symbols!A303)","v":""},"","",{"$f":"IF(A303=\"\",\"\",RTD(\"cqg.rtd\", ,\"ContractData\",C303, \"LongDescription\",, \"T\"))","v":""},null,null,null,{"$f":"IF(A303=\"\",\"\",RTD(\"cqg.rtd\", ,\"ContractData\",C303, \"LastTradeToday\",, \"T\"))","v":""},{"$f":"IF(A303=\"\",\"\",RTD(\"cqg.rtd\", ,\"ContractData\",C303, \"NetLastTradeToday\",, \"T\"))","v":""},{"$f":"IF(A303=\"\",\"\",IFERROR(RTD(\"cqg.rtd\", ,\"ContractData\",C303, \"PerCentNetLastTrade\",, \"T\")/100,\"\"))","v":""},{"$f":"IF(A303=\"\",\"\",RTD(\"cqg.rtd\", ,\"ContractData\", C303, \"T_CVol\",, \"T\"))","v":""},303,{"$f":"IFERROR(RANK($J303,INDIRECT((\"$J$\"&\"1\"&\":$J$\"&$A$351)))+COUNTIF($J$1:J303,J303)-1,\"\")","v":""},"",""]
[{"$f":"IF(Symbols!A304=\"\",\"\",Symbols!A304)","v":""},"","",{"$f":"IF(A304=\"\",\"\",RTD(\"cqg.rtd\", ,\"ContractData\",C304, \"LongDescription\",, \"T\"))","v":""},null,null,null,{"$f":"IF(A304=\"\",\"\",RTD(\"cqg.rtd\", ,\"ContractData\",C304, \"LastTradeToday\",, \"T\"))","v":""},{"$f":"IF(A304=\"\",\"\",RTD(\"cqg.rtd\", ,\"ContractData\",C304, \"NetLastTradeToday\",, \"T\"))","v":""},{"$f":"IF(A304=\"\",\"\",IFERROR(RTD(\"cqg.rtd\", ,\"ContractData\",C304, \"PerCentNetLastTrade\",, \"T\")/100,\"\"))","v":""},{"$f":"IF(A304=\"\",\"\",RTD(\"cqg.rtd\", ,\"ContractData\", C304, \"T_CVol\",, \"T\"))","v":""},304,{"$f":"IFERROR(RANK($J304,INDIRECT((\"$J$\"&\"1\"&\":$J$\"&$A$351)))+COUNTIF($J$1:J304,J304)-1,\"\")","v":""},"",""]
[{"$f":"IF(Symbols!A305=\"\",\"\",Symbols!A305)","v":""},"","",{"$f":"IF(A305=\"\",\"\",RTD(\"cqg.rtd\", ,\"ContractData\",C305, \"LongDescription\",, \"T\"))","v":""},null,null,null,{"$f":"IF(A305=\"\",\"\",RTD(\"cqg.rtd\", ,\"ContractData\",C305, \"LastTradeToday\",, \"T\"))","v":""},{"$f":"IF(A305=\"\",\"\",RTD(\"cqg.rtd\", ,\"ContractData\",C305, \"NetLastTradeToday\",, \"T\"))","v":""},{"$f":"IF(A305=\"\",\"\",IFERROR(RTD(\"cqg.rtd\", ,\"ContractData\",C305, \"PerCentNetLastTrade\",, \"T\")/100,\"\"))","v":""},{"$f":"IF(A305=\"\",\"\",RTD(\"cqg.rtd\", ,\"ContractData\", C305, \"T_CVol\",, \"T\"))","v":""},305,{"$f":"IFERROR(RANK($J305,INDIRECT((\"$J$\"&\"1\"&\":$J$\"&$A$351)))+COUNTIF($J$1:J305,J305)-1,\"\")","v":""},"",""]
[{"$f":"IF(Symbols!A306=\"\",\"\",Symbols!A306)","v":""},"","",{"$f":"IF(A306=\"\",\"\",RTD(\"cqg.rtd\", ,\"ContractData\",C306, \"LongDescription\",, \"T\"))","v":""},null,null,null,{"$f":"IF(A306=\"\",\"\",RTD(\"cqg.rtd\", ,\"ContractData\",C306, \"LastTradeToday\",, \"T\"))","v":""},{"$f":"IF(A306=\"\",\"\",RTD(\"cqg.rtd\", ,\"ContractData\",C306, \"NetLastTradeToday\",, \"T\"))","v":""},{"$f":"IF(A306=\"\",\"\",IFERROR(RTD(\"cqg.rtd\", ,\"ContractData\",C306, \"PerCentNetLastTrade\",, \"T\")/100,\"\"))","v":""},{"$f":"IF(A306=\"\",\"\",RTD(\"cqg.rtd\", ,\"ContractData\", C306, \"T_CVol\",, \"T\"))","v":""},306,{"$f":"IFERROR(RANK($J306,INDIRECT((\"$J$\"&\"1\"&\":$J$\"&$A$351)))+COUNTIF($J$1:J306,J306)-1,\"\")","v":""},"",""]
[{"$f":"IF(Symbols!A307=\"\",\"\",Symbols!A307)","v":""},"","",{"$f":"IF(A307=\"\",\"\",RTD(\"cqg.rtd\", ,\"ContractData\",C307, \"LongDescription\",, \"T\"))","v":""},null,null,null,{"$f":"IF(A307=\"\",\"\",RTD(\"cqg.rtd\", ,\"ContractData\",C307, \"LastTradeToday\",, \"T\"))","v":""},{"$f":"IF(A307=\"\",\"\",RTD(\"cqg.rtd\", ,\"ContractData\",C307, \"NetLastTradeToday\",, \"T\"))","v":""},{"$f":"IF(A307=\"\",\"\",IFERROR(RTD(\"cqg.rtd\", ,\"ContractData\",C307, \"PerCentNetLastTrade\",, \"T\")/100,\"\"))","v":""},{"$f":"IF(A307=\"\",\"\",RTD(\"cqg.rtd\", ,\"ContractData\", C307, \"T_CVol\",, \"T\"))","v":""},307,{"$f":"IFERROR(RANK($J307,INDIRECT((\"$J$\"&\"1\"&\":$J$\"&$A$351)))+COUNTIF($J$1:J307,J307)-1,\"\")","v":""},"",""]
[{"$f":"IF(Symbols!A308=\"\",\"\",Symbols!A308)","v":""},"","",{"$f":"IF(A308=\"\",\"\",RTD(\"cqg.rtd\", ,\"ContractData\",C308, \"LongDescription\",, \"T\"))","v":""},null,null,null,{"$f":"IF(A308=\"\",\"\",RTD(\"cqg.rtd\", ,\"ContractData\",C308, \"LastTradeToday\",, \"T\"))","v":""},{"$f":"IF(A308=\"\",\"\",RTD(\"cqg.rtd\", ,\"ContractData\",C308, \"NetLastTradeToday\",, \"T\"))","v":""},{"$f":"IF(A308=\"\",\"\",IFERROR(RTD(\"cqg.rtd\", ,\"ContractData\",C308, \"PerCentNetLastTrade\",, \"T\")/100,\"\"))","v":""},{"$f":"IF(A308=\"\",\"\",RTD(\"cqg.rtd\", ,\"ContractData\", C308, \"T_CVol\",, \"T\"))","v":""},308,{"$f":"IFERROR(RANK($J308,INDIRECT((\"$J$\"&\"1\"&\":$J$\"&$A$351)))+COUNTIF($J$1:J308,J308)-1,\"\")","v":""},"",""]
[{"$f":"IF(Symbols!A309=\"\",\"\",Symbols!A309)","v":""},"","",{"$f":"IF(A309=\"\",\"\",RTD(\"cqg.rtd\", ,\"ContractData\",C309, \"LongDescription\",, \"T\"))","v":""},null,null,null,{"$f":"IF(A309=\"\",\"\",RTD(\"cqg.rtd\", ,\"ContractData\",C309, \"LastTradeToday\",, \"T\"))","v":""},{"$f":"IF(A309=\"\",\"\",RTD(\"cqg.rtd\", ,\"ContractData\",C309, \"NetLastTradeToday\",, \"T\"))","v":""},{"$f":"IF(A309=\"\",\"\",IFERROR(RTD(\"cqg.rtd\", ,\"ContractData\",C309, \"PerCentNetLastTrade\",, \"T\")/100,\"\"))","v":""},{"$f":"IF(A309=\"\",\"\",RTD(\"cqg.rtd\", ,\"ContractData\", C309, \"T_CVol\",, \"T\"))","v":""},309,{"$f":"IFERROR(RANK($J309,INDIRECT((\"$J$\"&\"1\"&\":$J$\"&$A$351)))+COUNTIF($J$1:J309,J309)-1,\"\")","v":""},"",""]
[{"$f":"IF(Symbols!A310=\"\",\"\",Symbols!A310)","v":""},"","",{"$f":"IF(A310=\"\",\"\",RTD(\"cqg.rtd\", ,\"ContractData\",C310, \"LongDescription\",, \"T\"))","v":""},null,null,null,{"$f":"IF(A310=\"\",\"\",RTD(\"cqg.rtd\", ,\"ContractData\",C310, \"LastTradeToday\",, \"T\"))","v":""},{"$f":"IF(A310=\"\",\"\",RTD(\"cqg.rtd\", ,\"ContractData\",C310, \"NetLastTradeToday\",, \"T\"))","v":""},{"$f":"IF(A310=\"\",\"\",IFERROR(RTD(\"cqg.rtd\", ,\"ContractData\",C310, \"PerCentNetLastTrade\",, \"T\")/100,\"\"))","v":""},{"$f":"IF(A310=\"\",\"\",RTD(\"cqg.rtd\", ,\"ContractData\", C310, \"T_CVol\",, \"T\"))","v":""},310,{"$f":"IFERROR(RANK($J310,INDIRECT((\"$J$\"&\"1\"&\":$J$\"&$A$351)))+COUNTIF($J$1:J310,J310)-1,\"\")","v":""},"",""]
[{"$f":"IF(Symbols!A311=\"\",\"\",Symbols!A311)","v":""},"","",{"$f":"IF(A311=\"\",\"\",RTD(\"cqg.rtd\", ,\"ContractData\",C311, \"LongDescription\",, \"T\"))","v":""},null,null,null,{"$f":"IF(A311=\"\",\"\",RTD(\"cqg.rtd\", ,\"ContractData\",C311, \"LastTradeToday\",, \"T\"))","v":""},{"$f":"IF(A311=\"\",\"\",RTD(\"cqg.rtd\", ,\"ContractData\",C311, \"NetLastTradeToday\",, \"T\"))","v":""},{"$f":"IF(A311=\"\",\"\",IFERROR(RTD(\"cqg.rtd\", ,\"ContractData\",C311, \"PerCentNetLastTrade\",, \"T\")/100,\"\"))","v":""},{"$f":"IF(A311=\"\",\"\",RTD(\"cqg.rtd\", ,\"ContractData\", C311, \"T_CVol\",, \"T\"))","v":""},311,{"$f":"IFERROR(RANK($J311,INDIRECT((\"$J$\"&\"1\"&\":$J$\"&$A$351)))+COUNTIF($J$1:J311,J311)-1,\"\")","v":""},"",""]
[{"$f":"IF(Symbols!A312=\"\",\"\",Symbols!A312)","v":""},"","",{"$f":"IF(A312=\"\",\"\",RTD(\"cqg.rtd\", ,\"ContractData\",C312, \"LongDescription\",, \"T\"))","v":""},null,null,null,{"$f":"IF(A312=\"\",\"\",RTD(\"cqg.rtd\", ,\"ContractData\",C312, \"LastTradeToday\",, \"T\"))","v":""},{"$f":"IF(A312=\"\",\"\",RTD(\"cqg.rtd\", ,\"ContractData\",C312, \"NetLastTradeToday\",, \"T\"))","v":""},{"$f":"IF(A312=\"\",\"\",IFERROR(RTD(\"cqg.rtd\", ,\"ContractData\",C312, \"PerCentNetLastTrade\",, \"T\")/100,\"\"))","v":""},{"$f":"IF(A312=\"\",\"\",RTD(\"cqg.rtd\", ,\"ContractData\", C312, \"T_CVol\",, \"T\"))","v":""},312,{"$f":"IFERROR(RANK($J312,INDIRECT((\"$J$\"&\"1\"&\":$J$\"&$A$351)))+COUNTIF($J$1:J312,J312)-1,\"\")","v":""},"",""]
[{"$f":"IF(Symbols!A313=\"\",\"\",Symbols!A313)","v":""},"","",{"$f":"IF(A313=\"\",\"\",RTD(\"cqg.rtd\", ,\"ContractData\",C313, \"LongDescription\",, \"T\"))","v":""},null,null,null,{"$f":"IF(A313=\"\",\"\",RTD(\"cqg.rtd\", ,\"ContractData\",C313, \"LastTradeToday\",, \"T\"))","v":""},{"$f":"IF(A313=\"\",\"\",RTD(\"cqg.rtd\", ,\"ContractData\",C313, \"NetLastTradeToday\",, \"T\"))","v":""},{"$f":"IF(A313=\"\",\"\",IFERROR(RTD(\"cqg.rtd\", ,\"ContractData\",C313, \"PerCentNetLastTrade\",, \"T\")/100,\"\"))","v":""},{"$f":"IF(A313=\"\",\"\",RTD(\"cqg.rtd\", ,\"ContractData\", C313, \"T_CVol\",, \"T\"))","v":""},313,{"$f":"IFERROR(RANK($J313,INDIRECT((\"$J$\"&\"1\"&\":$J$\"&$A$351)))+COUNTIF($J$1:J313,J313)-1,\"\")","v":""},"",""]
[{"$f":"IF(Symbols!A314=\"\",\"\",Symbols!A314)","v":""},"","",{"$f":"IF(A314=\"\",\"\",RTD(\"cqg.rtd\", ,\"ContractData\",C314, \"LongDescription\",, \"T\"))","v":""},null,null,null,{"$f":"IF(A314=\"\",\"\",RTD(\"cqg.rtd\", ,\"ContractData\",C314, \"LastTradeToday\",, \"T\"))","v":""},{"$f":"IF(A314=\"\",\"\",RTD(\"cqg.rtd\", ,\"ContractData\",C314, \"NetLastTradeToday\",, \"T\"))","v":""},{"$f":"IF(A314=\"\",\"\",IFERROR(RTD(\"cqg.rtd\", ,\"ContractData\",C314, \"PerCentNetLastTrade\",, \"T\")/100,\"\"))","v":""},{"$f":"IF(A314=\"\",\"\",RTD(\"cqg.rtd\", ,\"ContractData\", C314, \"T_CVol\",, \"T\"))","v":""},314,{"$f":"IFERROR(RANK($J314,INDIRECT((\"$J$\"&\"1\"&\":$J$\"&$A$351)))+COUNTIF($J$1:J314,J314)-1,\"\")","v":""},"",""]
[{"$f":"IF(Symbols!A315=\"\",\"\",Symbols!A315)","v":""},"","",{"$f":"IF(A315=\"\",\"\",RTD(\"cqg.rtd\", ,\"ContractData\",C315, \"LongDescription\",, \"T\"))","v":""},null,null,null,{"$f":"IF(A315=\"\",\"\",RTD(\"cqg.rtd\", ,\"ContractData\",C315, \"LastTradeToday\",, \"T\"))","v":""},{"$f":"IF(A315=\"\",\"\",RTD(\"cqg.rtd\", ,\"ContractData\",C315, \"NetLastTradeToday\",, \"T\"))","v":""},{"$f":"IF(A315=\"\",\"\",IFERROR(RTD(\"cqg.rtd\", ,\"ContractData\",C315, \"PerCentNetLastTrade\",, \"T\")/100,\"\"))","v":""},{"$f":"IF(A315=\"\",\"\",RTD(\"cqg.rtd\", ,\"ContractData\", C315, \"T_CVol\",, \"T\"))","v":""},315,{"$f":"IFERROR(RANK($J315,INDIRECT((\"$J$\"&\"1\"&\":$J$\"&$A$351)))+COUNTIF($J$1:J315,J315)-1,\"\")","v":""},"",""]
[{"$f":"IF(Symbols!A316=\"\",\"\",Symbols!A316)","v":""},"","",{"$f":"IF(A316=\"\",\"\",RTD(\"cqg.rtd\", ,\"ContractData\",C316, \"LongDescription\",, \"T\"))","v":""},null,null,null,{"$f":"IF(A316=\"\",\"\",RTD(\"cqg.rtd\", ,\"ContractData\",C316, \"LastTradeToday\",, \"T\"))","v":""},{"$f":"IF(A316=\"\",\"\",RTD(\"cqg.rtd\", ,\"ContractData\",C316, \"NetLastTradeToday\",, \"T\"))","v":""},{"$f":"IF(A316=\"\",\"\",IFERROR(RTD(\"cqg.rtd\", ,\"ContractData\",C316, \"PerCentNetLastTrade\",, \"T\")/100,\"\"))","v":""},{"$f":"IF(A316=\"\",\"\",RTD(\"cqg.rtd\", ,\"ContractData\", C316, \"T_CVol\",, \"T\"))","v":""},316,{"$f":"IFERROR(RANK($J316,INDIRECT((\"$J$\"&\"1\"&\":$J$\"&$A$351)))+COUNTIF($J$1:J316,J316)-1,\"\")","v":""},"",""]
[{"$f":"IF(Symbols!A317=\"\",\"\",Symbols!A317)","v":""},{"$f":"IF(A317=\"\",\"\",IF(J317>0,1,0))","v":""},{"$f":"A317","v":""},{"$f":"IF(A317=\"\",\"\",RTD(\"cqg.rtd\", ,\"ContractData\",C317, \"LongDescription\",, \"T\"))","v":""},null,null,null,{"$f":"IF(A317=\"\",\"\",RTD(\"cqg.rtd\", ,\"ContractData\",C317, \"LastTradeToday\",, \"T\"))","v":""},{"$f":"IF(A317=\"\",\"\",RTD(\"cqg.rtd\", ,\"ContractData\",C317, \"NetLastTradeToday\",, \"T\"))","v":""},{"$f":"IF(A317=\"\",\"\",IFERROR(RTD(\"cqg.rtd\", ,\"ContractData\",C317, \"PerCentNetLastTrade\",, \"T\")/100,\"\"))","v":""},{"$f":"IF(A317=\"\",\"\",RTD(\"cqg.rtd\", ,\"ContractData\", C317, \"T_CVol\",, \"T\"))","v":""},317,{"$f":"IFERROR(RANK($J317,INDIRECT((\"$J$\"&\"1\"&\":$J$\"&$A$351)))+COUNTIF($J$1:J317,J317)-1,\"\")","v":""},{"$f":"C317","v":""},""]
[{"$f":"IF(Symbols!A318=\"\",\"\",Symbols!A318)","v":""},"","",{"$f":"IF(A318=\"\",\"\",RTD(\"cqg.rtd\", ,\"ContractData\",C318, \"LongDescription\",, \"T\"))","v":""},null,null,null,{"$f":"IF(A318=\"\",\"\",RTD(\"cqg.rtd\", ,\"ContractData\",C318, \"LastTradeToday\",, \"T\"))","v":""},{"$f":"IF(A318=\"\",\"\",RTD(\"cqg.rtd\", ,\"ContractData\",C318, \"NetLastTradeToday\",, \"T\"))","v":""},{"$f":"IF(A318=\"\",\"\",IFERROR(RTD(\"cqg.rtd\", ,\"ContractData\",C318, \"PerCentNetLastTrade\",, \"T\")/100,\"\"))","v":""},{"$f":"IF(A318=\"\",\"\",RTD(\"cqg.rtd\", ,\"ContractData\", C318, \"T_CVol\",, \"T\"))","v":""},318,{"$f":"IFERROR(RANK($J318,INDIRECT((\"$J$\"&\"1\"&\":$J$\"&$A$351)))+COUNTIF($J$1:J318,J318)-1,\"\")","v":""},"",""]
[{"$f":"IF(Symbols!A319=\"\",\"\",Symbols!A319)","v":""},"","",{"$f":"IF(A319=\"\",\"\",RTD(\"cqg.rtd\", ,\"ContractData\",C319, \"LongDescription\",, \"T\"))","v":""},null,null,null,{"$f":"IF(A319=\"\",\"\",RTD(\"cqg.rtd\", ,\"ContractData\",C319, \"LastTradeToday\",, \"T\"))","v":""},{"$f":"IF(A319=\"\",\"\",RTD(\"cqg.rtd\", ,\"ContractData\",C319, \"NetLastTradeToday\",, \"T\"))","v":""},{"$f":"IF(A319=\"\",\"\",IFERROR(RTD(\"cqg.rtd\", ,\"ContractData\",C319, \"PerCentNetLastTrade\",, \"T\")/100,\"\"))","v":""},{"$f":"IF(A319=\"\",\"\",RTD(\"cqg.rtd\", ,\"ContractData\", C319, \"T_CVol\",, \"T\"))","v":""},319,{"$f":"IFERROR(RANK($J319,INDIRECT((\"$J$\"&\"1\"&\":$J$\"&$A$351)))+COUNTIF($J$1:J319,J319)-1,\"\")","v":""},"",""]
[{"$f":"IF(Symbols!A320=\"\",\"\",Symbols!A320)","v":""},"","",{"$f":"IF(A320=\"\",\"\",RTD(\"cqg.rtd\", ,\"ContractData\",C320, \"LongDescription\",, \"T\"))","v":""},null,null,null,{"$f":"IF(A320=\"\",\"\",RTD(\"cqg.rtd\", ,\"ContractData\",C320, \"LastTradeToday\",, \"T\"))","v":""},{"$f":"IF(A320=\"\",\"\",RTD(\"cqg.rtd\", ,\"ContractData\",C320, \"NetLastTradeToday\",, \"T\"))","v":""},{"$f":"IF(A320=\"\",\"\",IFERROR(RTD(\"cqg.rtd\", ,\"ContractData\",C320, \"PerCentNetLastTrade\",, \"T\")/100,\"\"))","v":""},{"$f":"IF(A320=\"\",\"\",RTD(\"cqg.rtd\", ,\"ContractData\", C320, \"T_CVol\",, \"T\"))","v":""},320,{"$f":"IFERROR(RANK($J320,INDIRECT((\"$J$\"&\"1\"&\":$J$\"&$A$351)))+COUNTIF($J$1:J320,J320)-1,\"\")","v":""},"",""]
[{"$f":"IF(Symbols!A321=\"\",\"\",Symbols!A321)","v":""},"","",{"$f":"IF(A321=\"\",\"\",RTD(\"cqg.rtd\", ,\"ContractData\",C321, \"LongDescription\",, \"T\"))","v":""},null,null,null,{"$f":"IF(A321=\"\",\"\",RTD(\"cqg.rtd\", ,\"ContractData\",C321, \"LastTradeToday\",, \"T\"))","v":""},{"$f":"IF(A321=\"\",\"\",RTD(\"cqg.rtd\", ,\"ContractData\",C321, \"NetLastTradeToday\",, \"T\"))","v":""},{"$f":"IF(A321=\"\",\"\",IFERROR(RTD(\"cqg.rtd\", ,\"ContractData\",C321, \"PerCentNetLastTrade\",, \"T\")/100,\"\"))","v":""},{"$f":"IF(A321=\"\",\"\",RTD(\"cqg.rtd\", ,\"ContractData\", C321, \"T_CVol\",, \"T\"))","v":""},321,{"$f":"IFERROR(RANK($J321,INDIRECT((\"$J$\"&\"1\"&\":$J$\"&$A$351)))+COUNTIF($J$1:J321,J321)-1,\"\")","v":""},"",""]
[{"$f":"IF(Symbols!A322=\"\",\"\",Symbols!A322)","v":""},"","",{"$f":"IF(A322=\"\",\"\",RTD(\"cqg.rtd\", ,\"ContractData\",C322, \"LongDescription\",, \"T\"))","v":""},null,null,null,{"$f":"IF(A322=\"\",\"\",RTD(\"cqg.rtd\", ,\"ContractData\",C322, \"LastTradeToday\",, \"T\"))","v":""},{"$f":"IF(A322=\"\",\"\",RTD(\"cqg.rtd\", ,\"ContractData\",C322, \"NetLastTradeToday\",, \"T\"))","v":""},{"$f":"IF(A322=\"\",\"\",IFERROR(RTD(\"cqg.rtd\", ,\"ContractData\",C322, \"PerCentNetLastTrade\",, \"T\")/100,\"\"))","v":""},{"$f":"IF(A322=\"\",\"\",RTD(\"cqg.rtd\", ,\"ContractData\", C322, \"T_CVol\",, \"T\"))","v":""},322,{"$f":"IFERROR(RANK($J322,INDIRECT((\"$J$\"&\"1\"&\":$J$\"&$A$351)))+COUNTIF($J$1:J322,J322)-1,\"\")","v":""},"",{"$f":"IFERROR(VLOOKUP($L322,$M$1:$N$350,2,FALSE),\"\")","v":""}]
[{"$f":"IF(Symbols!A323=\"\",\"\",Symbols!A323)","v":""},"","",{"$f":"IF(A323=\"\",\"\",RTD(\"cqg.rtd\", ,\"ContractData\",C323, \"LongDescription\",, \"T\"))","v":""},null,null,null,{"$f":"IF(A323=\"\",\"\",RTD(\"cqg.rtd\", ,\"ContractData\",C323, \"LastTradeToday\",, \"T\"))","v":""},{"$f":"IF(A323=\"\",\"\",RTD(\"cqg.rtd\", ,\"ContractData\",C323, \"NetLastTradeToday\",, \"T\"))","v":""},{"$f":"IF(A323=\"\",\"\",IFERROR(RTD(\"cqg.rtd\", ,\"ContractData\",C323, \"PerCentNetLastTrade\",, \"T\")/100,\"\"))","v":""},{"$f":"IF(A323=\"\",\"\",RTD(\"cqg.rtd\", ,\"ContractData\", C323, \"T_CVol\",, \"T\"))","v":""},{"$f":"L322+1","v":323},{"$f":"IFERROR(RANK($J323,INDIRECT((\"$J$\"&\"1\"&\":$J$\"&$A$351)))+COUNTIF($J$1:J323,J323)-1,\"\")","v":""},"",""]
[{"$f":"IF(Symbols!A324=\"\",\"\",Symbols!A324)","v":""},"","",{"$f":"IF(A324=\"\",\"\",RTD(\"cqg.rtd\", ,\"ContractData\",C324, \"LongDescription\",, \"T\"))","v":""},null,null,null,{"$f":"IF(A324=\"\",\"\",RTD(\"cqg.rtd\", ,\"ContractData\",C324, \"LastTradeToday\",, \"T\"))","v":""},{"$f":"IF(A324=\"\",\"\",RTD(\"cqg.rtd\", ,\"ContractData\",C324, \"NetLastTradeToday\",, \"T\"))","v":""},{"$f":"IF(A324=\"\",\"\",IFERROR(RTD(\"cqg.rtd\", ,\"ContractData\",C324, \"PerCentNetLastTrade\",, \"T\")/100,\"\"))","v":""},{"$f":"IF(A324=\"\",\"\",RTD(\"cqg.rtd\", ,\"ContractData\", C324, \"T_CVol\",, \"T\"))","v":""},324,{"$f":"IFERROR(RANK($J324,INDIRECT((\"$J$\"&\"1\"&\":$J$\"&$A$351)))+COUNTIF($J$1:J324,J324)-1,\"\")","v":""},"",""]
[{"$f":"IF(Symbols!A325=\"\",\"\",Symbols!A325)","v":""},"","",{"$f":"IF(A325=\"\",\"\",RTD(\"cqg.rtd\", ,\"ContractData\",C325, \"LongDescription\",, \"T\"))","v":""},null,null,null,{"$f":"IF(A325=\"\",\"\",RTD(\"cqg.rtd\", ,\"ContractData\",C325, \"LastTradeToday\",, \"T\"))","v":""},{"$f":"IF(A325=\"\",\"\",RTD(\"cqg.rtd\", ,\"ContractData\",C325, \"NetLastTradeToday\",, \"T\"))","v":""},{"$f":"IF(A325=\"\",\"\",IFERROR(RTD(\"cqg.rtd\", ,\"ContractData\",C325, \"PerCentNetLastTrade\",, \"T\")/100,\"\"))","v":""},{"$f":"IF(A325=\"\",\"\",RTD(\"cqg.rtd\", ,\"ContractData\", C325, \"T_CVol\",, \"T\"))","v":""},325,{"$f":"IFERROR(RANK($J325,INDIRECT((\"$J$\"&\"1\"&\":$J$\"&$A$351)))+COUNTIF($J$1:J325,J325)-1,\"\")","v":""},"",""]
[{"$f":"IF(Symbols!A326=\"\",\"\",Symbols!A326)","v":""},"","",{"$f":"IF(A326=\"\",\"\",RTD(\"cqg.rtd\", ,\"ContractData\",C326, \"LongDescription\",, \"T\"))","v":""},null,null,null,{"$f":"IF(A326=\"\",\"\",RTD(\"cqg.rtd\", ,\"ContractData\",C326, \"LastTradeToday\",, \"T\"))","v":""},{"$f":"IF(A326=\"\",\"\",RTD(\"cqg.rtd\", ,\"ContractData\",C326, \"NetLastTradeToday\",, \"T\"))","v":""},{"$f":"IF(A326=\"\",\"\",IFERROR(RTD(\"cqg.rtd\", ,\"ContractData\",C326, \"PerCentNetLastTrade\",, \"T\")/100,\"\"))","v":""},{"$f":"IF(A326=\"\",\"\",RTD(\"cqg.rtd\", ,\"ContractData\", C326, \"T_CVol\",, \"T\"))","v":""},326,{"$f":"IFERROR(RANK($J326,INDIRECT((\"$J$\"&\"1\"&\":$J$\"&$A$351)))+COUNTIF($J$1:J326,J326)-1,\"\")","v":""},"",""]
[{"$f":"IF(Symbols!A327=\"\",\"\",Symbols!A327)","v":""},"","",{"$f":"IF(A327=\"\",\"\",RTD(\"cqg.rtd\", ,\"ContractData\",C327, \"LongDescription\",, \"T\"))","v":""},null,null,null,{"$f":"IF(A327=\"\",\"\",RTD(\"cqg.rtd\", ,\"ContractData\",C327, \"LastTradeToday\",, \"T\"))","v":""},{"$f":"IF(A327=\"\",\"\",RTD(\"cqg.rtd\", ,\"ContractData\",C327, \"NetLastTradeToday\",, \"T\"))","v":""},{"$f":"IF(A327=\"\",\"\",IFERROR(RTD(\"cqg.rtd\", ,\"ContractData\",C327, \"PerCentNetLastTrade\",, \"T\")/100,\"\"))","v":""},{"$f":"IF(A327=\"\",\"\",RTD(\"cqg.rtd\", ,\"ContractData\", C327, \"T_CVol\",, \"T\"))","v":""},327,{"$f":"IFERROR(RANK($J327,INDIRECT((\"$J$\"&\"1\"&\":$J$\"&$A$351)))+COUNTIF($J$1:J327,J327)-1,\"\")","v":""},"",""]
[{"$f":"IF(Symbols!A328=\"\",\"\",Symbols!A328)","v":""},"","",{"$f":"IF(A328=\"\",\"\",RTD(\"cqg.rtd\", ,\"ContractData\",C328, \"LongDescription\",, \"T\"))","v":""},null,null,null,{"$f":"IF(A328=\"\",\"\",RTD(\"cqg.rtd\", ,\"ContractData\",C328, \"LastTradeToday\",, \"T\"))","v":""},{"$f":"IF(A328=\"\",\"\",RTD(\"cqg.rtd\", ,\"ContractData\",C328, \"NetLastTradeToday\",, \"T\"))","v":""},{"$f":"IF(A328=\"\",\"\",IFERROR(RTD(\"cqg.rtd\", ,\"ContractData\",C328, \"PerCentNetLastTrade\",, \"T\")/100,\"\"))","v":""},{"$f":"IF(A328=\"\",\"\",RTD(\"cqg.rtd\", ,\"ContractData\", C328, \"T_CVol\",, \"T\"))","v":""},328,{"$f":"IFERROR(RANK($J328,INDIRECT((\"$J$\"&\"1\"&\":$J$\"&$A$351)))+COUNTIF($J$1:J328,J328)-1,\"\")","v":""},"",""]
[{"$f":"IF(Symbols!A329=\"\",\"\",Symbols!A329)","v":""},"","",{"$f":"IF(A329=\"\",\"\",RTD(\"cqg.rtd\", ,\"ContractData\",C329, \"LongDescription\",, \"T\"))","v":""},null,null,null,{"$f":"IF(A329=\"\",\"\",RTD(\"cqg.rtd\", ,\"ContractData\",C329, \"LastTradeToday\",, \"T\"))","v":""},{"$f":"IF(A329=\"\",\"\",RTD(\"cqg.rtd\", ,\"ContractData\",C329, \"NetLastTradeToday\",, \"T\"))","v":""},{"$f":"IF(A329=\"\",\"\",IFERROR(RTD(\"cqg.rtd\", ,\"ContractData\",C329, \"PerCentNetLastTrade\",, \"T\")/100,\"\"))","v":""},{"$f":"IF(A329=\"\",\"\",RTD(\"cqg.rtd\", ,\"ContractData\", C329, \"T_CVol\",, \"T\"))","v":""},329,{"$f":"IFERROR(RANK($J329,INDIRECT((\"$J$\"&\"1\"&\":$J$\"&$A$351)))+COUNTIF($J$1:J329,J329)-1,\"\")","v":""},"",""]
[{"$f":"IF(Symbols!A330=\"\",\"\",Symbols!A330)","v":""},"","",{"$f":"IF(A330=\"\",\"\",RTD(\"cqg.rtd\", ,\"ContractData\",C330, \"LongDescription\",, \"T\"))","v":""},null,null,null,{"$f":"IF(A330=\"\",\"\",RTD(\"cqg.rtd\", ,\"ContractData\",C330, \"LastTradeToday\",, \"T\"))","v":""},{"$f":"IF(A330=\"\",\"\",RTD(\"cqg.rtd\", ,\"ContractData\",C330, \"NetLastTradeToday\",, \"T\"))","v":""},{"$f":"IF(A330=\"\",\"\",IFERROR(RTD(\"cqg.rtd\", ,\"ContractData\",C330, \"PerCentNetLastTrade\",, \"T\")/100,\"\"))","v":""},{"$f":"IF(A330=\"\",\"\",RTD(\"cqg.rtd\", ,\"ContractData\", C330, \"T_CVol\",, \"T\"))","v":""},330,{"$f":"IFERROR(RANK($J330,INDIRECT((\"$J$\"&\"1\"&\":$J$\"&$A$351)))+COUNTIF($J$1:J330,J330)-1,\"\")","v":""},"",""]
[{"$f":"IF(Symbols!A331=\"\",\"\",Symbols!A331)","v":""},"","",{"$f":"IF(A331=\"\",\"\",RTD(\"cqg.rtd\", ,\"ContractData\",C331, \"LongDescription\",, \"T\"))","v":""},null,null,null,{"$f":"IF(A331=\"\",\"\",RTD(\"cqg.rtd\", ,\"ContractData\",C331, \"LastTradeToday\",, \"T\"))","v":""},{"$f":"IF(A331=\"\",\"\",RTD(\"cqg.rtd\", ,\"ContractData\",C331, \"NetLastTradeToday\",, \"T\"))","v":""},{"$f":"IF(A331=\"\",\"\",IFERROR(RTD(\"cqg.rtd\", ,\"ContractData\",C331, \"PerCentNetLastTrade\",, \"T\")/100,\"\"))","v":""},{"$f":"IF(A331=\"\",\"\",RTD(\"cqg.rtd\", ,\"ContractData\", C331, \"T_CVol\",, \"T\"))","v":""},331,{"$f":"IFERROR(RANK($J331,INDIRECT((\"$J$\"&\"1\"&\":$J$\"&$A$351)))+COUNTIF($J$1:J331,J331)-1,\"\")","v":""},"",""]
[{"$f":"IF(Symbols!A332=\"\",\"\",Symbols!A332)","v":""},"","",{"$f":"IF(A332=\"\",\"\",RTD(\"cqg.rtd\", ,\"ContractData\",C332, \"LongDescription\",, \"T\"))","v":""},null,null,null,{"$f":"IF(A332=\"\",\"\",RTD(\"cqg.rtd\", ,\"ContractData\",C332, \"LastTradeToday\",, \"T\"))","v":""},{"$f":"IF(A332=\"\",\"\",RTD(\"cqg.rtd\", ,\"ContractData\",C332, \"NetLastTradeToday\",, \"T\"))","v":""},{"$f":"IF(A332=\"\",\"\",IFERROR(RTD(\"cqg.rtd\", ,\"ContractData\",C332, \"PerCentNetLastTrade\",, \"T\")/100,\"\"))","v":""},{"$f":"IF(A332=\"\",\"\",RTD(\"cqg.rtd\", ,\"ContractData\", C332, \"T_CVol\",, \"T\"))","v":""},332,{"$f":"IFERROR(RANK($J332,INDIRECT((\"$J$\"&\"1\"&\":$J$\"&$A$351)))+COUNTIF($J$1:J332,J332)-1,\"\")","v":""},"",""]
[{"$f":"IF(Symbols!A333=\"\",\"\",Symbols!A333)","v":""},"","",{"$f":"IF(A333=\"\",\"\",RTD(\"cqg.rtd\", ,\"ContractData\",C333, \"LongDescription\",, \"T\"))","v":""},null,null,null,{"$f":"IF(A333=\"\",\"\",RTD(\"cqg.rtd\", ,\"ContractData\",C333, \"LastTradeToday\",, \"T\"))","v":""},{"$f":"IF(A333=\"\",\"\",RTD(\"cqg.rtd\", ,\"ContractData\",C333, \"NetLastTradeToday\",, \"T\"))","v":""},{"$f":"IF(A333=\"\",\"\",IFERROR(RTD(\"cqg.rtd\", ,\"ContractData\",C333, \"PerCentNetLastTrade\",, \"T\")/100,\"\"))","v":""},{"$f":"IF(A333=\"\",\"\",RTD(\"cqg.rtd\", ,\"ContractData\", C333, \"T_CVol\",, \"T\"))","v":""},333,{"$f":"IFERROR(RANK($J333,INDIRECT((\"$J$\"&\"1\"&\":$J$\"&$A$351)))+COUNTIF($J$1:J333,J333)-1,\"\")","v":""},"",""]
[{"$f":"IF(Symbols!A334=\"\",\"\",Symbols!A334)","v":""},"","",{"$f":"IF(A334=\"\",\"\",RTD(\"cqg.rtd\", ,\"ContractData\",C334, \"LongDescription\",, \"T\"))","v":""},null,null,null,{"$f":"IF(A334=\"\",\"\",RTD(\"cqg.rtd\", ,\"ContractData\",C334, \"LastTradeToday\",, \"T\"))","v":""},{"$f":"IF(A334=\"\",\"\",RTD(\"cqg.rtd\", ,\"ContractData\",C334, \"NetLastTradeToday\",, \"T\"))","v":""},{"$f":"IF(A334=\"\",\"\",IFERROR(RTD(\"cqg.rtd\", ,\"ContractData\",C334, \"PerCentNetLastTrade\",, \"T\")/100,\"\"))","v":""},{"$f":"IF(A334=\"\",\"\",RTD(\"cqg.rtd\", ,\"ContractData\", C334, \"T_CVol\",, \"T\"))","v":""},334,{"$f":"IFERROR(RANK($J334,INDIRECT((\"$J$\"&\"1\"&\":$J$\"&$A$351)))+COUNTIF($J$1:J334,J334)-1,\"\")","v":""},"",""]
[{"$f":"IF(Symbols!A335=\"\",\"\",Symbols!A335)","v":""},"","",{"$f":"IF(A335=\"\",\"\",RTD(\"cqg.rtd\", ,\"ContractData\",C335, \"LongDescription\",, \"T\"))","v":""},null,null,null,{"$f":"IF(A335=\"\",\"\",RTD(\"cqg.rtd\", ,\"ContractData\",C335, \"LastTradeToday\",, \"T\"))","v":""},{"$f":"IF(A335=\"\",\"\",RTD(\"cqg.rtd\", ,\"ContractData\",C335, \"NetLastTradeToday\",, \"T\"))","v":""},{"$f":"IF(A335=\"\",\"\",IFERROR(RTD(\"cqg.rtd\", ,\"ContractData\",C335, \"PerCentNetLastTrade\",, \"T\")/100,\"\"))","v":""},{"$f":"IF(A335=\"\",\"\",RTD(\"cqg.rtd\", ,\"ContractData\", C335, \"T_CVol\",, \"T\"))","v":""},335,{"$f":"IFERROR(RANK($J335,INDIRECT((\"$J$\"&\"1\"&\":$J$\"&$A$351)))+COUNTIF($J$1:J335,J335)-1,\"\")","v":""},"",""]
[{"$f":"IF(Symbols!A336=\"\",\"\",Symbols!A336)","v":""},"","",{"$f":"IF(A336=\"\",\"\",RTD(\"cqg.rtd\", ,\"ContractData\",C336, \"LongDescription\",, \"T\"))","v":""},null,null,null,{"$f":"IF(A336=\"\",\"\",RTD(\"cqg.rtd\", ,\"ContractData\",C336, \"LastTradeToday\",, \"T\"))","v":""},{"$f":"IF(A336=\"\",\"\",RTD(\"cqg.rtd\", ,\"ContractData\",C336, \"NetLastTradeToday\",, \"T\"))","v":""},{"$f":"IF(A336=\"\",\"\",IFERROR(RTD(\"cqg.rtd\", ,\"ContractData\",C336, \"PerCentNetLastTrade\",, \"T\")/100,\"\"))","v":""},{"$f":"IF(A336=\"\",\"\",RTD(\"cqg.rtd\", ,\"ContractData\", C336, \"T_CVol\",, \"T\"))","v":""},336,{"$f":"IFERROR(RANK($J336,INDIRECT((\"$J$\"&\"1\"&\":$J$\"&$A$351)))+COUNTIF($J$1:J336,J336)-1,\"\")","v":""},"",""]
[{"$f":"IF(Symbols!A337=\"\",\"\",Symbols!A337)","v":""},"","",{"$f":"IF(A337=\"\",\"\",RTD(\"cqg.rtd\", ,\"ContractData\",C337, \"LongDescription\",, \"T\"))","v":""},null,null,null,{"$f":"IF(A337=\"\",\"\",RTD(\"cqg.rtd\", ,\"ContractData\",C337, \"LastTradeToday\",, \"T\"))","v":""},{"$f":"IF(A337=\"\",\"\",RTD(\"cqg.rtd\", ,\"ContractData\",C337, \"NetLastTradeToday\",, \"T\"))","v":""},{"$f":"IF(A337=\"\",\"\",IFERROR(RTD(\"cqg.rtd\", ,\"ContractData\",C337, \"PerCentNetLastTrade\",, \"T\")/100,\"\"))","v":""},{"$f":"IF(A337=\"\",\"\",RTD(\"cqg.rtd\", ,\"ContractData\", C337, \"T_CVol\",, \"T\"))","v":""},337,{"$f":"IFERROR(RANK($J337,INDIRECT((\"$J$\"&\"1\"&\":$J$\"&$A$351)))+COUNTIF($J$1:J337,J337)-1,\"\")","v":""},"",""]
[{"$f":"IF(Symbols!A338=\"\",\"\",Symbols!A338)","v":""},"","",{"$f":"IF(A338=\"\",\"\",RTD(\"cqg.rtd\", ,\"ContractData\",C338, \"LongDescription\",, \"T\"))","v":""},null,null,null,{"$f":"IF(A338=\"\",\"\",RTD(\"cqg.rtd\", ,\"ContractData\",C338, \"LastTradeToday\",, \"T\"))","v":""},{"$f":"IF(A338=\"\",\"\",RTD(\"cqg.rtd\", ,\"ContractData\",C338, \"NetLastTradeToday\",, \"T\"))","v":""},{"$f":"IF(A338=\"\",\"\",IFERROR(RTD(\"cqg.rtd\", ,\"ContractData\",C338, \"PerCentNetLastTrade\",, \"T\")/100,\"\"))","v":""},{"$f":"IF(A338=\"\",\"\",RTD(\"cqg.rtd\", ,\"ContractData\", C338, \"T_CVol\",, \"T\"))","v":""},338,{"$f":"IFERROR(RANK($J338,INDIRECT((\"$J$\"&\"1\"&\":$J$\"&$A$351)))+COUNTIF($J$1:J338,J338)-1,\"\")","v":""},"",""]
[{"$f":"IF(Symbols!A339=\"\",\"\",Symbols!A339)","v":""},"","",{"$f":"IF(A339=\"\",\"\",RTD(\"cqg.rtd\", ,\"ContractData\",C339, \"LongDescription\",, \"T\"))","v":""},null,null,null,{"$f":"IF(A339=\"\",\"\",RTD(\"cqg.rtd\", ,\"ContractData\",C339, \"LastTradeToday\",, \"T\"))","v":""},{"$f":"IF(A339=\"\",\"\",RTD(\"cqg.rtd\", ,\"ContractData\",C339, \"NetLastTradeToday\",, \"T\"))","v":""},{"$f":"IF(A339=\"\",\"\",IFERROR(RTD(\"cqg.rtd\", ,\"ContractData\",C339, \"PerCentNetLastTrade\",, \"T\")/100,\"\"))","v":""},{"$f":"IF(A339=\"\",\"\",RTD(\"cqg.rtd\", ,\"ContractData\", C339, \"T_CVol\",, \"T\"))","v":""},339,{"$f":"IFERROR(RANK($J339,INDIRECT((\"$J$\"&\"1\"&\":$J$\"&$A$351)))+COUNTIF($J$1:J339,J339)-1,\"\")","v":""},"",""]
[{"$f":"IF(Symbols!A340=\"\",\"\",Symbols!A340)","v":""},"","",{"$f":"IF(A340=\"\",\"\",RTD(\"cqg.rtd\", ,\"ContractData\",C340, \"LongDescription\",, \"T\"))","v":""},null,null,null,{"$f":"IF(A340=\"\",\"\",RTD(\"cqg.rtd\", ,\"ContractData\",C340, \"LastTradeToday\",, \"T\"))","v":""},{"$f":"IF(A340=\"\",\"\",RTD(\"cqg.rtd\", ,\"ContractData\",C340, \"NetLastTradeToday\",, \"T\"))","v":""},{"$f":"IF(A340=\"\",\"\",IFERROR(RTD(\"cqg.rtd\", ,\"ContractData\",C340, \"PerCentNetLastTrade\",, \"T\")/100,\"\"))","v":""},{"$f":"IF(A340=\"\",\"\",RTD(\"cqg.rtd\", ,\"ContractData\", C340, \"T_CVol\",, \"T\"))","v":""},340,{"$f":"IFERROR(RANK($J340,INDIRECT((\"$J$\"&\"1\"&\":$J$\"&$A$351)))+COUNTIF($J$1:J340,J340)-1,\"\")","v":""},"",""]
[{"$f":"IF(Symbols!A341=\"\",\"\",Symbols!A341)","v":""},"","",{"$f":"IF(A341=\"\",\"\",RTD(\"cqg.rtd\", ,\"ContractData\",C341, \"LongDescription\",, \"T\"))","v":""},null,null,null,{"$f":"IF(A341=\"\",\"\",RTD(\"cqg.rtd\", ,\"ContractData\",C341, \"LastTradeToday\",, \"T\"))","v":""},{"$f":"IF(A341=\"\",\"\",RTD(\"cqg.rtd\", ,\"ContractData\",C341, \"NetLastTradeToday\",, \"T\"))","v":""},{"$f":"IF(A341=\"\",\"\",IFERROR(RTD(\"cqg.rtd\", ,\"ContractData\",C341, \"PerCentNetLastTrade\",, \"T\")/100,\"\"))","v":""},{"$f":"IF(A341=\"\",\"\",RTD(\"cqg.rtd\", ,\"ContractData\", C341, \"T_CVol\",, \"T\"))","v":""},341,{"$f":"IFERROR(RANK($J341,INDIRECT((\"$J$\"&\"1\"&\":$J$\"&$A$351)))+COUNTIF($J$1:J341,J341)-1,\"\")","v":""},"",""]
[{"$f":"IF(Symbols!A342=\"\",\"\",Symbols!A342)","v":""},"","",{"$f":"IF(A342=\"\",\"\",RTD(\"cqg.rtd\", ,\"ContractData\",C342, \"LongDescription\",, \"T\"))","v":""},null,null,null,{"$f":"IF(A342=\"\",\"\",RTD(\"cqg.rtd\", ,\"ContractData\",C342, \"LastTradeToday\",, \"T\"))","v":""},{"$f":"IF(A342=\"\",\"\",RTD(\"cqg.rtd\", ,\"ContractData\",C342, \"NetLastTradeToday\",, \"T\"))","v":""},{"$f":"IF(A342=\"\",\"\",IFERROR(RTD(\"cqg.rtd\", ,\"ContractData\",C342, \"PerCentNetLastTrade\",, \"T\")/100,\"\"))","v":""},{"$f":"IF(A342=\"\",\"\",RTD(\"cqg.rtd\", ,\"ContractData\", C342, \"T_CVol\",, \"T\"))","v":""},342,{"$f":"IFERROR(RANK($J342,INDIRECT((\"$J$\"&\"1\"&\":$J$\"&$A$351)))+COUNTIF($J$1:J342,J342)-1,\"\")","v":""},"",""]
[{"$f":"IF(Symbols!A343=\"\",\"\",Symbols!A343)","v":""},"","",{"$f":"IF(A343=\"\",\"\",RTD(\"cqg.rtd\", ,\"ContractData\",C343, \"LongDescription\",, \"T\"))","v":""},null,null,null,{"$f":"IF(A343=\"\",\"\",RTD(\"cqg.rtd\", ,\"ContractData\",C343, \"LastTradeToday\",, \"T\"))","v":""},{"$f":"IF(A343=\"\",\"\",RTD(\"cqg.rtd\", ,\"ContractData\",C343, \"NetLastTradeToday\",, \"T\"))","v":""},{"$f":"IF(A343=\"\",\"\",IFERROR(RTD(\"cqg.rtd\", ,\"ContractData\",C343, \"PerCentNetLastTrade\",, \"T\")/100,\"\"))","v":""},{"$f":"IF(A343=\"\",\"\",RTD(\"cqg.rtd\", ,\"ContractData\", C343, \"T_CVol\",, \"T\"))","v":""},343,{"$f":"IFERROR(RANK($J343,INDIRECT((\"$J$\"&\"1\"&\":$J$\"&$A$351)))+COUNTIF($J$1:J343,J343)-1,\"\")","v":""},"",""]
[{"$f":"IF(Symbols!A344=\"\",\"\",Symbols!A344)","v":""},"","",{"$f":"IF(A344=\"\",\"\",RTD(\"cqg.rtd\", ,\"ContractData\",C344, \"LongDescription\",, \"T\"))","v":""},null,null,null,{"$f":"IF(A344=\"\",\"\",RTD(\"cqg.rtd\", ,\"ContractData\",C344, \"LastTradeToday\",, \"T\"))","v":""},{"$f":"IF(A344=\"\",\"\",RTD(\"cqg.rtd\", ,\"ContractData\",C344, \"NetLastTradeToday\",, \"T\"))","v":""},{"$f":"IF(A344=\"\",\"\",IFERROR(RTD(\"cqg.rtd\", ,\"ContractData\",C344, \"PerCentNetLastTrade\",, \"T\")/100,\"\"))","v":""},{"$f":"IF(A344=\"\",\"\",RTD(\"cqg.rtd\", ,\"ContractData\", C344, \"T_CVol\",, \"T\"))","v":""},344,{"$f":"IFERROR(RANK($J344,INDIRECT((\"$J$\"&\"1\"&\":$J$\"&$A$351)))+COUNTIF($J$1:J344,J344)-1,\"\")","v":""},"",""]
[{"$f":"IF(Symbols!A345=\"\",\"\",Symbols!A345)","v":""},"","",{"$f":"IF(A345=\"\",\"\",RTD(\"cqg.rtd\", ,\"ContractData\",C345, \"LongDescription\",, \"T\"))","v":""},null,null,null,{"$f":"IF(A345=\"\",\"\",RTD(\"cqg.rtd\", ,\"ContractData\",C345, \"LastTradeToday\",, \"T\"))","v":""},{"$f":"IF(A345=\"\",\"\",RTD(\"cqg.rtd\", ,\"ContractData\",C345, \"NetLastTradeToday\",, \"T\"))","v":""},{"$f":"IF(A345=\"\",\"\",IFERROR(RTD(\"cqg.rtd\", ,\"ContractData\",C345, \"PerCentNetLastTrade\",, \"T\")/100,\"\"))","v":""},{"$f":"IF(A345=\"\",\"\",RTD(\"cqg.rtd\", ,\"ContractData\", C345, \"T_CVol\",, \"T\"))","v":""},345,{"$f":"IFERROR(RANK($J345,INDIRECT((\"$J$\"&\"1\"&\":$J$\"&$A$351)))+COUNTIF($J$1:J345,J345)-1,\"\")","v":""},"",""]
[{"$f":"IF(Symbols!A346=\"\",\"\",Symbols!A346)","v":""},"","",{"$f":"IF(A346=\"\",\"\",RTD(\"cqg.rtd\", ,\"ContractData\",C346, \"LongDescription\",, \"T\"))","v":""},null,null,null,{"$f":"IF(A346=\"\",\"\",RTD(\"cqg.rtd\", ,\"ContractData\",C346, \"LastTradeToday\",, \"T\"))","v":""},{"$f":"IF(A346=\"\",\"\",RTD(\"cqg.rtd\", ,\"ContractData\",C346, \"NetLastTradeToday\",, \"T\"))","v":""},{"$f":"IF(A346=\"\",\"\",IFERROR(RTD(\"cqg.rtd\", ,\"ContractData\",C346, \"PerCentNetLastTrade\",, \"T\")/100,\"\"))","v":""},{"$f":"IF(A346=\"\",\"\",RTD(\"cqg.rtd\", ,\"ContractData\", C346, \"T_CVol\",, \"T\"))","v":""},346,{"$f":"IFERROR(RANK($J346,INDIRECT((\"$J$\"&\"1\"&\":$J$\"&$A$351)))+COUNTIF($J$1:J346,J346)-1,\"\")","v":""},"",""]
[{"$f":"IF(Symbols!A347=\"\",\"\",Symbols!A347)","v":""},"","",{"$f":"IF(A347=\"\",\"\",RTD(\"cqg.rtd\", ,\"ContractData\",C347, \"LongDescription\",, \"T\"))","v":""},null,null,null,{"$f":"IF(A347=\"\",\"\",RTD(\"cqg.rtd\", ,\"ContractData\",C347, \"LastTradeToday\",, \"T\"))","v":""},{"$f":"IF(A347=\"\",\"\",RTD(\"cqg.rtd\", ,\"ContractData\",C347, \"NetLastTradeToday\",, \"T\"))","v":""},{"$f":"IF(A347=\"\",\"\",IFERROR(RTD(\"cqg.rtd\", ,\"ContractData\",C347, \"PerCentNetLastTrade\",, \"T\")/100,\"\"))","v":""},{"$f":"IF(A347=\"\",\"\",RTD(\"cqg.rtd\", ,\"ContractData\", C347, \"T_CVol\",, \"T\"))","v":""},347,{"$f":"IFERROR(RANK($J347,INDIRECT((\"$J$\"&\"1\"&\":$J$\"&$A$351)))+COUNTIF($J$1:J347,J347)-1,\"\")","v":""},"",""]
[{"$f":"IF(Symbols!A348=\"\",\"\",Symbols!A348)","v":""},"","",{"$f":"IF(A348=\"\",\"\",RTD(\"cqg.rtd\", ,\"ContractData\",C348, \"LongDescription\",, \"T\"))","v":""},null,null,null,{"$f":"IF(A348=\"\",\"\",RTD(\"cqg.rtd\", ,\"ContractData\",C348, \"LastTradeToday\",, \"T\"))","v":""},{"$f":"IF(A348=\"\",\"\",RTD(\"cqg.rtd\", ,\"ContractData\",C348, \"NetLastTradeToday\",, \"T\"))","v":""},{"$f":"IF(A348=\"\",\"\",IFERROR(RTD(\"cqg.rtd\", ,\"ContractData\",C348, \"PerCentNetLastTrade\",, \"T\")/100,\"\"))","v":""},{"$f":"IF(A348=\"\",\"\",RTD(\"cqg.rtd\", ,\"ContractData\", C348, \"T_CVol\",, \"T\"))","v":""},348,{"$f":"IFERROR(RANK($J348,INDIRECT((\"$J$\"&\"1\"&\":$J$\"&$A$351)))+COUNTIF($J$1:J348,J348)-1,\"\")","v":""},"",""]
[{"$f":"IF(Symbols!A349=\"\",\"\",Symbols!A349)","v":""},"","",{"$f":"IF(A349=\"\",\"\",RTD(\"cqg.rtd\", ,\"ContractData\",C349, \"LongDescription\",, \"T\"))","v":""},null,null,null,{"$f":"IF(A349=\"\",\"\",RTD(\"cqg.rtd\", ,\"ContractData\",C349, \"LastTradeToday\",, \"T\"))","v":""},{"$f":"IF(A349=\"\",\"\",RTD(\"cqg.rtd\", ,\"ContractData\",C349, \"NetLastTradeToday\",, \"T\"))","v":""},{"$f":"IF(A349=\"\",\"\",IFERROR(RTD(\"cqg.rtd\", ,\"ContractData\",C349, \"PerCentNetLastTrade\",, \"T\")/100,\"\"))","v":""},{"$f":"IF(A349=\"\",\"\",RTD(\"cqg.rtd\", ,\"ContractData\", C349, \"T_CVol\",, \"T\"))","v":""},349,{"$f":"IFERROR(RANK($J349,INDIRECT((\"$J$\"&\"1\"&\":$J$\"&$A$351)))+COUNTIF($J$1:J349,J349)-1,\"\")","v":""},"",""]
[{"$f":"IF(Symbols!A350=\"\",\"\",Symbols!A350)","v":""},"","",{"$f":"IF(A350=\"\",\"\",RTD(\"cqg.rtd\", ,\"ContractData\",C350, \"LongDescription\",, \"T\"))","v":""},null,null,null,{"$f":"IF(A350=\"\",\"\",RTD(\"cqg.rtd\", ,\"ContractData\",C350, \"LastTradeToday\",, \"T\"))","v":""},{"$f":"IF(A350=\"\",\"\",RTD(\"cqg.rtd\", ,\"ContractData\",C350, \"NetLastTradeToday\",, \"T\"))","v":""},{"$f":"IF(A350=\"\",\"\",IFERROR(RTD(\"cqg.rtd\", ,\"ContractData\",C350, \"PerCentNetLastTrade\",, \"T\")/100,\"\"))","v":""},{"$f":"IF(A350=\"\",\"\",RTD(\"cqg.rtd\", ,\"ContractData\", C350, \"T_CVol\",, \"T\"))","v":""},350,{"$f":"IFERROR(RANK($J350,INDIRECT((\"$J$\"&\"1\"&\":$J$\"&$A$351)))+COUNTIF($J$1:J350,J350)-1,\"\")","v":""},"",""]
[{"$f":"350-COUNTIF(A1:A350,\"\")","v":41},{"$f":"SUM(B1:B350)/A351","v":1}]
[{"$f":"\"$J$1:$J$\"&A351","v":"$J$1:$J$41"}]

{"sheet":"Symbols","index":2,"n_rows":312,"n_cols":7,"rows_kept":312,"cut":false,"hidden":false,"merged":[[11,3,11,10],[9,7,9,10],[4,3,4,6],[5,3,5,6],[6,3,6,6],[7,3,7,6],[8,3,8,6],[9,3,9,6],[4,7,4,10],[5,7,5,10],[6,7,6,10],[7,7,7,10],[8,7,8,10]]}
["S.US.ACHR",{"$f":"IF(A1=\"\",\"\",RTD(\"cqg.rtd\", ,\"ContractData\",A1, \"LongDescription\",, \"T\"))","v":"Archer Aviation Inc"}]
["S.US.AIR",{"$f":"IF(A2=\"\",\"\",RTD(\"cqg.rtd\", ,\"ContractData\",A2, \"LongDescription\",, \"T\"))","v":"AAR Corporation"}]
["S.US.ATI",{"$f":"IF(A3=\"\",\"\",RTD(\"cqg.rtd\", ,\"ContractData\",A3, \"LongDescription\",, \"T\"))","v":"ATI Inc."}]
["S.US.ATRO",{"$f":"IF(A4=\"\",\"\",RTD(\"cqg.rtd\", ,\"ContractData\",A4, \"LongDescription\",, \"T\"))","v":"ASTRONICS CP ##"}]
["S.US.AVAV",{"$f":"IF(A5=\"\",\"\",RTD(\"cqg.rtd\", ,\"ContractData\",A5, \"LongDescription\",, \"T\"))","v":"AEROVIRONMENT, INC."}]
["S.US.AXON",{"$f":"IF(A6=\"\",\"\",RTD(\"cqg.rtd\", ,\"ContractData\",A6, \"LongDescription\",, \"T\"))","v":"AXON ENTERPRISE, INC"}]
["S.US.BA",{"$f":"IF(A7=\"\",\"\",RTD(\"cqg.rtd\", ,\"ContractData\",A7, \"LongDescription\",, \"T\"))","v":"Boeing Company"}]
["S.US.BWXT",{"$f":"IF(A8=\"\",\"\",RTD(\"cqg.rtd\", ,\"ContractData\",A8, \"LongDescription\",, \"T\"))","v":"BWX Technologies, Inc."}]
["S.US.CDRE",{"$f":"IF(A9=\"\",\"\",RTD(\"cqg.rtd\", ,\"ContractData\",A9, \"LongDescription\",, \"T\"))","v":"Cadre Holdings, Inc."}]
["S.US.CRS",{"$f":"IF(A10=\"\",\"\",RTD(\"cqg.rtd\", ,\"ContractData\",A10, \"LongDescription\",, \"T\"))","v":"Carpenter Technology Corp"}]
["S.US.CW",{"$f":"IF(A11=\"\",\"\",RTD(\"cqg.rtd\", ,\"ContractData\",A11, \"LongDescription\",, \"T\"))","v":"Curtiss-Wright Corporation"}]
["S.US.DCO",{"$f":"IF(A12=\"\",\"\",RTD(\"cqg.rtd\", ,\"ContractData\",A12, \"LongDescription\",, \"T\"))","v":"DUCOMMUN INC"},null,"https://www.ishares.com/us/products/239502/ishares-us-aerospace-defense-etf"]
["S.US.DRS",{"$f":"IF(A13=\"\",\"\",RTD(\"cqg.rtd\", ,\"ContractData\",A13, \"LongDescription\",, \"T\"))","v":"LEONARDO DRS, INC CM"}]
["S.US.GD",{"$f":"IF(A14=\"\",\"\",RTD(\"cqg.rtd\", ,\"ContractData\",A14, \"LongDescription\",, \"T\"))","v":"General Dynamics Corp"}]
["S.US.GE",{"$f":"IF(A15=\"\",\"\",RTD(\"cqg.rtd\", ,\"ContractData\",A15, \"LongDescription\",, \"T\"))","v":"General Electric Co"}]
["S.US.HEI",{"$f":"IF(A16=\"\",\"\",RTD(\"cqg.rtd\", ,\"ContractData\",A16, \"LongDescription\",, \"T\"))","v":"HEICO CORP"}]
["S.US.HEIA",{"$f":"IF(A17=\"\",\"\",RTD(\"cqg.rtd\", ,\"ContractData\",A17, \"LongDescription\",, \"T\"))","v":"HEICO Corp ClA"}]
["S.US.HII",{"$f":"IF(A18=\"\",\"\",RTD(\"cqg.rtd\", ,\"ContractData\",A18, \"LongDescription\",, \"T\"))","v":"Huntington Ingalls Industries"},"To update the Ticker List:"]
["S.US.HWM",{"$f":"IF(A19=\"\",\"\",RTD(\"cqg.rtd\", ,\"ContractData\",A19, \"LongDescription\",, \"T\"))","v":"Howmet Aerospace Inc."}]
["S.US.HXL",{"$f":"IF(A20=\"\",\"\",RTD(\"cqg.rtd\", ,\"ContractData\",A20, \"LongDescription\",, \"T\"))","v":"Hexcel Corp"}]
["S.US.KRMN",{"$f":"IF(A21=\"\",\"\",RTD(\"cqg.rtd\", ,\"ContractData\",A21, \"LongDescription\",, \"T\"))","v":"Karman Holdings Inc."},"1) From their Web site download the CSV File."]
["S.US.KTOS",{"$f":"IF(A22=\"\",\"\",RTD(\"cqg.rtd\", ,\"ContractData\",A22, \"LongDescription\",, \"T\"))","v":"KRATOS DEFNS"}]
["S.US.LHX",{"$f":"IF(A23=\"\",\"\",RTD(\"cqg.rtd\", ,\"ContractData\",A23, \"LongDescription\",, \"T\"))","v":"L3Harris Technologies, Inc."}]
["S.US.LMT",{"$f":"IF(A24=\"\",\"\",RTD(\"cqg.rtd\", ,\"ContractData\",A24, \"LongDescription\",, \"T\"))","v":"Lockheed Martin Corp"},"2) Copy the Tickers from the file.",null,null,null,"Merge \"S.US.\" to the Tickers. =\"S.US.\"&H1"]
["S.US.LOAR",{"$f":"IF(A25=\"\",\"\",RTD(\"cqg.rtd\", ,\"ContractData\",A25, \"LongDescription\",, \"T\"))","v":"Loar Holdings Inc."}]
["S.US.LUNR",{"$f":"IF(A26=\"\",\"\",RTD(\"cqg.rtd\", ,\"ContractData\",A26, \"LongDescription\",, \"T\"))","v":"INTUITIVE MCHNS CM"}]
["S.US.MOGA",{"$f":"IF(A27=\"\",\"\",RTD(\"cqg.rtd\", ,\"ContractData\",A27, \"LongDescription\",, \"T\"))","v":"Moog Inc ClsA"},"3) Remove money market fund tickers."]
["S.US.MRCY",{"$f":"IF(A28=\"\",\"\",RTD(\"cqg.rtd\", ,\"ContractData\",A28, \"LongDescription\",, \"T\"))","v":"MERCURY SYS INC"}]
["S.US.NOC",{"$f":"IF(A29=\"\",\"\",RTD(\"cqg.rtd\", ,\"ContractData\",A29, \"LongDescription\",, \"T\"))","v":"Northrop Grumman Corporation"}]
["S.US.NPK",{"$f":"IF(A30=\"\",\"\",RTD(\"cqg.rtd\", ,\"ContractData\",A30, \"LongDescription\",, \"T\"))","v":"National Presto Industries Inc."},"4) Copy and Paste \"As Values\" the updated Ticker List to column A."]
["S.US.RCAT",{"$f":"IF(A31=\"\",\"\",RTD(\"cqg.rtd\", ,\"ContractData\",A31, \"LongDescription\",, \"T\"))","v":"RED CAT HOLDINGS CMN"}]
["S.US.RGR",{"$f":"IF(A32=\"\",\"\",RTD(\"cqg.rtd\", ,\"ContractData\",A32, \"LongDescription\",, \"T\"))","v":"Sturm Ruger & Co Inc"}]
["S.US.RKLB",{"$f":"IF(A33=\"\",\"\",RTD(\"cqg.rtd\", ,\"ContractData\",A33, \"LongDescription\",, \"T\"))","v":"ROCKET LAB CORP CMN"}]
["S.US.RTX",{"$f":"IF(A34=\"\",\"\",RTD(\"cqg.rtd\", ,\"ContractData\",A34, \"LongDescription\",, \"T\"))","v":"RTX Corporation"}]
["S.US.SARO",{"$f":"IF(A35=\"\",\"\",RTD(\"cqg.rtd\", ,\"ContractData\",A35, \"LongDescription\",, \"T\"))","v":"StandardAero, Inc."}]
["S.US.SWBI",{"$f":"IF(A36=\"\",\"\",RTD(\"cqg.rtd\", ,\"ContractData\",A36, \"LongDescription\",, \"T\"))","v":"SMITH & WESSON BRAND"}]
["S.US.TDG",{"$f":"IF(A37=\"\",\"\",RTD(\"cqg.rtd\", ,\"ContractData\",A37, \"LongDescription\",, \"T\"))","v":"TransDigm Group"}]
["S.US.TXT",{"$f":"IF(A38=\"\",\"\",RTD(\"cqg.rtd\", ,\"ContractData\",A38, \"LongDescription\",, \"T\"))","v":"Textron Inc"}]
["S.US.VSEC",{"$f":"IF(A39=\"\",\"\",RTD(\"cqg.rtd\", ,\"ContractData\",A39, \"LongDescription\",, \"T\"))","v":"V S E CP ##"}]
["S.US.VVX",{"$f":"IF(A40=\"\",\"\",RTD(\"cqg.rtd\", ,\"ContractData\",A40, \"LongDescription\",, \"T\"))","v":"V2X, Inc."}]
["S.US.WWD",{"$f":"IF(A41=\"\",\"\",RTD(\"cqg.rtd\", ,\"ContractData\",A41, \"LongDescription\",, \"T\"))","v":"Woodward, Inc."}]
[null,{"$f":"IF(A42=\"\",\"\",RTD(\"cqg.rtd\", ,\"ContractData\",A42, \"LongDescription\",, \"T\"))","v":""}]
[null,{"$f":"IF(A43=\"\",\"\",RTD(\"cqg.rtd\", ,\"ContractData\",A43, \"LongDescription\",, \"T\"))","v":""}]
[null,{"$f":"IF(A44=\"\",\"\",RTD(\"cqg.rtd\", ,\"ContractData\",A44, \"LongDescription\",, \"T\"))","v":""}]
[null,{"$f":"IF(A45=\"\",\"\",RTD(\"cqg.rtd\", ,\"ContractData\",A45, \"LongDescription\",, \"T\"))","v":""}]
[null,{"$f":"IF(A46=\"\",\"\",RTD(\"cqg.rtd\", ,\"ContractData\",A46, \"LongDescription\",, \"T\"))","v":""}]
[null,{"$f":"IF(A47=\"\",\"\",RTD(\"cqg.rtd\", ,\"ContractData\",A47, \"LongDescription\",, \"T\"))","v":""}]
[null,{"$f":"IF(A48=\"\",\"\",RTD(\"cqg.rtd\", ,\"ContractData\",A48, \"LongDescription\",, \"T\"))","v":""}]
[null,{"$f":"IF(A49=\"\",\"\",RTD(\"cqg.rtd\", ,\"ContractData\",A49, \"LongDescription\",, \"T\"))","v":""}]
[null,{"$f":"IF(A50=\"\",\"\",RTD(\"cqg.rtd\", ,\"ContractData\",A50, \"LongDescription\",, \"T\"))","v":""}]
[null,{"$f":"IF(A51=\"\",\"\",RTD(\"cqg.rtd\", ,\"ContractData\",A51, \"LongDescription\",, \"T\"))","v":""}]
[null,{"$f":"IF(A52=\"\",\"\",RTD(\"cqg.rtd\", ,\"ContractData\",A52, \"LongDescription\",, \"T\"))","v":""}]
[null,{"$f":"IF(A53=\"\",\"\",RTD(\"cqg.rtd\", ,\"ContractData\",A53, \"LongDescription\",, \"T\"))","v":""}]
[null,{"$f":"IF(A54=\"\",\"\",RTD(\"cqg.rtd\", ,\"ContractData\",A54, \"LongDescription\",, \"T\"))","v":""}]
[null,{"$f":"IF(A55=\"\",\"\",RTD(\"cqg.rtd\", ,\"ContractData\",A55, \"LongDescription\",, \"T\"))","v":""}]
[null,{"$f":"IF(A56=\"\",\"\",RTD(\"cqg.rtd\", ,\"ContractData\",A56, \"LongDescription\",, \"T\"))","v":""}]
[null,{"$f":"IF(A57=\"\",\"\",RTD(\"cqg.rtd\", ,\"ContractData\",A57, \"LongDescription\",, \"T\"))","v":""}]
[null,{"$f":"IF(A58=\"\",\"\",RTD(\"cqg.rtd\", ,\"ContractData\",A58, \"LongDescription\",, \"T\"))","v":""}]
[null,{"$f":"IF(A59=\"\",\"\",RTD(\"cqg.rtd\", ,\"ContractData\",A59, \"LongDescription\",, \"T\"))","v":""}]
[null,{"$f":"IF(A60=\"\",\"\",RTD(\"cqg.rtd\", ,\"ContractData\",A60, \"LongDescription\",, \"T\"))","v":""}]
[null,{"$f":"IF(A61=\"\",\"\",RTD(\"cqg.rtd\", ,\"ContractData\",A61, \"LongDescription\",, \"T\"))","v":""}]
[null,{"$f":"IF(A62=\"\",\"\",RTD(\"cqg.rtd\", ,\"ContractData\",A62, \"LongDescription\",, \"T\"))","v":""}]
[null,{"$f":"IF(A63=\"\",\"\",RTD(\"cqg.rtd\", ,\"ContractData\",A63, \"LongDescription\",, \"T\"))","v":""}]
[null,{"$f":"IF(A64=\"\",\"\",RTD(\"cqg.rtd\", ,\"ContractData\",A64, \"LongDescription\",, \"T\"))","v":""}]
[null,{"$f":"IF(A65=\"\",\"\",RTD(\"cqg.rtd\", ,\"ContractData\",A65, \"LongDescription\",, \"T\"))","v":""}]
[null,{"$f":"IF(A66=\"\",\"\",RTD(\"cqg.rtd\", ,\"ContractData\",A66, \"LongDescription\",, \"T\"))","v":""}]
[null,{"$f":"IF(A67=\"\",\"\",RTD(\"cqg.rtd\", ,\"ContractData\",A67, \"LongDescription\",, \"T\"))","v":""}]
[null,{"$f":"IF(A68=\"\",\"\",RTD(\"cqg.rtd\", ,\"ContractData\",A68, \"LongDescription\",, \"T\"))","v":""}]
[null,{"$f":"IF(A69=\"\",\"\",RTD(\"cqg.rtd\", ,\"ContractData\",A69, \"LongDescription\",, \"T\"))","v":""}]
[null,{"$f":"IF(A70=\"\",\"\",RTD(\"cqg.rtd\", ,\"ContractData\",A70, \"LongDescription\",, \"T\"))","v":""}]
[null,{"$f":"IF(A71=\"\",\"\",RTD(\"cqg.rtd\", ,\"ContractData\",A71, \"LongDescription\",, \"T\"))","v":""}]
[null,{"$f":"IF(A72=\"\",\"\",RTD(\"cqg.rtd\", ,\"ContractData\",A72, \"LongDescription\",, \"T\"))","v":""}]
[null,{"$f":"IF(A73=\"\",\"\",RTD(\"cqg.rtd\", ,\"ContractData\",A73, \"LongDescription\",, \"T\"))","v":""}]
[null,{"$f":"IF(A74=\"\",\"\",RTD(\"cqg.rtd\", ,\"ContractData\",A74, \"LongDescription\",, \"T\"))","v":""}]
[null,{"$f":"IF(A75=\"\",\"\",RTD(\"cqg.rtd\", ,\"ContractData\",A75, \"LongDescription\",, \"T\"))","v":""}]
[null,{"$f":"IF(A76=\"\",\"\",RTD(\"cqg.rtd\", ,\"ContractData\",A76, \"LongDescription\",, \"T\"))","v":""}]
[null,{"$f":"IF(A77=\"\",\"\",RTD(\"cqg.rtd\", ,\"ContractData\",A77, \"LongDescription\",, \"T\"))","v":""}]
[null,{"$f":"IF(A78=\"\",\"\",RTD(\"cqg.rtd\", ,\"ContractData\",A78, \"LongDescription\",, \"T\"))","v":""}]
[null,{"$f":"IF(A79=\"\",\"\",RTD(\"cqg.rtd\", ,\"ContractData\",A79, \"LongDescription\",, \"T\"))","v":""}]
[null,{"$f":"IF(A80=\"\",\"\",RTD(\"cqg.rtd\", ,\"ContractData\",A80, \"LongDescription\",, \"T\"))","v":""}]
[null,{"$f":"IF(A81=\"\",\"\",RTD(\"cqg.rtd\", ,\"ContractData\",A81, \"LongDescription\",, \"T\"))","v":""}]
[null,{"$f":"IF(A82=\"\",\"\",RTD(\"cqg.rtd\", ,\"ContractData\",A82, \"LongDescription\",, \"T\"))","v":""}]
[null,{"$f":"IF(A83=\"\",\"\",RTD(\"cqg.rtd\", ,\"ContractData\",A83, \"LongDescription\",, \"T\"))","v":""}]
[null,{"$f":"IF(A84=\"\",\"\",RTD(\"cqg.rtd\", ,\"ContractData\",A84, \"LongDescription\",, \"T\"))","v":""}]
[null,{"$f":"IF(A85=\"\",\"\",RTD(\"cqg.rtd\", ,\"ContractData\",A85, \"LongDescription\",, \"T\"))","v":""}]
[null,{"$f":"IF(A86=\"\",\"\",RTD(\"cqg.rtd\", ,\"ContractData\",A86, \"LongDescription\",, \"T\"))","v":""}]
[null,{"$f":"IF(A87=\"\",\"\",RTD(\"cqg.rtd\", ,\"ContractData\",A87, \"LongDescription\",, \"T\"))","v":""}]
[null,{"$f":"IF(A88=\"\",\"\",RTD(\"cqg.rtd\", ,\"ContractData\",A88, \"LongDescription\",, \"T\"))","v":""}]
[null,{"$f":"IF(A89=\"\",\"\",RTD(\"cqg.rtd\", ,\"ContractData\",A89, \"LongDescription\",, \"T\"))","v":""}]
[null,{"$f":"IF(A90=\"\",\"\",RTD(\"cqg.rtd\", ,\"ContractData\",A90, \"LongDescription\",, \"T\"))","v":""}]
[null,{"$f":"IF(A91=\"\",\"\",RTD(\"cqg.rtd\", ,\"ContractData\",A91, \"LongDescription\",, \"T\"))","v":""}]
[null,{"$f":"IF(A92=\"\",\"\",RTD(\"cqg.rtd\", ,\"ContractData\",A92, \"LongDescription\",, \"T\"))","v":""}]
[null,{"$f":"IF(A93=\"\",\"\",RTD(\"cqg.rtd\", ,\"ContractData\",A93, \"LongDescription\",, \"T\"))","v":""}]
[null,{"$f":"IF(A94=\"\",\"\",RTD(\"cqg.rtd\", ,\"ContractData\",A94, \"LongDescription\",, \"T\"))","v":""}]
[null,{"$f":"IF(A95=\"\",\"\",RTD(\"cqg.rtd\", ,\"ContractData\",A95, \"LongDescription\",, \"T\"))","v":""}]
[null,{"$f":"IF(A96=\"\",\"\",RTD(\"cqg.rtd\", ,\"ContractData\",A96, \"LongDescription\",, \"T\"))","v":""}]
[null,{"$f":"IF(A97=\"\",\"\",RTD(\"cqg.rtd\", ,\"ContractData\",A97, \"LongDescription\",, \"T\"))","v":""}]
[null,{"$f":"IF(A98=\"\",\"\",RTD(\"cqg.rtd\", ,\"ContractData\",A98, \"LongDescription\",, \"T\"))","v":""}]
[null,{"$f":"IF(A99=\"\",\"\",RTD(\"cqg.rtd\", ,\"ContractData\",A99, \"LongDescription\",, \"T\"))","v":""}]
[null,{"$f":"IF(A100=\"\",\"\",RTD(\"cqg.rtd\", ,\"ContractData\",A100, \"LongDescription\",, \"T\"))","v":""}]
[null,{"$f":"IF(A101=\"\",\"\",RTD(\"cqg.rtd\", ,\"ContractData\",A101, \"LongDescription\",, \"T\"))","v":""}]
[null,{"$f":"IF(A102=\"\",\"\",RTD(\"cqg.rtd\", ,\"ContractData\",A102, \"LongDescription\",, \"T\"))","v":""}]
[null,{"$f":"IF(A103=\"\",\"\",RTD(\"cqg.rtd\", ,\"ContractData\",A103, \"LongDescription\",, \"T\"))","v":""}]
[null,{"$f":"IF(A104=\"\",\"\",RTD(\"cqg.rtd\", ,\"ContractData\",A104, \"LongDescription\",, \"T\"))","v":""}]
[null,{"$f":"IF(A105=\"\",\"\",RTD(\"cqg.rtd\", ,\"ContractData\",A105, \"LongDescription\",, \"T\"))","v":""}]
[null,{"$f":"IF(A106=\"\",\"\",RTD(\"cqg.rtd\", ,\"ContractData\",A106, \"LongDescription\",, \"T\"))","v":""}]
[null,{"$f":"IF(A107=\"\",\"\",RTD(\"cqg.rtd\", ,\"ContractData\",A107, \"LongDescription\",, \"T\"))","v":""}]
[null,{"$f":"IF(A108=\"\",\"\",RTD(\"cqg.rtd\", ,\"ContractData\",A108, \"LongDescription\",, \"T\"))","v":""}]
[null,{"$f":"IF(A109=\"\",\"\",RTD(\"cqg.rtd\", ,\"ContractData\",A109, \"LongDescription\",, \"T\"))","v":""}]
[null,{"$f":"IF(A110=\"\",\"\",RTD(\"cqg.rtd\", ,\"ContractData\",A110, \"LongDescription\",, \"T\"))","v":""}]
[null,{"$f":"IF(A111=\"\",\"\",RTD(\"cqg.rtd\", ,\"ContractData\",A111, \"LongDescription\",, \"T\"))","v":""}]
[null,{"$f":"IF(A112=\"\",\"\",RTD(\"cqg.rtd\", ,\"ContractData\",A112, \"LongDescription\",, \"T\"))","v":""}]
[null,{"$f":"IF(A113=\"\",\"\",RTD(\"cqg.rtd\", ,\"ContractData\",A113, \"LongDescription\",, \"T\"))","v":""}]
[null,{"$f":"IF(A114=\"\",\"\",RTD(\"cqg.rtd\", ,\"ContractData\",A114, \"LongDescription\",, \"T\"))","v":""}]
[null,{"$f":"IF(A115=\"\",\"\",RTD(\"cqg.rtd\", ,\"ContractData\",A115, \"LongDescription\",, \"T\"))","v":""}]
[null,{"$f":"IF(A116=\"\",\"\",RTD(\"cqg.rtd\", ,\"ContractData\",A116, \"LongDescription\",, \"T\"))","v":""}]
[null,{"$f":"IF(A117=\"\",\"\",RTD(\"cqg.rtd\", ,\"ContractData\",A117, \"LongDescription\",, \"T\"))","v":""}]
[null,{"$f":"IF(A118=\"\",\"\",RTD(\"cqg.rtd\", ,\"ContractData\",A118, \"LongDescription\",, \"T\"))","v":""}]
[null,{"$f":"IF(A119=\"\",\"\",RTD(\"cqg.rtd\", ,\"ContractData\",A119, \"LongDescription\",, \"T\"))","v":""}]
[null,{"$f":"IF(A120=\"\",\"\",RTD(\"cqg.rtd\", ,\"ContractData\",A120, \"LongDescription\",, \"T\"))","v":""}]
[null,{"$f":"IF(A121=\"\",\"\",RTD(\"cqg.rtd\", ,\"ContractData\",A121, \"LongDescription\",, \"T\"))","v":""}]
[null,{"$f":"IF(A122=\"\",\"\",RTD(\"cqg.rtd\", ,\"ContractData\",A122, \"LongDescription\",, \"T\"))","v":""}]
[null,{"$f":"IF(A123=\"\",\"\",RTD(\"cqg.rtd\", ,\"ContractData\",A123, \"LongDescription\",, \"T\"))","v":""}]
[null,{"$f":"IF(A124=\"\",\"\",RTD(\"cqg.rtd\", ,\"ContractData\",A124, \"LongDescription\",, \"T\"))","v":""}]
[null,{"$f":"IF(A125=\"\",\"\",RTD(\"cqg.rtd\", ,\"ContractData\",A125, \"LongDescription\",, \"T\"))","v":""}]
[null,{"$f":"IF(A126=\"\",\"\",RTD(\"cqg.rtd\", ,\"ContractData\",A126, \"LongDescription\",, \"T\"))","v":""}]
[null,{"$f":"IF(A127=\"\",\"\",RTD(\"cqg.rtd\", ,\"ContractData\",A127, \"LongDescription\",, \"T\"))","v":""}]
[null,{"$f":"IF(A128=\"\",\"\",RTD(\"cqg.rtd\", ,\"ContractData\",A128, \"LongDescription\",, \"T\"))","v":""}]
[null,{"$f":"IF(A129=\"\",\"\",RTD(\"cqg.rtd\", ,\"ContractData\",A129, \"LongDescription\",, \"T\"))","v":""}]
[null,{"$f":"IF(A130=\"\",\"\",RTD(\"cqg.rtd\", ,\"ContractData\",A130, \"LongDescription\",, \"T\"))","v":""}]
[null,{"$f":"IF(A131=\"\",\"\",RTD(\"cqg.rtd\", ,\"ContractData\",A131, \"LongDescription\",, \"T\"))","v":""}]
[null,{"$f":"IF(A132=\"\",\"\",RTD(\"cqg.rtd\", ,\"ContractData\",A132, \"LongDescription\",, \"T\"))","v":""}]
[null,{"$f":"IF(A133=\"\",\"\",RTD(\"cqg.rtd\", ,\"ContractData\",A133, \"LongDescription\",, \"T\"))","v":""}]
[null,{"$f":"IF(A134=\"\",\"\",RTD(\"cqg.rtd\", ,\"ContractData\",A134, \"LongDescription\",, \"T\"))","v":""}]
[null,{"$f":"IF(A135=\"\",\"\",RTD(\"cqg.rtd\", ,\"ContractData\",A135, \"LongDescription\",, \"T\"))","v":""}]
[null,{"$f":"IF(A136=\"\",\"\",RTD(\"cqg.rtd\", ,\"ContractData\",A136, \"LongDescription\",, \"T\"))","v":""}]
[null,{"$f":"IF(A137=\"\",\"\",RTD(\"cqg.rtd\", ,\"ContractData\",A137, \"LongDescription\",, \"T\"))","v":""}]
[null,{"$f":"IF(A138=\"\",\"\",RTD(\"cqg.rtd\", ,\"ContractData\",A138, \"LongDescription\",, \"T\"))","v":""}]
[null,{"$f":"IF(A139=\"\",\"\",RTD(\"cqg.rtd\", ,\"ContractData\",A139, \"LongDescription\",, \"T\"))","v":""}]
[null,{"$f":"IF(A140=\"\",\"\",RTD(\"cqg.rtd\", ,\"ContractData\",A140, \"LongDescription\",, \"T\"))","v":""}]
[null,{"$f":"IF(A141=\"\",\"\",RTD(\"cqg.rtd\", ,\"ContractData\",A141, \"LongDescription\",, \"T\"))","v":""}]
[null,{"$f":"IF(A142=\"\",\"\",RTD(\"cqg.rtd\", ,\"ContractData\",A142, \"LongDescription\",, \"T\"))","v":""}]
[null,{"$f":"IF(A143=\"\",\"\",RTD(\"cqg.rtd\", ,\"ContractData\",A143, \"LongDescription\",, \"T\"))","v":""}]
[null,{"$f":"IF(A144=\"\",\"\",RTD(\"cqg.rtd\", ,\"ContractData\",A144, \"LongDescription\",, \"T\"))","v":""}]
[null,{"$f":"IF(A145=\"\",\"\",RTD(\"cqg.rtd\", ,\"ContractData\",A145, \"LongDescription\",, \"T\"))","v":""}]
[null,{"$f":"IF(A146=\"\",\"\",RTD(\"cqg.rtd\", ,\"ContractData\",A146, \"LongDescription\",, \"T\"))","v":""}]
[null,{"$f":"IF(A147=\"\",\"\",RTD(\"cqg.rtd\", ,\"ContractData\",A147, \"LongDescription\",, \"T\"))","v":""}]
[null,{"$f":"IF(A148=\"\",\"\",RTD(\"cqg.rtd\", ,\"ContractData\",A148, \"LongDescription\",, \"T\"))","v":""}]
[null,{"$f":"IF(A149=\"\",\"\",RTD(\"cqg.rtd\", ,\"ContractData\",A149, \"LongDescription\",, \"T\"))","v":""}]
[null,{"$f":"IF(A150=\"\",\"\",RTD(\"cqg.rtd\", ,\"ContractData\",A150, \"LongDescription\",, \"T\"))","v":""}]
[null,{"$f":"IF(A151=\"\",\"\",RTD(\"cqg.rtd\", ,\"ContractData\",A151, \"LongDescription\",, \"T\"))","v":""}]
[null,{"$f":"IF(A152=\"\",\"\",RTD(\"cqg.rtd\", ,\"ContractData\",A152, \"LongDescription\",, \"T\"))","v":""}]
[null,{"$f":"IF(A153=\"\",\"\",RTD(\"cqg.rtd\", ,\"ContractData\",A153, \"LongDescription\",, \"T\"))","v":""}]
[null,{"$f":"IF(A154=\"\",\"\",RTD(\"cqg.rtd\", ,\"ContractData\",A154, \"LongDescription\",, \"T\"))","v":""}]
[null,{"$f":"IF(A155=\"\",\"\",RTD(\"cqg.rtd\", ,\"ContractData\",A155, \"LongDescription\",, \"T\"))","v":""}]
[null,{"$f":"IF(A156=\"\",\"\",RTD(\"cqg.rtd\", ,\"ContractData\",A156, \"LongDescription\",, \"T\"))","v":""}]
[null,{"$f":"IF(A157=\"\",\"\",RTD(\"cqg.rtd\", ,\"ContractData\",A157, \"LongDescription\",, \"T\"))","v":""}]
[null,{"$f":"IF(A158=\"\",\"\",RTD(\"cqg.rtd\", ,\"ContractData\",A158, \"LongDescription\",, \"T\"))","v":""}]
[null,{"$f":"IF(A159=\"\",\"\",RTD(\"cqg.rtd\", ,\"ContractData\",A159, \"LongDescription\",, \"T\"))","v":""}]
[null,{"$f":"IF(A160=\"\",\"\",RTD(\"cqg.rtd\", ,\"ContractData\",A160, \"LongDescription\",, \"T\"))","v":""}]
[null,{"$f":"IF(A161=\"\",\"\",RTD(\"cqg.rtd\", ,\"ContractData\",A161, \"LongDescription\",, \"T\"))","v":""}]
[null,{"$f":"IF(A162=\"\",\"\",RTD(\"cqg.rtd\", ,\"ContractData\",A162, \"LongDescription\",, \"T\"))","v":""}]
[null,{"$f":"IF(A163=\"\",\"\",RTD(\"cqg.rtd\", ,\"ContractData\",A163, \"LongDescription\",, \"T\"))","v":""}]
[null,{"$f":"IF(A164=\"\",\"\",RTD(\"cqg.rtd\", ,\"ContractData\",A164, \"LongDescription\",, \"T\"))","v":""}]
[null,{"$f":"IF(A165=\"\",\"\",RTD(\"cqg.rtd\", ,\"ContractData\",A165, \"LongDescription\",, \"T\"))","v":""}]
[null,{"$f":"IF(A166=\"\",\"\",RTD(\"cqg.rtd\", ,\"ContractData\",A166, \"LongDescription\",, \"T\"))","v":""}]
[null,{"$f":"IF(A167=\"\",\"\",RTD(\"cqg.rtd\", ,\"ContractData\",A167, \"LongDescription\",, \"T\"))","v":""}]
[null,{"$f":"IF(A168=\"\",\"\",RTD(\"cqg.rtd\", ,\"ContractData\",A168, \"LongDescription\",, \"T\"))","v":""}]
[null,{"$f":"IF(A169=\"\",\"\",RTD(\"cqg.rtd\", ,\"ContractData\",A169, \"LongDescription\",, \"T\"))","v":""}]
[null,{"$f":"IF(A170=\"\",\"\",RTD(\"cqg.rtd\", ,\"ContractData\",A170, \"LongDescription\",, \"T\"))","v":""}]
[null,{"$f":"IF(A171=\"\",\"\",RTD(\"cqg.rtd\", ,\"ContractData\",A171, \"LongDescription\",, \"T\"))","v":""}]
[null,{"$f":"IF(A172=\"\",\"\",RTD(\"cqg.rtd\", ,\"ContractData\",A172, \"LongDescription\",, \"T\"))","v":""}]
[null,{"$f":"IF(A173=\"\",\"\",RTD(\"cqg.rtd\", ,\"ContractData\",A173, \"LongDescription\",, \"T\"))","v":""}]
[null,{"$f":"IF(A174=\"\",\"\",RTD(\"cqg.rtd\", ,\"ContractData\",A174, \"LongDescription\",, \"T\"))","v":""}]
[null,{"$f":"IF(A175=\"\",\"\",RTD(\"cqg.rtd\", ,\"ContractData\",A175, \"LongDescription\",, \"T\"))","v":""}]
[null,{"$f":"IF(A176=\"\",\"\",RTD(\"cqg.rtd\", ,\"ContractData\",A176, \"LongDescription\",, \"T\"))","v":""}]
[null,{"$f":"IF(A177=\"\",\"\",RTD(\"cqg.rtd\", ,\"ContractData\",A177, \"LongDescription\",, \"T\"))","v":""}]
[null,{"$f":"IF(A178=\"\",\"\",RTD(\"cqg.rtd\", ,\"ContractData\",A178, \"LongDescription\",, \"T\"))","v":""}]
[null,{"$f":"IF(A179=\"\",\"\",RTD(\"cqg.rtd\", ,\"ContractData\",A179, \"LongDescription\",, \"T\"))","v":""}]
[null,{"$f":"IF(A180=\"\",\"\",RTD(\"cqg.rtd\", ,\"ContractData\",A180, \"LongDescription\",, \"T\"))","v":""}]
[null,{"$f":"IF(A181=\"\",\"\",RTD(\"cqg.rtd\", ,\"ContractData\",A181, \"LongDescription\",, \"T\"))","v":""}]
[null,{"$f":"IF(A182=\"\",\"\",RTD(\"cqg.rtd\", ,\"ContractData\",A182, \"LongDescription\",, \"T\"))","v":""}]
[null,{"$f":"IF(A183=\"\",\"\",RTD(\"cqg.rtd\", ,\"ContractData\",A183, \"LongDescription\",, \"T\"))","v":""}]
[null,{"$f":"IF(A184=\"\",\"\",RTD(\"cqg.rtd\", ,\"ContractData\",A184, \"LongDescription\",, \"T\"))","v":""}]
[null,{"$f":"IF(A185=\"\",\"\",RTD(\"cqg.rtd\", ,\"ContractData\",A185, \"LongDescription\",, \"T\"))","v":""}]
[null,{"$f":"IF(A186=\"\",\"\",RTD(\"cqg.rtd\", ,\"ContractData\",A186, \"LongDescription\",, \"T\"))","v":""}]
[null,{"$f":"IF(A187=\"\",\"\",RTD(\"cqg.rtd\", ,\"ContractData\",A187, \"LongDescription\",, \"T\"))","v":""}]
[null,{"$f":"IF(A188=\"\",\"\",RTD(\"cqg.rtd\", ,\"ContractData\",A188, \"LongDescription\",, \"T\"))","v":""}]
[null,{"$f":"IF(A189=\"\",\"\",RTD(\"cqg.rtd\", ,\"ContractData\",A189, \"LongDescription\",, \"T\"))","v":""}]
[null,{"$f":"IF(A190=\"\",\"\",RTD(\"cqg.rtd\", ,\"ContractData\",A190, \"LongDescription\",, \"T\"))","v":""}]
[null,{"$f":"IF(A191=\"\",\"\",RTD(\"cqg.rtd\", ,\"ContractData\",A191, \"LongDescription\",, \"T\"))","v":""}]
[null,{"$f":"IF(A192=\"\",\"\",RTD(\"cqg.rtd\", ,\"ContractData\",A192, \"LongDescription\",, \"T\"))","v":""}]
[null,{"$f":"IF(A193=\"\",\"\",RTD(\"cqg.rtd\", ,\"ContractData\",A193, \"LongDescription\",, \"T\"))","v":""}]
[null,{"$f":"IF(A194=\"\",\"\",RTD(\"cqg.rtd\", ,\"ContractData\",A194, \"LongDescription\",, \"T\"))","v":""}]
[null,{"$f":"IF(A195=\"\",\"\",RTD(\"cqg.rtd\", ,\"ContractData\",A195, \"LongDescription\",, \"T\"))","v":""}]
[null,{"$f":"IF(A196=\"\",\"\",RTD(\"cqg.rtd\", ,\"ContractData\",A196, \"LongDescription\",, \"T\"))","v":""}]
[null,{"$f":"IF(A197=\"\",\"\",RTD(\"cqg.rtd\", ,\"ContractData\",A197, \"LongDescription\",, \"T\"))","v":""}]
[null,{"$f":"IF(A198=\"\",\"\",RTD(\"cqg.rtd\", ,\"ContractData\",A198, \"LongDescription\",, \"T\"))","v":""}]
[null,{"$f":"IF(A199=\"\",\"\",RTD(\"cqg.rtd\", ,\"ContractData\",A199, \"LongDescription\",, \"T\"))","v":""}]
[null,{"$f":"IF(A200=\"\",\"\",RTD(\"cqg.rtd\", ,\"ContractData\",A200, \"LongDescription\",, \"T\"))","v":""}]
[null,{"$f":"IF(A201=\"\",\"\",RTD(\"cqg.rtd\", ,\"ContractData\",A201, \"LongDescription\",, \"T\"))","v":""}]
[null,{"$f":"IF(A202=\"\",\"\",RTD(\"cqg.rtd\", ,\"ContractData\",A202, \"LongDescription\",, \"T\"))","v":""}]
[null,{"$f":"IF(A203=\"\",\"\",RTD(\"cqg.rtd\", ,\"ContractData\",A203, \"LongDescription\",, \"T\"))","v":""}]
[null,{"$f":"IF(A204=\"\",\"\",RTD(\"cqg.rtd\", ,\"ContractData\",A204, \"LongDescription\",, \"T\"))","v":""}]
[null,{"$f":"IF(A205=\"\",\"\",RTD(\"cqg.rtd\", ,\"ContractData\",A205, \"LongDescription\",, \"T\"))","v":""}]
[null,{"$f":"IF(A206=\"\",\"\",RTD(\"cqg.rtd\", ,\"ContractData\",A206, \"LongDescription\",, \"T\"))","v":""}]
[null,{"$f":"IF(A207=\"\",\"\",RTD(\"cqg.rtd\", ,\"ContractData\",A207, \"LongDescription\",, \"T\"))","v":""}]
[null,{"$f":"IF(A208=\"\",\"\",RTD(\"cqg.rtd\", ,\"ContractData\",A208, \"LongDescription\",, \"T\"))","v":""}]
[null,{"$f":"IF(A209=\"\",\"\",RTD(\"cqg.rtd\", ,\"ContractData\",A209, \"LongDescription\",, \"T\"))","v":""}]
[null,{"$f":"IF(A210=\"\",\"\",RTD(\"cqg.rtd\", ,\"ContractData\",A210, \"LongDescription\",, \"T\"))","v":""}]
[null,{"$f":"IF(A211=\"\",\"\",RTD(\"cqg.rtd\", ,\"ContractData\",A211, \"LongDescription\",, \"T\"))","v":""}]
[null,{"$f":"IF(A212=\"\",\"\",RTD(\"cqg.rtd\", ,\"ContractData\",A212, \"LongDescription\",, \"T\"))","v":""}]
[null,{"$f":"IF(A213=\"\",\"\",RTD(\"cqg.rtd\", ,\"ContractData\",A213, \"LongDescription\",, \"T\"))","v":""}]
[null,{"$f":"IF(A214=\"\",\"\",RTD(\"cqg.rtd\", ,\"ContractData\",A214, \"LongDescription\",, \"T\"))","v":""}]
[null,{"$f":"IF(A215=\"\",\"\",RTD(\"cqg.rtd\", ,\"ContractData\",A215, \"LongDescription\",, \"T\"))","v":""}]
[null,{"$f":"IF(A216=\"\",\"\",RTD(\"cqg.rtd\", ,\"ContractData\",A216, \"LongDescription\",, \"T\"))","v":""}]
[null,{"$f":"IF(A217=\"\",\"\",RTD(\"cqg.rtd\", ,\"ContractData\",A217, \"LongDescription\",, \"T\"))","v":""}]
[null,{"$f":"IF(A218=\"\",\"\",RTD(\"cqg.rtd\", ,\"ContractData\",A218, \"LongDescription\",, \"T\"))","v":""}]
[null,{"$f":"IF(A219=\"\",\"\",RTD(\"cqg.rtd\", ,\"ContractData\",A219, \"LongDescription\",, \"T\"))","v":""}]
[null,{"$f":"IF(A220=\"\",\"\",RTD(\"cqg.rtd\", ,\"ContractData\",A220, \"LongDescription\",, \"T\"))","v":""}]
[null,{"$f":"IF(A221=\"\",\"\",RTD(\"cqg.rtd\", ,\"ContractData\",A221, \"LongDescription\",, \"T\"))","v":""}]
[null,{"$f":"IF(A222=\"\",\"\",RTD(\"cqg.rtd\", ,\"ContractData\",A222, \"LongDescription\",, \"T\"))","v":""}]
[null,{"$f":"IF(A223=\"\",\"\",RTD(\"cqg.rtd\", ,\"ContractData\",A223, \"LongDescription\",, \"T\"))","v":""}]
[null,{"$f":"IF(A224=\"\",\"\",RTD(\"cqg.rtd\", ,\"ContractData\",A224, \"LongDescription\",, \"T\"))","v":""}]
[null,{"$f":"IF(A225=\"\",\"\",RTD(\"cqg.rtd\", ,\"ContractData\",A225, \"LongDescription\",, \"T\"))","v":""}]
[null,{"$f":"IF(A226=\"\",\"\",RTD(\"cqg.rtd\", ,\"ContractData\",A226, \"LongDescription\",, \"T\"))","v":""}]
[null,{"$f":"IF(A227=\"\",\"\",RTD(\"cqg.rtd\", ,\"ContractData\",A227, \"LongDescription\",, \"T\"))","v":""}]
[null,{"$f":"IF(A228=\"\",\"\",RTD(\"cqg.rtd\", ,\"ContractData\",A228, \"LongDescription\",, \"T\"))","v":""}]
[null,{"$f":"IF(A229=\"\",\"\",RTD(\"cqg.rtd\", ,\"ContractData\",A229, \"LongDescription\",, \"T\"))","v":""}]
[null,{"$f":"IF(A230=\"\",\"\",RTD(\"cqg.rtd\", ,\"ContractData\",A230, \"LongDescription\",, \"T\"))","v":""}]
[null,{"$f":"IF(A231=\"\",\"\",RTD(\"cqg.rtd\", ,\"ContractData\",A231, \"LongDescription\",, \"T\"))","v":""}]
[null,{"$f":"IF(A232=\"\",\"\",RTD(\"cqg.rtd\", ,\"ContractData\",A232, \"LongDescription\",, \"T\"))","v":""}]
[null,{"$f":"IF(A233=\"\",\"\",RTD(\"cqg.rtd\", ,\"ContractData\",A233, \"LongDescription\",, \"T\"))","v":""}]
[null,{"$f":"IF(A234=\"\",\"\",RTD(\"cqg.rtd\", ,\"ContractData\",A234, \"LongDescription\",, \"T\"))","v":""}]
[null,{"$f":"IF(A235=\"\",\"\",RTD(\"cqg.rtd\", ,\"ContractData\",A235, \"LongDescription\",, \"T\"))","v":""}]
[null,{"$f":"IF(A236=\"\",\"\",RTD(\"cqg.rtd\", ,\"ContractData\",A236, \"LongDescription\",, \"T\"))","v":""}]
[null,{"$f":"IF(A237=\"\",\"\",RTD(\"cqg.rtd\", ,\"ContractData\",A237, \"LongDescription\",, \"T\"))","v":""}]
[null,{"$f":"IF(A238=\"\",\"\",RTD(\"cqg.rtd\", ,\"ContractData\",A238, \"LongDescription\",, \"T\"))","v":""}]
[null,{"$f":"IF(A239=\"\",\"\",RTD(\"cqg.rtd\", ,\"ContractData\",A239, \"LongDescription\",, \"T\"))","v":""}]
[null,{"$f":"IF(A240=\"\",\"\",RTD(\"cqg.rtd\", ,\"ContractData\",A240, \"LongDescription\",, \"T\"))","v":""}]
[null,{"$f":"IF(A241=\"\",\"\",RTD(\"cqg.rtd\", ,\"ContractData\",A241, \"LongDescription\",, \"T\"))","v":""}]
[null,{"$f":"IF(A242=\"\",\"\",RTD(\"cqg.rtd\", ,\"ContractData\",A242, \"LongDescription\",, \"T\"))","v":""}]
[null,{"$f":"IF(A243=\"\",\"\",RTD(\"cqg.rtd\", ,\"ContractData\",A243, \"LongDescription\",, \"T\"))","v":""}]
[null,{"$f":"IF(A244=\"\",\"\",RTD(\"cqg.rtd\", ,\"ContractData\",A244, \"LongDescription\",, \"T\"))","v":""}]
[null,{"$f":"IF(A245=\"\",\"\",RTD(\"cqg.rtd\", ,\"ContractData\",A245, \"LongDescription\",, \"T\"))","v":""}]
[null,{"$f":"IF(A246=\"\",\"\",RTD(\"cqg.rtd\", ,\"ContractData\",A246, \"LongDescription\",, \"T\"))","v":""}]
[null,{"$f":"IF(A247=\"\",\"\",RTD(\"cqg.rtd\", ,\"ContractData\",A247, \"LongDescription\",, \"T\"))","v":""}]
[null,{"$f":"IF(A248=\"\",\"\",RTD(\"cqg.rtd\", ,\"ContractData\",A248, \"LongDescription\",, \"T\"))","v":""}]
[null,{"$f":"IF(A249=\"\",\"\",RTD(\"cqg.rtd\", ,\"ContractData\",A249, \"LongDescription\",, \"T\"))","v":""}]
[null,{"$f":"IF(A250=\"\",\"\",RTD(\"cqg.rtd\", ,\"ContractData\",A250, \"LongDescription\",, \"T\"))","v":""}]
[null,{"$f":"IF(A251=\"\",\"\",RTD(\"cqg.rtd\", ,\"ContractData\",A251, \"LongDescription\",, \"T\"))","v":""}]
[null,{"$f":"IF(A252=\"\",\"\",RTD(\"cqg.rtd\", ,\"ContractData\",A252, \"LongDescription\",, \"T\"))","v":""}]
[null,{"$f":"IF(A253=\"\",\"\",RTD(\"cqg.rtd\", ,\"ContractData\",A253, \"LongDescription\",, \"T\"))","v":""}]
[null,{"$f":"IF(A254=\"\",\"\",RTD(\"cqg.rtd\", ,\"ContractData\",A254, \"LongDescription\",, \"T\"))","v":""}]
[null,{"$f":"IF(A255=\"\",\"\",RTD(\"cqg.rtd\", ,\"ContractData\",A255, \"LongDescription\",, \"T\"))","v":""}]
[null,{"$f":"IF(A256=\"\",\"\",RTD(\"cqg.rtd\", ,\"ContractData\",A256, \"LongDescription\",, \"T\"))","v":""}]
[null,{"$f":"IF(A257=\"\",\"\",RTD(\"cqg.rtd\", ,\"ContractData\",A257, \"LongDescription\",, \"T\"))","v":""}]
[null,{"$f":"IF(A258=\"\",\"\",RTD(\"cqg.rtd\", ,\"ContractData\",A258, \"LongDescription\",, \"T\"))","v":""}]
[null,{"$f":"IF(A259=\"\",\"\",RTD(\"cqg.rtd\", ,\"ContractData\",A259, \"LongDescription\",, \"T\"))","v":""}]
[null,{"$f":"IF(A260=\"\",\"\",RTD(\"cqg.rtd\", ,\"ContractData\",A260, \"LongDescription\",, \"T\"))","v":""}]
[null,{"$f":"IF(A261=\"\",\"\",RTD(\"cqg.rtd\", ,\"ContractData\",A261, \"LongDescription\",, \"T\"))","v":""}]
[null,{"$f":"IF(A262=\"\",\"\",RTD(\"cqg.rtd\", ,\"ContractData\",A262, \"LongDescription\",, \"T\"))","v":""}]
[null,{"$f":"IF(A263=\"\",\"\",RTD(\"cqg.rtd\", ,\"ContractData\",A263, \"LongDescription\",, \"T\"))","v":""}]
[null,{"$f":"IF(A264=\"\",\"\",RTD(\"cqg.rtd\", ,\"ContractData\",A264, \"LongDescription\",, \"T\"))","v":""}]
[null,{"$f":"IF(A265=\"\",\"\",RTD(\"cqg.rtd\", ,\"ContractData\",A265, \"LongDescription\",, \"T\"))","v":""}]
[null,{"$f":"IF(A266=\"\",\"\",RTD(\"cqg.rtd\", ,\"ContractData\",A266, \"LongDescription\",, \"T\"))","v":""}]
[null,{"$f":"IF(A267=\"\",\"\",RTD(\"cqg.rtd\", ,\"ContractData\",A267, \"LongDescription\",, \"T\"))","v":""}]
[null,{"$f":"IF(A268=\"\",\"\",RTD(\"cqg.rtd\", ,\"ContractData\",A268, \"LongDescription\",, \"T\"))","v":""}]
[null,{"$f":"IF(A269=\"\",\"\",RTD(\"cqg.rtd\", ,\"ContractData\",A269, \"LongDescription\",, \"T\"))","v":""}]
[null,{"$f":"IF(A270=\"\",\"\",RTD(\"cqg.rtd\", ,\"ContractData\",A270, \"LongDescription\",, \"T\"))","v":""}]
[null,{"$f":"IF(A271=\"\",\"\",RTD(\"cqg.rtd\", ,\"ContractData\",A271, \"LongDescription\",, \"T\"))","v":""}]
[null,{"$f":"IF(A272=\"\",\"\",RTD(\"cqg.rtd\", ,\"ContractData\",A272, \"LongDescription\",, \"T\"))","v":""}]
[null,{"$f":"IF(A273=\"\",\"\",RTD(\"cqg.rtd\", ,\"ContractData\",A273, \"LongDescription\",, \"T\"))","v":""}]
[null,{"$f":"IF(A274=\"\",\"\",RTD(\"cqg.rtd\", ,\"ContractData\",A274, \"LongDescription\",, \"T\"))","v":""}]
[null,{"$f":"IF(A275=\"\",\"\",RTD(\"cqg.rtd\", ,\"ContractData\",A275, \"LongDescription\",, \"T\"))","v":""}]
[null,{"$f":"IF(A276=\"\",\"\",RTD(\"cqg.rtd\", ,\"ContractData\",A276, \"LongDescription\",, \"T\"))","v":""}]
[null,{"$f":"IF(A277=\"\",\"\",RTD(\"cqg.rtd\", ,\"ContractData\",A277, \"LongDescription\",, \"T\"))","v":""}]
[null,{"$f":"IF(A278=\"\",\"\",RTD(\"cqg.rtd\", ,\"ContractData\",A278, \"LongDescription\",, \"T\"))","v":""}]
[null,{"$f":"IF(A279=\"\",\"\",RTD(\"cqg.rtd\", ,\"ContractData\",A279, \"LongDescription\",, \"T\"))","v":""}]
[null,{"$f":"IF(A280=\"\",\"\",RTD(\"cqg.rtd\", ,\"ContractData\",A280, \"LongDescription\",, \"T\"))","v":""}]
[null,{"$f":"IF(A281=\"\",\"\",RTD(\"cqg.rtd\", ,\"ContractData\",A281, \"LongDescription\",, \"T\"))","v":""}]
[null,{"$f":"IF(A282=\"\",\"\",RTD(\"cqg.rtd\", ,\"ContractData\",A282, \"LongDescription\",, \"T\"))","v":""}]
[null,{"$f":"IF(A283=\"\",\"\",RTD(\"cqg.rtd\", ,\"ContractData\",A283, \"LongDescription\",, \"T\"))","v":""}]
[null,{"$f":"IF(A284=\"\",\"\",RTD(\"cqg.rtd\", ,\"ContractData\",A284, \"LongDescription\",, \"T\"))","v":""}]
[null,{"$f":"IF(A285=\"\",\"\",RTD(\"cqg.rtd\", ,\"ContractData\",A285, \"LongDescription\",, \"T\"))","v":""}]
[null,{"$f":"IF(A286=\"\",\"\",RTD(\"cqg.rtd\", ,\"ContractData\",A286, \"LongDescription\",, \"T\"))","v":""}]
[null,{"$f":"IF(A287=\"\",\"\",RTD(\"cqg.rtd\", ,\"ContractData\",A287, \"LongDescription\",, \"T\"))","v":""}]
[null,{"$f":"IF(A288=\"\",\"\",RTD(\"cqg.rtd\", ,\"ContractData\",A288, \"LongDescription\",, \"T\"))","v":""}]
[null,{"$f":"IF(A289=\"\",\"\",RTD(\"cqg.rtd\", ,\"ContractData\",A289, \"LongDescription\",, \"T\"))","v":""}]
[null,{"$f":"IF(A290=\"\",\"\",RTD(\"cqg.rtd\", ,\"ContractData\",A290, \"LongDescription\",, \"T\"))","v":""}]
[null,{"$f":"IF(A291=\"\",\"\",RTD(\"cqg.rtd\", ,\"ContractData\",A291, \"LongDescription\",, \"T\"))","v":""}]
[null,{"$f":"IF(A292=\"\",\"\",RTD(\"cqg.rtd\", ,\"ContractData\",A292, \"LongDescription\",, \"T\"))","v":""}]
[null,{"$f":"IF(A293=\"\",\"\",RTD(\"cqg.rtd\", ,\"ContractData\",A293, \"LongDescription\",, \"T\"))","v":""}]
[null,{"$f":"IF(A294=\"\",\"\",RTD(\"cqg.rtd\", ,\"ContractData\",A294, \"LongDescription\",, \"T\"))","v":""}]
[null,{"$f":"IF(A295=\"\",\"\",RTD(\"cqg.rtd\", ,\"ContractData\",A295, \"LongDescription\",, \"T\"))","v":""}]
[null,{"$f":"IF(A296=\"\",\"\",RTD(\"cqg.rtd\", ,\"ContractData\",A296, \"LongDescription\",, \"T\"))","v":""}]
[null,{"$f":"IF(A297=\"\",\"\",RTD(\"cqg.rtd\", ,\"ContractData\",A297, \"LongDescription\",, \"T\"))","v":""}]
[null,{"$f":"IF(A298=\"\",\"\",RTD(\"cqg.rtd\", ,\"ContractData\",A298, \"LongDescription\",, \"T\"))","v":""}]
[null,{"$f":"IF(A299=\"\",\"\",RTD(\"cqg.rtd\", ,\"ContractData\",A299, \"LongDescription\",, \"T\"))","v":""}]
[null,{"$f":"IF(A300=\"\",\"\",RTD(\"cqg.rtd\", ,\"ContractData\",A300, \"LongDescription\",, \"T\"))","v":""}]
[null,{"$f":"IF(A301=\"\",\"\",RTD(\"cqg.rtd\", ,\"ContractData\",A301, \"LongDescription\",, \"T\"))","v":""}]
[null,{"$f":"IF(A302=\"\",\"\",RTD(\"cqg.rtd\", ,\"ContractData\",A302, \"LongDescription\",, \"T\"))","v":""}]
[null,{"$f":"IF(A303=\"\",\"\",RTD(\"cqg.rtd\", ,\"ContractData\",A303, \"LongDescription\",, \"T\"))","v":""}]
[null,{"$f":"IF(A304=\"\",\"\",RTD(\"cqg.rtd\", ,\"ContractData\",A304, \"LongDescription\",, \"T\"))","v":""}]
[null,{"$f":"IF(A305=\"\",\"\",RTD(\"cqg.rtd\", ,\"ContractData\",A305, \"LongDescription\",, \"T\"))","v":""}]
[null,{"$f":"IF(A306=\"\",\"\",RTD(\"cqg.rtd\", ,\"ContractData\",A306, \"LongDescription\",, \"T\"))","v":""}]
[null,{"$f":"IF(A307=\"\",\"\",RTD(\"cqg.rtd\", ,\"ContractData\",A307, \"LongDescription\",, \"T\"))","v":""}]
[null,{"$f":"IF(A308=\"\",\"\",RTD(\"cqg.rtd\", ,\"ContractData\",A308, \"LongDescription\",, \"T\"))","v":""}]
[null,{"$f":"IF(A309=\"\",\"\",RTD(\"cqg.rtd\", ,\"ContractData\",A309, \"LongDescription\",, \"T\"))","v":""}]
[null,{"$f":"IF(A310=\"\",\"\",RTD(\"cqg.rtd\", ,\"ContractData\",A310, \"LongDescription\",, \"T\"))","v":""}]
[null,{"$f":"IF(A311=\"\",\"\",RTD(\"cqg.rtd\", ,\"ContractData\",A311, \"LongDescription\",, \"T\"))","v":""}]
[null,{"$f":"IF(A312=\"\",\"\",RTD(\"cqg.rtd\", ,\"ContractData\",A312, \"LongDescription\",, \"T\"))","v":""}]